<86>Feb 11 15:53:19 userdel[4005882]: delete user 'rooter'
<86>Feb 11 15:53:19 userdel[4005882]: removed group 'rooter' owned by 'rooter'
<86>Feb 11 15:53:19 userdel[4005882]: removed shadow group 'rooter' owned by 'rooter'
<86>Feb 11 15:53:19 groupadd[4005899]: group added to /etc/group: name=rooter, GID=1250
<86>Feb 11 15:53:19 groupadd[4005899]: group added to /etc/gshadow: name=rooter
<86>Feb 11 15:53:19 groupadd[4005899]: new group: name=rooter, GID=1250
<86>Feb 11 15:53:19 useradd[4005912]: new user: name=rooter, UID=1250, GID=1250, home=/root, shell=/bin/bash
<86>Feb 11 15:53:19 userdel[4005926]: delete user 'builder'
<86>Feb 11 15:53:19 userdel[4005926]: removed group 'builder' owned by 'builder'
<86>Feb 11 15:53:19 userdel[4005926]: removed shadow group 'builder' owned by 'builder'
<86>Feb 11 15:53:19 groupadd[4005939]: group added to /etc/group: name=builder, GID=1251
<86>Feb 11 15:53:19 groupadd[4005939]: group added to /etc/gshadow: name=builder
<86>Feb 11 15:53:19 groupadd[4005939]: new group: name=builder, GID=1251
<86>Feb 11 15:53:19 useradd[4005952]: new user: name=builder, UID=1251, GID=1251, home=/usr/src, shell=/bin/bash
<13>Feb 11 15:53:26 rpmi: python-module-sphinxcontrib-2.1.1-alt2.1.2 sisyphus+227529.1100.1.2 1555924423 installed
<13>Feb 11 15:53:26 rpmi: python-module-unidecode-0.04.17-alt1.git20141218.1.2 sisyphus+227535.600.1.2 1555953087 installed
<13>Feb 11 15:53:26 rpmi: pytz-zoneinfo-1:2016.10-alt1 1484291011 installed
<13>Feb 11 15:53:26 rpmi: python-module-imagesize-1.1.0-alt1 sisyphus+229015.100.2.1 1557233756 installed
<13>Feb 11 15:53:26 rpmi: python-sphinx-objects.inv-1:2.3.8.20190514-alt1 p9+229421.100.1.1 1557927689 installed
<13>Feb 11 15:53:26 rpmi: python-module-google-0.4.2-alt2.1 sisyphus+228356.1500.3.1 1556633038 installed
<13>Feb 11 15:53:26 rpmi: python-module-markupsafe-1.1.1-alt1 p9+254838.60.14.1 1602882123 installed
<13>Feb 11 15:53:26 rpmi: python-module-enum34-1.1.6-alt3 1527251693 installed
<13>Feb 11 15:53:26 rpmi: libyaml2-0.2.2-alt1 sisyphus+229134.100.1.1 1557342720 installed
<13>Feb 11 15:53:26 rpmi: libxapian-1.4.15-alt1 p9+258827.100.1.1 1601305414 installed
<13>Feb 11 15:53:26 rpmi: libsqlite3-3.33.0-alt1 p9+258834.40.2.1 1601364885 installed
<13>Feb 11 15:53:26 rpmi: openldap-common-2.4.59-alt0.p9.1 p9+281540.300.5.1 1629898589 installed
<13>Feb 11 15:53:26 rpmi: libgpg-error-1.36-alt1 p9+261942.140.4.1 1606237682 installed
<13>Feb 11 15:53:26 rpmi: libgcrypt20-1.8.5-alt3 p9+261942.200.4.1 1606237844 installed
<13>Feb 11 15:53:26 rpmi: libxslt-1.1.34-alt1.p9.1 p9+261811.300.3.1 1605513910 installed
<13>Feb 11 15:53:26 rpmi: libexpat-2.4.3-alt1 p9+293696.100.1.1 1643124786 installed
<13>Feb 11 15:53:26 rpmi: python-modules-curses-2.7.16-alt1.M90P.2 p9+260393.40.3.1 1604003646 installed
<13>Feb 11 15:53:26 rpmi: libgdbm-1.8.3-alt10 1454943313 installed
<13>Feb 11 15:53:26 rpmi: libncurses-6.1.20180407-alt2 sisyphus+222164.200.1.1 1550686221 installed
<13>Feb 11 15:53:26 rpmi: libtinfo-devel-6.1.20180407-alt2 sisyphus+222164.200.1.1 1550686221 installed
<13>Feb 11 15:53:26 rpmi: libncurses-devel-6.1.20180407-alt2 sisyphus+222164.200.1.1 1550686221 installed
<13>Feb 11 15:53:26 rpmi: libverto-0.3.0-alt1_7 sisyphus+225932.100.1.1 1553994917 installed
<13>Feb 11 15:53:26 rpmi: libkeyutils-1.6-alt2 sisyphus+226520.100.2.1 1554512088 installed
<13>Feb 11 15:53:26 rpmi: libp11-kit-0.23.15-alt2 p9+254920.2400.19.1 1601385869 installed
<13>Feb 11 15:53:26 rpmi: libtasn1-4.14-alt1 p9+235792.100.2.1 1565425233 installed
<13>Feb 11 15:53:26 rpmi: rpm-macros-alternatives-0.5.1-alt1 sisyphus+226946.100.1.1 1554830426 installed
<13>Feb 11 15:53:26 rpmi: alternatives-0.5.1-alt1 sisyphus+226946.100.1.1 1554830426 installed
<13>Feb 11 15:53:26 rpmi: ca-certificates-2021.10.06-alt1 p9+289862.100.1.1 1637033643 installed
<13>Feb 11 15:53:26 rpmi: ca-trust-0.1.2-alt1 p9+233349.100.1.1 1561655062 installed
<13>Feb 11 15:53:26 rpmi: p11-kit-trust-0.23.15-alt2 p9+254920.2400.19.1 1601385869 installed
<13>Feb 11 15:53:26 rpmi: libcrypto1.1-1.1.1u-alt1 p9+322202.100.1.1 1685863283 installed
<13>Feb 11 15:53:26 rpmi: libssl1.1-1.1.1u-alt1 p9+322202.100.1.1 1685863283 installed
<13>Feb 11 15:53:26 rpmi: libcom_err-1.44.6-alt1 sisyphus+224154.100.1.1 1552091653 installed
<86>Feb 11 15:53:26 groupadd[4018278]: group added to /etc/group: name=_keytab, GID=499
<86>Feb 11 15:53:26 groupadd[4018278]: group added to /etc/gshadow: name=_keytab
<86>Feb 11 15:53:26 groupadd[4018278]: new group: name=_keytab, GID=499
<13>Feb 11 15:53:26 rpmi: libkrb5-1.17.2-alt5 p9+325691.100.1.1 1690460821 installed
<13>Feb 11 15:53:26 rpmi: libtirpc-1.0.3-alt1 1532008015 installed
<13>Feb 11 15:53:27 rpmi: libnsl2-1.1.0-alt1_1 1511548748 installed
<13>Feb 11 15:53:27 rpmi: python-modules-compiler-2.7.16-alt1.M90P.2 p9+260393.40.3.1 1604003646 installed
<13>Feb 11 15:53:27 rpmi: python-modules-email-2.7.16-alt1.M90P.2 p9+260393.40.3.1 1604003646 installed
<13>Feb 11 15:53:27 rpmi: python-modules-unittest-2.7.16-alt1.M90P.2 p9+260393.40.3.1 1604003646 installed
<13>Feb 11 15:53:27 rpmi: python-modules-encodings-2.7.16-alt1.M90P.2 p9+260393.40.3.1 1604003646 installed
<13>Feb 11 15:53:27 rpmi: python-modules-2.7.16-alt1.M90P.2 p9+260393.40.3.1 1604003646 installed
<13>Feb 11 15:53:27 rpmi: python-modules-nis-2.7.16-alt1.M90P.2 p9+260393.40.3.1 1604003646 installed
<13>Feb 11 15:53:27 rpmi: python-module-six-1.12.0-alt1 sisyphus+219665.100.2.1 1548148570 installed
<13>Feb 11 15:53:27 rpmi: python-module-pkg_resources-1:40.8.0-alt2 sisyphus+229158.200.2.1 1557735221 installed
<13>Feb 11 15:53:27 rpmi: python-modules-json-2.7.16-alt1.M90P.2 p9+260393.40.3.1 1604003646 installed
<13>Feb 11 15:53:27 rpmi: python-modules-ctypes-2.7.16-alt1.M90P.2 p9+260393.40.3.1 1604003646 installed
<13>Feb 11 15:53:27 rpmi: python-modules-xml-2.7.16-alt1.M90P.2 p9+260393.40.3.1 1604003646 installed
<13>Feb 11 15:53:27 rpmi: python-modules-multiprocessing-2.7.16-alt1.M90P.2 p9+260393.40.3.1 1604003646 installed
<13>Feb 11 15:53:27 rpmi: python-modules-logging-2.7.16-alt1.M90P.2 p9+260393.40.3.1 1604003646 installed
<13>Feb 11 15:53:27 rpmi: python-module-jinja2-2.11.2-alt1 p9+254838.40.14.1 1602882082 installed
<13>Feb 11 15:53:27 rpmi: python-modules-hotshot-2.7.16-alt1.M90P.2 p9+260393.40.3.1 1604003646 installed
<13>Feb 11 15:53:27 rpmi: python-module-chardet-3.0.4-alt1 sisyphus+227476.1700.1.2 1555756717 installed
<13>Feb 11 15:53:27 rpmi: python-module-dateutil-2.7.3-alt1 1534408281 installed
<13>Feb 11 15:53:27 rpmi: python-tools-2to3-2.7.16-alt1.M90P.2 p9+260393.40.3.1 1604003646 installed
<13>Feb 11 15:53:27 rpmi: python-module-whoosh-2.7.4-alt1 1527697941 installed
<13>Feb 11 15:53:27 rpmi: python-module-webencodings-0.5.1-alt1.1 1517943573 installed
<13>Feb 11 15:53:27 rpmi: python-modules-bsddb-2.7.16-alt1.M90P.2 p9+260393.40.3.1 1604003646 installed
<13>Feb 11 15:53:27 rpmi: python-2.7.16-alt1.M90P.2 p9+260393.40.3.1 1604003646 installed
<13>Feb 11 15:53:27 rpmi: python-strict-2.7.16-alt1.M90P.2 p9+260393.40.3.1 1604003646 installed
<13>Feb 11 15:53:27 rpmi: python-modules-distutils-2.7.16-alt1.M90P.2 p9+260393.40.3.1 1604003646 installed
<13>Feb 11 15:53:27 rpmi: python-module-pytz-1:2016.10-alt1 1484291011 installed
<13>Feb 11 15:53:28 rpmi: python-module-babel-1:2.6.0-alt1 sisyphus+228351.2400.6.2 1556652168 installed
<13>Feb 11 15:53:28 rpmi: python-module-pycparser-2.19-alt1 sisyphus+228366.1000.2.3 1556706938 installed
<13>Feb 11 15:53:28 rpmi: python-module-cffi-1.12.3-alt1 sisyphus+229040.200.3.1 1557316502 installed
<13>Feb 11 15:53:28 rpmi: python-module-asn1crypto-0.24.0-alt1 sisyphus+227473.1300.1.2 1555756512 installed
<13>Feb 11 15:53:28 rpmi: python-module-PyStemmer-1.0.1-alt1.2.1 1321387369 installed
<13>Feb 11 15:53:28 rpmi: python-module-snowballstemmer-1.2.0-alt2.1 1457859319 installed
<13>Feb 11 15:53:28 rpmi: python-module-cssselect-0.9.1-alt1.2 sisyphus+227479.1100.1.2 1555757152 installed
<13>Feb 11 15:53:28 rpmi: python-module-html5lib-1:0.999999999-alt4.qa1 sisyphus+227493.600.1.3 1555835341 installed
<13>Feb 11 15:53:28 rpmi: python-module-lxml-4.4.2-alt1 p9+244111.100.1.1 1578758711 installed
<13>Feb 11 15:53:28 rpmi: python-module-docutils-0.14-alt2 1535729778 installed
<13>Feb 11 15:53:28 rpmi: python-module-idna-2.8-alt1 sisyphus+227494.400.1.3 1555838720 installed
<13>Feb 11 15:53:28 rpmi: python-module-ntlm-1.1.0-alt1.2 sisyphus+228512.100.1.1 1556654575 installed
<13>Feb 11 15:53:28 rpmi: python-module-ipaddress-1.0.18-alt1.1 sisyphus+227494.1700.1.3 1555839523 installed
<13>Feb 11 15:53:28 rpmi: python-module-cryptography-2.6.1-alt1 sisyphus+225625.24400.91.1 1555299604 installed
<13>Feb 11 15:53:28 rpmi: python-module-OpenSSL-18.0.0-alt1 1532996168 installed
<13>Feb 11 15:53:28 rpmi: python-module-simplejson-3.15.0-alt1.qa1 sisyphus+225625.16100.91.1 1555293606 installed
<13>Feb 11 15:53:28 rpmi: python-module-ndg-0.4.2-alt1.qa1 sisyphus+227504.1300.1.2 1555853074 installed
<13>Feb 11 15:53:28 rpmi: python-module-ndg-httpsclient-0.4.2-alt1.qa1 sisyphus+227504.1300.1.2 1555853074 installed
<13>Feb 11 15:53:28 rpmi: python-module-backports-3.5.0.1-alt1.1.1 1517645428 installed
<13>Feb 11 15:53:28 rpmi: python-module-backports.ssl_match_hostname-3.5.0.1-alt1.1.1 1517645428 installed
<13>Feb 11 15:53:28 rpmi: python-module-urllib3-2:1.25.6-alt1 p9+250567.200.5.1 1590420860 installed
<13>Feb 11 15:53:28 rpmi: python-module-requests-2.23.0-alt1 p9+250567.400.5.1 1590420890 installed
<13>Feb 11 15:53:28 rpmi: python-module-typing-3.6.6-alt2 sisyphus+220108.100.1.1 1548749697 installed
<13>Feb 11 15:53:28 rpmi: python-modules-sqlite3-2.7.16-alt1.M90P.2 p9+260393.40.3.1 1604003646 installed
<13>Feb 11 15:53:28 rpmi: python-module-SQLAlchemy-1.2.15-alt1 sisyphus+225625.4500.91.1 1555285684 installed
<13>Feb 11 15:53:28 rpmi: python-module-blinker-1.3-alt1.git20130703.1.2 sisyphus+227475.600.1.1 1555687516 installed
<13>Feb 11 15:53:28 rpmi: python-modules-wsgiref-2.7.16-alt1.M90P.2 p9+260393.40.3.1 1604003646 installed
<13>Feb 11 15:53:28 rpmi: python-module-yaml-5.4.1-alt0.p9 p9+267990.100.1.1 1616060841 installed
<13>Feb 11 15:53:28 rpmi: python-module-funcsigs-1.0.2-alt2 sisyphus+228355.2600.2.1 1556560236 installed
<13>Feb 11 15:53:28 rpmi: python-module-linecache2-1.0.0-alt1.git20150306.2.1 sisyphus+228360.2100.5.2 1556666704 installed
<13>Feb 11 15:53:28 rpmi: python-module-traceback2-1.4.0-alt2.1 sisyphus+227534.300.1.3 1555957009 installed
<13>Feb 11 15:53:28 rpmi: python-module-unittest2-1.1.0-alt3 sisyphus+227535.1100.2.1 1556009290 installed
<13>Feb 11 15:53:28 rpmi: python-module-xapian-1.4.15-alt1 p9+258827.200.2.1 1601308059 installed
<13>Feb 11 15:53:28 rpmi: python-module-sphinxcontrib-websupport-1.0.1-alt5 p9+247680.340.15.1 1585331199 installed
<13>Feb 11 15:53:28 rpmi: python-module-alabaster-0.7.6-alt3 sisyphus+228351.700.4.1 1556637370 installed
<13>Feb 11 15:53:29 rpmi: python-module-Pygments-2.4.2-alt3 p9+263160.400.4.1 1607939146 installed
<13>Feb 11 15:53:29 rpmi: python-module-sphinx-1:1.6.5-alt8 p9+250806.100.2.1 1588178467 installed
<13>Feb 11 15:53:29 rpmi: libnsl2-devel-1.1.0-alt1_1 1511548748 installed
<13>Feb 11 15:53:29 rpmi: python-dev-2.7.16-alt1.M90P.2 p9+260393.40.3.1 1604003646 installed
<13>Feb 11 15:53:29 rpmi: python-module-setuptools-1:40.8.0-alt2 sisyphus+229158.200.2.1 1557735221 installed
<13>Feb 11 15:53:29 rpmi: python-module-pbr-5.4.2-alt1 p9+235989.100.1.1 1565701052 installed
<86>Feb 11 15:53:29 groupadd[4022813]: group added to /etc/group: name=sasl, GID=498
<86>Feb 11 15:53:29 groupadd[4022813]: group added to /etc/gshadow: name=sasl
<86>Feb 11 15:53:29 groupadd[4022813]: new group: name=sasl, GID=498
<13>Feb 11 15:53:29 rpmi: libsasl2-3-2.1.27-alt2.1 p9+256192.100.1.1 1597226707 installed
<13>Feb 11 15:53:29 rpmi: libldap-2.4.59-alt0.p9.1 p9+281540.300.5.1 1629898589 installed
<13>Feb 11 15:53:29 rpmi: libpq5-12.17-alt0.M90P.1 p9+333985.100.2.1 1700650921 installed
<13>Feb 11 15:53:29 rpmi: python-module-psycopg2-2.8.3-alt1 p9+232795.100.2.1 1561367519 installed
<13>Feb 11 15:53:30 rpmi: python-module-django-1.11.29-alt2 p9+266900.500.5.1 1617659832 installed
<13>Feb 11 15:53:30 rpmi: python-module-pelican-4.0.1-alt1 sisyphus+224329.100.1.1 1552235663 installed
<13>Feb 11 15:53:30 rpmi: python-module-mock-2.0.0-alt1 sisyphus+224400.100.2.1 1554338032 installed
Building target platforms: x86_64
Building for target x86_64
Wrote: /usr/src/in/nosrpm/python-module-pelican-4.0.1-alt1.nosrc.rpm (w1.gzdio)
Installing python-module-pelican-4.0.1-alt1.src.rpm
Building target platforms: x86_64
Building for target x86_64
Executing(%prep): /bin/sh -e /usr/src/tmp/rpm-tmp.88832
+ umask 022
+ /bin/mkdir -p /usr/src/RPM/BUILD
+ cd /usr/src/RPM/BUILD
+ cd /usr/src/RPM/BUILD
+ rm -rf pelican-4.0.1
+ echo 'Source #0 (pelican-4.0.1.tar):'
Source #0 (pelican-4.0.1.tar):
+ /bin/tar -xf /usr/src/RPM/SOURCES/pelican-4.0.1.tar
+ cd pelican-4.0.1
+ /bin/chmod -c -Rf u+rwX,go-w .
+ rm -rf pelican.egg-info
+ sed -i 1d pelican/tools/pelican_import.py
+ sed -i 1d pelican/tools/pelican_quickstart.py
+ sed -i 1d pelican/tools/pelican_themes.py
+ sed -i 's|feedgenerator|django.utils.feedgenerator|' pelican/writers.py
+ sed -i 's|'\''feedgenerator >= 1.6'\'', ||' setup.py
+ exit 0
Executing(%build): /bin/sh -e /usr/src/tmp/rpm-tmp.88832
+ umask 022
+ /bin/mkdir -p /usr/src/RPM/BUILD
+ cd /usr/src/RPM/BUILD
+ cd pelican-4.0.1
+ CFLAGS='-pipe -frecord-gcc-switches -Wall -g -O2'
+ export CFLAGS
+ CXXFLAGS='-pipe -frecord-gcc-switches -Wall -g -O2'
+ export CXXFLAGS
+ FFLAGS='-pipe -frecord-gcc-switches -Wall -g -O2'
+ export FFLAGS
+ /usr/bin/python setup.py build
running build
running build_py
creating build
creating build/lib
creating build/lib/pelican
copying pelican/writers.py -> build/lib/pelican
copying pelican/utils.py -> build/lib/pelican
copying pelican/urlwrappers.py -> build/lib/pelican
copying pelican/signals.py -> build/lib/pelican
copying pelican/settings.py -> build/lib/pelican
copying pelican/server.py -> build/lib/pelican
copying pelican/rstdirectives.py -> build/lib/pelican
copying pelican/readers.py -> build/lib/pelican
copying pelican/paginator.py -> build/lib/pelican
copying pelican/log.py -> build/lib/pelican
copying pelican/generators.py -> build/lib/pelican
copying pelican/contents.py -> build/lib/pelican
copying pelican/cache.py -> build/lib/pelican
copying pelican/__init__.py -> build/lib/pelican
creating build/lib/pelican/tools
copying pelican/tools/pelican_themes.py -> build/lib/pelican/tools
copying pelican/tools/pelican_quickstart.py -> build/lib/pelican/tools
copying pelican/tools/pelican_import.py -> build/lib/pelican/tools
copying pelican/tools/__init__.py -> build/lib/pelican/tools
creating build/lib/pelican/themes
creating build/lib/pelican/themes/simple
creating build/lib/pelican/themes/simple/templates
copying pelican/themes/simple/templates/translations.html -> build/lib/pelican/themes/simple/templates
copying pelican/themes/simple/templates/tags.html -> build/lib/pelican/themes/simple/templates
copying pelican/themes/simple/templates/tag.html -> build/lib/pelican/themes/simple/templates
copying pelican/themes/simple/templates/period_archives.html -> build/lib/pelican/themes/simple/templates
copying pelican/themes/simple/templates/pagination.html -> build/lib/pelican/themes/simple/templates
copying pelican/themes/simple/templates/page.html -> build/lib/pelican/themes/simple/templates
copying pelican/themes/simple/templates/index.html -> build/lib/pelican/themes/simple/templates
copying pelican/themes/simple/templates/gosquared.html -> build/lib/pelican/themes/simple/templates
copying pelican/themes/simple/templates/category.html -> build/lib/pelican/themes/simple/templates
copying pelican/themes/simple/templates/categories.html -> build/lib/pelican/themes/simple/templates
copying pelican/themes/simple/templates/base.html -> build/lib/pelican/themes/simple/templates
copying pelican/themes/simple/templates/authors.html -> build/lib/pelican/themes/simple/templates
copying pelican/themes/simple/templates/author.html -> build/lib/pelican/themes/simple/templates
copying pelican/themes/simple/templates/article.html -> build/lib/pelican/themes/simple/templates
copying pelican/themes/simple/templates/archives.html -> build/lib/pelican/themes/simple/templates
creating build/lib/pelican/themes/notmyidea
creating build/lib/pelican/themes/notmyidea/templates
copying pelican/themes/notmyidea/templates/twitter.html -> build/lib/pelican/themes/notmyidea/templates
copying pelican/themes/notmyidea/templates/translations.html -> build/lib/pelican/themes/notmyidea/templates
copying pelican/themes/notmyidea/templates/tags.html -> build/lib/pelican/themes/notmyidea/templates
copying pelican/themes/notmyidea/templates/taglist.html -> build/lib/pelican/themes/notmyidea/templates
copying pelican/themes/notmyidea/templates/tag.html -> build/lib/pelican/themes/notmyidea/templates
copying pelican/themes/notmyidea/templates/period_archives.html -> build/lib/pelican/themes/notmyidea/templates
copying pelican/themes/notmyidea/templates/page.html -> build/lib/pelican/themes/notmyidea/templates
copying pelican/themes/notmyidea/templates/index.html -> build/lib/pelican/themes/notmyidea/templates
copying pelican/themes/notmyidea/templates/github.html -> build/lib/pelican/themes/notmyidea/templates
copying pelican/themes/notmyidea/templates/disqus_script.html -> build/lib/pelican/themes/notmyidea/templates
copying pelican/themes/notmyidea/templates/comments.html -> build/lib/pelican/themes/notmyidea/templates
copying pelican/themes/notmyidea/templates/category.html -> build/lib/pelican/themes/notmyidea/templates
copying pelican/themes/notmyidea/templates/base.html -> build/lib/pelican/themes/notmyidea/templates
copying pelican/themes/notmyidea/templates/authors.html -> build/lib/pelican/themes/notmyidea/templates
copying pelican/themes/notmyidea/templates/author.html -> build/lib/pelican/themes/notmyidea/templates
copying pelican/themes/notmyidea/templates/article_infos.html -> build/lib/pelican/themes/notmyidea/templates
copying pelican/themes/notmyidea/templates/article.html -> build/lib/pelican/themes/notmyidea/templates
copying pelican/themes/notmyidea/templates/archives.html -> build/lib/pelican/themes/notmyidea/templates
copying pelican/themes/notmyidea/templates/analytics.html -> build/lib/pelican/themes/notmyidea/templates
creating build/lib/pelican/themes/notmyidea/static
creating build/lib/pelican/themes/notmyidea/static/images
creating build/lib/pelican/themes/notmyidea/static/images/icons
copying pelican/themes/notmyidea/static/images/icons/youtube.png -> build/lib/pelican/themes/notmyidea/static/images/icons
copying pelican/themes/notmyidea/static/images/icons/vimeo.png -> build/lib/pelican/themes/notmyidea/static/images/icons
copying pelican/themes/notmyidea/static/images/icons/twitter.png -> build/lib/pelican/themes/notmyidea/static/images/icons
copying pelican/themes/notmyidea/static/images/icons/stackoverflow.png -> build/lib/pelican/themes/notmyidea/static/images/icons
copying pelican/themes/notmyidea/static/images/icons/speakerdeck.png -> build/lib/pelican/themes/notmyidea/static/images/icons
copying pelican/themes/notmyidea/static/images/icons/slideshare.png -> build/lib/pelican/themes/notmyidea/static/images/icons
copying pelican/themes/notmyidea/static/images/icons/rss.png -> build/lib/pelican/themes/notmyidea/static/images/icons
copying pelican/themes/notmyidea/static/images/icons/reddit.png -> build/lib/pelican/themes/notmyidea/static/images/icons
copying pelican/themes/notmyidea/static/images/icons/linkedin.png -> build/lib/pelican/themes/notmyidea/static/images/icons
copying pelican/themes/notmyidea/static/images/icons/lastfm.png -> build/lib/pelican/themes/notmyidea/static/images/icons
copying pelican/themes/notmyidea/static/images/icons/hackernews.png -> build/lib/pelican/themes/notmyidea/static/images/icons
copying pelican/themes/notmyidea/static/images/icons/google-plus.png -> build/lib/pelican/themes/notmyidea/static/images/icons
copying pelican/themes/notmyidea/static/images/icons/google-groups.png -> build/lib/pelican/themes/notmyidea/static/images/icons
copying pelican/themes/notmyidea/static/images/icons/gittip.png -> build/lib/pelican/themes/notmyidea/static/images/icons
copying pelican/themes/notmyidea/static/images/icons/gitorious.png -> build/lib/pelican/themes/notmyidea/static/images/icons
copying pelican/themes/notmyidea/static/images/icons/github.png -> build/lib/pelican/themes/notmyidea/static/images/icons
copying pelican/themes/notmyidea/static/images/icons/facebook.png -> build/lib/pelican/themes/notmyidea/static/images/icons
copying pelican/themes/notmyidea/static/images/icons/delicious.png -> build/lib/pelican/themes/notmyidea/static/images/icons
copying pelican/themes/notmyidea/static/images/icons/bitbucket.png -> build/lib/pelican/themes/notmyidea/static/images/icons
copying pelican/themes/notmyidea/static/images/icons/aboutme.png -> build/lib/pelican/themes/notmyidea/static/images/icons
creating build/lib/pelican/themes/notmyidea/static/fonts
copying pelican/themes/notmyidea/static/fonts/font.css -> build/lib/pelican/themes/notmyidea/static/fonts
copying pelican/themes/notmyidea/static/fonts/Yanone_Kaffeesatz_400.woff2 -> build/lib/pelican/themes/notmyidea/static/fonts
copying pelican/themes/notmyidea/static/fonts/Yanone_Kaffeesatz_400.woff -> build/lib/pelican/themes/notmyidea/static/fonts
copying pelican/themes/notmyidea/static/fonts/Yanone_Kaffeesatz_400.ttf -> build/lib/pelican/themes/notmyidea/static/fonts
copying pelican/themes/notmyidea/static/fonts/Yanone_Kaffeesatz_400.svg -> build/lib/pelican/themes/notmyidea/static/fonts
copying pelican/themes/notmyidea/static/fonts/Yanone_Kaffeesatz_400.eot -> build/lib/pelican/themes/notmyidea/static/fonts
creating build/lib/pelican/themes/notmyidea/static/css
copying pelican/themes/notmyidea/static/css/wide.css -> build/lib/pelican/themes/notmyidea/static/css
copying pelican/themes/notmyidea/static/css/typogrify.css -> build/lib/pelican/themes/notmyidea/static/css
copying pelican/themes/notmyidea/static/css/reset.css -> build/lib/pelican/themes/notmyidea/static/css
copying pelican/themes/notmyidea/static/css/pygment.css -> build/lib/pelican/themes/notmyidea/static/css
copying pelican/themes/notmyidea/static/css/main.css -> build/lib/pelican/themes/notmyidea/static/css
copying pelican/themes/notmyidea/static/css/fonts.css -> build/lib/pelican/themes/notmyidea/static/css
creating build/lib/pelican/tools/templates
copying pelican/tools/templates/tasks.py.jinja2 -> build/lib/pelican/tools/templates
copying pelican/tools/templates/publishconf.py.jinja2 -> build/lib/pelican/tools/templates
copying pelican/tools/templates/pelicanconf.py.jinja2 -> build/lib/pelican/tools/templates
copying pelican/tools/templates/Makefile.jinja2 -> build/lib/pelican/tools/templates
+ sphinx-build docs html
Running Sphinx v1.6.5
making output directory...
Generating grammar tables from /usr/lib/python2.7/site-packages/sphinx/pycode/Grammar-py2.txt
loading pickled environment... not yet created
building [mo]: targets for 0 po files that are out of date
building [html]: targets for 16 source files that are out of date
updating environment: 16 added, 0 changed, 0 removed
reading sources... [  6%] changelog
/usr/lib/python2.7/site-packages/sphinx/environment/__init__.py:686: RemovedInSphinx17Warning: html_use_smartypants option is deprecated. Smart quotes are on by default; if you want to disable or customize them, use the smart_quotes option in docutils.conf.
  RemovedInSphinx17Warning)
reading sources... [ 12%] content
reading sources... [ 18%] contribute
reading sources... [ 25%] faq
reading sources... [ 31%] importer
reading sources... [ 37%] index
reading sources... [ 43%] install
reading sources... [ 50%] internals
reading sources... [ 56%] pelican-themes
reading sources... [ 62%] plugins
reading sources... [ 68%] publish
reading sources... [ 75%] quickstart
reading sources... [ 81%] report
reading sources... [ 87%] settings
reading sources... [ 93%] themes
reading sources... [100%] tips

looking for now-outdated files... none found
pickling environment... done
checking consistency... preparing documents... writing output... [  6%] changelog
writing output... [ 12%] content
writing output... [ 18%] contribute
writing output... [ 25%] faq
writing output... [ 31%] importer
writing output... [ 37%] index
writing output... [ 43%] install
writing output... [ 50%] internals
writing output... [ 56%] pelican-themes
writing output... [ 62%] plugins
writing output... [ 68%] publish
writing output... [ 75%] quickstart
writing output... [ 81%] report
writing output... [ 87%] settings
writing output... [ 93%] themes
writing output... [100%] tips

/usr/src/RPM/BUILD/pelican-4.0.1/docs/themes.rst:246: WARNING: Pygments lexer name u'markdown' is not known
generating indices...
writing additional pages... searchcopying images... [ 50%] _static/overall.png
copying images... [100%] _static/uml.jpg

copying downloadable files... [100%] _static/theme-basic.zip

copying static files... copying extra files... dumping search index in English (code: en) ... dumping object inventory... build succeeded, 1 warning.
+ rm html/_downloads/theme-basic.zip html/_static/theme-basic.zip
+ rm -rf html/.doctrees html/.buildinfo
+ exit 0
Executing(%install): /bin/sh -e /usr/src/tmp/rpm-tmp.96822
+ umask 022
+ /bin/mkdir -p /usr/src/RPM/BUILD
+ cd /usr/src/RPM/BUILD
+ /bin/chmod -Rf u+rwX -- /usr/src/tmp/python-module-pelican-buildroot
+ :
+ /bin/rm -rf -- /usr/src/tmp/python-module-pelican-buildroot
+ PATH=/usr/libexec/rpm-build:/usr/src/bin:/bin:/usr/bin:/usr/X11R6/bin:/usr/games
+ cd pelican-4.0.1
+ CFLAGS='-pipe -frecord-gcc-switches -Wall -g -O2'
+ export CFLAGS
+ CXXFLAGS='-pipe -frecord-gcc-switches -Wall -g -O2'
+ export CXXFLAGS
+ FFLAGS='-pipe -frecord-gcc-switches -Wall -g -O2'
+ export FFLAGS
+ /usr/bin/python setup.py install --skip-build --root=/usr/src/tmp/python-module-pelican-buildroot --force
running install
running install_lib
creating /usr/src/tmp/python-module-pelican-buildroot
creating /usr/src/tmp/python-module-pelican-buildroot/usr
creating /usr/src/tmp/python-module-pelican-buildroot/usr/lib
creating /usr/src/tmp/python-module-pelican-buildroot/usr/lib/python2.7
creating /usr/src/tmp/python-module-pelican-buildroot/usr/lib/python2.7/site-packages
creating /usr/src/tmp/python-module-pelican-buildroot/usr/lib/python2.7/site-packages/pelican
creating /usr/src/tmp/python-module-pelican-buildroot/usr/lib/python2.7/site-packages/pelican/themes
creating /usr/src/tmp/python-module-pelican-buildroot/usr/lib/python2.7/site-packages/pelican/themes/notmyidea
creating /usr/src/tmp/python-module-pelican-buildroot/usr/lib/python2.7/site-packages/pelican/themes/notmyidea/static
creating /usr/src/tmp/python-module-pelican-buildroot/usr/lib/python2.7/site-packages/pelican/themes/notmyidea/static/css
copying build/lib/pelican/themes/notmyidea/static/css/fonts.css -> /usr/src/tmp/python-module-pelican-buildroot/usr/lib/python2.7/site-packages/pelican/themes/notmyidea/static/css
copying build/lib/pelican/themes/notmyidea/static/css/main.css -> /usr/src/tmp/python-module-pelican-buildroot/usr/lib/python2.7/site-packages/pelican/themes/notmyidea/static/css
copying build/lib/pelican/themes/notmyidea/static/css/pygment.css -> /usr/src/tmp/python-module-pelican-buildroot/usr/lib/python2.7/site-packages/pelican/themes/notmyidea/static/css
copying build/lib/pelican/themes/notmyidea/static/css/reset.css -> /usr/src/tmp/python-module-pelican-buildroot/usr/lib/python2.7/site-packages/pelican/themes/notmyidea/static/css
copying build/lib/pelican/themes/notmyidea/static/css/typogrify.css -> /usr/src/tmp/python-module-pelican-buildroot/usr/lib/python2.7/site-packages/pelican/themes/notmyidea/static/css
copying build/lib/pelican/themes/notmyidea/static/css/wide.css -> /usr/src/tmp/python-module-pelican-buildroot/usr/lib/python2.7/site-packages/pelican/themes/notmyidea/static/css
creating /usr/src/tmp/python-module-pelican-buildroot/usr/lib/python2.7/site-packages/pelican/themes/notmyidea/static/fonts
copying build/lib/pelican/themes/notmyidea/static/fonts/Yanone_Kaffeesatz_400.eot -> /usr/src/tmp/python-module-pelican-buildroot/usr/lib/python2.7/site-packages/pelican/themes/notmyidea/static/fonts
copying build/lib/pelican/themes/notmyidea/static/fonts/Yanone_Kaffeesatz_400.svg -> /usr/src/tmp/python-module-pelican-buildroot/usr/lib/python2.7/site-packages/pelican/themes/notmyidea/static/fonts
copying build/lib/pelican/themes/notmyidea/static/fonts/Yanone_Kaffeesatz_400.ttf -> /usr/src/tmp/python-module-pelican-buildroot/usr/lib/python2.7/site-packages/pelican/themes/notmyidea/static/fonts
copying build/lib/pelican/themes/notmyidea/static/fonts/Yanone_Kaffeesatz_400.woff -> /usr/src/tmp/python-module-pelican-buildroot/usr/lib/python2.7/site-packages/pelican/themes/notmyidea/static/fonts
copying build/lib/pelican/themes/notmyidea/static/fonts/Yanone_Kaffeesatz_400.woff2 -> /usr/src/tmp/python-module-pelican-buildroot/usr/lib/python2.7/site-packages/pelican/themes/notmyidea/static/fonts
copying build/lib/pelican/themes/notmyidea/static/fonts/font.css -> /usr/src/tmp/python-module-pelican-buildroot/usr/lib/python2.7/site-packages/pelican/themes/notmyidea/static/fonts
creating /usr/src/tmp/python-module-pelican-buildroot/usr/lib/python2.7/site-packages/pelican/themes/notmyidea/static/images
creating /usr/src/tmp/python-module-pelican-buildroot/usr/lib/python2.7/site-packages/pelican/themes/notmyidea/static/images/icons
copying build/lib/pelican/themes/notmyidea/static/images/icons/aboutme.png -> /usr/src/tmp/python-module-pelican-buildroot/usr/lib/python2.7/site-packages/pelican/themes/notmyidea/static/images/icons
copying build/lib/pelican/themes/notmyidea/static/images/icons/bitbucket.png -> /usr/src/tmp/python-module-pelican-buildroot/usr/lib/python2.7/site-packages/pelican/themes/notmyidea/static/images/icons
copying build/lib/pelican/themes/notmyidea/static/images/icons/delicious.png -> /usr/src/tmp/python-module-pelican-buildroot/usr/lib/python2.7/site-packages/pelican/themes/notmyidea/static/images/icons
copying build/lib/pelican/themes/notmyidea/static/images/icons/facebook.png -> /usr/src/tmp/python-module-pelican-buildroot/usr/lib/python2.7/site-packages/pelican/themes/notmyidea/static/images/icons
copying build/lib/pelican/themes/notmyidea/static/images/icons/github.png -> /usr/src/tmp/python-module-pelican-buildroot/usr/lib/python2.7/site-packages/pelican/themes/notmyidea/static/images/icons
copying build/lib/pelican/themes/notmyidea/static/images/icons/gitorious.png -> /usr/src/tmp/python-module-pelican-buildroot/usr/lib/python2.7/site-packages/pelican/themes/notmyidea/static/images/icons
copying build/lib/pelican/themes/notmyidea/static/images/icons/gittip.png -> /usr/src/tmp/python-module-pelican-buildroot/usr/lib/python2.7/site-packages/pelican/themes/notmyidea/static/images/icons
copying build/lib/pelican/themes/notmyidea/static/images/icons/google-groups.png -> /usr/src/tmp/python-module-pelican-buildroot/usr/lib/python2.7/site-packages/pelican/themes/notmyidea/static/images/icons
copying build/lib/pelican/themes/notmyidea/static/images/icons/google-plus.png -> /usr/src/tmp/python-module-pelican-buildroot/usr/lib/python2.7/site-packages/pelican/themes/notmyidea/static/images/icons
copying build/lib/pelican/themes/notmyidea/static/images/icons/hackernews.png -> /usr/src/tmp/python-module-pelican-buildroot/usr/lib/python2.7/site-packages/pelican/themes/notmyidea/static/images/icons
copying build/lib/pelican/themes/notmyidea/static/images/icons/lastfm.png -> /usr/src/tmp/python-module-pelican-buildroot/usr/lib/python2.7/site-packages/pelican/themes/notmyidea/static/images/icons
copying build/lib/pelican/themes/notmyidea/static/images/icons/linkedin.png -> /usr/src/tmp/python-module-pelican-buildroot/usr/lib/python2.7/site-packages/pelican/themes/notmyidea/static/images/icons
copying build/lib/pelican/themes/notmyidea/static/images/icons/reddit.png -> /usr/src/tmp/python-module-pelican-buildroot/usr/lib/python2.7/site-packages/pelican/themes/notmyidea/static/images/icons
copying build/lib/pelican/themes/notmyidea/static/images/icons/rss.png -> /usr/src/tmp/python-module-pelican-buildroot/usr/lib/python2.7/site-packages/pelican/themes/notmyidea/static/images/icons
copying build/lib/pelican/themes/notmyidea/static/images/icons/slideshare.png -> /usr/src/tmp/python-module-pelican-buildroot/usr/lib/python2.7/site-packages/pelican/themes/notmyidea/static/images/icons
copying build/lib/pelican/themes/notmyidea/static/images/icons/speakerdeck.png -> /usr/src/tmp/python-module-pelican-buildroot/usr/lib/python2.7/site-packages/pelican/themes/notmyidea/static/images/icons
copying build/lib/pelican/themes/notmyidea/static/images/icons/stackoverflow.png -> /usr/src/tmp/python-module-pelican-buildroot/usr/lib/python2.7/site-packages/pelican/themes/notmyidea/static/images/icons
copying build/lib/pelican/themes/notmyidea/static/images/icons/twitter.png -> /usr/src/tmp/python-module-pelican-buildroot/usr/lib/python2.7/site-packages/pelican/themes/notmyidea/static/images/icons
copying build/lib/pelican/themes/notmyidea/static/images/icons/vimeo.png -> /usr/src/tmp/python-module-pelican-buildroot/usr/lib/python2.7/site-packages/pelican/themes/notmyidea/static/images/icons
copying build/lib/pelican/themes/notmyidea/static/images/icons/youtube.png -> /usr/src/tmp/python-module-pelican-buildroot/usr/lib/python2.7/site-packages/pelican/themes/notmyidea/static/images/icons
creating /usr/src/tmp/python-module-pelican-buildroot/usr/lib/python2.7/site-packages/pelican/themes/notmyidea/templates
copying build/lib/pelican/themes/notmyidea/templates/analytics.html -> /usr/src/tmp/python-module-pelican-buildroot/usr/lib/python2.7/site-packages/pelican/themes/notmyidea/templates
copying build/lib/pelican/themes/notmyidea/templates/archives.html -> /usr/src/tmp/python-module-pelican-buildroot/usr/lib/python2.7/site-packages/pelican/themes/notmyidea/templates
copying build/lib/pelican/themes/notmyidea/templates/article.html -> /usr/src/tmp/python-module-pelican-buildroot/usr/lib/python2.7/site-packages/pelican/themes/notmyidea/templates
copying build/lib/pelican/themes/notmyidea/templates/article_infos.html -> /usr/src/tmp/python-module-pelican-buildroot/usr/lib/python2.7/site-packages/pelican/themes/notmyidea/templates
copying build/lib/pelican/themes/notmyidea/templates/author.html -> /usr/src/tmp/python-module-pelican-buildroot/usr/lib/python2.7/site-packages/pelican/themes/notmyidea/templates
copying build/lib/pelican/themes/notmyidea/templates/authors.html -> /usr/src/tmp/python-module-pelican-buildroot/usr/lib/python2.7/site-packages/pelican/themes/notmyidea/templates
copying build/lib/pelican/themes/notmyidea/templates/base.html -> /usr/src/tmp/python-module-pelican-buildroot/usr/lib/python2.7/site-packages/pelican/themes/notmyidea/templates
copying build/lib/pelican/themes/notmyidea/templates/category.html -> /usr/src/tmp/python-module-pelican-buildroot/usr/lib/python2.7/site-packages/pelican/themes/notmyidea/templates
copying build/lib/pelican/themes/notmyidea/templates/comments.html -> /usr/src/tmp/python-module-pelican-buildroot/usr/lib/python2.7/site-packages/pelican/themes/notmyidea/templates
copying build/lib/pelican/themes/notmyidea/templates/disqus_script.html -> /usr/src/tmp/python-module-pelican-buildroot/usr/lib/python2.7/site-packages/pelican/themes/notmyidea/templates
copying build/lib/pelican/themes/notmyidea/templates/github.html -> /usr/src/tmp/python-module-pelican-buildroot/usr/lib/python2.7/site-packages/pelican/themes/notmyidea/templates
copying build/lib/pelican/themes/notmyidea/templates/index.html -> /usr/src/tmp/python-module-pelican-buildroot/usr/lib/python2.7/site-packages/pelican/themes/notmyidea/templates
copying build/lib/pelican/themes/notmyidea/templates/page.html -> /usr/src/tmp/python-module-pelican-buildroot/usr/lib/python2.7/site-packages/pelican/themes/notmyidea/templates
copying build/lib/pelican/themes/notmyidea/templates/period_archives.html -> /usr/src/tmp/python-module-pelican-buildroot/usr/lib/python2.7/site-packages/pelican/themes/notmyidea/templates
copying build/lib/pelican/themes/notmyidea/templates/tag.html -> /usr/src/tmp/python-module-pelican-buildroot/usr/lib/python2.7/site-packages/pelican/themes/notmyidea/templates
copying build/lib/pelican/themes/notmyidea/templates/taglist.html -> /usr/src/tmp/python-module-pelican-buildroot/usr/lib/python2.7/site-packages/pelican/themes/notmyidea/templates
copying build/lib/pelican/themes/notmyidea/templates/tags.html -> /usr/src/tmp/python-module-pelican-buildroot/usr/lib/python2.7/site-packages/pelican/themes/notmyidea/templates
copying build/lib/pelican/themes/notmyidea/templates/translations.html -> /usr/src/tmp/python-module-pelican-buildroot/usr/lib/python2.7/site-packages/pelican/themes/notmyidea/templates
copying build/lib/pelican/themes/notmyidea/templates/twitter.html -> /usr/src/tmp/python-module-pelican-buildroot/usr/lib/python2.7/site-packages/pelican/themes/notmyidea/templates
creating /usr/src/tmp/python-module-pelican-buildroot/usr/lib/python2.7/site-packages/pelican/themes/simple
creating /usr/src/tmp/python-module-pelican-buildroot/usr/lib/python2.7/site-packages/pelican/themes/simple/templates
copying build/lib/pelican/themes/simple/templates/archives.html -> /usr/src/tmp/python-module-pelican-buildroot/usr/lib/python2.7/site-packages/pelican/themes/simple/templates
copying build/lib/pelican/themes/simple/templates/article.html -> /usr/src/tmp/python-module-pelican-buildroot/usr/lib/python2.7/site-packages/pelican/themes/simple/templates
copying build/lib/pelican/themes/simple/templates/author.html -> /usr/src/tmp/python-module-pelican-buildroot/usr/lib/python2.7/site-packages/pelican/themes/simple/templates
copying build/lib/pelican/themes/simple/templates/authors.html -> /usr/src/tmp/python-module-pelican-buildroot/usr/lib/python2.7/site-packages/pelican/themes/simple/templates
copying build/lib/pelican/themes/simple/templates/base.html -> /usr/src/tmp/python-module-pelican-buildroot/usr/lib/python2.7/site-packages/pelican/themes/simple/templates
copying build/lib/pelican/themes/simple/templates/categories.html -> /usr/src/tmp/python-module-pelican-buildroot/usr/lib/python2.7/site-packages/pelican/themes/simple/templates
copying build/lib/pelican/themes/simple/templates/category.html -> /usr/src/tmp/python-module-pelican-buildroot/usr/lib/python2.7/site-packages/pelican/themes/simple/templates
copying build/lib/pelican/themes/simple/templates/gosquared.html -> /usr/src/tmp/python-module-pelican-buildroot/usr/lib/python2.7/site-packages/pelican/themes/simple/templates
copying build/lib/pelican/themes/simple/templates/index.html -> /usr/src/tmp/python-module-pelican-buildroot/usr/lib/python2.7/site-packages/pelican/themes/simple/templates
copying build/lib/pelican/themes/simple/templates/page.html -> /usr/src/tmp/python-module-pelican-buildroot/usr/lib/python2.7/site-packages/pelican/themes/simple/templates
copying build/lib/pelican/themes/simple/templates/pagination.html -> /usr/src/tmp/python-module-pelican-buildroot/usr/lib/python2.7/site-packages/pelican/themes/simple/templates
copying build/lib/pelican/themes/simple/templates/period_archives.html -> /usr/src/tmp/python-module-pelican-buildroot/usr/lib/python2.7/site-packages/pelican/themes/simple/templates
copying build/lib/pelican/themes/simple/templates/tag.html -> /usr/src/tmp/python-module-pelican-buildroot/usr/lib/python2.7/site-packages/pelican/themes/simple/templates
copying build/lib/pelican/themes/simple/templates/tags.html -> /usr/src/tmp/python-module-pelican-buildroot/usr/lib/python2.7/site-packages/pelican/themes/simple/templates
copying build/lib/pelican/themes/simple/templates/translations.html -> /usr/src/tmp/python-module-pelican-buildroot/usr/lib/python2.7/site-packages/pelican/themes/simple/templates
creating /usr/src/tmp/python-module-pelican-buildroot/usr/lib/python2.7/site-packages/pelican/tools
creating /usr/src/tmp/python-module-pelican-buildroot/usr/lib/python2.7/site-packages/pelican/tools/templates
copying build/lib/pelican/tools/templates/Makefile.jinja2 -> /usr/src/tmp/python-module-pelican-buildroot/usr/lib/python2.7/site-packages/pelican/tools/templates
copying build/lib/pelican/tools/templates/pelicanconf.py.jinja2 -> /usr/src/tmp/python-module-pelican-buildroot/usr/lib/python2.7/site-packages/pelican/tools/templates
copying build/lib/pelican/tools/templates/publishconf.py.jinja2 -> /usr/src/tmp/python-module-pelican-buildroot/usr/lib/python2.7/site-packages/pelican/tools/templates
copying build/lib/pelican/tools/templates/tasks.py.jinja2 -> /usr/src/tmp/python-module-pelican-buildroot/usr/lib/python2.7/site-packages/pelican/tools/templates
copying build/lib/pelican/tools/__init__.py -> /usr/src/tmp/python-module-pelican-buildroot/usr/lib/python2.7/site-packages/pelican/tools
copying build/lib/pelican/tools/pelican_import.py -> /usr/src/tmp/python-module-pelican-buildroot/usr/lib/python2.7/site-packages/pelican/tools
copying build/lib/pelican/tools/pelican_quickstart.py -> /usr/src/tmp/python-module-pelican-buildroot/usr/lib/python2.7/site-packages/pelican/tools
copying build/lib/pelican/tools/pelican_themes.py -> /usr/src/tmp/python-module-pelican-buildroot/usr/lib/python2.7/site-packages/pelican/tools
copying build/lib/pelican/__init__.py -> /usr/src/tmp/python-module-pelican-buildroot/usr/lib/python2.7/site-packages/pelican
copying build/lib/pelican/cache.py -> /usr/src/tmp/python-module-pelican-buildroot/usr/lib/python2.7/site-packages/pelican
copying build/lib/pelican/contents.py -> /usr/src/tmp/python-module-pelican-buildroot/usr/lib/python2.7/site-packages/pelican
copying build/lib/pelican/generators.py -> /usr/src/tmp/python-module-pelican-buildroot/usr/lib/python2.7/site-packages/pelican
copying build/lib/pelican/log.py -> /usr/src/tmp/python-module-pelican-buildroot/usr/lib/python2.7/site-packages/pelican
copying build/lib/pelican/paginator.py -> /usr/src/tmp/python-module-pelican-buildroot/usr/lib/python2.7/site-packages/pelican
copying build/lib/pelican/readers.py -> /usr/src/tmp/python-module-pelican-buildroot/usr/lib/python2.7/site-packages/pelican
copying build/lib/pelican/rstdirectives.py -> /usr/src/tmp/python-module-pelican-buildroot/usr/lib/python2.7/site-packages/pelican
copying build/lib/pelican/server.py -> /usr/src/tmp/python-module-pelican-buildroot/usr/lib/python2.7/site-packages/pelican
copying build/lib/pelican/settings.py -> /usr/src/tmp/python-module-pelican-buildroot/usr/lib/python2.7/site-packages/pelican
copying build/lib/pelican/signals.py -> /usr/src/tmp/python-module-pelican-buildroot/usr/lib/python2.7/site-packages/pelican
copying build/lib/pelican/urlwrappers.py -> /usr/src/tmp/python-module-pelican-buildroot/usr/lib/python2.7/site-packages/pelican
copying build/lib/pelican/utils.py -> /usr/src/tmp/python-module-pelican-buildroot/usr/lib/python2.7/site-packages/pelican
copying build/lib/pelican/writers.py -> /usr/src/tmp/python-module-pelican-buildroot/usr/lib/python2.7/site-packages/pelican
byte-compiling /usr/src/tmp/python-module-pelican-buildroot/usr/lib/python2.7/site-packages/pelican/tools/__init__.py to __init__.pyc
byte-compiling /usr/src/tmp/python-module-pelican-buildroot/usr/lib/python2.7/site-packages/pelican/tools/pelican_import.py to pelican_import.pyc
byte-compiling /usr/src/tmp/python-module-pelican-buildroot/usr/lib/python2.7/site-packages/pelican/tools/pelican_quickstart.py to pelican_quickstart.pyc
byte-compiling /usr/src/tmp/python-module-pelican-buildroot/usr/lib/python2.7/site-packages/pelican/tools/pelican_themes.py to pelican_themes.pyc
byte-compiling /usr/src/tmp/python-module-pelican-buildroot/usr/lib/python2.7/site-packages/pelican/__init__.py to __init__.pyc
byte-compiling /usr/src/tmp/python-module-pelican-buildroot/usr/lib/python2.7/site-packages/pelican/cache.py to cache.pyc
byte-compiling /usr/src/tmp/python-module-pelican-buildroot/usr/lib/python2.7/site-packages/pelican/contents.py to contents.pyc
byte-compiling /usr/src/tmp/python-module-pelican-buildroot/usr/lib/python2.7/site-packages/pelican/generators.py to generators.pyc
byte-compiling /usr/src/tmp/python-module-pelican-buildroot/usr/lib/python2.7/site-packages/pelican/log.py to log.pyc
byte-compiling /usr/src/tmp/python-module-pelican-buildroot/usr/lib/python2.7/site-packages/pelican/paginator.py to paginator.pyc
byte-compiling /usr/src/tmp/python-module-pelican-buildroot/usr/lib/python2.7/site-packages/pelican/readers.py to readers.pyc
byte-compiling /usr/src/tmp/python-module-pelican-buildroot/usr/lib/python2.7/site-packages/pelican/rstdirectives.py to rstdirectives.pyc
byte-compiling /usr/src/tmp/python-module-pelican-buildroot/usr/lib/python2.7/site-packages/pelican/server.py to server.pyc
byte-compiling /usr/src/tmp/python-module-pelican-buildroot/usr/lib/python2.7/site-packages/pelican/settings.py to settings.pyc
byte-compiling /usr/src/tmp/python-module-pelican-buildroot/usr/lib/python2.7/site-packages/pelican/signals.py to signals.pyc
byte-compiling /usr/src/tmp/python-module-pelican-buildroot/usr/lib/python2.7/site-packages/pelican/urlwrappers.py to urlwrappers.pyc
byte-compiling /usr/src/tmp/python-module-pelican-buildroot/usr/lib/python2.7/site-packages/pelican/utils.py to utils.pyc
byte-compiling /usr/src/tmp/python-module-pelican-buildroot/usr/lib/python2.7/site-packages/pelican/writers.py to writers.pyc
running install_egg_info
running egg_info
creating pelican.egg-info
writing requirements to pelican.egg-info/requires.txt
writing pelican.egg-info/PKG-INFO
writing top-level names to pelican.egg-info/top_level.txt
writing dependency_links to pelican.egg-info/dependency_links.txt
writing entry points to pelican.egg-info/entry_points.txt
writing manifest file 'pelican.egg-info/SOURCES.txt'
reading manifest file 'pelican.egg-info/SOURCES.txt'
reading manifest template 'MANIFEST.in'
'pelican/tests/output/custom_locale/posts/2012/février/29/second-article/index.html' not ANSI_X3.4-1968 encodable -- skipping
'pelican/tests/output/custom_locale/posts/2011/février/17/article-3/index.html' not ANSI_X3.4-1968 encodable -- skipping
'pelican/tests/output/custom_locale/posts/2011/février/17/article-2/index.html' not ANSI_X3.4-1968 encodable -- skipping
'pelican/tests/output/custom_locale/posts/2011/février/17/article-1/index.html' not ANSI_X3.4-1968 encodable -- skipping
'pelican/tests/output/custom_locale/posts/2010/décembre/02/this-is-a-super-article/index.html' not ANSI_X3.4-1968 encodable -- skipping
writing manifest file 'pelican.egg-info/SOURCES.txt'
Copying pelican.egg-info to /usr/src/tmp/python-module-pelican-buildroot/usr/lib/python2.7/site-packages/pelican-4.0.1-py2.7.egg-info
running install_scripts
Installing pelican script to /usr/src/tmp/python-module-pelican-buildroot/usr/bin
Installing pelican-import script to /usr/src/tmp/python-module-pelican-buildroot/usr/bin
Installing pelican-quickstart script to /usr/src/tmp/python-module-pelican-buildroot/usr/bin
Installing pelican-themes script to /usr/src/tmp/python-module-pelican-buildroot/usr/bin
+ /usr/lib/rpm/brp-alt
Cleaning files in /usr/src/tmp/python-module-pelican-buildroot (auto)
Verifying and fixing files in /usr/src/tmp/python-module-pelican-buildroot (binconfig,pkgconfig,libtool,desktop,gnuconfig)
Checking contents of files in /usr/src/tmp/python-module-pelican-buildroot/ (default)
Compressing files in /usr/src/tmp/python-module-pelican-buildroot (auto)
Adjusting library links in /usr/src/tmp/python-module-pelican-buildroot
./usr/lib:
Verifying ELF objects in /usr/src/tmp/python-module-pelican-buildroot (arch=normal,fhs=normal,lfs=relaxed,lint=relaxed,rpath=normal,stack=normal,textrel=normal,unresolved=normal)
Bytecompiling python modules in /usr/src/tmp/python-module-pelican-buildroot using /usr/bin/python
unlink /usr/src/tmp/python-module-pelican-buildroot/usr/lib/python2.7/site-packages/pelican/tools/__init__.pyc
unlink /usr/src/tmp/python-module-pelican-buildroot/usr/lib/python2.7/site-packages/pelican/tools/pelican_import.pyc
unlink /usr/src/tmp/python-module-pelican-buildroot/usr/lib/python2.7/site-packages/pelican/tools/pelican_quickstart.pyc
unlink /usr/src/tmp/python-module-pelican-buildroot/usr/lib/python2.7/site-packages/pelican/tools/pelican_themes.pyc
compile /usr/src/tmp/python-module-pelican-buildroot/usr/lib/python2.7/site-packages/pelican/tools/__init__.py
compile /usr/src/tmp/python-module-pelican-buildroot/usr/lib/python2.7/site-packages/pelican/tools/pelican_import.py
compile /usr/src/tmp/python-module-pelican-buildroot/usr/lib/python2.7/site-packages/pelican/tools/pelican_quickstart.py
compile /usr/src/tmp/python-module-pelican-buildroot/usr/lib/python2.7/site-packages/pelican/tools/pelican_themes.py
unlink /usr/src/tmp/python-module-pelican-buildroot/usr/lib/python2.7/site-packages/pelican/__init__.pyc
unlink /usr/src/tmp/python-module-pelican-buildroot/usr/lib/python2.7/site-packages/pelican/cache.pyc
unlink /usr/src/tmp/python-module-pelican-buildroot/usr/lib/python2.7/site-packages/pelican/contents.pyc
unlink /usr/src/tmp/python-module-pelican-buildroot/usr/lib/python2.7/site-packages/pelican/generators.pyc
unlink /usr/src/tmp/python-module-pelican-buildroot/usr/lib/python2.7/site-packages/pelican/log.pyc
unlink /usr/src/tmp/python-module-pelican-buildroot/usr/lib/python2.7/site-packages/pelican/paginator.pyc
unlink /usr/src/tmp/python-module-pelican-buildroot/usr/lib/python2.7/site-packages/pelican/readers.pyc
unlink /usr/src/tmp/python-module-pelican-buildroot/usr/lib/python2.7/site-packages/pelican/rstdirectives.pyc
unlink /usr/src/tmp/python-module-pelican-buildroot/usr/lib/python2.7/site-packages/pelican/server.pyc
unlink /usr/src/tmp/python-module-pelican-buildroot/usr/lib/python2.7/site-packages/pelican/settings.pyc
unlink /usr/src/tmp/python-module-pelican-buildroot/usr/lib/python2.7/site-packages/pelican/signals.pyc
unlink /usr/src/tmp/python-module-pelican-buildroot/usr/lib/python2.7/site-packages/pelican/urlwrappers.pyc
unlink /usr/src/tmp/python-module-pelican-buildroot/usr/lib/python2.7/site-packages/pelican/utils.pyc
unlink /usr/src/tmp/python-module-pelican-buildroot/usr/lib/python2.7/site-packages/pelican/writers.pyc
compile /usr/src/tmp/python-module-pelican-buildroot/usr/lib/python2.7/site-packages/pelican/__init__.py
compile /usr/src/tmp/python-module-pelican-buildroot/usr/lib/python2.7/site-packages/pelican/cache.py
compile /usr/src/tmp/python-module-pelican-buildroot/usr/lib/python2.7/site-packages/pelican/contents.py
compile /usr/src/tmp/python-module-pelican-buildroot/usr/lib/python2.7/site-packages/pelican/generators.py
compile /usr/src/tmp/python-module-pelican-buildroot/usr/lib/python2.7/site-packages/pelican/log.py
compile /usr/src/tmp/python-module-pelican-buildroot/usr/lib/python2.7/site-packages/pelican/paginator.py
compile /usr/src/tmp/python-module-pelican-buildroot/usr/lib/python2.7/site-packages/pelican/readers.py
compile /usr/src/tmp/python-module-pelican-buildroot/usr/lib/python2.7/site-packages/pelican/rstdirectives.py
compile /usr/src/tmp/python-module-pelican-buildroot/usr/lib/python2.7/site-packages/pelican/server.py
compile /usr/src/tmp/python-module-pelican-buildroot/usr/lib/python2.7/site-packages/pelican/settings.py
compile /usr/src/tmp/python-module-pelican-buildroot/usr/lib/python2.7/site-packages/pelican/signals.py
compile /usr/src/tmp/python-module-pelican-buildroot/usr/lib/python2.7/site-packages/pelican/urlwrappers.py
compile /usr/src/tmp/python-module-pelican-buildroot/usr/lib/python2.7/site-packages/pelican/utils.py
compile /usr/src/tmp/python-module-pelican-buildroot/usr/lib/python2.7/site-packages/pelican/writers.py
Bytecompiling python modules with optimization in /usr/src/tmp/python-module-pelican-buildroot using /usr/bin/python -O
compile /usr/src/tmp/python-module-pelican-buildroot/usr/lib/python2.7/site-packages/pelican/tools/__init__.py
compile /usr/src/tmp/python-module-pelican-buildroot/usr/lib/python2.7/site-packages/pelican/tools/pelican_import.py
compile /usr/src/tmp/python-module-pelican-buildroot/usr/lib/python2.7/site-packages/pelican/tools/pelican_quickstart.py
compile /usr/src/tmp/python-module-pelican-buildroot/usr/lib/python2.7/site-packages/pelican/tools/pelican_themes.py
compile /usr/src/tmp/python-module-pelican-buildroot/usr/lib/python2.7/site-packages/pelican/__init__.py
compile /usr/src/tmp/python-module-pelican-buildroot/usr/lib/python2.7/site-packages/pelican/cache.py
compile /usr/src/tmp/python-module-pelican-buildroot/usr/lib/python2.7/site-packages/pelican/contents.py
compile /usr/src/tmp/python-module-pelican-buildroot/usr/lib/python2.7/site-packages/pelican/generators.py
compile /usr/src/tmp/python-module-pelican-buildroot/usr/lib/python2.7/site-packages/pelican/log.py
compile /usr/src/tmp/python-module-pelican-buildroot/usr/lib/python2.7/site-packages/pelican/paginator.py
compile /usr/src/tmp/python-module-pelican-buildroot/usr/lib/python2.7/site-packages/pelican/readers.py
compile /usr/src/tmp/python-module-pelican-buildroot/usr/lib/python2.7/site-packages/pelican/rstdirectives.py
compile /usr/src/tmp/python-module-pelican-buildroot/usr/lib/python2.7/site-packages/pelican/server.py
compile /usr/src/tmp/python-module-pelican-buildroot/usr/lib/python2.7/site-packages/pelican/settings.py
compile /usr/src/tmp/python-module-pelican-buildroot/usr/lib/python2.7/site-packages/pelican/signals.py
compile /usr/src/tmp/python-module-pelican-buildroot/usr/lib/python2.7/site-packages/pelican/urlwrappers.py
compile /usr/src/tmp/python-module-pelican-buildroot/usr/lib/python2.7/site-packages/pelican/utils.py
compile /usr/src/tmp/python-module-pelican-buildroot/usr/lib/python2.7/site-packages/pelican/writers.py
Hardlinking identical .pyc and .pyo files
'./usr/lib/python2.7/site-packages/pelican/writers.pyo' => './usr/lib/python2.7/site-packages/pelican/writers.pyc'
'./usr/lib/python2.7/site-packages/pelican/utils.pyo' => './usr/lib/python2.7/site-packages/pelican/utils.pyc'
'./usr/lib/python2.7/site-packages/pelican/urlwrappers.pyo' => './usr/lib/python2.7/site-packages/pelican/urlwrappers.pyc'
'./usr/lib/python2.7/site-packages/pelican/signals.pyo' => './usr/lib/python2.7/site-packages/pelican/signals.pyc'
'./usr/lib/python2.7/site-packages/pelican/settings.pyo' => './usr/lib/python2.7/site-packages/pelican/settings.pyc'
'./usr/lib/python2.7/site-packages/pelican/server.pyo' => './usr/lib/python2.7/site-packages/pelican/server.pyc'
'./usr/lib/python2.7/site-packages/pelican/rstdirectives.pyo' => './usr/lib/python2.7/site-packages/pelican/rstdirectives.pyc'
'./usr/lib/python2.7/site-packages/pelican/readers.pyo' => './usr/lib/python2.7/site-packages/pelican/readers.pyc'
'./usr/lib/python2.7/site-packages/pelican/paginator.pyo' => './usr/lib/python2.7/site-packages/pelican/paginator.pyc'
'./usr/lib/python2.7/site-packages/pelican/log.pyo' => './usr/lib/python2.7/site-packages/pelican/log.pyc'
'./usr/lib/python2.7/site-packages/pelican/generators.pyo' => './usr/lib/python2.7/site-packages/pelican/generators.pyc'
'./usr/lib/python2.7/site-packages/pelican/contents.pyo' => './usr/lib/python2.7/site-packages/pelican/contents.pyc'
'./usr/lib/python2.7/site-packages/pelican/cache.pyo' => './usr/lib/python2.7/site-packages/pelican/cache.pyc'
'./usr/lib/python2.7/site-packages/pelican/__init__.pyo' => './usr/lib/python2.7/site-packages/pelican/__init__.pyc'
'./usr/lib/python2.7/site-packages/pelican/tools/pelican_themes.pyo' => './usr/lib/python2.7/site-packages/pelican/tools/pelican_themes.pyc'
'./usr/lib/python2.7/site-packages/pelican/tools/pelican_quickstart.pyo' => './usr/lib/python2.7/site-packages/pelican/tools/pelican_quickstart.pyc'
'./usr/lib/python2.7/site-packages/pelican/tools/__init__.pyo' => './usr/lib/python2.7/site-packages/pelican/tools/__init__.pyc'
Executing(%check): /bin/sh -e /usr/src/tmp/rpm-tmp.88633
+ umask 022
+ /bin/mkdir -p /usr/src/RPM/BUILD
+ cd /usr/src/RPM/BUILD
+ cd pelican-4.0.1
+ LC_ALL=en_US.UTF-8
+ python -m unittest discover
.....................................................................sssssssss..................EEE.........EF...F.FF.....F..F....FFFE............F...............................................................F....F......
======================================================================
ERROR: test_basic_generation_works (pelican.tests.test_pelican.TestPelican)
----------------------------------------------------------------------
Traceback (most recent call last):
  File "/usr/src/RPM/BUILD/pelican-4.0.1/pelican/tests/test_pelican.py", line 113, in test_basic_generation_works
    self.temp_path, os.path.join(OUTPUT_PATH, 'basic'))
  File "/usr/src/RPM/BUILD/pelican-4.0.1/pelican/tests/test_pelican.py", line 69, in assertDirsEqual
    stderr=subprocess.PIPE
  File "/usr/lib64/python2.7/subprocess.py", line 394, in __init__
    errread, errwrite)
  File "/usr/lib64/python2.7/subprocess.py", line 1047, in _execute_child
    raise child_exception
OSError: [Errno 2] No such file or directory

======================================================================
ERROR: test_custom_generation_works (pelican.tests.test_pelican.TestPelican)
----------------------------------------------------------------------
Traceback (most recent call last):
  File "/usr/src/RPM/BUILD/pelican-4.0.1/pelican/tests/test_pelican.py", line 130, in test_custom_generation_works
    self.temp_path, os.path.join(OUTPUT_PATH, 'custom'))
  File "/usr/src/RPM/BUILD/pelican-4.0.1/pelican/tests/test_pelican.py", line 69, in assertDirsEqual
    stderr=subprocess.PIPE
  File "/usr/lib64/python2.7/subprocess.py", line 394, in __init__
    errread, errwrite)
  File "/usr/lib64/python2.7/subprocess.py", line 1047, in _execute_child
    raise child_exception
OSError: [Errno 2] No such file or directory

======================================================================
ERROR: test_custom_locale_generation_works (pelican.tests.test_pelican.TestPelican)
Test that generation with fr_FR.UTF-8 locale works
----------------------------------------------------------------------
Traceback (most recent call last):
  File "/usr/src/RPM/BUILD/pelican-4.0.1/pelican/tests/test_pelican.py", line 150, in test_custom_locale_generation_works
    self.temp_path, os.path.join(OUTPUT_PATH, 'custom_locale'))
  File "/usr/src/RPM/BUILD/pelican-4.0.1/pelican/tests/test_pelican.py", line 69, in assertDirsEqual
    stderr=subprocess.PIPE
  File "/usr/lib64/python2.7/subprocess.py", line 394, in __init__
    errread, errwrite)
  File "/usr/lib64/python2.7/subprocess.py", line 1047, in _execute_child
    raise child_exception
OSError: [Errno 2] No such file or directory

======================================================================
ERROR: pelican.tests.test_importer (unittest.loader.ModuleImportFailure)
----------------------------------------------------------------------
ImportError: Failed to import test module: pelican.tests.test_importer
Traceback (most recent call last):
  File "/usr/lib64/python2.7/unittest/loader.py", line 254, in _find_tests
    module = self._get_module_from_name(name)
  File "/usr/lib64/python2.7/unittest/loader.py", line 232, in _get_module_from_name
    __import__(name)
  File "/usr/src/RPM/BUILD/pelican-4.0.1/pelican/tests/test_importer.py", line 12, in <module>
    from pelican.tools.pelican_import import (blogger2fields, build_header,
  File "/usr/src/RPM/BUILD/pelican-4.0.1/pelican/tools/pelican_import.py", line 23, in <module>
    from html import unescape  # py3.4+
ImportWarning: Not importing directory '/usr/src/RPM/BUILD/pelican-4.0.1/html': missing __init__.py


======================================================================
ERROR: test_tag_and_category_links_on_generated_pages (pelican.tests.test_generators.TestPageGenerator)
----------------------------------------------------------------------
Traceback (most recent call last):
  File "/usr/src/RPM/BUILD/pelican-4.0.1/pelican/tests/test_generators.py", line 745, in test_tag_and_category_links_on_generated_pages
    test_content = pages_by_title['Page with a bunch of links'].content
KeyError: u'Page with a bunch of links'

======================================================================
FAIL: test_article_order_by (pelican.tests.test_generators.TestArticlesGenerator)
----------------------------------------------------------------------
Traceback (most recent call last):
  File "/usr/src/RPM/BUILD/pelican-4.0.1/pelican/tests/test_generators.py", line 583, in test_article_order_by
    self.assertEqual(articles, expected)
AssertionError: Lists differ: [u'An Article With Code Block ... != [u'An Article With Code Block ...

First differing element 3:
u'Article with template'
u'Article with markdown and summary metadata multi'

Second list contains 10 additional elements.
First extra element 19:
u'This is a super article !'

Diff is 1388 characters long. Set self.maxDiff to None to see it.

======================================================================
FAIL: test_do_not_use_folder_as_category (pelican.tests.test_generators.TestArticlesGenerator)
----------------------------------------------------------------------
Traceback (most recent call last):
  File "/usr/src/RPM/BUILD/pelican-4.0.1/pelican/tests/test_generators.py", line 324, in test_do_not_use_folder_as_category
    self.assertIn(sorted(categories), categories_alternatives)
AssertionError: [u'Default', u'yeah'] not found in ([u'Default', u'Yeah', u'test', u'\u6307\u5c0e\u66f8'], [u'Default', u'test', u'yeah', u'\u6307\u5c0e\u66f8'])

======================================================================
FAIL: test_generate_categories (pelican.tests.test_generators.TestArticlesGenerator)
----------------------------------------------------------------------
Traceback (most recent call last):
  File "/usr/src/RPM/BUILD/pelican-4.0.1/pelican/tests/test_generators.py", line 296, in test_generate_categories
    self.assertIn(sorted(categories), categories_alternatives)
AssertionError: [u'Default', u'TestCategory', u'yeah'] not found in ([u'Default', u'TestCategory', u'Yeah', u'test', u'\u6307\u5c0e\u66f8'], [u'Default', u'TestCategory', u'test', u'yeah', u'\u6307\u5c0e\u66f8'])

======================================================================
FAIL: test_generate_context (pelican.tests.test_generators.TestArticlesGenerator)
----------------------------------------------------------------------
Traceback (most recent call last):
  File "/usr/src/RPM/BUILD/pelican-4.0.1/pelican/tests/test_generators.py", line 284, in test_generate_context
    self.assertEqual(sorted(articles_expected), sorted(self.articles))
AssertionError: Lists differ: [[u'An Article With Code Block... != [[u'An Article With Code Block...

First differing element 3:
[u'Article with markdown and summary metadata multi', u'published', u'Default', u'article']
[u'Article with template', u'published', u'Default', u'custom']

First list contains 10 additional elements.
First extra element 19:
[u'This is a super article !', u'published', u'yeah', u'article']

Diff is 2534 characters long. Set self.maxDiff to None to see it.

======================================================================
FAIL: test_standard_metadata_in_default_metadata (pelican.tests.test_generators.TestArticlesGenerator)
----------------------------------------------------------------------
Traceback (most recent call last):
  File "/usr/src/RPM/BUILD/pelican-4.0.1/pelican/tests/test_generators.py", line 531, in test_standard_metadata_in_default_metadata
    self.assertIn(categories, categories_expected)
AssertionError: [u'Default', u'TestCategory', u'yeah'] not found in [[u'Default', u'TestCategory', u'test', u'yeah', u'\u6307\u5c0e\u66f8'], [u'Default', u'TestCategory', u'Yeah', u'test', u'\u6307\u5c0e\u66f8']]

======================================================================
FAIL: test_get_files_exclude (pelican.tests.test_generators.TestGenerator)
Test that Generator.get_files() properly excludes directories.
----------------------------------------------------------------------
Traceback (most recent call last):
  File "/usr/src/RPM/BUILD/pelican-4.0.1/pelican/tests/test_generators.py", line 68, in test_get_files_exclude
    "get_files() failed to find one or more files")
AssertionError: get_files() failed to find one or more files

======================================================================
FAIL: test_generate_context (pelican.tests.test_generators.TestPageGenerator)
----------------------------------------------------------------------
Traceback (most recent call last):
  File "/usr/src/RPM/BUILD/pelican-4.0.1/pelican/tests/test_generators.py", line 653, in test_generate_context
    self.assertEqual(sorted(pages_expected), sorted(pages))
AssertionError: Lists differ: [[u'A Page (Test) for sorting'... != [[u'A Page (Test) for sorting'...

First differing element 1:
[u'Page with a bunch of links', u'published', u'page']
[u'This is a test page', u'published', u'page']

First list contains 3 additional elements.
First extra element 3:
[u'This is a markdown test page', u'published', u'page']

  [[u'A Page (Test) for sorting', u'published', u'page'],
-  [u'Page with a bunch of links', u'published', u'page'],
-  [u'Page with static links', u'published', u'page'],
-  [u'This is a markdown test page', u'published', u'page'],
   [u'This is a test page', u'published', u'page'],
   [u'This is a test page with a preset template', u'published', u'custom']]

======================================================================
FAIL: test_generate_sorted (pelican.tests.test_generators.TestPageGenerator)
----------------------------------------------------------------------
Traceback (most recent call last):
  File "/usr/src/RPM/BUILD/pelican-4.0.1/pelican/tests/test_generators.py", line 688, in test_generate_sorted
    self.assertEqual(pages_expected_sorted_by_filename, pages)
AssertionError: Lists differ: [[u'This is a test page', u'pu... != [[u'This is a test page', u'pu...

First differing element 1:
[u'This is a markdown test page', u'published', u'page']
[u'A Page (Test) for sorting', u'published', u'page']

First list contains 3 additional elements.
First extra element 3:
[u'Page with a bunch of links', u'published', u'page']

  [[u'This is a test page', u'published', u'page'],
-  [u'This is a markdown test page', u'published', u'page'],
   [u'A Page (Test) for sorting', u'published', u'page'],
-  [u'Page with a bunch of links', u'published', u'page'],
-  [u'Page with static links', u'published', u'page'],
   [u'This is a test page with a preset template', u'published', u'custom']]

======================================================================
FAIL: test_static_and_attach_links_on_generated_pages (pelican.tests.test_generators.TestPageGenerator)
----------------------------------------------------------------------
Traceback (most recent call last):
  File "/usr/src/RPM/BUILD/pelican-4.0.1/pelican/tests/test_generators.py", line 766, in test_static_and_attach_links_on_generated_pages
    context['static_links'])
AssertionError: u'pelican/tests/TestPages/image0.jpg' not found in set([])

======================================================================
FAIL: test_static_exclude_sources (pelican.tests.test_generators.TestStaticGenerator)
Test that StaticGenerator respects STATIC_EXCLUDE_SOURCES.
----------------------------------------------------------------------
Traceback (most recent call last):
  File "/usr/src/RPM/BUILD/pelican-4.0.1/pelican/tests/test_generators.py", line 947, in test_static_exclude_sources
    "STATIC_EXCLUDE_SOURCES=True failed to exclude a markdown file")
AssertionError: STATIC_EXCLUDE_SOURCES=True failed to exclude a markdown file

======================================================================
FAIL: test_link_to_unknown_file (pelican.tests.test_contents.TestStatic)
{filename} link to unknown file should trigger warning.
----------------------------------------------------------------------
Traceback (most recent call last):
  File "/usr/src/RPM/BUILD/pelican-4.0.1/pelican/tests/test_contents.py", line 885, in test_link_to_unknown_file
    level=logging.WARNING)
  File "/usr/src/RPM/BUILD/pelican-4.0.1/pelican/tests/support.py", line 220, in assertLogCountEqual
    count, msg, actual))
AssertionError: expected 1 occurrences of u"Unable to find 'foo', skipping url replacement.", but found 0

======================================================================
FAIL: test_article_object_caching (pelican.tests.test_cache.TestCache)
Test Article objects caching at the generator level
----------------------------------------------------------------------
Traceback (most recent call last):
  File "/usr/src/RPM/BUILD/pelican-4.0.1/pelican/tests/test_cache.py", line 166, in test_article_object_caching
    self.assertEqual(generator.readers.read_file.call_count, 6)
AssertionError: 3 != 6

----------------------------------------------------------------------
Ran 222 tests in 5.845s

FAILED (failures=12, errors=5, skipped=9)
+ :
+ exit 0
Processing files: python-module-pelican-4.0.1-alt1
Executing(%doc): /bin/sh -e /usr/src/tmp/rpm-tmp.4895
+ umask 022
+ /bin/mkdir -p /usr/src/RPM/BUILD
+ cd /usr/src/RPM/BUILD
+ cd pelican-4.0.1
+ DOCDIR=/usr/src/tmp/python-module-pelican-buildroot/usr/share/doc/python-module-pelican-4.0.1
+ export DOCDIR
+ rm -rf /usr/src/tmp/python-module-pelican-buildroot/usr/share/doc/python-module-pelican-4.0.1
+ /bin/mkdir -p /usr/src/tmp/python-module-pelican-buildroot/usr/share/doc/python-module-pelican-4.0.1
+ cp -prL html README.rst LICENSE /usr/src/tmp/python-module-pelican-buildroot/usr/share/doc/python-module-pelican-4.0.1
+ chmod -R go-w /usr/src/tmp/python-module-pelican-buildroot/usr/share/doc/python-module-pelican-4.0.1
+ chmod -R a+rX /usr/src/tmp/python-module-pelican-buildroot/usr/share/doc/python-module-pelican-4.0.1
+ exit 0
Finding Provides (using /usr/lib/rpm/find-provides)
Executing: /bin/sh -e /usr/src/tmp/rpm-tmp.aZCB4G
find-provides: running scripts (alternatives,debuginfo,lib,pam,perl,pkgconfig,python,shell)
Finding Requires (using /usr/lib/rpm/find-requires)
Executing: /bin/sh -e /usr/src/tmp/rpm-tmp.4O8BKf
find-requires: running scripts (cpp,debuginfo,files,lib,pam,perl,pkgconfig,pkgconfiglib,python,rpmlib,shebang,shell,static,symlinks,systemd-services)
python.req: /usr/src/tmp/python-module-pelican-buildroot/usr/bin/pelican: skipping sys
python.req: /usr/src/tmp/python-module-pelican-buildroot/usr/bin/pelican-import: skipping sys
python.req: /usr/src/tmp/python-module-pelican-buildroot/usr/bin/pelican-quickstart: skipping sys
python.req: /usr/src/tmp/python-module-pelican-buildroot/usr/bin/pelican-themes: skipping sys
python.req: /usr/src/tmp/python-module-pelican-buildroot/usr/lib/python2.7/site-packages/pelican/__init__.py: skipping sys
python.req: /usr/src/tmp/python-module-pelican-buildroot/usr/lib/python2.7/site-packages/pelican/__init__.py: hiding pelican, which SEEMS TO BE SELF-SATISFIED
python.req: /usr/src/tmp/python-module-pelican-buildroot/usr/lib/python2.7/site-packages/pelican/__init__.py: hiding pelican, which SEEMS TO BE SELF-SATISFIED
python.req: /usr/src/tmp/python-module-pelican-buildroot/usr/lib/python2.7/site-packages/pelican/__init__.py: hiding pelican, which SEEMS TO BE SELF-SATISFIED
python.req: /usr/src/tmp/python-module-pelican-buildroot/usr/lib/python2.7/site-packages/pelican/__init__.py: hiding pelican, which SEEMS TO BE SELF-SATISFIED
python.req: /usr/src/tmp/python-module-pelican-buildroot/usr/lib/python2.7/site-packages/pelican/__init__.py: hiding pelican, which SEEMS TO BE SELF-SATISFIED
python.req: /usr/src/tmp/python-module-pelican-buildroot/usr/lib/python2.7/site-packages/pelican/__init__.py: hiding pelican, which SEEMS TO BE SELF-SATISFIED
python.req: /usr/src/tmp/python-module-pelican-buildroot/usr/lib/python2.7/site-packages/pelican/__init__.py: hiding pelican, which SEEMS TO BE SELF-SATISFIED
python.req: /usr/src/tmp/python-module-pelican-buildroot/usr/lib/python2.7/site-packages/pelican/__init__.py: hiding pelican, which SEEMS TO BE SELF-SATISFIED
python.req: /usr/src/tmp/python-module-pelican-buildroot/usr/lib/python2.7/site-packages/pelican/cache.py: hiding pelican, which SEEMS TO BE SELF-SATISFIED
/usr/lib/rpm/python.req.py: /usr/src/tmp/python-module-pelican-buildroot/usr/lib/python2.7/site-packages/pelican/cache.py: line=30 IGNORE (for REQ=slight and deep=15) module=gzip
python.req: /usr/src/tmp/python-module-pelican-buildroot/usr/lib/python2.7/site-packages/pelican/contents.py: skipping sys
python.req: /usr/src/tmp/python-module-pelican-buildroot/usr/lib/python2.7/site-packages/pelican/contents.py: hiding pelican, which SEEMS TO BE SELF-SATISFIED
python.req: /usr/src/tmp/python-module-pelican-buildroot/usr/lib/python2.7/site-packages/pelican/contents.py: hiding pelican, which SEEMS TO BE SELF-SATISFIED
python.req: /usr/src/tmp/python-module-pelican-buildroot/usr/lib/python2.7/site-packages/pelican/contents.py: hiding pelican, which SEEMS TO BE SELF-SATISFIED
python.req: /usr/src/tmp/python-module-pelican-buildroot/usr/lib/python2.7/site-packages/pelican/contents.py: hiding pelican, which SEEMS TO BE SELF-SATISFIED
python.req: /usr/src/tmp/python-module-pelican-buildroot/usr/lib/python2.7/site-packages/pelican/generators.py: skipping errno
python.req: /usr/src/tmp/python-module-pelican-buildroot/usr/lib/python2.7/site-packages/pelican/generators.py: hiding pelican, which SEEMS TO BE SELF-SATISFIED
python.req: /usr/src/tmp/python-module-pelican-buildroot/usr/lib/python2.7/site-packages/pelican/generators.py: hiding pelican, which SEEMS TO BE SELF-SATISFIED
python.req: /usr/src/tmp/python-module-pelican-buildroot/usr/lib/python2.7/site-packages/pelican/generators.py: hiding pelican, which SEEMS TO BE SELF-SATISFIED
python.req: /usr/src/tmp/python-module-pelican-buildroot/usr/lib/python2.7/site-packages/pelican/generators.py: hiding pelican, which SEEMS TO BE SELF-SATISFIED
python.req: /usr/src/tmp/python-module-pelican-buildroot/usr/lib/python2.7/site-packages/pelican/generators.py: hiding pelican, which SEEMS TO BE SELF-SATISFIED
python.req: /usr/src/tmp/python-module-pelican-buildroot/usr/lib/python2.7/site-packages/pelican/log.py: skipping sys
/usr/lib/rpm/python.req.py: /usr/src/tmp/python-module-pelican-buildroot/usr/lib/python2.7/site-packages/pelican/log.py: line=251 IGNORE (for REQ=slight and deep=8) module=warnings
python.req: /usr/src/tmp/python-module-pelican-buildroot/usr/lib/python2.7/site-packages/pelican/readers.py: hiding pelican, which SEEMS TO BE SELF-SATISFIED
python.req: /usr/src/tmp/python-module-pelican-buildroot/usr/lib/python2.7/site-packages/pelican/readers.py: hiding pelican, which SEEMS TO BE SELF-SATISFIED
python.req: /usr/src/tmp/python-module-pelican-buildroot/usr/lib/python2.7/site-packages/pelican/readers.py: hiding pelican, which SEEMS TO BE SELF-SATISFIED
python.req: /usr/src/tmp/python-module-pelican-buildroot/usr/lib/python2.7/site-packages/pelican/readers.py: hiding pelican, which SEEMS TO BE SELF-SATISFIED
python.req: /usr/src/tmp/python-module-pelican-buildroot/usr/lib/python2.7/site-packages/pelican/readers.py: hiding pelican, which SEEMS TO BE SELF-SATISFIED
/usr/lib/rpm/python.req.py: /usr/src/tmp/python-module-pelican-buildroot/usr/lib/python2.7/site-packages/pelican/readers.py: line=27 IGNORE (for REQ=slight and deep=8) module=markdown
/usr/lib/rpm/python.req.py: /usr/src/tmp/python-module-pelican-buildroot/usr/lib/python2.7/site-packages/pelican/readers.py: line=604 IGNORE (for REQ=slight and deep=15) module=typogrify
/usr/lib/rpm/python.req.py: /usr/src/tmp/python-module-pelican-buildroot/usr/lib/python2.7/site-packages/pelican/readers.py: line=605 IGNORE (for REQ=slight and deep=15) module=smartypants
python.req: /usr/src/tmp/python-module-pelican-buildroot/usr/lib/python2.7/site-packages/pelican/rstdirectives.py: hiding pelican, which SEEMS TO BE SELF-SATISFIED
python.req: /usr/src/tmp/python-module-pelican-buildroot/usr/lib/python2.7/site-packages/pelican/server.py: skipping sys
/usr/lib/rpm/python.req.py: /usr/src/tmp/python-module-pelican-buildroot/usr/lib/python2.7/site-packages/pelican/server.py: line=12 IGNORE (for REQ=slight and deep=8) module=magic
python.req: /usr/src/tmp/python-module-pelican-buildroot/usr/lib/python2.7/site-packages/pelican/server.py: hiding pelican, which SEEMS TO BE SELF-SATISFIED
python.req: /usr/src/tmp/python-module-pelican-buildroot/usr/lib/python2.7/site-packages/pelican/settings.py: hiding pelican, which SEEMS TO BE SELF-SATISFIED
/usr/lib/rpm/python.req.py: /usr/src/tmp/python-module-pelican-buildroot/usr/lib/python2.7/site-packages/pelican/settings.py: line=19 IGNORE (for REQ=slight and deep=8) module=importlib
/usr/lib/rpm/python.req.py: /usr/src/tmp/python-module-pelican-buildroot/usr/lib/python2.7/site-packages/pelican/settings.py: line=25 IGNORE (for REQ=slight and deep=8) module=imp
/usr/lib/rpm/python.req.py: /usr/src/tmp/python-module-pelican-buildroot/usr/lib/python2.7/site-packages/pelican/settings.py: line=556 IGNORE (for REQ=slight and deep=8) module=pelican
python.req: /usr/src/tmp/python-module-pelican-buildroot/usr/lib/python2.7/site-packages/pelican/tools/pelican_import.py: skipping sys
python.req: /usr/src/tmp/python-module-pelican-buildroot/usr/lib/python2.7/site-packages/pelican/tools/pelican_import.py: hiding pelican, which SEEMS TO BE SELF-SATISFIED
python.req: /usr/src/tmp/python-module-pelican-buildroot/usr/lib/python2.7/site-packages/pelican/tools/pelican_import.py: hiding pelican, which SEEMS TO BE SELF-SATISFIED
python.req: /usr/src/tmp/python-module-pelican-buildroot/usr/lib/python2.7/site-packages/pelican/tools/pelican_import.py: hiding pelican, which SEEMS TO BE SELF-SATISFIED
/usr/lib/rpm/python.req.py: /usr/src/tmp/python-module-pelican-buildroot/usr/lib/python2.7/site-packages/pelican/tools/pelican_import.py: line=23 IGNORE (for REQ=slight and deep=8) module=html
/usr/lib/rpm/python.req.py: /usr/src/tmp/python-module-pelican-buildroot/usr/lib/python2.7/site-packages/pelican/tools/pelican_import.py: line=25 IGNORE (for REQ=slight and deep=8) module=six
/usr/lib/rpm/python.req.py: /usr/src/tmp/python-module-pelican-buildroot/usr/lib/python2.7/site-packages/pelican/tools/pelican_import.py: line=122 IGNORE (for REQ=slight and deep=12) module=bs4
/usr/lib/rpm/python.req.py: /usr/src/tmp/python-module-pelican-buildroot/usr/lib/python2.7/site-packages/pelican/tools/pelican_import.py: line=254 IGNORE (for REQ=slight and deep=12) module=bs4
/usr/lib/rpm/python.req.py: /usr/src/tmp/python-module-pelican-buildroot/usr/lib/python2.7/site-packages/pelican/tools/pelican_import.py: line=395 IGNORE (for REQ=slight and deep=8) module=base64
/usr/lib/rpm/python.req.py: /usr/src/tmp/python-module-pelican-buildroot/usr/lib/python2.7/site-packages/pelican/tools/pelican_import.py: line=396 IGNORE (for REQ=slight and deep=8) module=datetime
/usr/lib/rpm/python.req.py: /usr/src/tmp/python-module-pelican-buildroot/usr/lib/python2.7/site-packages/pelican/tools/pelican_import.py: line=399 IGNORE (for REQ=slight and deep=12) module=json
/usr/lib/rpm/python.req.py: /usr/src/tmp/python-module-pelican-buildroot/usr/lib/python2.7/site-packages/pelican/tools/pelican_import.py: line=402 IGNORE (for REQ=slight and deep=12) module=simplejson
/usr/lib/rpm/python.req.py: /usr/src/tmp/python-module-pelican-buildroot/usr/lib/python2.7/site-packages/pelican/tools/pelican_import.py: line=406 IGNORE (for REQ=slight and deep=12) module=urllib
/usr/lib/rpm/python.req.py: /usr/src/tmp/python-module-pelican-buildroot/usr/lib/python2.7/site-packages/pelican/tools/pelican_import.py: line=409 IGNORE (for REQ=slight and deep=12) module=urllib2
/usr/lib/rpm/python.req.py: /usr/src/tmp/python-module-pelican-buildroot/usr/lib/python2.7/site-packages/pelican/tools/pelican_import.py: line=454 IGNORE (for REQ=slight and deep=12) module=json
/usr/lib/rpm/python.req.py: /usr/src/tmp/python-module-pelican-buildroot/usr/lib/python2.7/site-packages/pelican/tools/pelican_import.py: line=457 IGNORE (for REQ=slight and deep=12) module=simplejson
/usr/lib/rpm/python.req.py: /usr/src/tmp/python-module-pelican-buildroot/usr/lib/python2.7/site-packages/pelican/tools/pelican_import.py: line=461 IGNORE (for REQ=slight and deep=12) module=urllib
/usr/lib/rpm/python.req.py: /usr/src/tmp/python-module-pelican-buildroot/usr/lib/python2.7/site-packages/pelican/tools/pelican_import.py: line=464 IGNORE (for REQ=slight and deep=12) module=urllib2
/usr/lib/rpm/python.req.py: /usr/src/tmp/python-module-pelican-buildroot/usr/lib/python2.7/site-packages/pelican/tools/pelican_import.py: line=560 IGNORE (for REQ=slight and deep=8) module=feedparser
/usr/lib/rpm/python.req.py: /usr/src/tmp/python-module-pelican-buildroot/usr/lib/python2.7/site-packages/pelican/tools/pelican_import.py: line=581 IGNORE (for REQ=slight and deep=8) module=docutils
python.req: /usr/src/tmp/python-module-pelican-buildroot/usr/lib/python2.7/site-packages/pelican/tools/pelican_quickstart.py: skipping sys
/usr/lib/rpm/python.req.py: /usr/src/tmp/python-module-pelican-buildroot/usr/lib/python2.7/site-packages/pelican/tools/pelican_quickstart.py: line=15 IGNORE (for REQ=slight and deep=8) module=readline
/usr/lib/rpm/python.req.py: /usr/src/tmp/python-module-pelican-buildroot/usr/lib/python2.7/site-packages/pelican/tools/pelican_quickstart.py: line=20 IGNORE (for REQ=slight and deep=8) module=tzlocal
python.req: /usr/src/tmp/python-module-pelican-buildroot/usr/lib/python2.7/site-packages/pelican/tools/pelican_quickstart.py: hiding pelican, which SEEMS TO BE SELF-SATISFIED
python.req: /usr/src/tmp/python-module-pelican-buildroot/usr/lib/python2.7/site-packages/pelican/tools/pelican_themes.py: skipping sys
/usr/lib/rpm/python.req.py: /usr/src/tmp/python-module-pelican-buildroot/usr/lib/python2.7/site-packages/pelican/tools/pelican_themes.py: line=18 IGNORE (for REQ=slight and deep=8) module=pelican
python.req: /usr/src/tmp/python-module-pelican-buildroot/usr/lib/python2.7/site-packages/pelican/urlwrappers.py: hiding pelican, which SEEMS TO BE SELF-SATISFIED
python.req: /usr/src/tmp/python-module-pelican-buildroot/usr/lib/python2.7/site-packages/pelican/utils.py: skipping errno
python.req: /usr/src/tmp/python-module-pelican-buildroot/usr/lib/python2.7/site-packages/pelican/utils.py: skipping sys
/usr/lib/rpm/python.req.py: /usr/src/tmp/python-module-pelican-buildroot/usr/lib/python2.7/site-packages/pelican/utils.py: line=32 IGNORE (for REQ=slight and deep=8) module=html
/usr/lib/rpm/python.req.py: /usr/src/tmp/python-module-pelican-buildroot/usr/lib/python2.7/site-packages/pelican/utils.py: line=34 IGNORE (for REQ=slight and deep=8) module=cgi
/usr/lib/rpm/python.req.py: /usr/src/tmp/python-module-pelican-buildroot/usr/lib/python2.7/site-packages/pelican/utils.py: line=277 IGNORE (for REQ=slight and deep=8) module=unicodedata
/usr/lib/rpm/python.req.py: /usr/src/tmp/python-module-pelican-buildroot/usr/lib/python2.7/site-packages/pelican/utils.py: line=278 IGNORE (for REQ=slight and deep=8) module=unidecode
python.req: /usr/src/tmp/python-module-pelican-buildroot/usr/lib/python2.7/site-packages/pelican/writers.py: hiding pelican, which SEEMS TO BE SELF-SATISFIED
python.req: /usr/src/tmp/python-module-pelican-buildroot/usr/lib/python2.7/site-packages/pelican/writers.py: hiding pelican, which SEEMS TO BE SELF-SATISFIED
python.req: /usr/src/tmp/python-module-pelican-buildroot/usr/lib/python2.7/site-packages/pelican/writers.py: hiding pelican, which SEEMS TO BE SELF-SATISFIED
/usr/lib/rpm/python.req.py: /usr/src/tmp/python-module-pelican-buildroot/usr/lib/python2.7/site-packages/pelican/writers.py: line=20 IGNORE (for REQ=slight and deep=8) module=codecs
Provides: python2.7(pelican), python2.7(pelican.cache), python2.7(pelican.contents), python2.7(pelican.generators), python2.7(pelican.log), python2.7(pelican.paginator), python2.7(pelican.readers), python2.7(pelican.rstdirectives), python2.7(pelican.server), python2.7(pelican.settings), python2.7(pelican.signals), python2.7(pelican.tools), python2.7(pelican.tools.pelican_import), python2.7(pelican.tools.pelican_quickstart), python2.7(pelican.tools.pelican_themes), python2.7(pelican.urlwrappers), python2.7(pelican.utils), python2.7(pelican.writers)
Requires: python2.7(unidecode), /usr/bin/python, /usr/lib/python2.7/site-packages, python-modules, python2.7(blinker), python2.7(dateutil), python2.7(django), python2.7(docutils), python2.7(inspect), python2.7(jinja2), python2.7(logging), python2.7(multiprocessing), python2.7(pkg_resources), python2.7(pygments), python2.7(pytz), python2.7(six)
Processing files: pelican-4.0.1-alt1
Requires: python-module-pelican, python-module-markdown, python-module-Pygments-tests
Adding to pelican a strict dependency on python-module-pelican
Wrote: /usr/src/RPM/RPMS/noarch/python-module-pelican-4.0.1-alt1.noarch.rpm (w2.lzdio)
Wrote: /usr/src/RPM/RPMS/noarch/pelican-4.0.1-alt1.noarch.rpm (w2.lzdio)
15.64user 1.40system 0:18.67elapsed 91%CPU (0avgtext+0avgdata 77268maxresident)k
0inputs+0outputs (0major+269968minor)pagefaults 0swaps
6.53user 2.39system 0:36.29elapsed 24%CPU (0avgtext+0avgdata 134696maxresident)k
1400inputs+0outputs (0major+231922minor)pagefaults 0swaps
--- python-module-pelican-4.0.1-alt1.noarch.rpm.repo	2019-03-10 16:34:27.000000000 +0000
+++ python-module-pelican-4.0.1-alt1.noarch.rpm.hasher	2024-02-11 15:53:53.420086981 +0000
@@ -274,7 +274,7 @@
 File: /usr/lib/python2.7/site-packages/pelican/contents.py	100644	root:root	7d3522de078ab99ca987724c759126e0	
-File: /usr/lib/python2.7/site-packages/pelican/contents.pyc	100644	root:root	52510c01355ad87f70063161bff413d6	
-File: /usr/lib/python2.7/site-packages/pelican/contents.pyo	100644	root:root	52510c01355ad87f70063161bff413d6	
+File: /usr/lib/python2.7/site-packages/pelican/contents.pyc	100644	root:root	dbcf564e56a0b8ce0b4c60407d8485a8	
+File: /usr/lib/python2.7/site-packages/pelican/contents.pyo	100644	root:root	dbcf564e56a0b8ce0b4c60407d8485a8	
 File: /usr/lib/python2.7/site-packages/pelican/generators.py	100644	root:root	46648593eb6105a58b98edfc787bf613	
-File: /usr/lib/python2.7/site-packages/pelican/generators.pyc	100644	root:root	e756baf23e04df884d5eb68ef4aaae74	
-File: /usr/lib/python2.7/site-packages/pelican/generators.pyo	100644	root:root	e756baf23e04df884d5eb68ef4aaae74	
+File: /usr/lib/python2.7/site-packages/pelican/generators.pyc	100644	root:root	762dee4f4759e42141393b5cc27c5f6f	
+File: /usr/lib/python2.7/site-packages/pelican/generators.pyo	100644	root:root	762dee4f4759e42141393b5cc27c5f6f	
 File: /usr/lib/python2.7/site-packages/pelican/log.py	100644	root:root	6b5ef8c73e191cb4a4d2c5d6b6f611f5	
@@ -286,4 +286,4 @@
 File: /usr/lib/python2.7/site-packages/pelican/readers.py	100644	root:root	488b640fd5cac63c635954951b8a2b85	
-File: /usr/lib/python2.7/site-packages/pelican/readers.pyc	100644	root:root	1300bf18c47483a0ae4ba81709eb8405	
-File: /usr/lib/python2.7/site-packages/pelican/readers.pyo	100644	root:root	1300bf18c47483a0ae4ba81709eb8405	
+File: /usr/lib/python2.7/site-packages/pelican/readers.pyc	100644	root:root	1436e6a47b293f41de82e3b09d5b3592	
+File: /usr/lib/python2.7/site-packages/pelican/readers.pyo	100644	root:root	1436e6a47b293f41de82e3b09d5b3592	
 File: /usr/lib/python2.7/site-packages/pelican/rstdirectives.py	100644	root:root	8434d52558735459448fdd05c15822dc	
@@ -295,4 +295,4 @@
 File: /usr/lib/python2.7/site-packages/pelican/settings.py	100644	root:root	73472b1e3a4d1decb2f15f54e0ac8335	
-File: /usr/lib/python2.7/site-packages/pelican/settings.pyc	100644	root:root	32f6eba489e24df385f502326321a95a	
-File: /usr/lib/python2.7/site-packages/pelican/settings.pyo	100644	root:root	32f6eba489e24df385f502326321a95a	
+File: /usr/lib/python2.7/site-packages/pelican/settings.pyc	100644	root:root	e30e09fa49eea740ce6bd90e20a0b7aa	
+File: /usr/lib/python2.7/site-packages/pelican/settings.pyo	100644	root:root	e30e09fa49eea740ce6bd90e20a0b7aa	
 File: /usr/lib/python2.7/site-packages/pelican/signals.py	100644	root:root	1404c606d74ee3317f98742a922f86ff	
@@ -378,13 +378,13 @@
 File: /usr/lib/python2.7/site-packages/pelican/tools/__init__.py	100644	root:root		
-File: /usr/lib/python2.7/site-packages/pelican/tools/__init__.pyc	100644	root:root	6ef405861938800f6622b48a97759425	
-File: /usr/lib/python2.7/site-packages/pelican/tools/__init__.pyo	100644	root:root	6ef405861938800f6622b48a97759425	
+File: /usr/lib/python2.7/site-packages/pelican/tools/__init__.pyc	100644	root:root	593380e4d2eb7273dd3136b0ca201281	
+File: /usr/lib/python2.7/site-packages/pelican/tools/__init__.pyo	100644	root:root	593380e4d2eb7273dd3136b0ca201281	
 File: /usr/lib/python2.7/site-packages/pelican/tools/pelican_import.py	100644	root:root	208e4d74f527a61f1cbc6ba5df8777c5	
-File: /usr/lib/python2.7/site-packages/pelican/tools/pelican_import.pyc	100644	root:root	c1d96ee51a210159ec1f84bc4776a091	
-File: /usr/lib/python2.7/site-packages/pelican/tools/pelican_import.pyo	100644	root:root	70ff226ed56f8e2a40fa96e3c1b9cda8	
+File: /usr/lib/python2.7/site-packages/pelican/tools/pelican_import.pyc	100644	root:root	e266180511a8747f874acae544b4024d	
+File: /usr/lib/python2.7/site-packages/pelican/tools/pelican_import.pyo	100644	root:root	8f3acac2e8c3d7e85e9c7c7c2d817838	
 File: /usr/lib/python2.7/site-packages/pelican/tools/pelican_quickstart.py	100644	root:root	a632ed344c3606ee53cdc88aefe5a8cf	
-File: /usr/lib/python2.7/site-packages/pelican/tools/pelican_quickstart.pyc	100644	root:root	b500d87c33a694afa1a9aae3cb00e4d2	
-File: /usr/lib/python2.7/site-packages/pelican/tools/pelican_quickstart.pyo	100644	root:root	b500d87c33a694afa1a9aae3cb00e4d2	
+File: /usr/lib/python2.7/site-packages/pelican/tools/pelican_quickstart.pyc	100644	root:root	7ce51da131abbf197cf1140423ca2ba4	
+File: /usr/lib/python2.7/site-packages/pelican/tools/pelican_quickstart.pyo	100644	root:root	7ce51da131abbf197cf1140423ca2ba4	
 File: /usr/lib/python2.7/site-packages/pelican/tools/pelican_themes.py	100644	root:root	7df0f2a8d331c6dc4dbb0c98e43e09ab	
-File: /usr/lib/python2.7/site-packages/pelican/tools/pelican_themes.pyc	100644	root:root	769a0e350144bb06220d6ecbb640a8b7	
-File: /usr/lib/python2.7/site-packages/pelican/tools/pelican_themes.pyo	100644	root:root	769a0e350144bb06220d6ecbb640a8b7	
+File: /usr/lib/python2.7/site-packages/pelican/tools/pelican_themes.pyc	100644	root:root	0ecbc3b9fa533b62d7f37038c705219b	
+File: /usr/lib/python2.7/site-packages/pelican/tools/pelican_themes.pyo	100644	root:root	0ecbc3b9fa533b62d7f37038c705219b	
 File: /usr/lib/python2.7/site-packages/pelican/tools/templates	40755	root:root		
@@ -398,7 +398,7 @@
 File: /usr/lib/python2.7/site-packages/pelican/utils.py	100644	root:root	5ebdfb52aaa4d656f835261a9fcad433	
-File: /usr/lib/python2.7/site-packages/pelican/utils.pyc	100644	root:root	cfe0cef3867a3b7606a5c3d9ee350a4e	
-File: /usr/lib/python2.7/site-packages/pelican/utils.pyo	100644	root:root	cfe0cef3867a3b7606a5c3d9ee350a4e	
+File: /usr/lib/python2.7/site-packages/pelican/utils.pyc	100644	root:root	e0c077ddb9fd6613ee8edc3e063e8c32	
+File: /usr/lib/python2.7/site-packages/pelican/utils.pyo	100644	root:root	e0c077ddb9fd6613ee8edc3e063e8c32	
 File: /usr/lib/python2.7/site-packages/pelican/writers.py	100644	root:root	70c0573d85f65cb8e9b99889ea94c718	
-File: /usr/lib/python2.7/site-packages/pelican/writers.pyc	100644	root:root	677789264ccf92ea9f5a6444a247828b	
-File: /usr/lib/python2.7/site-packages/pelican/writers.pyo	100644	root:root	677789264ccf92ea9f5a6444a247828b	
+File: /usr/lib/python2.7/site-packages/pelican/writers.pyc	100644	root:root	07af049cb0b2cbbcc3476da6b784e98d	
+File: /usr/lib/python2.7/site-packages/pelican/writers.pyo	100644	root:root	07af049cb0b2cbbcc3476da6b784e98d	
 File: /usr/share/doc/python-module-pelican-4.0.1	40755	root:root		
@@ -471,5 +471,5 @@
 File: /usr/share/doc/python-module-pelican-4.0.1/html/searchindex.js	100644	root:root	6a4762455ad3742a598ccb377be7671f	
-File: /usr/share/doc/python-module-pelican-4.0.1/html/settings.html	100644	root:root	6a47aff5ca2f9aed16d8cd18ecf46c1a	
+File: /usr/share/doc/python-module-pelican-4.0.1/html/settings.html	100644	root:root	6965a64f9ed29328f7aa6b2fde8be9d8	
 File: /usr/share/doc/python-module-pelican-4.0.1/html/themes.html	100644	root:root	f3a8b59082f5580a7d74c61bca311bfd	
 File: /usr/share/doc/python-module-pelican-4.0.1/html/tips.html	100644	root:root	cb50f2ab6716120e5cbf46ecb4a69396	
-RPMIdentity: 25f5629e9a803b73b480300d1ee9f83b0d62170ae933575c1cf4a6e764019def2b36bc67e4c25430d577fba1b10eed9ba118671fb8407b48dfe1be0127b95872
+RPMIdentity: 2e3ece665c8bd14684c0b8ecb748fc56e1cad649762d2c17fe3e8f03ac82533fbb935328ee1c403f4999a42e92fa4e75c74ef3ce7cb15673f5b5232be1410e1c