<86>Feb  2 03:24:01 userdel[721167]: delete user 'rooter'
<86>Feb  2 03:24:01 userdel[721167]: removed group 'rooter' owned by 'rooter'
<86>Feb  2 03:24:01 userdel[721167]: removed shadow group 'rooter' owned by 'rooter'
<86>Feb  2 03:24:01 groupadd[721181]: group added to /etc/group: name=rooter, GID=645
<86>Feb  2 03:24:01 groupadd[721181]: group added to /etc/gshadow: name=rooter
<86>Feb  2 03:24:01 groupadd[721181]: new group: name=rooter, GID=645
<86>Feb  2 03:24:01 useradd[721190]: new user: name=rooter, UID=645, GID=645, home=/root, shell=/bin/bash
<86>Feb  2 03:24:01 userdel[721198]: delete user 'builder'
<86>Feb  2 03:24:01 userdel[721198]: removed group 'builder' owned by 'builder'
<86>Feb  2 03:24:01 userdel[721198]: removed shadow group 'builder' owned by 'builder'
<86>Feb  2 03:24:01 groupadd[721206]: group added to /etc/group: name=builder, GID=646
<86>Feb  2 03:24:01 groupadd[721206]: group added to /etc/gshadow: name=builder
<86>Feb  2 03:24:01 groupadd[721206]: new group: name=builder, GID=646
<86>Feb  2 03:24:01 useradd[721214]: new user: name=builder, UID=646, GID=646, home=/usr/src, shell=/bin/bash
<13>Feb  2 03:24:04 rpmi: libidn2-2.2.0-alt1 p9+229971.100.2.1 1558696275 installed
<13>Feb  2 03:24:04 rpmi: libruby-2.5.5-alt3 p9+231429.100.1.1 1559580197 installed
<13>Feb  2 03:24:04 rpmi: rpm-macros-ruby-1:1.0.0-alt7 sisyphus+226987.40.5.1 1556275679 installed
<13>Feb  2 03:24:04 rpmi: libexpat-2.2.4-alt1 1503305341 installed
<13>Feb  2 03:24:04 rpmi: publicsuffix-list-dafsa-20200106-alt1 p9+244008.100.1.1 1578591661 installed
<13>Feb  2 03:24:04 rpmi: libpsl-0.21.0-alt1 sisyphus+227314.100.1.2 1555618432 installed
<13>Feb  2 03:24:04 rpmi: libnghttp2-1.34.0-alt1 sisyphus+222625.100.1.1 1550947249 installed
<13>Feb  2 03:24:04 rpmi: libbrotlicommon-1.0.7-alt1 sisyphus+226738.100.2.1 1554554565 installed
<13>Feb  2 03:24:04 rpmi: libbrotlidec-1.0.7-alt1 sisyphus+226738.100.2.1 1554554565 installed
<13>Feb  2 03:24:04 rpmi: rsync-3.1.3-alt1 1518721083 installed
<13>Feb  2 03:24:04 rpmi: libverto-0.3.0-alt1_7 sisyphus+225932.100.1.1 1553994917 installed
<13>Feb  2 03:24:04 rpmi: libkeyutils-1.6-alt2 sisyphus+226520.100.2.1 1554512088 installed
<13>Feb  2 03:24:04 rpmi: libcom_err-1.44.6-alt1 sisyphus+224154.100.1.1 1552091653 installed
<13>Feb  2 03:24:04 rpmi: libedit3-3.1.20181209-alt1 sisyphus+224773.40.4.1 1552311071 installed
<13>Feb  2 03:24:04 rpmi: less-530-alt1 sisyphus+226367.200.2.2 1554151813 installed
<13>Feb  2 03:24:04 rpmi: ruby-slop3-3.6.0-alt1 1495448712 installed
<13>Feb  2 03:24:04 rpmi: diffstat-1.62-alt1 sisyphus+221902.1600.4.1 1550595227 installed
<13>Feb  2 03:24:04 rpmi: chrpath-0.16-alt1 1453066315 installed
<13>Feb  2 03:24:04 rpmi: libp11-kit-0.23.15-alt1 sisyphus+226408.100.2.1 1554288187 installed
<13>Feb  2 03:24:04 rpmi: libtasn1-4.14-alt1 p9+235792.100.2.1 1565425233 installed
<13>Feb  2 03:24:04 rpmi: libgdbm-1.8.3-alt10 1454943313 installed
<13>Feb  2 03:24:04 rpmi: libyaml2-0.2.2-alt1 sisyphus+229134.100.1.1 1557342720 installed
<13>Feb  2 03:24:04 rpmi: rpm-macros-alternatives-0.5.1-alt1 sisyphus+226946.100.1.1 1554830426 installed
<13>Feb  2 03:24:04 rpmi: alternatives-0.5.1-alt1 sisyphus+226946.100.1.1 1554830426 installed
<13>Feb  2 03:24:04 rpmi: ca-certificates-2019.10.28-alt1 p9+240634.100.1.1 1573575926 installed
<13>Feb  2 03:24:04 rpmi: ca-trust-0.1.2-alt1 p9+233349.100.1.1 1561655062 installed
<13>Feb  2 03:24:04 rpmi: p11-kit-trust-0.23.15-alt1 sisyphus+226408.100.2.1 1554288187 installed
<13>Feb  2 03:24:04 rpmi: libcrypto1.1-1.1.1d-alt1.1 p9+237853.200.3.1 1569251778 installed
<13>Feb  2 03:24:04 rpmi: libssl1.1-1.1.1d-alt1.1 p9+237853.200.3.1 1569251778 installed
<13>Feb  2 03:24:04 rpmi: ruby-rubygems-update-3.0.3-alt1 sisyphus+226411.5400.6.1 1554381326 installed
<13>Feb  2 03:24:04 rpmi: gem-did-you-mean-1.3.0-alt1 sisyphus+219587.100.1.1 1547808061 installed
<13>Feb  2 03:24:04 rpmi: ruby-minitest-5.11.3-alt1 sisyphus+219345.3500.8.1 1547631954 installed
<13>Feb  2 03:24:04 rpmi: ruby-net-telnet-0.2.0-alt1 sisyphus+219345.2700.8.1 1547631566 installed
<13>Feb  2 03:24:04 rpmi: gem-power-assert-1.1.4-alt1 sisyphus+226411.3200.6.1 1554380195 installed
<13>Feb  2 03:24:04 rpmi: rake-12.3.2-alt2 sisyphus+218713.60.1.1 1547734935 installed
<13>Feb  2 03:24:04 rpmi: ruby-rake-12.3.2-alt2 sisyphus+218713.60.1.1 1547734935 installed
<13>Feb  2 03:24:04 rpmi: ruby-test-unit-1:3.3.1-alt1 sisyphus+226411.5300.6.1 1554381151 installed
<13>Feb  2 03:24:04 rpmi: ruby-xmlrpc-0.3.0-alt1 sisyphus+219345.3300.8.1 1547631818 installed
<13>Feb  2 03:24:04 rpmi: gem-2.5.5-alt3 p9+231429.100.1.1 1559580197 installed
<13>Feb  2 03:24:04 rpmi: ri-6.1.1-alt3 sisyphus+220149.7500.44.1 1552167568 installed
<13>Feb  2 03:24:04 rpmi: rdoc-6.1.1-alt3 sisyphus+220149.7500.44.1 1552167568 installed
<13>Feb  2 03:24:04 rpmi: ruby-rdoc-6.1.1-alt3 sisyphus+220149.7500.44.1 1552167568 installed
<13>Feb  2 03:24:05 rpmi: ruby-stdlibs-2.5.5-alt3 p9+231429.100.1.1 1559580197 installed
<13>Feb  2 03:24:05 rpmi: erb-2.5.5-alt3 p9+231429.100.1.1 1559580197 installed
<13>Feb  2 03:24:05 rpmi: irb-2.5.5-alt3 p9+231429.100.1.1 1559580197 installed
<13>Feb  2 03:24:05 rpmi: ruby-bundler-2.0.1-alt1 sisyphus+218713.700.2.1 1547736109 installed
<13>Feb  2 03:24:05 rpmi: bundle-2.0.1-alt1 sisyphus+218713.700.2.1 1547736109 installed
<13>Feb  2 03:24:05 rpmi: ruby-2.5.5-alt3 p9+231429.100.1.1 1559580197 installed
<86>Feb  2 03:24:05 groupadd[729249]: group added to /etc/group: name=_keytab, GID=499
<86>Feb  2 03:24:05 groupadd[729249]: group added to /etc/gshadow: name=_keytab
<86>Feb  2 03:24:05 groupadd[729249]: new group: name=_keytab, GID=499
<13>Feb  2 03:24:05 rpmi: libkrb5-1.17.1-alt1 p9+242852.100.2.1 1576572448 installed
<86>Feb  2 03:24:05 groupadd[729453]: group added to /etc/group: name=sasl, GID=498
<86>Feb  2 03:24:05 groupadd[729453]: group added to /etc/gshadow: name=sasl
<86>Feb  2 03:24:05 groupadd[729453]: new group: name=sasl, GID=498
<13>Feb  2 03:24:05 rpmi: libsasl2-3-2.1.27-alt2 sisyphus+228101.100.1.1 1556139861 installed
<13>Feb  2 03:24:05 rpmi: libldap-2.4.48-alt3 p9+238817.100.1.1 1570449030 installed
<13>Feb  2 03:24:05 rpmi: libcurl-7.65.0-alt1 p9+229801.100.1.1 1558513332 installed
<13>Feb  2 03:24:05 rpmi: ruby-coderay-1.1.2-alt1.1 sisyphus.209945.5500 1537064013 installed
<13>Feb  2 03:24:05 rpmi: ruby-method_source-0.9.0-alt1 sisyphus.209945.31420 1537073074 installed
<13>Feb  2 03:24:05 rpmi: ruby-pry-0.12.2-alt1 sisyphus.216491.100 1542278185 installed
<13>Feb  2 03:24:05 rpmi: gem-setup-5.999.3-alt7 sisyphus+228264.40.4.1 1556619207 installed
<13>Feb  2 03:24:05 rpmi: openssh-common-7.9p1-alt1 p9+233306.100.1.1 1561630922 installed
<86>Feb  2 03:24:05 groupadd[729819]: group added to /etc/group: name=sshagent, GID=497
<86>Feb  2 03:24:05 groupadd[729819]: group added to /etc/gshadow: name=sshagent
<86>Feb  2 03:24:05 groupadd[729819]: new group: name=sshagent, GID=497
<13>Feb  2 03:24:05 rpmi: openssh-clients-7.9p1-alt1 p9+233306.100.1.1 1561630922 installed
<13>Feb  2 03:24:05 rpmi: git-core-2.24.1-alt1 p9+242632.100.1.1 1576011193 installed
<13>Feb  2 03:24:05 rpmi: ruby-tool-setup-3.4.1-alt15 sisyphus+224756.300.2.1 1552290808 installed
<13>Feb  2 03:24:05 rpmi: libruby-devel-2.5.5-alt3 p9+231429.100.1.1 1559580197 installed
<13>Feb  2 03:24:05 rpmi: rpm-build-ruby-1:1.0.0-alt7 sisyphus+226987.40.5.1 1556275679 installed
<13>Feb  2 03:24:10 rpmi: ruby-rspec-support-3.8.0-alt2 sisyphus+225188.1100.2.2 1552931132 installed
<13>Feb  2 03:24:10 rpmi: ruby-unicode-display-width-1.4.1-alt1 sisyphus+220149.172.44.1 1552161057 installed
<13>Feb  2 03:24:10 rpmi: gem-ruby-progressbar-1.10.0-alt2 sisyphus+220149.174.44.1 1552161125 installed
<13>Feb  2 03:24:10 rpmi: gem-rainbow-3.0.0-alt1 sisyphus+220149.75.44.1 1552160366 installed
<13>Feb  2 03:24:10 rpmi: gem-psych-3.1.0-alt1 sisyphus+224856.1100.2.1 1552412416 installed
<13>Feb  2 03:24:10 rpmi: gem-parallel-1.17.0-alt1 sisyphus+226411.3000.6.1 1554380073 installed
<13>Feb  2 03:24:10 rpmi: gem-jaro-winkler-1.5.2-alt2 sisyphus+228264.1600.6.1 1556633610 installed
<13>Feb  2 03:24:10 rpmi: gem-ast-2.4.0-alt1 sisyphus+225188.400.2.2 1552930655 installed
<13>Feb  2 03:24:10 rpmi: gem-parser-2.6.2.0-alt1 sisyphus+226411.1400.6.1 1554379503 installed
<13>Feb  2 03:24:10 rpmi: bc-1:1.07.1-alt1 sisyphus+221902.700.4.1 1550587848 installed
<13>Feb  2 03:24:11 rpmi: libcurl-devel-7.65.0-alt1 p9+229801.100.1.1 1558513332 installed
<13>Feb  2 03:24:11 rpmi: gem-rubocop-0.66.0-alt1 sisyphus+226411.5000.6.1 1554380993 installed
<13>Feb  2 03:24:11 rpmi: ruby-rspec-core-3.8.0-alt2 sisyphus+225188.600.2.2 1552930876 installed
<13>Feb  2 03:24:11 rpmi: xml-utils-1:2.9.10-alt2 p9+240157.100.1.1 1572735290 installed
<13>Feb  2 03:24:11 rpmi: ruby-yard-0.9.19-alt1 sisyphus+226411.5200.6.1 1554381078 installed
<13>Feb  2 03:24:11 rpmi: rake-compiler-1.0.7-alt3 p9+232751.100.2.2 1561158194 installed
<13>Feb  2 03:24:11 rpmi: libxml2-devel-1:2.9.10-alt2 p9+240157.100.1.1 1572735290 installed
Building target platforms: x86_64
Building for target x86_64
Wrote: /usr/src/in/nosrpm/ruby-ovirt-engine-sdk-4.3.0-alt1.nosrc.rpm
Installing ruby-ovirt-engine-sdk-4.3.0-alt1.src.rpm
Building target platforms: x86_64
Building for target x86_64
Executing(%prep): /bin/sh -e /usr/src/tmp/rpm-tmp.82799
+ umask 022
+ /bin/mkdir -p /usr/src/RPM/BUILD
+ cd /usr/src/RPM/BUILD
+ cd /usr/src/RPM/BUILD
+ rm -rf ruby-ovirt-engine-sdk-4.3.0
+ echo 'Source #0 (ruby-ovirt-engine-sdk-4.3.0.tar):'
Source #0 (ruby-ovirt-engine-sdk-4.3.0.tar):
+ /bin/tar -xf /usr/src/RPM/SOURCES/ruby-ovirt-engine-sdk-4.3.0.tar
+ cd ruby-ovirt-engine-sdk-4.3.0
+ /bin/chmod -c -Rf u+rwX,go-w .
++ xmllint pom.xml --xpath '/*[name()='\''project'\'']/*[name()='\''version'\'']/text()'
+ echo 'module OvirtSDK4;VERSION = '\''4.3.0'\'';end'
+ exit 0
Executing(%build): /bin/sh -e /usr/src/tmp/rpm-tmp.32805
+ umask 022
+ /bin/mkdir -p /usr/src/RPM/BUILD
+ cd /usr/src/RPM/BUILD
+ cd ruby-ovirt-engine-sdk-4.3.0
+ /usr/bin/setup.rb build --gem-version-replace=
[setup.rb] -> NoMethodError: undefined method `full_name' for nil:NilClass
gem 'ovirt-engine-sdk' at /usr/src/RPM/BUILD/ruby-ovirt-engine-sdk-4.3.0/sdk
(ruby 2.5.5 x86_64-linux)
ERROR[LoadError]: cannot load such file -- Rakefile

- - PRECONFIG - - - - - - - - - - - - - - - - - - - - - - - - - - - - 

SetupConfig was saved. Edit to customize configuration.

- - COMPILE - - - - - - - - - - - - - - - - - - - - - - - - - - - - - 

[/usr/src/RPM/BUILD/ruby-ovirt-engine-sdk-4.3.0/sdk/ext/ovirtsdk4c]$ ruby extconf.rb -- --use-system-libraries --enable-debug-build
checking for xml2-config... yes
checking for curl-config... yes
creating Makefile
[/usr/src/RPM/BUILD/ruby-ovirt-engine-sdk-4.3.0/sdk/ext/ovirtsdk4c]$ make make
make: Entering directory '/usr/src/RPM/BUILD/ruby-ovirt-engine-sdk-4.3.0/sdk/ext/ovirtsdk4c'
compiling ov_error.c
compiling ov_http_client.c
compiling ov_http_request.c
compiling ov_http_response.c
compiling ov_http_transfer.c
compiling ov_module.c
compiling ov_string.c
compiling ov_xml_reader.c
compiling ov_xml_writer.c
ov_xml_writer.c: In function 'ov_xml_writer_string':
ov_xml_writer.c:184:12: warning: initialization of 'long unsigned int' from 'void *' makes integer from pointer without a cast [-Wint-conversion]
     return rb_funcall(ptr->io, STRING_ID, 0, NULL);
            ^~~~~~~~~~
ov_xml_writer.c:184:12: note: (near initialization for 'rb_funcall_args[0]')
compiling ovirtsdk4c.c
linking shared-object ovirtsdk4c.so
make: Leaving directory '/usr/src/RPM/BUILD/ruby-ovirt-engine-sdk-4.3.0/sdk/ext/ovirtsdk4c'
make: Entering directory '/usr/src/RPM/BUILD/ruby-ovirt-engine-sdk-4.3.0/sdk/ext/ovirtsdk4c'
/bin/install -c -m 0755 ovirtsdk4c.so /usr/src/RPM/BUILD/ruby-ovirt-engine-sdk-4.3.0/sdk/.so.ovirt-engine-sdk/usr/lib/ruby/site_ruby/2.5.5/x86_64-linux
make: Leaving directory '/usr/src/RPM/BUILD/ruby-ovirt-engine-sdk-4.3.0/sdk/ext/ovirtsdk4c'

- - DOCUMENT- - - - - - - - - - - - - - - - - - - - - - - - - - - - - 


+ exit 0
Executing(%install): /bin/sh -e /usr/src/tmp/rpm-tmp.70280
+ umask 022
+ /bin/mkdir -p /usr/src/RPM/BUILD
+ cd /usr/src/RPM/BUILD
+ /bin/chmod -Rf u+rwX -- /usr/src/tmp/ruby-ovirt-engine-sdk-buildroot
+ :
+ /bin/rm -rf -- /usr/src/tmp/ruby-ovirt-engine-sdk-buildroot
+ cd ruby-ovirt-engine-sdk-4.3.0
+ /usr/bin/setup.rb install --install_prefix=/usr/src/tmp/ruby-ovirt-engine-sdk-buildroot
[setup.rb] -> NoMethodError: undefined method `full_name' for nil:NilClass
gem 'ovirt-engine-sdk' at /usr/src/RPM/BUILD/ruby-ovirt-engine-sdk-4.3.0/sdk
(ruby 2.5.5 x86_64-linux)
ERROR[LoadError]: cannot load such file -- Rakefile

- - INSTALL - - - - - - - - - - - - - - - - - - - - - - - - - - - - - 

* bin ->
* ext ->
  - [ovirt-engine-sdk] in .so.ovirt-engine-sdk/usr/lib/ruby/site_ruby/2.5.5/x86_64-linux
    ovirtsdk4c.so => [/usr/src/tmp/ruby-ovirt-engine-sdk-buildroot]/usr/lib/ruby/gems/2.5.0/extensions/x86_64-linux/2.5.0/ovirt-engine-sdk-4.3.0/ovirtsdk4c.so
    gem.build_complete => [/usr/src/tmp/ruby-ovirt-engine-sdk-buildroot]/usr/lib/ruby/gems/2.5.0/extensions/x86_64-linux/2.5.0/ovirt-engine-sdk-4.3.0/gem.build_complete
* lib ->
  - [ovirt-engine-sdk] in lib
    ovirtsdk4/version.rb => [/usr/src/tmp/ruby-ovirt-engine-sdk-buildroot]/usr/lib/ruby/gems/2.5.0/gems/ovirt-engine-sdk-4.3.0/lib/ovirtsdk4/version.rb
    ovirtsdk4/writer.rb => [/usr/src/tmp/ruby-ovirt-engine-sdk-buildroot]/usr/lib/ruby/gems/2.5.0/gems/ovirt-engine-sdk-4.3.0/lib/ovirtsdk4/writer.rb
    ovirtsdk4/type.rb => [/usr/src/tmp/ruby-ovirt-engine-sdk-buildroot]/usr/lib/ruby/gems/2.5.0/gems/ovirt-engine-sdk-4.3.0/lib/ovirtsdk4/type.rb
    ovirtsdk4/service.rb => [/usr/src/tmp/ruby-ovirt-engine-sdk-buildroot]/usr/lib/ruby/gems/2.5.0/gems/ovirt-engine-sdk-4.3.0/lib/ovirtsdk4/service.rb
    ovirtsdk4/reader.rb => [/usr/src/tmp/ruby-ovirt-engine-sdk-buildroot]/usr/lib/ruby/gems/2.5.0/gems/ovirt-engine-sdk-4.3.0/lib/ovirtsdk4/reader.rb
    ovirtsdk4/probe.rb => [/usr/src/tmp/ruby-ovirt-engine-sdk-buildroot]/usr/lib/ruby/gems/2.5.0/gems/ovirt-engine-sdk-4.3.0/lib/ovirtsdk4/probe.rb
    ovirtsdk4/errors.rb => [/usr/src/tmp/ruby-ovirt-engine-sdk-buildroot]/usr/lib/ruby/gems/2.5.0/gems/ovirt-engine-sdk-4.3.0/lib/ovirtsdk4/errors.rb
    ovirtsdk4/connection.rb => [/usr/src/tmp/ruby-ovirt-engine-sdk-buildroot]/usr/lib/ruby/gems/2.5.0/gems/ovirt-engine-sdk-4.3.0/lib/ovirtsdk4/connection.rb
    ovirtsdk4.rb => [/usr/src/tmp/ruby-ovirt-engine-sdk-buildroot]/usr/lib/ruby/gems/2.5.0/gems/ovirt-engine-sdk-4.3.0/lib/ovirtsdk4.rb
* data ->
  - [ovirt-engine-sdk] in .
    .yardopts => [/usr/src/tmp/ruby-ovirt-engine-sdk-buildroot]/usr/lib/ruby/gems/2.5.0/gems/ovirt-engine-sdk-4.3.0/.yardopts
    CHANGES.adoc => [/usr/src/tmp/ruby-ovirt-engine-sdk-buildroot]/usr/lib/ruby/gems/2.5.0/gems/ovirt-engine-sdk-4.3.0/CHANGES.adoc
    LICENSE.txt => [/usr/src/tmp/ruby-ovirt-engine-sdk-buildroot]/usr/lib/ruby/gems/2.5.0/gems/ovirt-engine-sdk-4.3.0/LICENSE.txt
    README.adoc => [/usr/src/tmp/ruby-ovirt-engine-sdk-buildroot]/usr/lib/ruby/gems/2.5.0/gems/ovirt-engine-sdk-4.3.0/README.adoc
* man ->
* ri ->
  - [ovirt-engine-sdk] in .ri.ovirt-engine-sdk
    cache.ri => [/usr/src/tmp/ruby-ovirt-engine-sdk-buildroot]/usr/lib/ruby/gems/2.5.0/doc/ovirt-engine-sdk-4.3.0/ri/cache.ri
    OvirtSDK4/Type/href%3d-i.ri => [/usr/src/tmp/ruby-ovirt-engine-sdk-buildroot]/usr/lib/ruby/gems/2.5.0/doc/ovirt-engine-sdk-4.3.0/ri/OvirtSDK4/Type/href%3d-i.ri
    OvirtSDK4/Type/href-i.ri => [/usr/src/tmp/ruby-ovirt-engine-sdk-buildroot]/usr/lib/ruby/gems/2.5.0/doc/ovirt-engine-sdk-4.3.0/ri/OvirtSDK4/Type/href-i.ri
    OvirtSDK4/Type/dig-i.ri => [/usr/src/tmp/ruby-ovirt-engine-sdk-buildroot]/usr/lib/ruby/gems/2.5.0/doc/ovirt-engine-sdk-4.3.0/ri/OvirtSDK4/Type/dig-i.ri
    OvirtSDK4/Type/cdesc-Type.ri => [/usr/src/tmp/ruby-ovirt-engine-sdk-buildroot]/usr/lib/ruby/gems/2.5.0/doc/ovirt-engine-sdk-4.3.0/ri/OvirtSDK4/Type/cdesc-Type.ri
    OvirtSDK4/cdesc-OvirtSDK4.ri => [/usr/src/tmp/ruby-ovirt-engine-sdk-buildroot]/usr/lib/ruby/gems/2.5.0/doc/ovirt-engine-sdk-4.3.0/ri/OvirtSDK4/cdesc-OvirtSDK4.ri
    OvirtSDK4/Writer/write_string-c.ri => [/usr/src/tmp/ruby-ovirt-engine-sdk-buildroot]/usr/lib/ruby/gems/2.5.0/doc/ovirt-engine-sdk-4.3.0/ri/OvirtSDK4/Writer/write_string-c.ri
    OvirtSDK4/Writer/write_integer-c.ri => [/usr/src/tmp/ruby-ovirt-engine-sdk-buildroot]/usr/lib/ruby/gems/2.5.0/doc/ovirt-engine-sdk-4.3.0/ri/OvirtSDK4/Writer/write_integer-c.ri
    OvirtSDK4/Writer/write_decimal-c.ri => [/usr/src/tmp/ruby-ovirt-engine-sdk-buildroot]/usr/lib/ruby/gems/2.5.0/doc/ovirt-engine-sdk-4.3.0/ri/OvirtSDK4/Writer/write_decimal-c.ri
    OvirtSDK4/Writer/write_date-c.ri => [/usr/src/tmp/ruby-ovirt-engine-sdk-buildroot]/usr/lib/ruby/gems/2.5.0/doc/ovirt-engine-sdk-4.3.0/ri/OvirtSDK4/Writer/write_date-c.ri
    OvirtSDK4/Writer/write_boolean-c.ri => [/usr/src/tmp/ruby-ovirt-engine-sdk-buildroot]/usr/lib/ruby/gems/2.5.0/doc/ovirt-engine-sdk-4.3.0/ri/OvirtSDK4/Writer/write_boolean-c.ri
    OvirtSDK4/Writer/write-c.ri => [/usr/src/tmp/ruby-ovirt-engine-sdk-buildroot]/usr/lib/ruby/gems/2.5.0/doc/ovirt-engine-sdk-4.3.0/ri/OvirtSDK4/Writer/write-c.ri
    OvirtSDK4/Writer/render_integer-c.ri => [/usr/src/tmp/ruby-ovirt-engine-sdk-buildroot]/usr/lib/ruby/gems/2.5.0/doc/ovirt-engine-sdk-4.3.0/ri/OvirtSDK4/Writer/render_integer-c.ri
    OvirtSDK4/Writer/render_decimal-c.ri => [/usr/src/tmp/ruby-ovirt-engine-sdk-buildroot]/usr/lib/ruby/gems/2.5.0/doc/ovirt-engine-sdk-4.3.0/ri/OvirtSDK4/Writer/render_decimal-c.ri
    OvirtSDK4/Writer/render_date-c.ri => [/usr/src/tmp/ruby-ovirt-engine-sdk-buildroot]/usr/lib/ruby/gems/2.5.0/doc/ovirt-engine-sdk-4.3.0/ri/OvirtSDK4/Writer/render_date-c.ri
    OvirtSDK4/Writer/render_boolean-c.ri => [/usr/src/tmp/ruby-ovirt-engine-sdk-buildroot]/usr/lib/ruby/gems/2.5.0/doc/ovirt-engine-sdk-4.3.0/ri/OvirtSDK4/Writer/render_boolean-c.ri
    OvirtSDK4/Writer/render-c.ri => [/usr/src/tmp/ruby-ovirt-engine-sdk-buildroot]/usr/lib/ruby/gems/2.5.0/doc/ovirt-engine-sdk-4.3.0/ri/OvirtSDK4/Writer/render-c.ri
    OvirtSDK4/Writer/register-c.ri => [/usr/src/tmp/ruby-ovirt-engine-sdk-buildroot]/usr/lib/ruby/gems/2.5.0/doc/ovirt-engine-sdk-4.3.0/ri/OvirtSDK4/Writer/register-c.ri
    OvirtSDK4/Writer/cdesc-Writer.ri => [/usr/src/tmp/ruby-ovirt-engine-sdk-buildroot]/usr/lib/ruby/gems/2.5.0/doc/ovirt-engine-sdk-4.3.0/ri/OvirtSDK4/Writer/cdesc-Writer.ri
    OvirtSDK4/List/cdesc-List.ri => [/usr/src/tmp/ruby-ovirt-engine-sdk-buildroot]/usr/lib/ruby/gems/2.5.0/doc/ovirt-engine-sdk-4.3.0/ri/OvirtSDK4/List/cdesc-List.ri
    OvirtSDK4/Struct/hash-i.ri => [/usr/src/tmp/ruby-ovirt-engine-sdk-buildroot]/usr/lib/ruby/gems/2.5.0/doc/ovirt-engine-sdk-4.3.0/ri/OvirtSDK4/Struct/hash-i.ri
    OvirtSDK4/Struct/eql%3f-i.ri => [/usr/src/tmp/ruby-ovirt-engine-sdk-buildroot]/usr/lib/ruby/gems/2.5.0/doc/ovirt-engine-sdk-4.3.0/ri/OvirtSDK4/Struct/eql%3f-i.ri
    OvirtSDK4/Struct/%3d%3d-i.ri => [/usr/src/tmp/ruby-ovirt-engine-sdk-buildroot]/usr/lib/ruby/gems/2.5.0/doc/ovirt-engine-sdk-4.3.0/ri/OvirtSDK4/Struct/%3d%3d-i.ri
    OvirtSDK4/Struct/new-c.ri => [/usr/src/tmp/ruby-ovirt-engine-sdk-buildroot]/usr/lib/ruby/gems/2.5.0/doc/ovirt-engine-sdk-4.3.0/ri/OvirtSDK4/Struct/new-c.ri
    OvirtSDK4/Struct/cdesc-Struct.ri => [/usr/src/tmp/ruby-ovirt-engine-sdk-buildroot]/usr/lib/ruby/gems/2.5.0/doc/ovirt-engine-sdk-4.3.0/ri/OvirtSDK4/Struct/cdesc-Struct.ri
    OvirtSDK4/Service/to_s-i.ri => [/usr/src/tmp/ruby-ovirt-engine-sdk-buildroot]/usr/lib/ruby/gems/2.5.0/doc/ovirt-engine-sdk-4.3.0/ri/OvirtSDK4/Service/to_s-i.ri
    OvirtSDK4/Service/internal_update-i.ri => [/usr/src/tmp/ruby-ovirt-engine-sdk-buildroot]/usr/lib/ruby/gems/2.5.0/doc/ovirt-engine-sdk-4.3.0/ri/OvirtSDK4/Service/internal_update-i.ri
    OvirtSDK4/Service/internal_remove-i.ri => [/usr/src/tmp/ruby-ovirt-engine-sdk-buildroot]/usr/lib/ruby/gems/2.5.0/doc/ovirt-engine-sdk-4.3.0/ri/OvirtSDK4/Service/internal_remove-i.ri
    OvirtSDK4/Service/internal_read_body-i.ri => [/usr/src/tmp/ruby-ovirt-engine-sdk-buildroot]/usr/lib/ruby/gems/2.5.0/doc/ovirt-engine-sdk-4.3.0/ri/OvirtSDK4/Service/internal_read_body-i.ri
    OvirtSDK4/Service/internal_get-i.ri => [/usr/src/tmp/ruby-ovirt-engine-sdk-buildroot]/usr/lib/ruby/gems/2.5.0/doc/ovirt-engine-sdk-4.3.0/ri/OvirtSDK4/Service/internal_get-i.ri
    OvirtSDK4/Service/internal_add-i.ri => [/usr/src/tmp/ruby-ovirt-engine-sdk-buildroot]/usr/lib/ruby/gems/2.5.0/doc/ovirt-engine-sdk-4.3.0/ri/OvirtSDK4/Service/internal_add-i.ri
    OvirtSDK4/Service/internal_action-i.ri => [/usr/src/tmp/ruby-ovirt-engine-sdk-buildroot]/usr/lib/ruby/gems/2.5.0/doc/ovirt-engine-sdk-4.3.0/ri/OvirtSDK4/Service/internal_action-i.ri
    OvirtSDK4/Service/inspect-i.ri => [/usr/src/tmp/ruby-ovirt-engine-sdk-buildroot]/usr/lib/ruby/gems/2.5.0/doc/ovirt-engine-sdk-4.3.0/ri/OvirtSDK4/Service/inspect-i.ri
    OvirtSDK4/Service/connection-i.ri => [/usr/src/tmp/ruby-ovirt-engine-sdk-buildroot]/usr/lib/ruby/gems/2.5.0/doc/ovirt-engine-sdk-4.3.0/ri/OvirtSDK4/Service/connection-i.ri
    OvirtSDK4/Service/check_fault-i.ri => [/usr/src/tmp/ruby-ovirt-engine-sdk-buildroot]/usr/lib/ruby/gems/2.5.0/doc/ovirt-engine-sdk-4.3.0/ri/OvirtSDK4/Service/check_fault-i.ri
    OvirtSDK4/Service/check_action-i.ri => [/usr/src/tmp/ruby-ovirt-engine-sdk-buildroot]/usr/lib/ruby/gems/2.5.0/doc/ovirt-engine-sdk-4.3.0/ri/OvirtSDK4/Service/check_action-i.ri
    OvirtSDK4/Service/absolute_path-i.ri => [/usr/src/tmp/ruby-ovirt-engine-sdk-buildroot]/usr/lib/ruby/gems/2.5.0/doc/ovirt-engine-sdk-4.3.0/ri/OvirtSDK4/Service/absolute_path-i.ri
    OvirtSDK4/Service/new-c.ri => [/usr/src/tmp/ruby-ovirt-engine-sdk-buildroot]/usr/lib/ruby/gems/2.5.0/doc/ovirt-engine-sdk-4.3.0/ri/OvirtSDK4/Service/new-c.ri
    OvirtSDK4/Service/cdesc-Service.ri => [/usr/src/tmp/ruby-ovirt-engine-sdk-buildroot]/usr/lib/ruby/gems/2.5.0/doc/ovirt-engine-sdk-4.3.0/ri/OvirtSDK4/Service/cdesc-Service.ri
    OvirtSDK4/Future/wait-i.ri => [/usr/src/tmp/ruby-ovirt-engine-sdk-buildroot]/usr/lib/ruby/gems/2.5.0/doc/ovirt-engine-sdk-4.3.0/ri/OvirtSDK4/Future/wait-i.ri
    OvirtSDK4/Future/to_s-i.ri => [/usr/src/tmp/ruby-ovirt-engine-sdk-buildroot]/usr/lib/ruby/gems/2.5.0/doc/ovirt-engine-sdk-4.3.0/ri/OvirtSDK4/Future/to_s-i.ri
    OvirtSDK4/Future/inspect-i.ri => [/usr/src/tmp/ruby-ovirt-engine-sdk-buildroot]/usr/lib/ruby/gems/2.5.0/doc/ovirt-engine-sdk-4.3.0/ri/OvirtSDK4/Future/inspect-i.ri
    OvirtSDK4/Future/new-c.ri => [/usr/src/tmp/ruby-ovirt-engine-sdk-buildroot]/usr/lib/ruby/gems/2.5.0/doc/ovirt-engine-sdk-4.3.0/ri/OvirtSDK4/Future/new-c.ri
    OvirtSDK4/Future/cdesc-Future.ri => [/usr/src/tmp/ruby-ovirt-engine-sdk-buildroot]/usr/lib/ruby/gems/2.5.0/doc/ovirt-engine-sdk-4.3.0/ri/OvirtSDK4/Future/cdesc-Future.ri
    OvirtSDK4/Reader/register-c.ri => [/usr/src/tmp/ruby-ovirt-engine-sdk-buildroot]/usr/lib/ruby/gems/2.5.0/doc/ovirt-engine-sdk-4.3.0/ri/OvirtSDK4/Reader/register-c.ri
    OvirtSDK4/Reader/read_strings-c.ri => [/usr/src/tmp/ruby-ovirt-engine-sdk-buildroot]/usr/lib/ruby/gems/2.5.0/doc/ovirt-engine-sdk-4.3.0/ri/OvirtSDK4/Reader/read_strings-c.ri
    OvirtSDK4/Reader/read_string-c.ri => [/usr/src/tmp/ruby-ovirt-engine-sdk-buildroot]/usr/lib/ruby/gems/2.5.0/doc/ovirt-engine-sdk-4.3.0/ri/OvirtSDK4/Reader/read_string-c.ri
    OvirtSDK4/Reader/read_integers-c.ri => [/usr/src/tmp/ruby-ovirt-engine-sdk-buildroot]/usr/lib/ruby/gems/2.5.0/doc/ovirt-engine-sdk-4.3.0/ri/OvirtSDK4/Reader/read_integers-c.ri
    OvirtSDK4/Reader/read_integer-c.ri => [/usr/src/tmp/ruby-ovirt-engine-sdk-buildroot]/usr/lib/ruby/gems/2.5.0/doc/ovirt-engine-sdk-4.3.0/ri/OvirtSDK4/Reader/read_integer-c.ri
    OvirtSDK4/Reader/read_enums-c.ri => [/usr/src/tmp/ruby-ovirt-engine-sdk-buildroot]/usr/lib/ruby/gems/2.5.0/doc/ovirt-engine-sdk-4.3.0/ri/OvirtSDK4/Reader/read_enums-c.ri
    OvirtSDK4/Reader/read_enum-c.ri => [/usr/src/tmp/ruby-ovirt-engine-sdk-buildroot]/usr/lib/ruby/gems/2.5.0/doc/ovirt-engine-sdk-4.3.0/ri/OvirtSDK4/Reader/read_enum-c.ri
    OvirtSDK4/Reader/read_decimals-c.ri => [/usr/src/tmp/ruby-ovirt-engine-sdk-buildroot]/usr/lib/ruby/gems/2.5.0/doc/ovirt-engine-sdk-4.3.0/ri/OvirtSDK4/Reader/read_decimals-c.ri
    OvirtSDK4/Reader/read_decimal-c.ri => [/usr/src/tmp/ruby-ovirt-engine-sdk-buildroot]/usr/lib/ruby/gems/2.5.0/doc/ovirt-engine-sdk-4.3.0/ri/OvirtSDK4/Reader/read_decimal-c.ri
    OvirtSDK4/Reader/read_dates-c.ri => [/usr/src/tmp/ruby-ovirt-engine-sdk-buildroot]/usr/lib/ruby/gems/2.5.0/doc/ovirt-engine-sdk-4.3.0/ri/OvirtSDK4/Reader/read_dates-c.ri
    OvirtSDK4/Reader/read_date-c.ri => [/usr/src/tmp/ruby-ovirt-engine-sdk-buildroot]/usr/lib/ruby/gems/2.5.0/doc/ovirt-engine-sdk-4.3.0/ri/OvirtSDK4/Reader/read_date-c.ri
    OvirtSDK4/Reader/read_booleans-c.ri => [/usr/src/tmp/ruby-ovirt-engine-sdk-buildroot]/usr/lib/ruby/gems/2.5.0/doc/ovirt-engine-sdk-4.3.0/ri/OvirtSDK4/Reader/read_booleans-c.ri
    OvirtSDK4/Reader/read_boolean-c.ri => [/usr/src/tmp/ruby-ovirt-engine-sdk-buildroot]/usr/lib/ruby/gems/2.5.0/doc/ovirt-engine-sdk-4.3.0/ri/OvirtSDK4/Reader/read_boolean-c.ri
    OvirtSDK4/Reader/read-c.ri => [/usr/src/tmp/ruby-ovirt-engine-sdk-buildroot]/usr/lib/ruby/gems/2.5.0/doc/ovirt-engine-sdk-4.3.0/ri/OvirtSDK4/Reader/read-c.ri
    OvirtSDK4/Reader/parse_integer-c.ri => [/usr/src/tmp/ruby-ovirt-engine-sdk-buildroot]/usr/lib/ruby/gems/2.5.0/doc/ovirt-engine-sdk-4.3.0/ri/OvirtSDK4/Reader/parse_integer-c.ri
    OvirtSDK4/Reader/parse_enum-c.ri => [/usr/src/tmp/ruby-ovirt-engine-sdk-buildroot]/usr/lib/ruby/gems/2.5.0/doc/ovirt-engine-sdk-4.3.0/ri/OvirtSDK4/Reader/parse_enum-c.ri
    OvirtSDK4/Reader/parse_decimal-c.ri => [/usr/src/tmp/ruby-ovirt-engine-sdk-buildroot]/usr/lib/ruby/gems/2.5.0/doc/ovirt-engine-sdk-4.3.0/ri/OvirtSDK4/Reader/parse_decimal-c.ri
    OvirtSDK4/Reader/parse_date-c.ri => [/usr/src/tmp/ruby-ovirt-engine-sdk-buildroot]/usr/lib/ruby/gems/2.5.0/doc/ovirt-engine-sdk-4.3.0/ri/OvirtSDK4/Reader/parse_date-c.ri
    OvirtSDK4/Reader/parse_boolean-c.ri => [/usr/src/tmp/ruby-ovirt-engine-sdk-buildroot]/usr/lib/ruby/gems/2.5.0/doc/ovirt-engine-sdk-4.3.0/ri/OvirtSDK4/Reader/parse_boolean-c.ri
    OvirtSDK4/Reader/cdesc-Reader.ri => [/usr/src/tmp/ruby-ovirt-engine-sdk-buildroot]/usr/lib/ruby/gems/2.5.0/doc/ovirt-engine-sdk-4.3.0/ri/OvirtSDK4/Reader/cdesc-Reader.ri
    OvirtSDK4/ProbeResult/version-i.ri => [/usr/src/tmp/ruby-ovirt-engine-sdk-buildroot]/usr/lib/ruby/gems/2.5.0/doc/ovirt-engine-sdk-4.3.0/ri/OvirtSDK4/ProbeResult/version-i.ri
    OvirtSDK4/ProbeResult/state-i.ri => [/usr/src/tmp/ruby-ovirt-engine-sdk-buildroot]/usr/lib/ruby/gems/2.5.0/doc/ovirt-engine-sdk-4.3.0/ri/OvirtSDK4/ProbeResult/state-i.ri
    OvirtSDK4/ProbeResult/hash-i.ri => [/usr/src/tmp/ruby-ovirt-engine-sdk-buildroot]/usr/lib/ruby/gems/2.5.0/doc/ovirt-engine-sdk-4.3.0/ri/OvirtSDK4/ProbeResult/hash-i.ri
    OvirtSDK4/ProbeResult/eql%3f-i.ri => [/usr/src/tmp/ruby-ovirt-engine-sdk-buildroot]/usr/lib/ruby/gems/2.5.0/doc/ovirt-engine-sdk-4.3.0/ri/OvirtSDK4/ProbeResult/eql%3f-i.ri
    OvirtSDK4/ProbeResult/%3d%3d-i.ri => [/usr/src/tmp/ruby-ovirt-engine-sdk-buildroot]/usr/lib/ruby/gems/2.5.0/doc/ovirt-engine-sdk-4.3.0/ri/OvirtSDK4/ProbeResult/%3d%3d-i.ri
    OvirtSDK4/ProbeResult/new-c.ri => [/usr/src/tmp/ruby-ovirt-engine-sdk-buildroot]/usr/lib/ruby/gems/2.5.0/doc/ovirt-engine-sdk-4.3.0/ri/OvirtSDK4/ProbeResult/new-c.ri
    OvirtSDK4/ProbeResult/cdesc-ProbeResult.ri => [/usr/src/tmp/ruby-ovirt-engine-sdk-buildroot]/usr/lib/ruby/gems/2.5.0/doc/ovirt-engine-sdk-4.3.0/ri/OvirtSDK4/ProbeResult/cdesc-ProbeResult.ri
    OvirtSDK4/Probe/probe-i.ri => [/usr/src/tmp/ruby-ovirt-engine-sdk-buildroot]/usr/lib/ruby/gems/2.5.0/doc/ovirt-engine-sdk-4.3.0/ri/OvirtSDK4/Probe/probe-i.ri
    OvirtSDK4/Probe/exists%3f-i.ri => [/usr/src/tmp/ruby-ovirt-engine-sdk-buildroot]/usr/lib/ruby/gems/2.5.0/doc/ovirt-engine-sdk-4.3.0/ri/OvirtSDK4/Probe/exists%3f-i.ri
    OvirtSDK4/Probe/close-i.ri => [/usr/src/tmp/ruby-ovirt-engine-sdk-buildroot]/usr/lib/ruby/gems/2.5.0/doc/ovirt-engine-sdk-4.3.0/ri/OvirtSDK4/Probe/close-i.ri
    OvirtSDK4/Probe/probe-c.ri => [/usr/src/tmp/ruby-ovirt-engine-sdk-buildroot]/usr/lib/ruby/gems/2.5.0/doc/ovirt-engine-sdk-4.3.0/ri/OvirtSDK4/Probe/probe-c.ri
    OvirtSDK4/Probe/new-c.ri => [/usr/src/tmp/ruby-ovirt-engine-sdk-buildroot]/usr/lib/ruby/gems/2.5.0/doc/ovirt-engine-sdk-4.3.0/ri/OvirtSDK4/Probe/new-c.ri
    OvirtSDK4/Probe/exists%3f-c.ri => [/usr/src/tmp/ruby-ovirt-engine-sdk-buildroot]/usr/lib/ruby/gems/2.5.0/doc/ovirt-engine-sdk-4.3.0/ri/OvirtSDK4/Probe/exists%3f-c.ri
    OvirtSDK4/Probe/cdesc-Probe.ri => [/usr/src/tmp/ruby-ovirt-engine-sdk-buildroot]/usr/lib/ruby/gems/2.5.0/doc/ovirt-engine-sdk-4.3.0/ri/OvirtSDK4/Probe/cdesc-Probe.ri
    OvirtSDK4/TimeoutError/cdesc-TimeoutError.ri => [/usr/src/tmp/ruby-ovirt-engine-sdk-buildroot]/usr/lib/ruby/gems/2.5.0/doc/ovirt-engine-sdk-4.3.0/ri/OvirtSDK4/TimeoutError/cdesc-TimeoutError.ri
    OvirtSDK4/NotFoundError/cdesc-NotFoundError.ri => [/usr/src/tmp/ruby-ovirt-engine-sdk-buildroot]/usr/lib/ruby/gems/2.5.0/doc/ovirt-engine-sdk-4.3.0/ri/OvirtSDK4/NotFoundError/cdesc-NotFoundError.ri
    OvirtSDK4/ConnectionError/cdesc-ConnectionError.ri => [/usr/src/tmp/ruby-ovirt-engine-sdk-buildroot]/usr/lib/ruby/gems/2.5.0/doc/ovirt-engine-sdk-4.3.0/ri/OvirtSDK4/ConnectionError/cdesc-ConnectionError.ri
    OvirtSDK4/AuthError/cdesc-AuthError.ri => [/usr/src/tmp/ruby-ovirt-engine-sdk-buildroot]/usr/lib/ruby/gems/2.5.0/doc/ovirt-engine-sdk-4.3.0/ri/OvirtSDK4/AuthError/cdesc-AuthError.ri
    OvirtSDK4/Error/fault-i.ri => [/usr/src/tmp/ruby-ovirt-engine-sdk-buildroot]/usr/lib/ruby/gems/2.5.0/doc/ovirt-engine-sdk-4.3.0/ri/OvirtSDK4/Error/fault-i.ri
    OvirtSDK4/Error/code-i.ri => [/usr/src/tmp/ruby-ovirt-engine-sdk-buildroot]/usr/lib/ruby/gems/2.5.0/doc/ovirt-engine-sdk-4.3.0/ri/OvirtSDK4/Error/code-i.ri
    OvirtSDK4/Error/cdesc-Error.ri => [/usr/src/tmp/ruby-ovirt-engine-sdk-buildroot]/usr/lib/ruby/gems/2.5.0/doc/ovirt-engine-sdk-4.3.0/ri/OvirtSDK4/Error/cdesc-Error.ri
    OvirtSDK4/Connection/wait-i.ri => [/usr/src/tmp/ruby-ovirt-engine-sdk-buildroot]/usr/lib/ruby/gems/2.5.0/doc/ovirt-engine-sdk-4.3.0/ri/OvirtSDK4/Connection/wait-i.ri
    OvirtSDK4/Connection/to_s-i.ri => [/usr/src/tmp/ruby-ovirt-engine-sdk-buildroot]/usr/lib/ruby/gems/2.5.0/doc/ovirt-engine-sdk-4.3.0/ri/OvirtSDK4/Connection/to_s-i.ri
    OvirtSDK4/Connection/test-i.ri => [/usr/src/tmp/ruby-ovirt-engine-sdk-buildroot]/usr/lib/ruby/gems/2.5.0/doc/ovirt-engine-sdk-4.3.0/ri/OvirtSDK4/Connection/test-i.ri
    OvirtSDK4/Connection/system_service-i.ri => [/usr/src/tmp/ruby-ovirt-engine-sdk-buildroot]/usr/lib/ruby/gems/2.5.0/doc/ovirt-engine-sdk-4.3.0/ri/OvirtSDK4/Connection/system_service-i.ri
    OvirtSDK4/Connection/service-i.ri => [/usr/src/tmp/ruby-ovirt-engine-sdk-buildroot]/usr/lib/ruby/gems/2.5.0/doc/ovirt-engine-sdk-4.3.0/ri/OvirtSDK4/Connection/service-i.ri
    OvirtSDK4/Connection/send-i.ri => [/usr/src/tmp/ruby-ovirt-engine-sdk-buildroot]/usr/lib/ruby/gems/2.5.0/doc/ovirt-engine-sdk-4.3.0/ri/OvirtSDK4/Connection/send-i.ri
    OvirtSDK4/Connection/raise_error-i.ri => [/usr/src/tmp/ruby-ovirt-engine-sdk-buildroot]/usr/lib/ruby/gems/2.5.0/doc/ovirt-engine-sdk-4.3.0/ri/OvirtSDK4/Connection/raise_error-i.ri
    OvirtSDK4/Connection/link%3f-i.ri => [/usr/src/tmp/ruby-ovirt-engine-sdk-buildroot]/usr/lib/ruby/gems/2.5.0/doc/ovirt-engine-sdk-4.3.0/ri/OvirtSDK4/Connection/link%3f-i.ri
    OvirtSDK4/Connection/is_link%3f-i.ri => [/usr/src/tmp/ruby-ovirt-engine-sdk-buildroot]/usr/lib/ruby/gems/2.5.0/doc/ovirt-engine-sdk-4.3.0/ri/OvirtSDK4/Connection/is_link%3f-i.ri
    OvirtSDK4/Connection/inspect-i.ri => [/usr/src/tmp/ruby-ovirt-engine-sdk-buildroot]/usr/lib/ruby/gems/2.5.0/doc/ovirt-engine-sdk-4.3.0/ri/OvirtSDK4/Connection/inspect-i.ri
    OvirtSDK4/Connection/follow_link-i.ri => [/usr/src/tmp/ruby-ovirt-engine-sdk-buildroot]/usr/lib/ruby/gems/2.5.0/doc/ovirt-engine-sdk-4.3.0/ri/OvirtSDK4/Connection/follow_link-i.ri
    OvirtSDK4/Connection/close-i.ri => [/usr/src/tmp/ruby-ovirt-engine-sdk-buildroot]/usr/lib/ruby/gems/2.5.0/doc/ovirt-engine-sdk-4.3.0/ri/OvirtSDK4/Connection/close-i.ri
    OvirtSDK4/Connection/check_xml_content_type-i.ri => [/usr/src/tmp/ruby-ovirt-engine-sdk-buildroot]/usr/lib/ruby/gems/2.5.0/doc/ovirt-engine-sdk-4.3.0/ri/OvirtSDK4/Connection/check_xml_content_type-i.ri
    OvirtSDK4/Connection/check_json_content_type-i.ri => [/usr/src/tmp/ruby-ovirt-engine-sdk-buildroot]/usr/lib/ruby/gems/2.5.0/doc/ovirt-engine-sdk-4.3.0/ri/OvirtSDK4/Connection/check_json_content_type-i.ri
    OvirtSDK4/Connection/authenticate-i.ri => [/usr/src/tmp/ruby-ovirt-engine-sdk-buildroot]/usr/lib/ruby/gems/2.5.0/doc/ovirt-engine-sdk-4.3.0/ri/OvirtSDK4/Connection/authenticate-i.ri
    OvirtSDK4/Connection/new-c.ri => [/usr/src/tmp/ruby-ovirt-engine-sdk-buildroot]/usr/lib/ruby/gems/2.5.0/doc/ovirt-engine-sdk-4.3.0/ri/OvirtSDK4/Connection/new-c.ri
    OvirtSDK4/Connection/cdesc-Connection.ri => [/usr/src/tmp/ruby-ovirt-engine-sdk-buildroot]/usr/lib/ruby/gems/2.5.0/doc/ovirt-engine-sdk-4.3.0/ri/OvirtSDK4/Connection/cdesc-Connection.ri
* include ->
  - [ovirt-engine-sdk] in ext/ovirtsdk4c
    ov_xml_writer.h => [/usr/src/tmp/ruby-ovirt-engine-sdk-buildroot]/usr/include/ovirt-engine-sdk/ov_xml_writer.h
    ov_xml_reader.h => [/usr/src/tmp/ruby-ovirt-engine-sdk-buildroot]/usr/include/ovirt-engine-sdk/ov_xml_reader.h
    ov_string.h => [/usr/src/tmp/ruby-ovirt-engine-sdk-buildroot]/usr/include/ovirt-engine-sdk/ov_string.h
    ov_module.h => [/usr/src/tmp/ruby-ovirt-engine-sdk-buildroot]/usr/include/ovirt-engine-sdk/ov_module.h
    ov_http_transfer.h => [/usr/src/tmp/ruby-ovirt-engine-sdk-buildroot]/usr/include/ovirt-engine-sdk/ov_http_transfer.h
    ov_http_response.h => [/usr/src/tmp/ruby-ovirt-engine-sdk-buildroot]/usr/include/ovirt-engine-sdk/ov_http_response.h
    ov_http_request.h => [/usr/src/tmp/ruby-ovirt-engine-sdk-buildroot]/usr/include/ovirt-engine-sdk/ov_http_request.h
    ov_http_client.h => [/usr/src/tmp/ruby-ovirt-engine-sdk-buildroot]/usr/include/ovirt-engine-sdk/ov_http_client.h
    ov_error.h => [/usr/src/tmp/ruby-ovirt-engine-sdk-buildroot]/usr/include/ovirt-engine-sdk/ov_error.h
* .gemspec ->
  - [ovirt-engine-sdk]
    /usr/src/tmp/gem.20200202-760094-10zwd4h => [/usr/src/tmp/ruby-ovirt-engine-sdk-buildroot]/usr/lib/ruby/gems/2.5.0/specifications/ovirt-engine-sdk-4.3.0.gemspec

+ /usr/lib/rpm/brp-alt
Cleaning files in /usr/src/tmp/ruby-ovirt-engine-sdk-buildroot (auto)
mode of 'usr/lib/ruby/gems/2.5.0/extensions/x86_64-linux/2.5.0/ovirt-engine-sdk-4.3.0/gem.build_complete' changed from 0555 (r-xr-xr-x) to 0755 (rwxr-xr-x)
mode of 'usr/lib/ruby/gems/2.5.0/extensions/x86_64-linux/2.5.0/ovirt-engine-sdk-4.3.0/ovirtsdk4c.so' changed from 0555 (r-xr-xr-x) to 0755 (rwxr-xr-x)
mode of './usr/lib/ruby/gems/2.5.0/extensions/x86_64-linux/2.5.0/ovirt-engine-sdk-4.3.0/ovirtsdk4c.so' changed from 0755 (rwxr-xr-x) to 0644 (rw-r--r--)
Verifying and fixing files in /usr/src/tmp/ruby-ovirt-engine-sdk-buildroot (binconfig,pkgconfig,libtool,desktop)
Checking contents of files in /usr/src/tmp/ruby-ovirt-engine-sdk-buildroot/ (default)
Compressing files in /usr/src/tmp/ruby-ovirt-engine-sdk-buildroot (auto)
Adjusting library links in /usr/src/tmp/ruby-ovirt-engine-sdk-buildroot
./usr/lib:
./usr/lib/ruby/gems/2.5.0/gems/ovirt-engine-sdk-4.3.0/lib:
/usr/lib/rpm/debugedit: ./usr/lib/ruby/gems/2.5.0/extensions/x86_64-linux/2.5.0/ovirt-engine-sdk-4.3.0/ovirtsdk4c.so: DWARF version 0 unhandled
Verifying ELF objects in /usr/src/tmp/ruby-ovirt-engine-sdk-buildroot (arch=normal,fhs=normal,lfs=relaxed,lint=relaxed,rpath=normal,stack=normal,textrel=normal,unresolved=normal)
Hardlinking identical .pyc and .pyo files
Executing(%check): /bin/sh -e /usr/src/tmp/rpm-tmp.53877
+ umask 022
+ /bin/mkdir -p /usr/src/RPM/BUILD
+ cd /usr/src/RPM/BUILD
+ cd ruby-ovirt-engine-sdk-4.3.0
+ /usr/bin/setup.rb test
[setup.rb] -> NoMethodError: undefined method `full_name' for nil:NilClass
gem 'ovirt-engine-sdk' at /usr/src/RPM/BUILD/ruby-ovirt-engine-sdk-4.3.0/sdk
(ruby 2.5.5 x86_64-linux)
ERROR[LoadError]: cannot load such file -- Rakefile

+ exit 0
Processing files: ruby-ovirt-engine-sdk-4.3.0-alt1
Executing(%doc): /bin/sh -e /usr/src/tmp/rpm-tmp.1528
+ umask 022
+ /bin/mkdir -p /usr/src/RPM/BUILD
+ cd /usr/src/RPM/BUILD
+ cd ruby-ovirt-engine-sdk-4.3.0
+ DOCDIR=/usr/src/tmp/ruby-ovirt-engine-sdk-buildroot/usr/share/doc/ruby-ovirt-engine-sdk-4.3.0
+ export DOCDIR
+ rm -rf /usr/src/tmp/ruby-ovirt-engine-sdk-buildroot/usr/share/doc/ruby-ovirt-engine-sdk-4.3.0
+ /bin/mkdir -p /usr/src/tmp/ruby-ovirt-engine-sdk-buildroot/usr/share/doc/ruby-ovirt-engine-sdk-4.3.0
+ cp -prL README.adoc /usr/src/tmp/ruby-ovirt-engine-sdk-buildroot/usr/share/doc/ruby-ovirt-engine-sdk-4.3.0
+ chmod -R go-w /usr/src/tmp/ruby-ovirt-engine-sdk-buildroot/usr/share/doc/ruby-ovirt-engine-sdk-4.3.0
+ chmod -R a+rX /usr/src/tmp/ruby-ovirt-engine-sdk-buildroot/usr/share/doc/ruby-ovirt-engine-sdk-4.3.0
+ exit 0
Finding Provides (using /usr/lib/rpm/find-provides)
Executing: /bin/sh -e /usr/src/tmp/rpm-tmp.0e4Nld
find-provides: running scripts (alternatives,debuginfo,lib,pam,perl,pkgconfig,python,ruby,shell)
Detecting ruby provides for ruby-ovirt-engine-sdk...
--- '/usr/src/RPM/BUILD/ruby-ovirt-engine-sdk-4.3.0/SetupConfig'
Ruby project file is '/usr/src/RPM/BUILD/ruby-ovirt-engine-sdk-4.3.0/SetupConfig'
setup.rb provides --install_prefix=/usr/src/tmp/ruby-ovirt-engine-sdk-buildroot --package=ruby-ovirt-engine-sdk -q
[setup.rb] -> NoMethodError: undefined method `full_name' for nil:NilClass
gem 'ovirt-engine-sdk' at /usr/src/RPM/BUILD/ruby-ovirt-engine-sdk-4.3.0/sdk
(ruby 2.5.5 x86_64-linux)
ERROR[LoadError]: cannot load such file -- Rakefile
* provs ->
  - [ovirt-engine-sdk]
    [lib]:
      gem(ovirt-engine-sdk) = 4.3.0
      ruby-gem(ovirt-engine-sdk) = 4.3.0
      rubygem(ovirt-engine-sdk) = 4.3.0
Finding Requires (using /usr/lib/rpm/find-requires)
Executing: /bin/sh -e /usr/src/tmp/rpm-tmp.0yapTN
find-requires: running scripts (cpp,debuginfo,files,lib,pam,perl,pkgconfig,pkgconfiglib,python,rpmlib,ruby,shebang,shell,static,symlinks)
Detecting ruby requires for ruby-ovirt-engine-sdk...
Ruby project file is '/usr/src/RPM/BUILD/ruby-ovirt-engine-sdk-4.3.0/SetupConfig'
setup.rb requires --install_prefix=/usr/src/tmp/ruby-ovirt-engine-sdk-buildroot --package=ruby-ovirt-engine-sdk -q
[setup.rb] -> NoMethodError: undefined method `full_name' for nil:NilClass
gem 'ovirt-engine-sdk' at /usr/src/RPM/BUILD/ruby-ovirt-engine-sdk-4.3.0/sdk
(ruby 2.5.5 x86_64-linux)
ERROR[LoadError]: cannot load such file -- Rakefile
* reqs ->
  - [ovirt-engine-sdk]
    [lib]:
      ruby(2.5.0)
      ruby-gem(json) >= 1
      ruby-gem(json) < 3
      ruby >= 2.1
      rubygems >= 0
Provides: gem(ovirt-engine-sdk) = 4.3.0, ruby-gem(ovirt-engine-sdk) = 4.3.0, rubygem(ovirt-engine-sdk) = 4.3.0
Requires: libc.so.6(GLIBC_2.14)(64bit), libc.so.6(GLIBC_2.2.5)(64bit), libc.so.6(GLIBC_2.3)(64bit), libc.so.6(GLIBC_2.4)(64bit), libcurl.so.4()(64bit) >= set:kfYXKLASFHkEm2SmZiXJchvM4DbbnuIfNVatD4YHozyuimK1g7p, libruby.so.2.5()(64bit) >= set:oiHaCDJx3TK6cd0gTcv1hyBAwYbg3u54heOjnfycDWW9SPWg7XXlYeRTS5xP98Nlqhzy1ddHjN0f0xk3qeZqCNis0pfl9yGKkfxy0kZnN8cdoLvSyDJthoCUPiMSKhyLsK62JrZmpX7Hgwz91Wrrgk5T54DFoy30, libxml2.so.2()(64bit) >= set:ojfKIGaukWnEpEvQjjNKtvZ3ZhFx0n9KIQ7reYV9aBfygQfhI0Oc1VJfMb9Vp1ATNNyu0, libxml2.so.2(LIBXML2_2.4.30)(64bit), libxml2.so.2(LIBXML2_2.5.0)(64bit), libxml2.so.2(LIBXML2_2.5.7)(64bit), libxml2.so.2(LIBXML2_2.6.0)(64bit), libxml2.so.2(LIBXML2_2.6.5)(64bit), rtld(GNU_HASH), ruby >= 2.1, ruby(2.5.0), ruby-gem(json) < 3, ruby-gem(json) >= 1, rubygems >= 0
Requires(rpmlib): rpmlib(SetVersions)
Finding debuginfo files (using /usr/lib/rpm/find-debuginfo-files)
Executing: /bin/sh -e /usr/src/tmp/rpm-tmp.w3NOew
/usr/lib/rpm/debugedit: ./usr/lib/debug/usr/lib/ruby/gems/2.5.0/extensions/x86_64-linux/2.5.0/ovirt-engine-sdk-4.3.0/ovirtsdk4c.so.debug: DWARF version 0 unhandled
Creating ruby-ovirt-engine-sdk-debuginfo package
Processing files: gem-ovirt-engine-sdk-doc-4.3.0-alt1
Finding Provides (using /usr/lib/rpm/find-provides)
Executing: /bin/sh -e /usr/src/tmp/rpm-tmp.euw49h
find-provides: running scripts (alternatives,debuginfo,lib,pam,perl,pkgconfig,python,ruby,shell)
Detecting ruby provides for gem-ovirt-engine-sdk-doc...
--- '/usr/src/RPM/BUILD/ruby-ovirt-engine-sdk-4.3.0/SetupConfig'
Ruby project file is '/usr/src/RPM/BUILD/ruby-ovirt-engine-sdk-4.3.0/SetupConfig'
setup.rb provides --install_prefix=/usr/src/tmp/ruby-ovirt-engine-sdk-buildroot --package=gem-ovirt-engine-sdk-doc -q
[setup.rb] -> NoMethodError: undefined method `full_name' for nil:NilClass
gem 'ovirt-engine-sdk' at /usr/src/RPM/BUILD/ruby-ovirt-engine-sdk-4.3.0/sdk
(ruby 2.5.5 x86_64-linux)
ERROR[LoadError]: cannot load such file -- Rakefile
* provs ->
  - [ovirt-engine-sdk]
Finding Requires (using /usr/lib/rpm/find-requires)
Executing: /bin/sh -e /usr/src/tmp/rpm-tmp.q4DoE7
find-requires: running scripts (cpp,debuginfo,files,lib,pam,perl,pkgconfig,pkgconfiglib,python,rpmlib,ruby,shebang,shell,static,symlinks)
Detecting ruby requires for gem-ovirt-engine-sdk-doc...
Ruby project file is '/usr/src/RPM/BUILD/ruby-ovirt-engine-sdk-4.3.0/SetupConfig'
setup.rb requires --install_prefix=/usr/src/tmp/ruby-ovirt-engine-sdk-buildroot --package=gem-ovirt-engine-sdk-doc -q
[setup.rb] -> NoMethodError: undefined method `full_name' for nil:NilClass
gem 'ovirt-engine-sdk' at /usr/src/RPM/BUILD/ruby-ovirt-engine-sdk-4.3.0/sdk
(ruby 2.5.5 x86_64-linux)
ERROR[LoadError]: cannot load such file -- Rakefile
* reqs ->
  - [ovirt-engine-sdk]
    [doc]:
      gem(ovirt-engine-sdk) = 4.3.0
Provides: ruby-ovirt-engine-sdk-ruby-doc
Requires: gem(ovirt-engine-sdk) = 4.3.0
Obsoletes: ruby-ovirt-engine-sdk-ruby-doc
Processing files: gem-ovirt-engine-sdk-devel-4.3.0-alt1
Finding Provides (using /usr/lib/rpm/find-provides)
Executing: /bin/sh -e /usr/src/tmp/rpm-tmp.SQ5rI0
find-provides: running scripts (alternatives,debuginfo,lib,pam,perl,pkgconfig,python,ruby,shell)
Detecting ruby provides for gem-ovirt-engine-sdk-devel...
--- '/usr/src/RPM/BUILD/ruby-ovirt-engine-sdk-4.3.0/SetupConfig'
Ruby project file is '/usr/src/RPM/BUILD/ruby-ovirt-engine-sdk-4.3.0/SetupConfig'
setup.rb provides --install_prefix=/usr/src/tmp/ruby-ovirt-engine-sdk-buildroot --package=gem-ovirt-engine-sdk-devel -q
[setup.rb] -> NoMethodError: undefined method `full_name' for nil:NilClass
gem 'ovirt-engine-sdk' at /usr/src/RPM/BUILD/ruby-ovirt-engine-sdk-4.3.0/sdk
(ruby 2.5.5 x86_64-linux)
ERROR[LoadError]: cannot load such file -- Rakefile
* provs ->
  - [ovirt-engine-sdk]
Finding Requires (using /usr/lib/rpm/find-requires)
Executing: /bin/sh -e /usr/src/tmp/rpm-tmp.KMHVlX
find-requires: running scripts (cpp,debuginfo,files,lib,pam,perl,pkgconfig,pkgconfiglib,python,rpmlib,ruby,shebang,shell,static,symlinks)
/usr/src/tmp/ruby-ovirt-engine-sdk-buildroot/usr/include/ovirt-engine-sdk/ov_xml_reader.h:22:10: fatal error: libxml/xmlreader.h: No such file or directory
 #include <libxml/xmlreader.h>
          ^~~~~~~~~~~~~~~~~~~~
compilation terminated.
cpp.req: /usr/src/tmp/ruby-ovirt-engine-sdk-buildroot/usr/include/ovirt-engine-sdk/ov_xml_reader.h: cpp failed, trying c++ mode
x86_64-alt-linux-cpp: error trying to exec 'cc1plus': execvp: No such file or directory
cpp.req: WARNING: /usr/src/tmp/ruby-ovirt-engine-sdk-buildroot/usr/include/ovirt-engine-sdk/ov_xml_reader.h: cpp failed
/usr/src/tmp/ruby-ovirt-engine-sdk-buildroot/usr/include/ovirt-engine-sdk/ov_xml_writer.h:22:10: fatal error: libxml/xmlwriter.h: No such file or directory
 #include <libxml/xmlwriter.h>
          ^~~~~~~~~~~~~~~~~~~~
compilation terminated.
cpp.req: WARNING: /usr/src/tmp/ruby-ovirt-engine-sdk-buildroot/usr/include/ovirt-engine-sdk/ov_xml_writer.h: cpp failed
Detecting ruby requires for gem-ovirt-engine-sdk-devel...
Ruby project file is '/usr/src/RPM/BUILD/ruby-ovirt-engine-sdk-4.3.0/SetupConfig'
setup.rb requires --install_prefix=/usr/src/tmp/ruby-ovirt-engine-sdk-buildroot --package=gem-ovirt-engine-sdk-devel -q
[setup.rb] -> NoMethodError: undefined method `full_name' for nil:NilClass
gem 'ovirt-engine-sdk' at /usr/src/RPM/BUILD/ruby-ovirt-engine-sdk-4.3.0/sdk
(ruby 2.5.5 x86_64-linux)
ERROR[LoadError]: cannot load such file -- Rakefile
* reqs ->
  - [ovirt-engine-sdk]
    [devel]:
      gem(ovirt-engine-sdk) = 4.3.0
Requires: gem(ovirt-engine-sdk) = 4.3.0, libcurl-devel, libruby-devel
Processing files: ruby-ovirt-engine-sdk-debuginfo-4.3.0-alt1
Finding Provides (using /usr/lib/rpm/find-provides)
Executing: /bin/sh -e /usr/src/tmp/rpm-tmp.6V4yzX
find-provides: running scripts (debuginfo)
Finding Requires (using /usr/lib/rpm/find-requires)
Executing: /bin/sh -e /usr/src/tmp/rpm-tmp.ysIZl1
find-requires: running scripts (debuginfo)
Requires: ruby-ovirt-engine-sdk = 4.3.0-alt1, debug64(libc.so.6), debug64(libcurl.so.4), debug64(libruby.so.2.5), debug64(libxml2.so.2)
Adding to ruby-ovirt-engine-sdk-debuginfo a strict dependency on ruby-ovirt-engine-sdk
Adding to gem-ovirt-engine-sdk-doc a strict dependency on ruby-ovirt-engine-sdk
Adding to gem-ovirt-engine-sdk-devel a strict dependency on ruby-ovirt-engine-sdk
Removing 1 extra deps from gem-ovirt-engine-sdk-doc due to dependency on ruby-ovirt-engine-sdk
Removing 1 extra deps from gem-ovirt-engine-sdk-devel due to dependency on ruby-ovirt-engine-sdk
Wrote: /usr/src/RPM/RPMS/x86_64/ruby-ovirt-engine-sdk-4.3.0-alt1.x86_64.rpm
Wrote: /usr/src/RPM/RPMS/noarch/gem-ovirt-engine-sdk-doc-4.3.0-alt1.noarch.rpm
Wrote: /usr/src/RPM/RPMS/noarch/gem-ovirt-engine-sdk-devel-4.3.0-alt1.noarch.rpm
Wrote: /usr/src/RPM/RPMS/x86_64/ruby-ovirt-engine-sdk-debuginfo-4.3.0-alt1.x86_64.rpm
15.54user 2.52system 0:25.52elapsed 70%CPU (0avgtext+0avgdata 55384maxresident)k
0inputs+0outputs (0major+534279minor)pagefaults 0swaps
28.45user 6.05system 0:45.49elapsed 75%CPU (0avgtext+0avgdata 115004maxresident)k
2248inputs+0outputs (0major+1050135minor)pagefaults 0swaps