<86>Jun 27 12:31:03 userdel[1750896]: delete user 'rooter'
<86>Jun 27 12:31:03 userdel[1750896]: removed group 'rooter' owned by 'rooter'
<86>Jun 27 12:31:03 userdel[1750896]: removed shadow group 'rooter' owned by 'rooter'
<86>Jun 27 12:31:03 groupadd[1750901]: group added to /etc/group: name=rooter, GID=618
<86>Jun 27 12:31:03 groupadd[1750901]: group added to /etc/gshadow: name=rooter
<86>Jun 27 12:31:03 groupadd[1750901]: new group: name=rooter, GID=618
<86>Jun 27 12:31:03 useradd[1750905]: new user: name=rooter, UID=618, GID=618, home=/root, shell=/bin/bash
<86>Jun 27 12:31:03 userdel[1750911]: delete user 'builder'
<86>Jun 27 12:31:03 userdel[1750911]: removed group 'builder' owned by 'builder'
<86>Jun 27 12:31:03 userdel[1750911]: removed shadow group 'builder' owned by 'builder'
<86>Jun 27 12:31:03 groupadd[1750916]: group added to /etc/group: name=builder, GID=619
<86>Jun 27 12:31:03 groupadd[1750916]: group added to /etc/gshadow: name=builder
<86>Jun 27 12:31:03 groupadd[1750916]: new group: name=builder, GID=619
<86>Jun 27 12:31:03 useradd[1750920]: new user: name=builder, UID=619, GID=619, home=/usr/src, shell=/bin/bash
<13>Jun 27 12:31:06 rpmi: rpm-build-compat-2.2.6-alt2 p9+263465.40.2.1 1608016546 installed
<13>Jun 27 12:31:06 rpmi: libgdbm-1.8.3-alt10 1454943334 installed
<13>Jun 27 12:31:06 rpmi: libexpat-2.2.10-alt1 p9+261554.100.1.1 1605103337 installed
<13>Jun 27 12:31:06 rpmi: libp11-kit-0.23.15-alt2 p9+254920.2400.19.1 1601385903 installed
<13>Jun 27 12:31:06 rpmi: libtasn1-4.14-alt1 p9+235792.100.2.1 1565425233 installed
<13>Jun 27 12:31:06 rpmi: rpm-macros-alternatives-0.5.1-alt1 sisyphus+226946.100.1.1 1554830426 installed
<13>Jun 27 12:31:06 rpmi: alternatives-0.5.1-alt1 sisyphus+226946.100.1.1 1554830426 installed
<13>Jun 27 12:31:06 rpmi: ca-certificates-2020.06.29-alt1 p9+258899.100.3.1 1601998604 installed
<13>Jun 27 12:31:06 rpmi: ca-trust-0.1.2-alt1 p9+233349.100.1.1 1561655062 installed
<13>Jun 27 12:31:06 rpmi: p11-kit-trust-0.23.15-alt2 p9+254920.2400.19.1 1601385903 installed
<13>Jun 27 12:31:06 rpmi: libcrypto1.1-1.1.1k-alt1 p9+268376.100.3.1 1616721011 installed
<13>Jun 27 12:31:06 rpmi: libssl1.1-1.1.1k-alt1 p9+268376.100.3.1 1616721011 installed
<13>Jun 27 12:31:06 rpmi: python3-3.7.4-alt3 p9+249932.100.2.1 1587127349 installed
<13>Jun 27 12:31:06 rpmi: libpython3-3.7.4-alt3 p9+249932.100.2.1 1587127349 installed
<13>Jun 27 12:31:07 rpmi: python3-base-3.7.4-alt3 p9+249932.100.2.1 1587127349 installed
<13>Jun 27 12:31:07 rpmi: tests-for-installed-python3-pkgs-0.1.13.1-alt2 1535450458 installed
<13>Jun 27 12:31:07 rpmi: rpm-build-python3-0.1.13.1-alt2 1535450458 installed
<13>Jun 27 12:31:07 rpmi: rpm-build-intro-2.2.6-alt2 p9+263465.40.2.1 1608016546 installed
<13>Jun 27 12:31:14 rpmi: python3-module-pkg_resources-1:40.8.0-alt2 sisyphus+229158.200.2.1 1557735221 installed
<13>Jun 27 12:31:14 rpmi: python3-module-six-1.12.0-alt1 sisyphus+219665.100.2.1 1548148570 installed
<13>Jun 27 12:31:14 rpmi: python3-module-ipython_genutils-0.1.0-alt1.1.2 sisyphus+227495.700.1.3 1555842873 installed
<13>Jun 27 12:31:14 rpmi: libsqlite3-3.33.0-alt1 p9+258834.40.2.1 1601365057 installed
<13>Jun 27 12:31:14 rpmi: libpng16-1.6.36-alt1 sisyphus+219478.100.1.1 1547633314 installed
<13>Jun 27 12:31:14 rpmi: libwayland-client-1.18.0-alt1 p9+260591.100.12.1 1606212861 installed
<13>Jun 27 12:31:14 rpmi: python3-module-click-6.7-alt1.1.1 sisyphus+228018.100.1.1 1556023031 installed
<13>Jun 27 12:31:14 rpmi: python3-module-zope.interface-4.6.0-alt1 sisyphus+227562.100.3.1 1556009950 installed
<13>Jun 27 12:31:14 rpmi: perl-HTTP-Date-6.02-alt1 1348645274 installed
<13>Jun 27 12:31:14 rpmi: libjpeg-2:2.0.2-alt1 sisyphus+226996.100.1.1 1554902907 installed
<13>Jun 27 12:31:14 rpmi: libidn2-2.2.0-alt1 p9+229971.100.2.1 1558696281 installed
<13>Jun 27 12:31:14 rpmi: libtcl-8.6.9-alt1 sisyphus+227145.100.1.2 1555606538 installed
<13>Jun 27 12:31:14 rpmi: python3-module-pyparsing-2.2.0-alt1 1534411950 installed
<13>Jun 27 12:31:14 rpmi: python3-module-pygobject-2.28.6-alt10.1.1.1 sisyphus+225625.41000.91.1 1555331367 installed
<13>Jun 27 12:31:14 rpmi: python3-module-attrs-19.3.0-alt1 p9+266900.5140.22.1 1618153287 installed
<13>Jun 27 12:31:14 rpmi: python3-module-decorator-4.3.0-alt1 sisyphus+227480.1300.1.2 1555757994 installed
<13>Jun 27 12:31:14 rpmi: python3-module-traitlets-4.3.2-alt2 sisyphus+227534.400.1.3 1555957137 installed
<13>Jun 27 12:31:14 rpmi: python3-module-jupyter_core-4.4.0-alt2 sisyphus+228359.1000.4.3 1556674457 installed
<13>Jun 27 12:31:14 rpmi: perl-XML-NamespaceSupport-1.12-alt1 1491296348 installed
<13>Jun 27 12:31:14 rpmi: libXau-1.0.9-alt1 sisyphus+223149.200.2.1 1551268152 installed
<13>Jun 27 12:31:14 rpmi: libICE-1.0.9-alt1 1409902721 installed
<13>Jun 27 12:31:14 rpmi: libSM-1.2.3-alt1 sisyphus+226734.100.2.1 1554586158 installed
<13>Jun 27 12:31:14 rpmi: libjasper-2.0.22-alt1 p9+259398.100.5.1 1602695044 installed
<13>Jun 27 12:31:14 rpmi: python3-modules-sqlite3-3.7.4-alt3 p9+249932.100.2.1 1587127349 installed
<13>Jun 27 12:31:14 rpmi: libproj-6.3.1-alt1 p9+251936.30.36.1 1619013977 installed
<13>Jun 27 12:31:14 rpmi: python3-module-jsonschema-2.6.0-alt1.1 sisyphus+227498.1400.1.3 1555852796 installed
<13>Jun 27 12:31:15 rpmi: python3-module-nbformat-4.4.0-alt1.1 sisyphus+227504.1000.1.3 1555865024 installed
<13>Jun 27 12:31:15 rpmi: python3-module-ntlm-1.1.0-alt1.2 sisyphus+228512.100.1.1 1556654575 installed
<13>Jun 27 12:31:15 rpmi: python3-module-coverage-4.5.3-alt1 sisyphus+228287.200.4.1 1556524564 installed
<13>Jun 27 12:31:15 rpmi: python3-module-jmespath-0.9.3-alt1.1 sisyphus+228357.1700.3.1 1556633327 installed
<13>Jun 27 12:31:15 rpmi: msulogin-1.0-alt1 1366288515 installed
<13>Jun 27 12:31:15 rpmi: libfontenc-1.1.4-alt1 sisyphus+223149.100.1.1 1551261109 installed
<13>Jun 27 12:31:15 rpmi: python3-module-wcwidth-0.1.7-alt2.1 sisyphus+227536.2000.1.2 1555963469 installed
<13>Jun 27 12:31:15 rpmi: python3-module-testpath-0.3.1-alt1 sisyphus+227532.1200.1.3 1555940533 installed
<13>Jun 27 12:31:15 rpmi: libopenblas-0.3.9-alt2 p9+274919.40.2.1 1624305327 installed
<13>Jun 27 12:31:15 rpmi: liblcms2-2.9-alt1 1516411892 installed
<13>Jun 27 12:31:15 rpmi: libfribidi-1.0.7-alt1 p9+238309.200.1.1 1569787058 installed
<13>Jun 27 12:31:15 rpmi: libpixman-3:0.38.4-alt1 sisyphus+228006.100.1.1 1556013870 installed
<13>Jun 27 12:31:15 rpmi: libglvnd-7:1.3.2-alt0.p9 p9+265957.240.8.1 1617618230 installed
<13>Jun 27 12:31:15 rpmi: libwayland-server-1.18.0-alt1 p9+260591.100.12.1 1606212861 installed
<13>Jun 27 12:31:15 rpmi: python3-module-pyasn1-0.4.5-alt1 sisyphus+219541.100.1.1 1547718467 installed
<13>Jun 27 12:31:15 rpmi: libev4-4.24-alt1 1490615355 installed
<13>Jun 27 12:31:15 rpmi: python3-module-ptyprocess-0.6.0-alt1 sisyphus+228365.1600.4.1 1556646134 installed
<13>Jun 27 12:31:15 rpmi: perl-LWP-MediaTypes-6.04-alt1 sisyphus+225468.100.1.1 1553186684 installed
<13>Jun 27 12:31:15 rpmi: perl-Compress-Raw-Zlib-2.086-alt1 sisyphus+226395.100.1.2 1554269783 installed
<13>Jun 27 12:31:15 rpmi: perl-libnet-1:3.11-alt1 1511423541 installed
<13>Jun 27 12:31:15 rpmi: perl-XML-SAX-Base-1.09-alt1 1494364363 installed
<13>Jun 27 12:31:15 rpmi: libnettle6-3.4.1-alt1 sisyphus+226533.100.2.1 1554512222 installed
<13>Jun 27 12:31:15 rpmi: liblz4-1:1.9.2-alt1 p9+238696.500.1.1 1570228299 installed
<13>Jun 27 12:31:15 rpmi: libXdmcp-1.1.3-alt1 sisyphus+225206.600.1.2 1552949353 installed
<13>Jun 27 12:31:15 rpmi: libxcb-1.13.1-alt1 sisyphus+226527.100.2.2 1554593801 installed
<13>Jun 27 12:31:15 rpmi: libhogweed4-3.4.1-alt1 sisyphus+226533.100.2.1 1554512222 installed
<13>Jun 27 12:31:15 rpmi: libgnutls30-3.6.16-alt1 p9+273087.100.1.1 1622487001 installed
<13>Jun 27 12:31:15 rpmi: python3-module-pexpect-4.6-alt3 sisyphus+222813.100.1.1 1551090209 installed
<13>Jun 27 12:31:15 rpmi: libev-devel-4.24-alt1 1490615355 installed
<13>Jun 27 12:31:15 rpmi: sysvinit-2.88-alt5 1424350686 installed
<13>Jun 27 12:31:15 rpmi: python3-module-packaging-16.8-alt1.qa1 sisyphus+228363.1100.2.2 1556671459 installed
<13>Jun 27 12:31:15 rpmi: tcl-8.6.9-alt1 sisyphus+227145.100.1.2 1555606538 installed
<13>Jun 27 12:31:15 rpmi: perl-File-Listing-6.04-alt1 1329758996 installed
<13>Jun 27 12:31:15 rpmi: python3-module-incremental-17.5.0-alt3 sisyphus+225625.45700.91.1 1555360824 installed
<13>Jun 27 12:31:15 rpmi: libwayland-cursor-1.18.0-alt1 p9+260591.100.12.1 1606212861 installed
<13>Jun 27 12:31:15 rpmi: libwayland-egl-4:18.1.0-alt1 p9+260591.100.12.1 1606212861 installed
<13>Jun 27 12:31:15 rpmi: python3-module-hamcrest-2.0.0-alt2.a1.git20150729.1.1.1.1 sisyphus+228127.100.1.1 1556184471 installed
<13>Jun 27 12:31:15 rpmi: python3-module-cycler-0.10.0-alt1.1 sisyphus+227479.1400.1.3 1555777401 installed
<13>Jun 27 12:31:15 rpmi: python3-module-xstatic-socialshareprivacy-1.4.1-alt3.1 sisyphus+227541.1400.1.2 1555972826 installed
<13>Jun 27 12:31:15 rpmi: python3-module-xstatic-term.js-0.0.7.0-alt1.1 sisyphus+227541.2100.1.2 1555973125 installed
<13>Jun 27 12:31:15 rpmi: python3-module-nose-1:1.3.7-alt4.git20160316 sisyphus+229068.100.1.1 1557255939 installed
<13>Jun 27 12:31:15 rpmi: python3-module-pymongo-3.6.0-alt1.1 sisyphus+225625.14500.91.1 1555291351 installed
<13>Jun 27 12:31:16 rpmi: python3-module-bson-3.6.0-alt1.1 sisyphus+225625.14500.91.1 1555291351 installed
<13>Jun 27 12:31:16 rpmi: mount-2.33.2-alt2 p9+254003.100.1.1 1593108043 installed
<13>Jun 27 12:31:16 rpmi: rgb-1.0.6-alt3 p9+229442.100.1.1 1557941137 installed
<13>Jun 27 12:31:16 rpmi: python3-module-pluggy-0.11.0-alt1 sisyphus+229116.100.1.1 1557316655 installed
<13>Jun 27 12:31:16 rpmi: python3-module-more-itertools-7.0.0-alt3 sisyphus+226536.100.1.1 1554329928 installed
<13>Jun 27 12:31:16 rpmi: python3-module-iniconfig-1.0.0-alt1 sisyphus+227494.1100.1.3 1555839106 installed
<13>Jun 27 12:31:16 rpmi: python3-module-atomicwrites-1.3.0-alt1 sisyphus+227473.2000.1.3 1555763467 installed
<13>Jun 27 12:31:16 rpmi: python3-module-apipkg-1.5-alt1 sisyphus+227465.1100.1.2 1555756555 installed
<13>Jun 27 12:31:16 rpmi: python3-module-py-1.8.0-alt2 sisyphus+228349.1400.4.1 1556631070 installed
<13>Jun 27 12:31:16 rpmi: python3-module-pytest-3.10.1-alt5 sisyphus+228366.2000.2.3 1556707871 installed
<13>Jun 27 12:31:18 rpmi: llvm11.0-libs-11.0.0-alt1 p9+264552.140.7.1 1611257131 installed
<13>Jun 27 12:31:18 rpmi: libsensors3-3.5.0-alt1 sisyphus+226785.100.6.2 1555147291 installed
<13>Jun 27 12:31:18 rpmi: libpcre2-10.33-alt1.1 sisyphus+227856.100.1.2 1555786378 installed
<13>Jun 27 12:31:18 rpmi: libkmod-26-alt1 sisyphus+226359.100.1.1 1554129990 installed
<13>Jun 27 12:31:18 rpmi: libiptables-1.8.3-alt2 p9+238412.300.6.1 1570110173 installed
<13>Jun 27 12:31:18 rpmi: zlib-devel-1.2.11-alt1 sisyphus+221902.6000.4.1 1550601058 installed
<13>Jun 27 12:31:18 rpmi: libltdl7-2.4.6-alt1 sisyphus+226971.100.2.1 1554906368 installed
<13>Jun 27 12:31:18 rpmi: libunixODBC2-2.3.7-alt1 sisyphus+228027.100.1.1 1556027338 installed
<13>Jun 27 12:31:18 rpmi: libunixODBC-devel-compat-2.3.7-alt1 sisyphus+228027.100.1.1 1556027338 installed
<13>Jun 27 12:31:18 rpmi: libunixODBC-devel-2.3.7-alt1 sisyphus+228027.100.1.1 1556027338 installed
<13>Jun 27 12:31:18 rpmi: libmysqlclient21-8.0.20-alt2 p9+252360.100.1.1 1590698673 installed
<13>Jun 27 12:31:18 rpmi: libhdf5-8-seq-1.8.13-alt1.qa4 sisyphus+222602.100.1.1 1550929955 installed
<13>Jun 27 12:31:18 rpmi: libgif-4.1.6-alt3 1299634261 installed
<13>Jun 27 12:31:18 rpmi: libgeos-3.9.1-alt1 p9+251936.3740.44.1 1619536725 installed
<13>Jun 27 12:31:18 rpmi: libnghttp2-1.41.0-alt1 p9+256449.100.1.1 1597829547 installed
<13>Jun 27 12:31:18 rpmi: libjson-c4-0.13.1-alt2 p9+254507.100.1.1 1593876142 installed
<13>Jun 27 12:31:18 rpmi: libdevmapper-1.02.173-alt1 p9+259866.100.1.1 1602632335 installed
<13>Jun 27 12:31:18 rpmi: libcfitsio9-3.490-alt1 p9+272679.100.1.1 1622126397 installed
<13>Jun 27 12:31:18 rpmi: libbrotlicommon-1.0.7-alt1 sisyphus+226738.100.2.1 1554554568 installed
<13>Jun 27 12:31:18 rpmi: libbrotlidec-1.0.7-alt1 sisyphus+226738.100.2.1 1554554568 installed
<13>Jun 27 12:31:18 rpmi: libargon2-20190702-alt1 p9+235535.100.1.1 1565051987 installed
<13>Jun 27 12:31:18 rpmi: python3-module-zipp-0.5.0-alt1 sisyphus+229321.100.1.1 1557825329 installed
<13>Jun 27 12:31:18 rpmi: python3-module-importlib_metadata-0.11-alt1 sisyphus+229324.100.1.1 1557826965 installed
<13>Jun 27 12:31:18 rpmi: python3-module-path.py-12.0.1-alt1 sisyphus+227926.200.1.1 1555927034 installed
<13>Jun 27 12:31:18 rpmi: python3-module-pickleshare-0.7.4-alt1 sisyphus+228364.2000.4.1 1556887192 installed
<13>Jun 27 12:31:18 rpmi: python3-module-OpenGL_accelerate-3.1.3b1-alt1 sisyphus+225625.51400.91.1 1555362110 installed
<13>Jun 27 12:31:19 rpmi: python3-module-OpenGL-3.1.1a1-alt2 sisyphus+227882.100.1.1 1555775819 installed
<13>Jun 27 12:31:19 rpmi: python3-module-pandocfilters-1.4.2-alt1 sisyphus+228363.1600.2.1 1556638946 installed
<13>Jun 27 12:31:19 rpmi: python3-module-entrypoints-0.3-alt1 sisyphus+227486.1700.1.3 1555815843 installed
<13>Jun 27 12:31:19 rpmi: python3-module-snowballstemmer-1.2.0-alt2.1 1457859319 installed
<13>Jun 27 12:31:19 rpmi: python3-module-imagesize-1.1.0-alt1 sisyphus+229015.100.2.1 1557233756 installed
<13>Jun 27 12:31:19 rpmi: python3-module-pytz-1:2016.10-alt1 1484291011 installed
<13>Jun 27 12:31:20 rpmi: python3-module-babel-1:2.6.0-alt1 sisyphus+228351.2400.6.2 1556652168 installed
<13>Jun 27 12:31:20 rpmi: python-sphinx-objects.inv-1:2.3.8.20190514-alt1 p9+229421.100.1.1 1557927689 installed
<13>Jun 27 12:31:20 rpmi: python3-module-ndg-0.4.2-alt1.qa1 sisyphus+227504.1300.1.2 1555853234 installed
<13>Jun 27 12:31:20 rpmi: python3-module-idna-2.8-alt1 sisyphus+227494.400.1.3 1555838720 installed
<13>Jun 27 12:31:20 rpmi: python3-module-chardet-3.0.4-alt1 sisyphus+227476.1700.1.2 1555756717 installed
<13>Jun 27 12:31:20 rpmi: python3-module-webencodings-0.5.1-alt1.1 1517943573 installed
<13>Jun 27 12:31:20 rpmi: python3-module-genshi-0.7-alt2 sisyphus+229363.100.1.1 1557847335 installed
<13>Jun 27 12:31:20 rpmi: python3-module-mistune-0.8.3-alt1 sisyphus+225625.25300.91.1 1555301257 installed
<13>Jun 27 12:31:20 rpmi: python3-module-markupsafe-1.1.1-alt1 p9+254838.60.14.1 1602882139 installed
<13>Jun 27 12:31:20 rpmi: python3-module-jinja2-2.11.2-alt1 p9+254838.40.14.1 1602882082 installed
<13>Jun 27 12:31:20 rpmi: libnumpy-py3-1:1.15.4-alt5 p9+255957.40.47.1 1599835883 installed
<13>Jun 27 12:31:20 rpmi: libxblas-1.0.248-alt1.3 sisyphus+229150.100.1.1 1557388786 installed
<13>Jun 27 12:31:20 rpmi: libquadmath0-8.4.1-alt0.p9.1 p9+247559.100.2.1 1585587912 installed
<13>Jun 27 12:31:20 rpmi: libgfortran5-8.4.1-alt0.p9.1 p9+247559.100.2.1 1585587912 installed
<13>Jun 27 12:31:21 rpmi: liblapack-1:3.8.0-alt3 sisyphus+221521.100.1.1 1550134903 installed
<13>Jun 27 12:31:21 rpmi: python3-module-numpy-1:1.15.4-alt5 p9+255957.40.47.1 1599835883 installed
<13>Jun 27 12:31:21 rpmi: python3-module-kiwisolver-1.1.0-alt1 sisyphus+228183.200.2.1 1556253153 installed
<13>Jun 27 12:31:21 rpmi: libxkbcommon-0.8.4-alt1 sisyphus+222759.100.1.1 1551009799 installed
<13>Jun 27 12:31:21 rpmi: publicsuffix-list-dafsa-20210419-alt1 p9+270359.100.1.1 1618926138 installed
<13>Jun 27 12:31:21 rpmi: libpsl-0.21.1-alt1 p9+255207.100.1.1 1595355048 installed
<13>Jun 27 12:31:21 rpmi: libverto-0.3.0-alt1_7 sisyphus+225932.100.1.1 1553994919 installed
<13>Jun 27 12:31:21 rpmi: libkeyutils-1.6-alt2 sisyphus+226520.100.2.1 1554512089 installed
<13>Jun 27 12:31:21 rpmi: libcom_err-1.44.6-alt1 sisyphus+224154.100.1.1 1552091678 installed
<86>Jun 27 12:31:21 groupadd[1759149]: group added to /etc/group: name=_keytab, GID=499
<86>Jun 27 12:31:21 groupadd[1759149]: group added to /etc/gshadow: name=_keytab
<86>Jun 27 12:31:21 groupadd[1759149]: new group: name=_keytab, GID=499
<13>Jun 27 12:31:21 rpmi: libkrb5-1.17.2-alt1 p9+262110.100.3.1 1606242416 installed
<86>Jun 27 12:31:21 groupadd[1759183]: group added to /etc/group: name=sasl, GID=498
<86>Jun 27 12:31:21 groupadd[1759183]: group added to /etc/gshadow: name=sasl
<86>Jun 27 12:31:21 groupadd[1759183]: new group: name=sasl, GID=498
<13>Jun 27 12:31:21 rpmi: libsasl2-3-2.1.27-alt2.1 p9+256192.100.1.1 1597226720 installed
<13>Jun 27 12:31:21 rpmi: libldap-2.4.57-alt0.M90P.1 p9+266288.100.1.1 1613244862 installed
<13>Jun 27 12:31:21 rpmi: libcurl-7.77.0-alt1 p9+272617.100.1.1 1622106828 installed
<13>Jun 27 12:31:21 rpmi: libpq5-12.7-alt0.M90P.1 p9+272061.100.1.1 1621317143 installed
<13>Jun 27 12:31:22 rpmi: libgdal-3.0.4-alt1.1.M90P.1 p9+272679.200.6.1 1622735807 installed
<13>Jun 27 12:31:22 rpmi: libepoxy-1.5.3-alt1 sisyphus+226740.100.2.3 1554619018 installed
<13>Jun 27 12:31:22 rpmi: libusb-1.0.22-alt1 1525452055 installed
<13>Jun 27 12:31:22 rpmi: libgudev-1:233-alt1 p9+235498.500.2.1 1565021367 installed
<13>Jun 27 12:31:22 rpmi: udev-rules-1:246.13-alt1 p9+265718.640.15.1 1618506267 installed
<13>Jun 27 12:31:22 rpmi: libdatrie-0.2.9-alt1_6 1511686676 installed
<13>Jun 27 12:31:22 rpmi: libthai-0.1.28-alt1_1 sisyphus+226107.100.1.1 1554123079 installed
<13>Jun 27 12:31:22 rpmi: libxshmfence-1.3-alt1 sisyphus+223149.1000.2.1 1551268571 installed
<13>Jun 27 12:31:22 rpmi: libpciaccess-1:0.14-alt1 1528969252 installed
<13>Jun 27 12:31:22 rpmi: libdrm-1:2.4.105-alt2 p9+271012.100.1.1 1619786697 installed
<13>Jun 27 12:31:22 rpmi: libgbm-4:21.0.3-alt1 p9+271012.200.3.1 1621244977 installed
<13>Jun 27 12:31:22 rpmi: libgraphite2-1.3.13-alt2 sisyphus+226799.100.1.1 1554648241 installed
<13>Jun 27 12:31:23 rpmi: libharfbuzz-2.6.2-alt1 p9+238790.200.1.1 1570435826 installed
<13>Jun 27 12:31:23 rpmi: libfreetype-2.10.1-alt1.1.p9.1 p9+260179.200.3.1 1603971407 installed
<13>Jun 27 12:31:23 rpmi: fontconfig-2.13.1-alt1 p9+247340.200.3.1 1583400517 installed
Updating fonts cache: <29>Jun 27 12:31:24 fontconfig: Updating fonts cache: succeeded
[ DONE ]
<13>Jun 27 12:31:24 rpmi: mkfontscale-1.2.0-alt1 sisyphus+225397.100.1.2 1553108224 installed
<13>Jun 27 12:31:24 rpmi: mkfontdir-1.0.7-alt1 1332532636 installed
<13>Jun 27 12:31:24 rpmi: fonts-bitmap-misc-7.0.0-alt6 1238575088 installed
<13>Jun 27 12:31:25 rpmi: libXfont2-2.0.3-alt2 sisyphus+226377.300.1.2 1554260428 installed
<13>Jun 27 12:31:25 rpmi: pytz-zoneinfo-1:2016.10-alt1 1484291011 installed
<13>Jun 27 12:31:25 rpmi: python3-module-dateutil-2.7.3-alt1 1534408281 installed
<13>Jun 27 12:31:25 rpmi: python3-module-pycrypto-2.7-alt3.a1.git20140620.1.1.1.1 sisyphus+225625.13600.91.1 1555290635 installed
<13>Jun 27 12:31:25 rpmi: python3-module-constantly-15.1.0-alt5.qa1 sisyphus+228353.1600.3.1 1556554115 installed
<13>Jun 27 12:31:25 rpmi: python3-module-priority-1.3.0-alt1.qa1 sisyphus+228365.500.1.1 1556564499 installed
<13>Jun 27 12:31:25 rpmi: python3-module-hyperframe-5.1.0-alt1.qa1 sisyphus+227493.1700.1.3 1555836018 installed
<13>Jun 27 12:31:25 rpmi: python3-module-hpack-3.0.0-alt1.qa1 sisyphus+227493.500.1.3 1555835217 installed
<13>Jun 27 12:31:25 rpmi: python3-module-h2-3.0.1-alt2 1502880428 installed
<13>Jun 27 12:31:25 rpmi: python3-module-z3c-3.0.0-alt3 sisyphus+220440.100.1.1 1549119447 installed
<13>Jun 27 12:31:25 rpmi: python3-module-zc-1.0.0-alt6.2 1458024175 installed
<13>Jun 27 12:31:25 rpmi: python3-module-zope-3.3.0-alt8.5 sisyphus+225625.33400.91.1 1555314837 installed
<13>Jun 27 12:31:25 rpmi: python3-module-serial-3.4-alt1 1508504506 installed
<13>Jun 27 12:31:25 rpmi: python3-module-hyperlink-17.3.0-alt1.qa1 sisyphus+227493.2000.1.3 1555836084 installed
<13>Jun 27 12:31:25 rpmi: python3-module-appdirs-1.4.3-alt1.1 sisyphus+227473.200.1.2 1555755564 installed
<13>Jun 27 12:31:25 rpmi: python3-module-asn1crypto-0.24.0-alt1 sisyphus+227473.1300.1.2 1555756512 installed
<13>Jun 27 12:31:25 rpmi: python3-module-pycares-2.3.0-alt1.1 sisyphus+225625.36700.91.1 1555325221 installed
<13>Jun 27 12:31:25 rpmi: python3-module-certifi-2016.9.26-alt1 sisyphus+227476.1200.1.2 1555756242 installed
<13>Jun 27 12:31:25 rpmi: python3-module-pycparser-2.19-alt1 sisyphus+228366.1000.2.3 1556706938 installed
<13>Jun 27 12:31:25 rpmi: python3-module-cffi-1.12.3-alt1 sisyphus+229040.200.3.1 1557316452 installed
<13>Jun 27 12:31:26 rpmi: python3-module-cryptography-2.6.1-alt1 sisyphus+225625.24400.91.1 1555298600 installed
<13>Jun 27 12:31:26 rpmi: python3-module-OpenSSL-18.0.0-alt1 1532996168 installed
<13>Jun 27 12:31:26 rpmi: python3-module-ndg-httpsclient-0.4.2-alt1.qa1 sisyphus+227504.1300.1.2 1555853234 installed
<13>Jun 27 12:31:26 rpmi: python3-module-urllib3-2:1.25.6-alt1 p9+250567.200.5.1 1590420860 installed
<13>Jun 27 12:31:26 rpmi: python3-module-requests-2.23.0-alt1 p9+250567.500.5.1 1590420921 installed
<13>Jun 27 12:31:26 rpmi: libcares-1.16.1-alt2 p9+261934.100.3.1 1605804390 installed
<13>Jun 27 12:31:26 rpmi: libtinfo-devel-6.1.20180407-alt2 sisyphus+222164.200.1.1 1550686226 installed
<13>Jun 27 12:31:26 rpmi: libncurses-devel-6.1.20180407-alt2 sisyphus+222164.200.1.1 1550686226 installed
<13>Jun 27 12:31:26 rpmi: python3-dev-3.7.4-alt3 p9+249932.100.2.1 1587127349 installed
<13>Jun 27 12:31:26 rpmi: python3-module-setuptools-1:40.8.0-alt2 sisyphus+229158.200.2.1 1557735221 installed
<13>Jun 27 12:31:26 rpmi: python3-module-automat-0.6.0-alt1.qa1 sisyphus+227474.200.1.1 1555687248 installed
<13>Jun 27 12:31:26 rpmi: python3-module-twisted-runner-18.9.0-alt1 sisyphus+225625.46000.91.1 1555354932 installed
<13>Jun 27 12:31:26 rpmi: python3-module-twisted-logger-18.9.0-alt1 sisyphus+225625.46000.91.1 1555354932 installed
<13>Jun 27 12:31:26 rpmi: python3-module-twisted-web-18.9.0-alt1 sisyphus+225625.46000.91.1 1555354932 installed
<13>Jun 27 12:31:26 rpmi: python3-module-twisted-names-18.9.0-alt1 sisyphus+225625.46000.91.1 1555354932 installed
<13>Jun 27 12:31:26 rpmi: python3-module-twisted-pair-18.9.0-alt1 sisyphus+225625.46000.91.1 1555354932 installed
<13>Jun 27 12:31:26 rpmi: python3-module-twisted-positioning-18.9.0-alt1 sisyphus+225625.46000.91.1 1555354932 installed
<13>Jun 27 12:31:26 rpmi: python3-module-twisted-words-18.9.0-alt1 sisyphus+225625.46000.91.1 1555354932 installed
<13>Jun 27 12:31:26 rpmi: python3-module-twisted-core-18.9.0-alt1 sisyphus+225625.46000.91.1 1555354932 installed
<13>Jun 27 12:31:26 rpmi: python3-module-twisted-conch-18.9.0-alt1 sisyphus+225625.46000.91.1 1555354932 installed
<13>Jun 27 12:31:27 rpmi: python3-module-twisted-core-test-18.9.0-alt1 sisyphus+225625.46000.91.1 1555354932 installed
<13>Jun 27 12:31:27 rpmi: python3-module-tornado-5.1.1-alt2 sisyphus+225625.16600.91.1 1555292790 installed
<13>Jun 27 12:31:27 rpmi: python3-module-tornado_xstatic-0.1-alt1.git20140929.2 sisyphus+227533.2000.1.2 1555929523 installed
<13>Jun 27 12:31:27 rpmi: python3-module-terminado-0.5-alt2.git20150717 sisyphus+227532.1000.1.3 1555940287 installed
<13>Jun 27 12:31:27 rpmi: python3-module-greenlet-0.4.15-alt1 sisyphus+225625.7600.91.1 1555287275 installed
<13>Jun 27 12:31:27 rpmi: python3-module-gevent-1.4.0-alt2 sisyphus+229109.100.2.1 1557341689 installed
<13>Jun 27 12:31:27 rpmi: libzeromq-4.2.3-alt1 1513846894 installed
<13>Jun 27 12:31:27 rpmi: python3-module-zmq-17.0.0-alt1 sisyphus+225625.32500.91.1 1555313584 installed
<13>Jun 27 12:31:27 rpmi: python3-module-jupyter_client-5.1.0-alt2 sisyphus+228359.600.4.3 1556674086 installed
<13>Jun 27 12:31:27 rpmi: python3-module-simplegeneric-0.8.1-alt1.1.1.1 sisyphus+228372.300.1.1 1556567603 installed
<13>Jun 27 12:31:27 rpmi: perl-Try-Tiny-0.30-alt1 1514318058 installed
<13>Jun 27 12:31:27 rpmi: perl-IO-Socket-IP-0.39-alt1 1494508514 installed
<13>Jun 27 12:31:27 rpmi: perl-Compress-Raw-Bzip2-2.086-alt1 sisyphus+226394.100.1.2 1554269409 installed
<13>Jun 27 12:31:27 rpmi: perl-HTML-Tagset-3.20-alt2 1317725093 installed
<13>Jun 27 12:31:27 rpmi: perl-Term-ANSIColor-4.06-alt1 1479407083 installed
<13>Jun 27 12:31:27 rpmi: perl-Data-Dump-1.23-alt1 1444601978 installed
<13>Jun 27 12:31:27 rpmi: perl-Filter-1.59-alt1.1 sisyphus+219907.400.1.1 1548343389 installed
<13>Jun 27 12:31:27 rpmi: perl-Encode-3.01-alt1 sisyphus+224923.100.1.1 1552474122 installed
<13>Jun 27 12:31:27 rpmi: perl-URI-1.76-alt1 sisyphus+220243.100.1.1 1548863244 installed
<13>Jun 27 12:31:27 rpmi: perl-IO-Compress-2.086-alt1 sisyphus+226399.100.2.1 1554270186 installed
<13>Jun 27 12:31:27 rpmi: perl-Net-HTTP-6.18-alt1 1526560501 installed
<13>Jun 27 12:31:27 rpmi: perl-HTML-Parser-3.72-alt1.2 sisyphus+219907.600.1.1 1548343581 installed
<13>Jun 27 12:31:27 rpmi: perl-WWW-RobotRules-6.02-alt1 1329756211 installed
<13>Jun 27 12:31:27 rpmi: perl-Encode-Locale-1.05-alt1 1444608613 installed
<13>Jun 27 12:31:27 rpmi: perl-IO-HTML-1.001-alt1 1404821752 installed
<13>Jun 27 12:31:27 rpmi: perl-HTTP-Message-6.18-alt1 1528288416 installed
<13>Jun 27 12:31:27 rpmi: perl-HTTP-Cookies-6.04-alt1 1504116575 installed
<13>Jun 27 12:31:27 rpmi: perl-HTTP-Negotiate-6.01-alt1 1329760563 installed
<13>Jun 27 12:31:27 rpmi: perl-libwww-6.39-alt1 sisyphus+229237.100.1.1 1557650051 installed
<13>Jun 27 12:31:28 rpmi: perl-XML-LibXML-2.0134-alt1 p9+240664.100.1.1 1573636517 installed
<13>Jun 27 12:31:28 rpmi: perl-XML-SAX-1.00-alt1 1519094959 installed
<13>Jun 27 12:31:28 rpmi: perl-XML-Simple-2.25-alt1 1521437714 installed
<13>Jun 27 12:31:28 rpmi: icon-naming-utils-0.8.90-alt1 1236573102 installed
<13>Jun 27 12:31:29 rpmi: icon-theme-adwaita-3.32.0-alt1 sisyphus+225063.1600.1.1 1552933594 installed
<13>Jun 27 12:31:29 rpmi: hwclock-1:2.33.2-alt2 p9+254003.100.1.1 1593108043 installed
<13>Jun 27 12:31:29 rpmi: libwebp7-1.0.3-alt1 p9+234901.200.1.1 1563552457 installed
<13>Jun 27 12:31:29 rpmi: libjbig-2.1-alt1 1401380926 installed
<13>Jun 27 12:31:29 rpmi: libtiff5-4.0.10.0.57.f9fc01c3-alt1 sisyphus+226958.100.1.1 1554850940 installed
<13>Jun 27 12:31:29 rpmi: libgdk-pixbuf-locales-2.38.2-alt1 p9+237353.1000.2.2 1568374008 installed
<13>Jun 27 12:31:29 rpmi: gtk+3-themes-incompatible-3.20-alt3 1461944560 installed
<13>Jun 27 12:31:29 rpmi: libproxy-0.4.15-alt5 p9+261541.200.3.1 1605276967 installed
<13>Jun 27 12:31:29 rpmi: gcc-c++-common-1.4.23-alt1 sisyphus+221902.2500.4.1 1550596716 installed
<13>Jun 27 12:31:29 rpmi: libstdc++8-devel-8.4.1-alt0.p9.1 p9+247559.100.2.1 1585587912 installed
<13>Jun 27 12:31:31 rpmi: gcc8-c++-8.4.1-alt0.p9.1 p9+247559.100.2.1 1585587912 installed
<13>Jun 27 12:31:31 rpmi: libatk-locales-2.32.0-alt1 sisyphus+225059.600.3.2 1552845198 installed
<13>Jun 27 12:31:31 rpmi: libatk-2.32.0-alt1 sisyphus+225059.600.3.2 1552845362 installed
<13>Jun 27 12:31:31 rpmi: shared-mime-info-1.13.1-alt1 p9+238204.100.1.1 1569496447 installed
<13>Jun 27 12:31:31 rpmi: gsettings-desktop-schemas-data-3.32.0-alt1 sisyphus+225059.300.3.2 1552843929 installed
<13>Jun 27 12:31:31 rpmi: libgio-2.60.7-alt1 p9+237353.100.2.2 1568373081 installed
<13>Jun 27 12:31:31 rpmi: gsettings-desktop-schemas-3.32.0-alt1 sisyphus+225059.300.3.2 1552843980 installed
<13>Jun 27 12:31:31 rpmi: gobject-introspection-1.60.2-alt1 p9+232288.200.1.1 1560708080 installed
<13>Jun 27 12:31:31 rpmi: libgdk-pixbuf-2.38.2-alt1 p9+237353.1000.2.2 1568374336 installed
<13>Jun 27 12:31:31 rpmi: gobject-introspection-x11-1.60.2-alt1 p9+232288.200.1.1 1560708080 installed
<13>Jun 27 12:31:31 rpmi: libgusb-0.3.4-alt1 p9+252428.140.2.1 1590759505 installed
<13>Jun 27 12:31:31 rpmi: libcolord-1.4.4-alt1 sisyphus+224111.100.1.1 1552060572 installed
<13>Jun 27 12:31:31 rpmi: gtk-update-icon-cache-3.24.11-alt1.M90P.1 p9+270534.40.3.1 1621245189 installed
<13>Jun 27 12:31:31 rpmi: libgdk-pixbuf-gir-2.38.2-alt1 p9+237353.1000.2.2 1568374336 installed
<13>Jun 27 12:31:31 rpmi: libatk-gir-2.32.0-alt1 sisyphus+225059.600.3.2 1552845362 installed
<13>Jun 27 12:31:31 rpmi: glib-networking-2.60.3-alt1.p9.2 p9+262755.100.1.1 1606834386 installed
<13>Jun 27 12:31:31 rpmi: libsoup-2.66.2-alt1 p9+230015.200.2.1 1559209103 installed
<13>Jun 27 12:31:31 rpmi: libsoup-gnome-2.66.2-alt1 p9+230015.200.2.1 1559209103 installed
<13>Jun 27 12:31:31 rpmi: librest-0.8.1-alt1 1508266400 installed
<13>Jun 27 12:31:31 rpmi: libdconf-0.32.0-alt1.1 p9+265957.1100.8.1 1617619390 installed
<13>Jun 27 12:31:31 rpmi: libjson-glib-1.4.4-alt1 sisyphus.213175.100 1537249589 installed
<13>Jun 27 12:31:31 rpmi: libgpg-error-1.36-alt1 p9+261942.140.4.1 1606237675 installed
<13>Jun 27 12:31:31 rpmi: libgcrypt20-1.8.5-alt3 p9+261942.200.4.1 1606237923 installed
<13>Jun 27 12:31:31 rpmi: libsystemd-1:246.13-alt1 p9+265718.640.15.1 1618506331 installed
<13>Jun 27 12:31:31 rpmi: libdbus-1.12.16-alt2 p9+240607.100.1.1 1573553687 installed
<13>Jun 27 12:31:31 rpmi: dbus-tools-1.12.16-alt2 p9+240607.100.1.1 1573553687 installed
<86>Jun 27 12:31:31 groupadd[1761722]: group added to /etc/group: name=messagebus, GID=497
<86>Jun 27 12:31:31 groupadd[1761722]: group added to /etc/gshadow: name=messagebus
<86>Jun 27 12:31:31 groupadd[1761722]: new group: name=messagebus, GID=497
<86>Jun 27 12:31:31 useradd[1761731]: new user: name=messagebus, UID=499, GID=497, home=/run/dbus, shell=/dev/null
<13>Jun 27 12:31:31 rpmi: dbus-1.12.16-alt2 p9+240607.100.1.1 1573553687 installed
<13>Jun 27 12:31:31 rpmi: dconf-0.32.0-alt1.1 p9+265957.1100.8.1 1617619390 installed
<13>Jun 27 12:31:31 rpmi: libgtk+3-schemas-3.24.11-alt1.M90P.1 p9+270534.40.3.1 1621245201 installed
<13>Jun 27 12:31:31 rpmi: libavahi-0.8-alt2 p9+270905.100.1.1 1619639865 installed
<13>Jun 27 12:31:31 rpmi: libcups-2.3.3-alt6.op2 p9+272723.300.4.1 1624275925 installed
<13>Jun 27 12:31:32 rpmi: libpolkit-0.116-alt2.M90P.2 p9+274034.100.1.1 1623151144 installed
<86>Jun 27 12:31:32 groupadd[1761811]: group added to /etc/group: name=colord, GID=496
<86>Jun 27 12:31:32 groupadd[1761811]: group added to /etc/gshadow: name=colord
<86>Jun 27 12:31:32 groupadd[1761811]: new group: name=colord, GID=496
<86>Jun 27 12:31:32 useradd[1761815]: new user: name=colord, UID=498, GID=496, home=/var/colord, shell=/dev/null
<13>Jun 27 12:31:32 rpmi: colord-1.4.4-alt1 sisyphus+224111.100.1.1 1552060572 installed
<13>Jun 27 12:31:32 rpmi: libxslt-1.1.34-alt1.p9.1 p9+261811.300.3.1 1605513919 installed
<13>Jun 27 12:31:32 rpmi: python3-module-cssselect-0.9.1-alt1.2 sisyphus+227479.1100.1.2 1555757152 installed
<13>Jun 27 12:31:32 rpmi: python3-module-html5lib-1:0.999999999-alt4.qa1 sisyphus+227493.600.1.3 1555835341 installed
<13>Jun 27 12:31:32 rpmi: python3-module-lxml-4.4.2-alt1 p9+244111.100.1.1 1578758819 installed
<13>Jun 27 12:31:32 rpmi: python3-module-docutils-0.14-alt2 1535729778 installed
<13>Jun 27 12:31:32 rpmi: python3-module-botocore-1.6.0-alt1.1 sisyphus+227475.1000.1.2 1555717401 installed
<13>Jun 27 12:31:32 rpmi: python3-module-s3transfer-0.1.10-alt1.1 sisyphus+227526.200.1.2 1555923713 installed
<13>Jun 27 12:31:32 rpmi: python3-module-alabaster-0.7.6-alt3 sisyphus+228351.700.4.1 1556637370 installed
<13>Jun 27 12:31:32 rpmi: python3-module-sphinxcontrib-applehelp-1.0.1-alt1 sisyphus+228217.100.1.1 1556282506 installed
<13>Jun 27 12:31:32 rpmi: python3-module-sphinxcontrib-devhelp-1.0.1-alt1 sisyphus+228218.100.1.1 1556283262 installed
<13>Jun 27 12:31:33 rpmi: python3-module-sphinxcontrib-htmlhelp-1.0.2-alt1 sisyphus+228401.100.1.1 1556572721 installed
<13>Jun 27 12:31:33 rpmi: python3-module-sphinxcontrib-jsmath-1.0.1-alt1 p9+247680.64.15.1 1585326575 installed
<13>Jun 27 12:31:33 rpmi: python3-module-sphinxcontrib-qthelp-1.0.2-alt1 sisyphus+228215.100.1.1 1556282300 installed
<13>Jun 27 12:31:33 rpmi: python3-module-sphinxcontrib-serializinghtml-1.1.3-alt1 sisyphus+228216.100.1.1 1556282403 installed
<13>Jun 27 12:31:33 rpmi: python3-module-sphinx-1:2.2.0-alt2.1.p9 p9+247680.14.15.1 1585326533 installed
<13>Jun 27 12:31:33 rpmi: python3-module-Pygments-2.6.1-alt2 p9+263160.600.6.1 1607946197 installed
<13>Jun 27 12:31:33 rpmi: python3-module-prompt_toolkit-1.0.14-alt1.1 sisyphus+228365.1300.4.2 1556671018 installed
<13>Jun 27 12:31:33 rpmi: python3-module-bleach-2.1.3-alt1.qa1 sisyphus+227475.300.1.1 1555687267 installed
<13>Jun 27 12:31:33 rpmi: libcryptsetup-2.3.3-alt1 p9+252585.100.1.1 1590914370 installed
<13>Jun 27 12:31:33 rpmi: startup-0.9.9.10-alt1 p9+263519.100.1.1 1608121516 installed
<13>Jun 27 12:31:34 rpmi: systemd-utils-1:246.13-alt1 p9+265718.640.15.1 1618506331 installed
<13>Jun 27 12:31:34 rpmi: libX11-locales-3:1.7.2-alt1 p9+273972.100.2.1 1623924318 installed
<13>Jun 27 12:31:34 rpmi: libX11-3:1.7.2-alt1 p9+273972.100.2.1 1623924397 installed
<13>Jun 27 12:31:34 rpmi: libXext-1.3.4-alt1 sisyphus+225206.700.1.2 1552949429 installed
<13>Jun 27 12:31:34 rpmi: libXrender-0.9.10-alt1 p9+261891.200.2.1 1606149111 installed
<13>Jun 27 12:31:34 rpmi: libXfixes-5.0.3-alt1 sisyphus+226736.100.2.2 1554614841 installed
<13>Jun 27 12:31:34 rpmi: libXft-2.3.3-alt1 sisyphus+225206.1000.3.2 1552987708 installed
<13>Jun 27 12:31:34 rpmi: libtk-8.6.9-alt1 sisyphus+227145.200.1.2 1555606681 installed
<13>Jun 27 12:31:34 rpmi: libat-spi2-core-2.32.1-alt1.1 sisyphus+227877.100.1.2 1555818555 installed
<13>Jun 27 12:31:34 rpmi: tk-8.6.9-alt1 sisyphus+227145.200.1.2 1555606681 installed
<13>Jun 27 12:31:34 rpmi: python3-modules-tkinter-3.7.4-alt3 p9+249932.100.2.1 1587127349 installed
<13>Jun 27 12:31:34 rpmi: libXcursor-1.2.0-alt1 sisyphus+225206.400.1.2 1552949218 installed
<13>Jun 27 12:31:34 rpmi: libXrandr-1.5.2-alt1 sisyphus+225206.1300.1.2 1552949710 installed
<13>Jun 27 12:31:34 rpmi: libXtst-1.2.3-alt1 p9+261891.100.2.1 1606149069 installed
<13>Jun 27 12:31:34 rpmi: libXxf86vm-1.1.4-alt2 1527672187 installed
<13>Jun 27 12:31:34 rpmi: libGLX-mesa-4:21.0.3-alt1 p9+271012.200.3.1 1621244977 installed
<13>Jun 27 12:31:34 rpmi: libEGL-mesa-4:21.0.3-alt1 p9+271012.200.3.1 1621244977 installed
<13>Jun 27 12:31:34 rpmi: libEGL-7:1.3.2-alt0.p9 p9+265957.240.8.1 1617618230 installed
<13>Jun 27 12:31:34 rpmi: libGLX-7:1.3.2-alt0.p9 p9+265957.240.8.1 1617618230 installed
<13>Jun 27 12:31:34 rpmi: libGL-7:1.3.2-alt0.p9 p9+265957.240.8.1 1617618230 installed
<13>Jun 27 12:31:34 rpmi: libcairo-1:1.16.0-alt1 sisyphus+226534.100.2.3 1554515535 installed
<13>Jun 27 12:31:34 rpmi: libpango-1.44.6-alt1 p9+237353.700.2.2 1568374131 installed
<13>Jun 27 12:31:34 rpmi: libcairo-gobject-1:1.16.0-alt1 sisyphus+226534.100.2.3 1554515535 installed
<13>Jun 27 12:31:34 rpmi: libpango-gir-1.44.6-alt1 p9+237353.700.2.2 1568374131 installed
<13>Jun 27 12:31:34 rpmi: python3-module-pycairo-1.18.1-alt1 sisyphus+227874.100.1.3 1555790160 installed
<13>Jun 27 12:31:34 rpmi: libXi-1.7.9-alt2 sisyphus+226377.100.1.2 1554260260 installed
<13>Jun 27 12:31:34 rpmi: libXinerama-1.1.4-alt1 sisyphus+223149.300.2.1 1551268216 installed
<13>Jun 27 12:31:34 rpmi: libXv-1.0.11-alt1 1527685499 installed
<13>Jun 27 12:31:34 rpmi: libXvMC-1.0.12-alt1 p9+272150.400.3.1 1621947524 installed
<13>Jun 27 12:31:37 rpmi: xorg-dri-swrast-4:21.0.3-alt1 p9+271012.200.3.1 1621244977 installed
<13>Jun 27 12:31:37 rpmi: dbus-tools-gui-1.12.16-alt2 p9+240607.100.1.1 1573553687 installed
<13>Jun 27 12:31:37 rpmi: at-spi2-core-2.32.1-alt1.1 sisyphus+227877.100.1.2 1555818555 installed
<13>Jun 27 12:31:37 rpmi: at-spi2-atk-2.32.0-alt1 sisyphus+225059.700.3.2 1552845433 installed
<13>Jun 27 12:31:37 rpmi: libXcomposite-0.4.5-alt1 sisyphus+225206.300.1.2 1552949137 installed
<13>Jun 27 12:31:37 rpmi: libXdamage-1.1.5-alt1 sisyphus+225206.500.1.2 1552949286 installed
<13>Jun 27 12:31:38 rpmi: libgtk+3-3.24.11-alt1.M90P.1 p9+270534.40.3.1 1621245189 installed
<13>Jun 27 12:31:38 rpmi: libgtk+3-gir-3.24.11-alt1.M90P.1 p9+270534.40.3.1 1621245189 installed
<13>Jun 27 12:31:38 rpmi: python3-module-pygobject3-3.32.2-alt2 p9+270488.260.17.1 1622219001 installed
<13>Jun 27 12:31:38 rpmi: python3-module-mpl_toolkits-2.2.3-alt6 p9+255957.1400.47.1 1599840095 installed
<13>Jun 27 12:31:38 rpmi: python3-module-matplotlib-cairo-2.2.3-alt6 p9+255957.1400.47.1 1599840095 installed
<13>Jun 27 12:31:38 rpmi: python3-module-matplotlib-tk-2.2.3-alt6 p9+255957.1400.47.1 1599840095 installed
<13>Jun 27 12:31:39 rpmi: python3-module-matplotlib-2.2.3-alt6 p9+255957.1400.47.1 1599840095 installed
<13>Jun 27 12:31:39 rpmi: python3-module-matplotlib-gtk3-2.2.3-alt6 p9+255957.1400.47.1 1599840095 installed
<13>Jun 27 12:31:39 rpmi: python3-module-notebook-5.2.2-alt4 sisyphus+227506.100.1.3 1555869801 installed
<13>Jun 27 12:31:39 rpmi: python3-module-nbconvert-5.3.1-alt5 sisyphus+228961.100.1.1 1557079124 installed
<13>Jun 27 12:31:39 rpmi: python3-module-ipyparallel-4.1.0-alt3 sisyphus+227495.500.1.3 1555842732 installed
<13>Jun 27 12:31:40 rpmi: ipython3-5.5.0-alt3 sisyphus+228348.2000.3.3 1556656641 installed
<13>Jun 27 12:31:40 rpmi: python3-module-ipykernel-4.6.1-alt4 sisyphus+227495.400.1.3 1555842586 installed
<13>Jun 27 12:31:40 rpmi: libXt-1.1.4-alt1 1369984722 installed
<13>Jun 27 12:31:40 rpmi: libXmu-1.1.3-alt1 sisyphus+225206.1200.1.2 1552949641 installed
<13>Jun 27 12:31:40 rpmi: xauth-1:1.0.10-alt1 1501868099 installed
<13>Jun 27 12:31:40 rpmi: libxkbfile-1.1.0-alt1 sisyphus+225206.1100.1.2 1552949569 installed
<13>Jun 27 12:31:40 rpmi: xkbcomp-1.4.2-alt1 sisyphus.213286.100 1537398723 installed
<13>Jun 27 12:31:40 rpmi: xkeyboard-config-1:2.25-alt1 sisyphus+226724.100.2.2 1554610603 installed
<13>Jun 27 12:31:40 rpmi: xorg-server-common-2:1.20.8-alt8 p9+269889.100.1.1 1618385500 installed
<13>Jun 27 12:31:40 rpmi: xorg-xvfb-2:1.20.8-alt8 p9+269889.100.1.1 1618385500 installed
<13>Jun 27 12:31:40 rpmi: xvfb-run-1.20.3-alt1 sisyphus.219055.100 1547009175 installed
<13>Jun 27 12:31:40 rpmi: python3-module-boto3-1.7.29-alt1 sisyphus+227475.700.1.2 1555714162 installed
<13>Jun 27 12:31:40 rpmi: gcc-c++-8-alt2 p9+246536.100.3.1 1582643803 installed
<13>Jun 27 12:31:40 rpmi: libnumpy-py3-devel-1:1.15.4-alt5 p9+255957.40.47.1 1599835883 installed
<13>Jun 27 12:31:40 rpmi: libgdal-devel-3.0.4-alt1.1.M90P.1 p9+272679.200.6.1 1622735807 installed
<13>Jun 27 12:31:40 rpmi: python3-module-snuggs-1.4.1-alt3.1 sisyphus+228372.2000.3.2 1556713050 installed
<13>Jun 27 12:31:40 rpmi: python3-module-pytest-cov-2.7.1-alt1 sisyphus+228997.200.2.1 1557154037 installed
<13>Jun 27 12:31:40 rpmi: python3-module-Cython-0.29.13-alt1 p9+235498.1200.4.1 1565036655 installed
<13>Jun 27 12:31:40 rpmi: libproj-devel-6.3.1-alt1 p9+251936.30.36.1 1619013977 installed
<13>Jun 27 12:31:40 rpmi: python3-module-click-plugins-1.0.2-alt1.1 sisyphus+228352.1200.3.1 1556556013 installed
<13>Jun 27 12:31:40 rpmi: python3-module-cligj-0.7.0-alt1 p9+251936.3550.41.1 1619088720 installed
<13>Jun 27 12:31:40 rpmi: python3-module-wheel-0.29.0-alt1.1 1517922392 installed
<13>Jun 27 12:31:40 rpmi: python3-module-affine-2.0.0.post1-alt2.1 sisyphus+228350.2000.5.1 1556556860 installed
<13>Jun 27 12:31:40 rpmi: libproj-nad-6.3.1-alt1 p9+251936.30.36.1 1619014004 installed
Building target platforms: i586
Building for target i586
Wrote: /usr/src/in/nosrpm/python3-module-rasterio-1.1.8-alt3.nosrc.rpm (w1.gzdio)
Installing python3-module-rasterio-1.1.8-alt3.src.rpm
Building target platforms: i586
Building for target i586
Executing(%prep): /bin/sh -e /usr/src/tmp/rpm-tmp.81491
+ umask 022
+ /bin/mkdir -p /usr/src/RPM/BUILD
+ cd /usr/src/RPM/BUILD
+ cd /usr/src/RPM/BUILD
+ rm -rf python3-module-rasterio-1.1.8
+ echo 'Source #0 (python3-module-rasterio-1.1.8.tar):'
Source #0 (python3-module-rasterio-1.1.8.tar):
+ /bin/tar -xf /usr/src/RPM/SOURCES/python3-module-rasterio-1.1.8.tar
+ cd python3-module-rasterio-1.1.8
+ /bin/chmod -c -Rf u+rwX,go-w .
+ /usr/bin/subst 's|/usr/local/share/proj|/usr/share/proj|' setup.py
+ exit 0
Executing(%build): /bin/sh -e /usr/src/tmp/rpm-tmp.71892
+ umask 022
+ /bin/mkdir -p /usr/src/RPM/BUILD
+ cd /usr/src/RPM/BUILD
+ cd python3-module-rasterio-1.1.8
+ CFLAGS='-pipe -frecord-gcc-switches -Wall -g -O2 -march=i586 -mtune=generic'
+ export CFLAGS
+ CXXFLAGS='-pipe -frecord-gcc-switches -Wall -g -O2 -march=i586 -mtune=generic'
+ export CXXFLAGS
+ FFLAGS='-pipe -frecord-gcc-switches -Wall -g -O2 -march=i586 -mtune=generic'
+ export FFLAGS
+ /usr/bin/python3 setup.py build --debug
INFO:root:GDAL API version obtained from gdal-config: 3.0.4
running build
running build_py
creating build
creating build/lib.linux-i686-3.7
creating build/lib.linux-i686-3.7/rasterio
copying ./rasterio/windows.py -> build/lib.linux-i686-3.7/rasterio
copying ./rasterio/warp.py -> build/lib.linux-i686-3.7/rasterio
copying ./rasterio/vrt.py -> build/lib.linux-i686-3.7/rasterio
copying ./rasterio/transform.py -> build/lib.linux-i686-3.7/rasterio
copying ./rasterio/tools.py -> build/lib.linux-i686-3.7/rasterio
copying ./rasterio/session.py -> build/lib.linux-i686-3.7/rasterio
copying ./rasterio/sample.py -> build/lib.linux-i686-3.7/rasterio
copying ./rasterio/profiles.py -> build/lib.linux-i686-3.7/rasterio
copying ./rasterio/plot.py -> build/lib.linux-i686-3.7/rasterio
copying ./rasterio/path.py -> build/lib.linux-i686-3.7/rasterio
copying ./rasterio/merge.py -> build/lib.linux-i686-3.7/rasterio
copying ./rasterio/mask.py -> build/lib.linux-i686-3.7/rasterio
copying ./rasterio/io.py -> build/lib.linux-i686-3.7/rasterio
copying ./rasterio/fill.py -> build/lib.linux-i686-3.7/rasterio
copying ./rasterio/features.py -> build/lib.linux-i686-3.7/rasterio
copying ./rasterio/errors.py -> build/lib.linux-i686-3.7/rasterio
copying ./rasterio/env.py -> build/lib.linux-i686-3.7/rasterio
copying ./rasterio/enums.py -> build/lib.linux-i686-3.7/rasterio
copying ./rasterio/dtypes.py -> build/lib.linux-i686-3.7/rasterio
copying ./rasterio/drivers.py -> build/lib.linux-i686-3.7/rasterio
copying ./rasterio/crs.py -> build/lib.linux-i686-3.7/rasterio
copying ./rasterio/coords.py -> build/lib.linux-i686-3.7/rasterio
copying ./rasterio/control.py -> build/lib.linux-i686-3.7/rasterio
copying ./rasterio/compat.py -> build/lib.linux-i686-3.7/rasterio
copying ./rasterio/__init__.py -> build/lib.linux-i686-3.7/rasterio
creating build/lib.linux-i686-3.7/rasterio/rio
copying ./rasterio/rio/warp.py -> build/lib.linux-i686-3.7/rasterio/rio
copying ./rasterio/rio/transform.py -> build/lib.linux-i686-3.7/rasterio/rio
copying ./rasterio/rio/stack.py -> build/lib.linux-i686-3.7/rasterio/rio
copying ./rasterio/rio/shapes.py -> build/lib.linux-i686-3.7/rasterio/rio
copying ./rasterio/rio/sample.py -> build/lib.linux-i686-3.7/rasterio/rio
copying ./rasterio/rio/rm.py -> build/lib.linux-i686-3.7/rasterio/rio
copying ./rasterio/rio/rasterize.py -> build/lib.linux-i686-3.7/rasterio/rio
copying ./rasterio/rio/overview.py -> build/lib.linux-i686-3.7/rasterio/rio
copying ./rasterio/rio/options.py -> build/lib.linux-i686-3.7/rasterio/rio
copying ./rasterio/rio/merge.py -> build/lib.linux-i686-3.7/rasterio/rio
copying ./rasterio/rio/mask.py -> build/lib.linux-i686-3.7/rasterio/rio
copying ./rasterio/rio/main.py -> build/lib.linux-i686-3.7/rasterio/rio
copying ./rasterio/rio/insp.py -> build/lib.linux-i686-3.7/rasterio/rio
copying ./rasterio/rio/info.py -> build/lib.linux-i686-3.7/rasterio/rio
copying ./rasterio/rio/helpers.py -> build/lib.linux-i686-3.7/rasterio/rio
copying ./rasterio/rio/gcps.py -> build/lib.linux-i686-3.7/rasterio/rio
copying ./rasterio/rio/env.py -> build/lib.linux-i686-3.7/rasterio/rio
copying ./rasterio/rio/edit_info.py -> build/lib.linux-i686-3.7/rasterio/rio
copying ./rasterio/rio/convert.py -> build/lib.linux-i686-3.7/rasterio/rio
copying ./rasterio/rio/clip.py -> build/lib.linux-i686-3.7/rasterio/rio
copying ./rasterio/rio/calc.py -> build/lib.linux-i686-3.7/rasterio/rio
copying ./rasterio/rio/bounds.py -> build/lib.linux-i686-3.7/rasterio/rio
copying ./rasterio/rio/blocks.py -> build/lib.linux-i686-3.7/rasterio/rio
copying ./rasterio/rio/__init__.py -> build/lib.linux-i686-3.7/rasterio/rio
running egg_info
creating rasterio.egg-info
writing rasterio.egg-info/PKG-INFO
writing dependency_links to rasterio.egg-info/dependency_links.txt
writing entry points to rasterio.egg-info/entry_points.txt
writing requirements to rasterio.egg-info/requires.txt
writing top-level names to rasterio.egg-info/top_level.txt
writing manifest file 'rasterio.egg-info/SOURCES.txt'
reading manifest file 'rasterio.egg-info/SOURCES.txt'
writing manifest file 'rasterio.egg-info/SOURCES.txt'
running build_ext
building 'rasterio._base' extension
creating build/temp.linux-i686-3.7
creating build/temp.linux-i686-3.7/rasterio
i586-alt-linux-gcc -pthread -Wno-unused-result -Wsign-compare -DNDEBUG -g -fwrapv -O3 -Wall -pipe -frecord-gcc-switches -Wall -g -O3 -march=i586 -mtune=generic -pipe -frecord-gcc-switches -Wall -g -O2 -march=i586 -mtune=generic -fPIC -g -I/usr/lib/python3/site-packages/numpy/core/include -I/usr/include/gdal -I/usr/include/python3.7m -c rasterio/_base.c -o build/temp.linux-i686-3.7/rasterio/_base.o -Wno-unused-parameter -Wno-unused-function
rasterio/_base.c: In function ‘__pyx_pf_8rasterio_5_base_11DatasetBase_46block_size’:
rasterio/_base.c:12123:17: warning: assignment discards ‘const’ qualifier from pointer target type [-Wdiscarded-qualifiers]
   __pyx_v_value = GDALGetMetadataItem(__pyx_v_obj, __pyx_v_key_c, ((char const *)"TIFF"));
                 ^
rasterio/_base.c: In function ‘__pyx_pf_8rasterio_5_base_11DatasetBase_59tags’:
rasterio/_base.c:17016:17: warning: assignment discards ‘const’ qualifier from pointer target type [-Wdiscarded-qualifiers]
     __pyx_v_val = CPLParseNameValue((__pyx_v_metadata[__pyx_v_i]), (&__pyx_v_key));
                 ^
rasterio/_base.c: In function ‘__pyx_pf_8rasterio_5_base_11DatasetBase_61get_tag_item’:
rasterio/_base.c:17568:17: warning: assignment discards ‘const’ qualifier from pointer target type [-Wdiscarded-qualifiers]
   __pyx_v_value = GDALGetMetadataItem(__pyx_v_obj, __pyx_v_name, __pyx_v_domain);
                 ^
i586-alt-linux-gcc -pthread -shared -pipe -frecord-gcc-switches -Wall -g -O2 -march=i586 -mtune=generic -g build/temp.linux-i686-3.7/rasterio/_base.o -L/usr/lib -lgdal -lpython3.7m -o build/lib.linux-i686-3.7/rasterio/_base.cpython-37m.so
building 'rasterio._io' extension
i586-alt-linux-gcc -pthread -Wno-unused-result -Wsign-compare -DNDEBUG -g -fwrapv -O3 -Wall -pipe -frecord-gcc-switches -Wall -g -O3 -march=i586 -mtune=generic -pipe -frecord-gcc-switches -Wall -g -O2 -march=i586 -mtune=generic -fPIC -g -I/usr/lib/python3/site-packages/numpy/core/include -I/usr/include/gdal -I/usr/include/python3.7m -c rasterio/_io.c -o build/temp.linux-i686-3.7/rasterio/_io.o -Wno-unused-parameter -Wno-unused-function
In file included from /usr/lib/python3/site-packages/numpy/core/include/numpy/ndarraytypes.h:1821,
                 from /usr/lib/python3/site-packages/numpy/core/include/numpy/ndarrayobject.h:18,
                 from /usr/lib/python3/site-packages/numpy/core/include/numpy/arrayobject.h:4,
                 from rasterio/_io.c:661:
/usr/lib/python3/site-packages/numpy/core/include/numpy/npy_1_7_deprecated_api.h:15:2: warning: #warning "Using deprecated NumPy API, disable it by " "#defining NPY_NO_DEPRECATED_API NPY_1_7_API_VERSION" [-Wcpp]
 #warning "Using deprecated NumPy API, disable it by " \
  ^~~~~~~
rasterio/_io.c: In function ‘__pyx_pf_8rasterio_3_io_14InMemoryRaster___cinit__’:
rasterio/_io.c:28227:45: warning: passing argument 2 of ‘OSRExportToWkt’ from incompatible pointer type [-Wincompatible-pointer-types]
         (void)(OSRExportToWkt(__pyx_v_osr, (&__pyx_v_srcwkt)));
                                            ~^~~~~~~~~~~~~~~~
In file included from rasterio/_io.c:655:
/usr/include/gdal/ogr_srs_api.h:502:66: note: expected ‘char **’ but argument is of type ‘const char **’
 OGRErr CPL_DLL CPL_STDCALL OSRExportToWkt( OGRSpatialReferenceH, char ** );
                                                                  ^~~~~~~
rasterio/_io.c:28311:19: warning: passing argument 1 of ‘VSIFree’ discards ‘const’ qualifier from pointer target type [-Wdiscarded-qualifiers]
           CPLFree(__pyx_v_srcwkt);
                   ^~~~~~~~~~~~~~
In file included from /usr/include/gdal/cpl_conv.h:36,
                 from rasterio/_io.c:650:
/usr/include/gdal/cpl_vsi.h:235:26: note: expected ‘void *’ but argument is of type ‘const char *’
 void CPL_DLL    VSIFree( void * );
                          ^~~~~~
rasterio/_io.c:28354:21: warning: passing argument 1 of ‘VSIFree’ discards ‘const’ qualifier from pointer target type [-Wdiscarded-qualifiers]
             CPLFree(__pyx_v_srcwkt);
                     ^~~~~~~~~~~~~~
In file included from /usr/include/gdal/cpl_conv.h:36,
                 from rasterio/_io.c:650:
/usr/include/gdal/cpl_vsi.h:235:26: note: expected ‘void *’ but argument is of type ‘const char *’
 void CPL_DLL    VSIFree( void * );
                          ^~~~~~
rasterio/_io.c:28685:43: warning: passing argument 2 of ‘OSRExportToWkt’ from incompatible pointer type [-Wincompatible-pointer-types]
       (void)(OSRExportToWkt(__pyx_v_osr, (&__pyx_v_srcwkt)));
                                          ~^~~~~~~~~~~~~~~~
In file included from rasterio/_io.c:655:
/usr/include/gdal/ogr_srs_api.h:502:66: note: expected ‘char **’ but argument is of type ‘const char **’
 OGRErr CPL_DLL CPL_STDCALL OSRExportToWkt( OGRSpatialReferenceH, char ** );
                                                                  ^~~~~~~
rasterio/_io.c:28716:17: warning: passing argument 1 of ‘VSIFree’ discards ‘const’ qualifier from pointer target type [-Wdiscarded-qualifiers]
         CPLFree(__pyx_v_srcwkt);
                 ^~~~~~~~~~~~~~
In file included from /usr/include/gdal/cpl_conv.h:36,
                 from rasterio/_io.c:650:
/usr/include/gdal/cpl_vsi.h:235:26: note: expected ‘void *’ but argument is of type ‘const char *’
 void CPL_DLL    VSIFree( void * );
                          ^~~~~~
rasterio/_io.c:28768:19: warning: passing argument 1 of ‘VSIFree’ discards ‘const’ qualifier from pointer target type [-Wdiscarded-qualifiers]
           CPLFree(__pyx_v_srcwkt);
                   ^~~~~~~~~~~~~~
In file included from /usr/include/gdal/cpl_conv.h:36,
                 from rasterio/_io.c:650:
/usr/include/gdal/cpl_vsi.h:235:26: note: expected ‘void *’ but argument is of type ‘const char *’
 void CPL_DLL    VSIFree( void * );
                          ^~~~~~
i586-alt-linux-gcc -pthread -shared -pipe -frecord-gcc-switches -Wall -g -O2 -march=i586 -mtune=generic -g build/temp.linux-i686-3.7/rasterio/_io.o -L/usr/lib -lgdal -lpython3.7m -o build/lib.linux-i686-3.7/rasterio/_io.cpython-37m.so
building 'rasterio._features' extension
i586-alt-linux-gcc -pthread -Wno-unused-result -Wsign-compare -DNDEBUG -g -fwrapv -O3 -Wall -pipe -frecord-gcc-switches -Wall -g -O3 -march=i586 -mtune=generic -pipe -frecord-gcc-switches -Wall -g -O2 -march=i586 -mtune=generic -fPIC -g -I/usr/lib/python3/site-packages/numpy/core/include -I/usr/include/gdal -I/usr/include/python3.7m -c rasterio/_features.c -o build/temp.linux-i686-3.7/rasterio/_features.o -Wno-unused-parameter -Wno-unused-function
In file included from /usr/lib/python3/site-packages/numpy/core/include/numpy/ndarraytypes.h:1821,
                 from /usr/lib/python3/site-packages/numpy/core/include/numpy/ndarrayobject.h:18,
                 from /usr/lib/python3/site-packages/numpy/core/include/numpy/arrayobject.h:4,
                 from rasterio/_features.c:661:
/usr/lib/python3/site-packages/numpy/core/include/numpy/npy_1_7_deprecated_api.h:15:2: warning: #warning "Using deprecated NumPy API, disable it by " "#defining NPY_NO_DEPRECATED_API NPY_1_7_API_VERSION" [-Wcpp]
 #warning "Using deprecated NumPy API, disable it by " \
  ^~~~~~~
i586-alt-linux-gcc -pthread -shared -pipe -frecord-gcc-switches -Wall -g -O2 -march=i586 -mtune=generic -g build/temp.linux-i686-3.7/rasterio/_features.o -L/usr/lib -lgdal -lpython3.7m -o build/lib.linux-i686-3.7/rasterio/_features.cpython-37m.so
building 'rasterio._env' extension
i586-alt-linux-gcc -pthread -Wno-unused-result -Wsign-compare -DNDEBUG -g -fwrapv -O3 -Wall -pipe -frecord-gcc-switches -Wall -g -O3 -march=i586 -mtune=generic -pipe -frecord-gcc-switches -Wall -g -O2 -march=i586 -mtune=generic -fPIC -g -I/usr/lib/python3/site-packages/numpy/core/include -I/usr/include/gdal -I/usr/include/python3.7m -c rasterio/_env.c -o build/temp.linux-i686-3.7/rasterio/_env.o -Wno-unused-parameter -Wno-unused-function
i586-alt-linux-gcc -pthread -shared -pipe -frecord-gcc-switches -Wall -g -O2 -march=i586 -mtune=generic -g build/temp.linux-i686-3.7/rasterio/_env.o -L/usr/lib -lgdal -lpython3.7m -o build/lib.linux-i686-3.7/rasterio/_env.cpython-37m.so
building 'rasterio._warp' extension
i586-alt-linux-gcc -pthread -Wno-unused-result -Wsign-compare -DNDEBUG -g -fwrapv -O3 -Wall -pipe -frecord-gcc-switches -Wall -g -O3 -march=i586 -mtune=generic -pipe -frecord-gcc-switches -Wall -g -O2 -march=i586 -mtune=generic -fPIC -g -I/usr/lib/python3/site-packages/numpy/core/include -I/usr/include/gdal -I/usr/include/python3.7m -c rasterio/_warp.cpp -o build/temp.linux-i686-3.7/rasterio/_warp.o -Wno-unused-parameter -Wno-unused-function -std=c++11
In file included from /usr/lib/python3/site-packages/numpy/core/include/numpy/ndarraytypes.h:1821,
                 from /usr/lib/python3/site-packages/numpy/core/include/numpy/ndarrayobject.h:18,
                 from /usr/lib/python3/site-packages/numpy/core/include/numpy/arrayobject.h:4,
                 from rasterio/_warp.cpp:679:
/usr/lib/python3/site-packages/numpy/core/include/numpy/npy_1_7_deprecated_api.h:15:2: warning: #warning "Using deprecated NumPy API, disable it by " "#defining NPY_NO_DEPRECATED_API NPY_1_7_API_VERSION" [-Wcpp]
 #warning "Using deprecated NumPy API, disable it by " \
  ^~~~~~~
i586-alt-linux-g++ -pthread -shared -pipe -frecord-gcc-switches -Wall -g -O2 -march=i586 -mtune=generic -g build/temp.linux-i686-3.7/rasterio/_warp.o -L/usr/lib -lgdal -lpython3.7m -o build/lib.linux-i686-3.7/rasterio/_warp.cpython-37m.so
building 'rasterio._fill' extension
i586-alt-linux-gcc -pthread -Wno-unused-result -Wsign-compare -DNDEBUG -g -fwrapv -O3 -Wall -pipe -frecord-gcc-switches -Wall -g -O3 -march=i586 -mtune=generic -pipe -frecord-gcc-switches -Wall -g -O2 -march=i586 -mtune=generic -fPIC -g -I/usr/lib/python3/site-packages/numpy/core/include -I/usr/include/gdal -I/usr/include/python3.7m -c rasterio/_fill.cpp -o build/temp.linux-i686-3.7/rasterio/_fill.o -Wno-unused-parameter -Wno-unused-function -std=c++11
In file included from /usr/lib/python3/site-packages/numpy/core/include/numpy/ndarraytypes.h:1821,
                 from /usr/lib/python3/site-packages/numpy/core/include/numpy/ndarrayobject.h:18,
                 from /usr/lib/python3/site-packages/numpy/core/include/numpy/arrayobject.h:4,
                 from rasterio/_fill.cpp:677:
/usr/lib/python3/site-packages/numpy/core/include/numpy/npy_1_7_deprecated_api.h:15:2: warning: #warning "Using deprecated NumPy API, disable it by " "#defining NPY_NO_DEPRECATED_API NPY_1_7_API_VERSION" [-Wcpp]
 #warning "Using deprecated NumPy API, disable it by " \
  ^~~~~~~
i586-alt-linux-g++ -pthread -shared -pipe -frecord-gcc-switches -Wall -g -O2 -march=i586 -mtune=generic -g build/temp.linux-i686-3.7/rasterio/_fill.o -L/usr/lib -lgdal -lpython3.7m -o build/lib.linux-i686-3.7/rasterio/_fill.cpython-37m.so
building 'rasterio._err' extension
i586-alt-linux-gcc -pthread -Wno-unused-result -Wsign-compare -DNDEBUG -g -fwrapv -O3 -Wall -pipe -frecord-gcc-switches -Wall -g -O3 -march=i586 -mtune=generic -pipe -frecord-gcc-switches -Wall -g -O2 -march=i586 -mtune=generic -fPIC -g -I/usr/lib/python3/site-packages/numpy/core/include -I/usr/include/gdal -I/usr/include/python3.7m -c rasterio/_err.c -o build/temp.linux-i686-3.7/rasterio/_err.o -Wno-unused-parameter -Wno-unused-function
i586-alt-linux-gcc -pthread -shared -pipe -frecord-gcc-switches -Wall -g -O2 -march=i586 -mtune=generic -g build/temp.linux-i686-3.7/rasterio/_err.o -L/usr/lib -lgdal -lpython3.7m -o build/lib.linux-i686-3.7/rasterio/_err.cpython-37m.so
building 'rasterio._example' extension
i586-alt-linux-gcc -pthread -Wno-unused-result -Wsign-compare -DNDEBUG -g -fwrapv -O3 -Wall -pipe -frecord-gcc-switches -Wall -g -O3 -march=i586 -mtune=generic -pipe -frecord-gcc-switches -Wall -g -O2 -march=i586 -mtune=generic -fPIC -g -I/usr/lib/python3/site-packages/numpy/core/include -I/usr/include/gdal -I/usr/include/python3.7m -c rasterio/_example.c -o build/temp.linux-i686-3.7/rasterio/_example.o -Wno-unused-parameter -Wno-unused-function
i586-alt-linux-gcc -pthread -shared -pipe -frecord-gcc-switches -Wall -g -O2 -march=i586 -mtune=generic -g build/temp.linux-i686-3.7/rasterio/_example.o -L/usr/lib -lgdal -lpython3.7m -o build/lib.linux-i686-3.7/rasterio/_example.cpython-37m.so
building 'rasterio._crs' extension
i586-alt-linux-gcc -pthread -Wno-unused-result -Wsign-compare -DNDEBUG -g -fwrapv -O3 -Wall -pipe -frecord-gcc-switches -Wall -g -O3 -march=i586 -mtune=generic -pipe -frecord-gcc-switches -Wall -g -O2 -march=i586 -mtune=generic -fPIC -g -I/usr/lib/python3/site-packages/numpy/core/include -I/usr/include/gdal -I/usr/include/python3.7m -c rasterio/_crs.c -o build/temp.linux-i686-3.7/rasterio/_crs.o -Wno-unused-parameter -Wno-unused-function
rasterio/_crs.c: In function ‘__pyx_pf_8rasterio_4_crs_gdal_version’:
rasterio/_crs.c:3007:18: warning: assignment discards ‘const’ qualifier from pointer target type [-Wdiscarded-qualifiers]
   __pyx_v_info_c = GDALVersionInfo(((char const *)"RELEASE_NAME"));
                  ^
i586-alt-linux-gcc -pthread -shared -pipe -frecord-gcc-switches -Wall -g -O2 -march=i586 -mtune=generic -g build/temp.linux-i686-3.7/rasterio/_crs.o -L/usr/lib -lgdal -lpython3.7m -o build/lib.linux-i686-3.7/rasterio/_crs.cpython-37m.so
building 'rasterio.shutil' extension
i586-alt-linux-gcc -pthread -Wno-unused-result -Wsign-compare -DNDEBUG -g -fwrapv -O3 -Wall -pipe -frecord-gcc-switches -Wall -g -O3 -march=i586 -mtune=generic -pipe -frecord-gcc-switches -Wall -g -O2 -march=i586 -mtune=generic -fPIC -g -I/usr/lib/python3/site-packages/numpy/core/include -I/usr/include/gdal -I/usr/include/python3.7m -c rasterio/shutil.c -o build/temp.linux-i686-3.7/rasterio/shutil.o -Wno-unused-parameter -Wno-unused-function
In file included from /usr/lib/python3/site-packages/numpy/core/include/numpy/ndarraytypes.h:1821,
                 from /usr/lib/python3/site-packages/numpy/core/include/numpy/ndarrayobject.h:18,
                 from /usr/lib/python3/site-packages/numpy/core/include/numpy/arrayobject.h:4,
                 from rasterio/shutil.c:661:
/usr/lib/python3/site-packages/numpy/core/include/numpy/npy_1_7_deprecated_api.h:15:2: warning: #warning "Using deprecated NumPy API, disable it by " "#defining NPY_NO_DEPRECATED_API NPY_1_7_API_VERSION" [-Wcpp]
 #warning "Using deprecated NumPy API, disable it by " \
  ^~~~~~~
i586-alt-linux-gcc -pthread -shared -pipe -frecord-gcc-switches -Wall -g -O2 -march=i586 -mtune=generic -g build/temp.linux-i686-3.7/rasterio/shutil.o -L/usr/lib -lgdal -lpython3.7m -o build/lib.linux-i686-3.7/rasterio/shutil.cpython-37m.so
building 'rasterio._transform' extension
i586-alt-linux-gcc -pthread -Wno-unused-result -Wsign-compare -DNDEBUG -g -fwrapv -O3 -Wall -pipe -frecord-gcc-switches -Wall -g -O3 -march=i586 -mtune=generic -pipe -frecord-gcc-switches -Wall -g -O2 -march=i586 -mtune=generic -fPIC -g -I/usr/lib/python3/site-packages/numpy/core/include -I/usr/include/gdal -I/usr/include/python3.7m -c rasterio/_transform.c -o build/temp.linux-i686-3.7/rasterio/_transform.o -Wno-unused-parameter -Wno-unused-function
i586-alt-linux-gcc -pthread -shared -pipe -frecord-gcc-switches -Wall -g -O2 -march=i586 -mtune=generic -g build/temp.linux-i686-3.7/rasterio/_transform.o -L/usr/lib -lgdal -lpython3.7m -o build/lib.linux-i686-3.7/rasterio/_transform.cpython-37m.so
building 'rasterio._shim' extension
i586-alt-linux-gcc -pthread -Wno-unused-result -Wsign-compare -DNDEBUG -g -fwrapv -O3 -Wall -pipe -frecord-gcc-switches -Wall -g -O3 -march=i586 -mtune=generic -pipe -frecord-gcc-switches -Wall -g -O2 -march=i586 -mtune=generic -fPIC -g -I/usr/lib/python3/site-packages/numpy/core/include -I/usr/include/gdal -I/usr/include/python3.7m -c rasterio/_shim30.c -o build/temp.linux-i686-3.7/rasterio/_shim30.o -Wno-unused-parameter -Wno-unused-function
In file included from /usr/lib/python3/site-packages/numpy/core/include/numpy/ndarraytypes.h:1821,
                 from /usr/lib/python3/site-packages/numpy/core/include/numpy/ndarrayobject.h:18,
                 from /usr/lib/python3/site-packages/numpy/core/include/numpy/arrayobject.h:4,
                 from rasterio/_shim30.c:621:
/usr/lib/python3/site-packages/numpy/core/include/numpy/npy_1_7_deprecated_api.h:15:2: warning: #warning "Using deprecated NumPy API, disable it by " "#defining NPY_NO_DEPRECATED_API NPY_1_7_API_VERSION" [-Wcpp]
 #warning "Using deprecated NumPy API, disable it by " \
  ^~~~~~~
rasterio/_shim30.c: In function ‘__pyx_f_8rasterio_5_shim_open_dataset’:
rasterio/_shim30.c:4840:64: warning: passing argument 3 of ‘GDALOpenEx’ from incompatible pointer type [-Wincompatible-pointer-types]
         __pyx_v_hds = GDALOpenEx(__pyx_v_fname, __pyx_v_flags, __pyx_v_drivers, __pyx_v_options, NULL);
                                                                ^~~~~~~~~~~~~~~
In file included from rasterio/_shim30.c:616:
/usr/include/gdal/gdal.h:525:65: note: expected ‘const char * const*’ but argument is of type ‘char **’
                                              const char* const* papszAllowedDrivers,
                                              ~~~~~~~~~~~~~~~~~~~^~~~~~~~~~~~~~~~~~~
rasterio/_shim30.c:4840:81: warning: passing argument 4 of ‘GDALOpenEx’ from incompatible pointer type [-Wincompatible-pointer-types]
         __pyx_v_hds = GDALOpenEx(__pyx_v_fname, __pyx_v_flags, __pyx_v_drivers, __pyx_v_options, NULL);
                                                                                 ^~~~~~~~~~~~~~~
In file included from rasterio/_shim30.c:616:
/usr/include/gdal/gdal.h:526:65: note: expected ‘const char * const*’ but argument is of type ‘char **’
                                              const char* const* papszOpenOptions,
                                              ~~~~~~~~~~~~~~~~~~~^~~~~~~~~~~~~~~~
rasterio/_shim30.c: In function ‘__pyx_f_8rasterio_5_shim_set_proj_search_path’:
rasterio/_shim30.c:5184:25: warning: passing argument 1 of ‘OSRSetPROJSearchPaths’ from incompatible pointer type [-Wincompatible-pointer-types]
   OSRSetPROJSearchPaths(__pyx_v_paths);
                         ^~~~~~~~~~~~~
In file included from rasterio/_shim30.c:615:
/usr/include/gdal/ogr_srs_api.h:466:57: note: expected ‘const char * const*’ but argument is of type ‘char **’
 void CPL_DLL OSRSetPROJSearchPaths( const char* const * papszPaths );
                                     ~~~~~~~~~~~~~~~~~~~~^~~~~~~~~~
i586-alt-linux-gcc -pthread -shared -pipe -frecord-gcc-switches -Wall -g -O2 -march=i586 -mtune=generic -g build/temp.linux-i686-3.7/rasterio/_shim30.o -L/usr/lib -lgdal -lpython3.7m -o build/lib.linux-i686-3.7/rasterio/_shim.cpython-37m.so
+ exit 0
Executing(%install): /bin/sh -e /usr/src/tmp/rpm-tmp.9335
+ umask 022
+ /bin/mkdir -p /usr/src/RPM/BUILD
+ cd /usr/src/RPM/BUILD
+ /bin/chmod -Rf u+rwX -- /usr/src/tmp/python3-module-rasterio-buildroot
+ :
+ /bin/rm -rf -- /usr/src/tmp/python3-module-rasterio-buildroot
+ PATH=/usr/libexec/rpm-build:/usr/src/bin:/bin:/usr/bin:/usr/X11R6/bin:/usr/games
+ cd python3-module-rasterio-1.1.8
+ CFLAGS='-pipe -frecord-gcc-switches -Wall -g -O2 -march=i586 -mtune=generic'
+ export CFLAGS
+ CXXFLAGS='-pipe -frecord-gcc-switches -Wall -g -O2 -march=i586 -mtune=generic'
+ export CXXFLAGS
+ FFLAGS='-pipe -frecord-gcc-switches -Wall -g -O2 -march=i586 -mtune=generic'
+ export FFLAGS
+ /usr/bin/python3 setup.py install --skip-build --root=/usr/src/tmp/python3-module-rasterio-buildroot --force
INFO:root:GDAL API version obtained from gdal-config: 3.0.4
running install
running install_lib
creating /usr/src/tmp/python3-module-rasterio-buildroot
creating /usr/src/tmp/python3-module-rasterio-buildroot/usr
creating /usr/src/tmp/python3-module-rasterio-buildroot/usr/lib
creating /usr/src/tmp/python3-module-rasterio-buildroot/usr/lib/python3
creating /usr/src/tmp/python3-module-rasterio-buildroot/usr/lib/python3/site-packages
creating /usr/src/tmp/python3-module-rasterio-buildroot/usr/lib/python3/site-packages/rasterio
copying build/lib.linux-i686-3.7/rasterio/_shim.cpython-37m.so -> /usr/src/tmp/python3-module-rasterio-buildroot/usr/lib/python3/site-packages/rasterio
copying build/lib.linux-i686-3.7/rasterio/_transform.cpython-37m.so -> /usr/src/tmp/python3-module-rasterio-buildroot/usr/lib/python3/site-packages/rasterio
copying build/lib.linux-i686-3.7/rasterio/shutil.cpython-37m.so -> /usr/src/tmp/python3-module-rasterio-buildroot/usr/lib/python3/site-packages/rasterio
copying build/lib.linux-i686-3.7/rasterio/_crs.cpython-37m.so -> /usr/src/tmp/python3-module-rasterio-buildroot/usr/lib/python3/site-packages/rasterio
copying build/lib.linux-i686-3.7/rasterio/_example.cpython-37m.so -> /usr/src/tmp/python3-module-rasterio-buildroot/usr/lib/python3/site-packages/rasterio
copying build/lib.linux-i686-3.7/rasterio/_err.cpython-37m.so -> /usr/src/tmp/python3-module-rasterio-buildroot/usr/lib/python3/site-packages/rasterio
copying build/lib.linux-i686-3.7/rasterio/_fill.cpython-37m.so -> /usr/src/tmp/python3-module-rasterio-buildroot/usr/lib/python3/site-packages/rasterio
copying build/lib.linux-i686-3.7/rasterio/_warp.cpython-37m.so -> /usr/src/tmp/python3-module-rasterio-buildroot/usr/lib/python3/site-packages/rasterio
copying build/lib.linux-i686-3.7/rasterio/_env.cpython-37m.so -> /usr/src/tmp/python3-module-rasterio-buildroot/usr/lib/python3/site-packages/rasterio
copying build/lib.linux-i686-3.7/rasterio/_features.cpython-37m.so -> /usr/src/tmp/python3-module-rasterio-buildroot/usr/lib/python3/site-packages/rasterio
copying build/lib.linux-i686-3.7/rasterio/_io.cpython-37m.so -> /usr/src/tmp/python3-module-rasterio-buildroot/usr/lib/python3/site-packages/rasterio
copying build/lib.linux-i686-3.7/rasterio/_base.cpython-37m.so -> /usr/src/tmp/python3-module-rasterio-buildroot/usr/lib/python3/site-packages/rasterio
creating /usr/src/tmp/python3-module-rasterio-buildroot/usr/lib/python3/site-packages/rasterio/rio
copying build/lib.linux-i686-3.7/rasterio/rio/__init__.py -> /usr/src/tmp/python3-module-rasterio-buildroot/usr/lib/python3/site-packages/rasterio/rio
copying build/lib.linux-i686-3.7/rasterio/rio/blocks.py -> /usr/src/tmp/python3-module-rasterio-buildroot/usr/lib/python3/site-packages/rasterio/rio
copying build/lib.linux-i686-3.7/rasterio/rio/bounds.py -> /usr/src/tmp/python3-module-rasterio-buildroot/usr/lib/python3/site-packages/rasterio/rio
copying build/lib.linux-i686-3.7/rasterio/rio/calc.py -> /usr/src/tmp/python3-module-rasterio-buildroot/usr/lib/python3/site-packages/rasterio/rio
copying build/lib.linux-i686-3.7/rasterio/rio/clip.py -> /usr/src/tmp/python3-module-rasterio-buildroot/usr/lib/python3/site-packages/rasterio/rio
copying build/lib.linux-i686-3.7/rasterio/rio/convert.py -> /usr/src/tmp/python3-module-rasterio-buildroot/usr/lib/python3/site-packages/rasterio/rio
copying build/lib.linux-i686-3.7/rasterio/rio/edit_info.py -> /usr/src/tmp/python3-module-rasterio-buildroot/usr/lib/python3/site-packages/rasterio/rio
copying build/lib.linux-i686-3.7/rasterio/rio/env.py -> /usr/src/tmp/python3-module-rasterio-buildroot/usr/lib/python3/site-packages/rasterio/rio
copying build/lib.linux-i686-3.7/rasterio/rio/gcps.py -> /usr/src/tmp/python3-module-rasterio-buildroot/usr/lib/python3/site-packages/rasterio/rio
copying build/lib.linux-i686-3.7/rasterio/rio/helpers.py -> /usr/src/tmp/python3-module-rasterio-buildroot/usr/lib/python3/site-packages/rasterio/rio
copying build/lib.linux-i686-3.7/rasterio/rio/info.py -> /usr/src/tmp/python3-module-rasterio-buildroot/usr/lib/python3/site-packages/rasterio/rio
copying build/lib.linux-i686-3.7/rasterio/rio/insp.py -> /usr/src/tmp/python3-module-rasterio-buildroot/usr/lib/python3/site-packages/rasterio/rio
copying build/lib.linux-i686-3.7/rasterio/rio/main.py -> /usr/src/tmp/python3-module-rasterio-buildroot/usr/lib/python3/site-packages/rasterio/rio
copying build/lib.linux-i686-3.7/rasterio/rio/mask.py -> /usr/src/tmp/python3-module-rasterio-buildroot/usr/lib/python3/site-packages/rasterio/rio
copying build/lib.linux-i686-3.7/rasterio/rio/merge.py -> /usr/src/tmp/python3-module-rasterio-buildroot/usr/lib/python3/site-packages/rasterio/rio
copying build/lib.linux-i686-3.7/rasterio/rio/options.py -> /usr/src/tmp/python3-module-rasterio-buildroot/usr/lib/python3/site-packages/rasterio/rio
copying build/lib.linux-i686-3.7/rasterio/rio/overview.py -> /usr/src/tmp/python3-module-rasterio-buildroot/usr/lib/python3/site-packages/rasterio/rio
copying build/lib.linux-i686-3.7/rasterio/rio/rasterize.py -> /usr/src/tmp/python3-module-rasterio-buildroot/usr/lib/python3/site-packages/rasterio/rio
copying build/lib.linux-i686-3.7/rasterio/rio/rm.py -> /usr/src/tmp/python3-module-rasterio-buildroot/usr/lib/python3/site-packages/rasterio/rio
copying build/lib.linux-i686-3.7/rasterio/rio/sample.py -> /usr/src/tmp/python3-module-rasterio-buildroot/usr/lib/python3/site-packages/rasterio/rio
copying build/lib.linux-i686-3.7/rasterio/rio/shapes.py -> /usr/src/tmp/python3-module-rasterio-buildroot/usr/lib/python3/site-packages/rasterio/rio
copying build/lib.linux-i686-3.7/rasterio/rio/stack.py -> /usr/src/tmp/python3-module-rasterio-buildroot/usr/lib/python3/site-packages/rasterio/rio
copying build/lib.linux-i686-3.7/rasterio/rio/transform.py -> /usr/src/tmp/python3-module-rasterio-buildroot/usr/lib/python3/site-packages/rasterio/rio
copying build/lib.linux-i686-3.7/rasterio/rio/warp.py -> /usr/src/tmp/python3-module-rasterio-buildroot/usr/lib/python3/site-packages/rasterio/rio
copying build/lib.linux-i686-3.7/rasterio/__init__.py -> /usr/src/tmp/python3-module-rasterio-buildroot/usr/lib/python3/site-packages/rasterio
copying build/lib.linux-i686-3.7/rasterio/compat.py -> /usr/src/tmp/python3-module-rasterio-buildroot/usr/lib/python3/site-packages/rasterio
copying build/lib.linux-i686-3.7/rasterio/control.py -> /usr/src/tmp/python3-module-rasterio-buildroot/usr/lib/python3/site-packages/rasterio
copying build/lib.linux-i686-3.7/rasterio/coords.py -> /usr/src/tmp/python3-module-rasterio-buildroot/usr/lib/python3/site-packages/rasterio
copying build/lib.linux-i686-3.7/rasterio/crs.py -> /usr/src/tmp/python3-module-rasterio-buildroot/usr/lib/python3/site-packages/rasterio
copying build/lib.linux-i686-3.7/rasterio/drivers.py -> /usr/src/tmp/python3-module-rasterio-buildroot/usr/lib/python3/site-packages/rasterio
copying build/lib.linux-i686-3.7/rasterio/dtypes.py -> /usr/src/tmp/python3-module-rasterio-buildroot/usr/lib/python3/site-packages/rasterio
copying build/lib.linux-i686-3.7/rasterio/enums.py -> /usr/src/tmp/python3-module-rasterio-buildroot/usr/lib/python3/site-packages/rasterio
copying build/lib.linux-i686-3.7/rasterio/env.py -> /usr/src/tmp/python3-module-rasterio-buildroot/usr/lib/python3/site-packages/rasterio
copying build/lib.linux-i686-3.7/rasterio/errors.py -> /usr/src/tmp/python3-module-rasterio-buildroot/usr/lib/python3/site-packages/rasterio
copying build/lib.linux-i686-3.7/rasterio/features.py -> /usr/src/tmp/python3-module-rasterio-buildroot/usr/lib/python3/site-packages/rasterio
copying build/lib.linux-i686-3.7/rasterio/fill.py -> /usr/src/tmp/python3-module-rasterio-buildroot/usr/lib/python3/site-packages/rasterio
copying build/lib.linux-i686-3.7/rasterio/io.py -> /usr/src/tmp/python3-module-rasterio-buildroot/usr/lib/python3/site-packages/rasterio
copying build/lib.linux-i686-3.7/rasterio/mask.py -> /usr/src/tmp/python3-module-rasterio-buildroot/usr/lib/python3/site-packages/rasterio
copying build/lib.linux-i686-3.7/rasterio/merge.py -> /usr/src/tmp/python3-module-rasterio-buildroot/usr/lib/python3/site-packages/rasterio
copying build/lib.linux-i686-3.7/rasterio/path.py -> /usr/src/tmp/python3-module-rasterio-buildroot/usr/lib/python3/site-packages/rasterio
copying build/lib.linux-i686-3.7/rasterio/plot.py -> /usr/src/tmp/python3-module-rasterio-buildroot/usr/lib/python3/site-packages/rasterio
copying build/lib.linux-i686-3.7/rasterio/profiles.py -> /usr/src/tmp/python3-module-rasterio-buildroot/usr/lib/python3/site-packages/rasterio
copying build/lib.linux-i686-3.7/rasterio/sample.py -> /usr/src/tmp/python3-module-rasterio-buildroot/usr/lib/python3/site-packages/rasterio
copying build/lib.linux-i686-3.7/rasterio/session.py -> /usr/src/tmp/python3-module-rasterio-buildroot/usr/lib/python3/site-packages/rasterio
copying build/lib.linux-i686-3.7/rasterio/tools.py -> /usr/src/tmp/python3-module-rasterio-buildroot/usr/lib/python3/site-packages/rasterio
copying build/lib.linux-i686-3.7/rasterio/transform.py -> /usr/src/tmp/python3-module-rasterio-buildroot/usr/lib/python3/site-packages/rasterio
copying build/lib.linux-i686-3.7/rasterio/vrt.py -> /usr/src/tmp/python3-module-rasterio-buildroot/usr/lib/python3/site-packages/rasterio
copying build/lib.linux-i686-3.7/rasterio/warp.py -> /usr/src/tmp/python3-module-rasterio-buildroot/usr/lib/python3/site-packages/rasterio
copying build/lib.linux-i686-3.7/rasterio/windows.py -> /usr/src/tmp/python3-module-rasterio-buildroot/usr/lib/python3/site-packages/rasterio
byte-compiling /usr/src/tmp/python3-module-rasterio-buildroot/usr/lib/python3/site-packages/rasterio/rio/__init__.py to __init__.cpython-37.pyc
byte-compiling /usr/src/tmp/python3-module-rasterio-buildroot/usr/lib/python3/site-packages/rasterio/rio/blocks.py to blocks.cpython-37.pyc
byte-compiling /usr/src/tmp/python3-module-rasterio-buildroot/usr/lib/python3/site-packages/rasterio/rio/bounds.py to bounds.cpython-37.pyc
byte-compiling /usr/src/tmp/python3-module-rasterio-buildroot/usr/lib/python3/site-packages/rasterio/rio/calc.py to calc.cpython-37.pyc
byte-compiling /usr/src/tmp/python3-module-rasterio-buildroot/usr/lib/python3/site-packages/rasterio/rio/clip.py to clip.cpython-37.pyc
byte-compiling /usr/src/tmp/python3-module-rasterio-buildroot/usr/lib/python3/site-packages/rasterio/rio/convert.py to convert.cpython-37.pyc
byte-compiling /usr/src/tmp/python3-module-rasterio-buildroot/usr/lib/python3/site-packages/rasterio/rio/edit_info.py to edit_info.cpython-37.pyc
byte-compiling /usr/src/tmp/python3-module-rasterio-buildroot/usr/lib/python3/site-packages/rasterio/rio/env.py to env.cpython-37.pyc
byte-compiling /usr/src/tmp/python3-module-rasterio-buildroot/usr/lib/python3/site-packages/rasterio/rio/gcps.py to gcps.cpython-37.pyc
byte-compiling /usr/src/tmp/python3-module-rasterio-buildroot/usr/lib/python3/site-packages/rasterio/rio/helpers.py to helpers.cpython-37.pyc
byte-compiling /usr/src/tmp/python3-module-rasterio-buildroot/usr/lib/python3/site-packages/rasterio/rio/info.py to info.cpython-37.pyc
byte-compiling /usr/src/tmp/python3-module-rasterio-buildroot/usr/lib/python3/site-packages/rasterio/rio/insp.py to insp.cpython-37.pyc
byte-compiling /usr/src/tmp/python3-module-rasterio-buildroot/usr/lib/python3/site-packages/rasterio/rio/main.py to main.cpython-37.pyc
byte-compiling /usr/src/tmp/python3-module-rasterio-buildroot/usr/lib/python3/site-packages/rasterio/rio/mask.py to mask.cpython-37.pyc
byte-compiling /usr/src/tmp/python3-module-rasterio-buildroot/usr/lib/python3/site-packages/rasterio/rio/merge.py to merge.cpython-37.pyc
byte-compiling /usr/src/tmp/python3-module-rasterio-buildroot/usr/lib/python3/site-packages/rasterio/rio/options.py to options.cpython-37.pyc
byte-compiling /usr/src/tmp/python3-module-rasterio-buildroot/usr/lib/python3/site-packages/rasterio/rio/overview.py to overview.cpython-37.pyc
byte-compiling /usr/src/tmp/python3-module-rasterio-buildroot/usr/lib/python3/site-packages/rasterio/rio/rasterize.py to rasterize.cpython-37.pyc
byte-compiling /usr/src/tmp/python3-module-rasterio-buildroot/usr/lib/python3/site-packages/rasterio/rio/rm.py to rm.cpython-37.pyc
byte-compiling /usr/src/tmp/python3-module-rasterio-buildroot/usr/lib/python3/site-packages/rasterio/rio/sample.py to sample.cpython-37.pyc
byte-compiling /usr/src/tmp/python3-module-rasterio-buildroot/usr/lib/python3/site-packages/rasterio/rio/shapes.py to shapes.cpython-37.pyc
byte-compiling /usr/src/tmp/python3-module-rasterio-buildroot/usr/lib/python3/site-packages/rasterio/rio/stack.py to stack.cpython-37.pyc
byte-compiling /usr/src/tmp/python3-module-rasterio-buildroot/usr/lib/python3/site-packages/rasterio/rio/transform.py to transform.cpython-37.pyc
byte-compiling /usr/src/tmp/python3-module-rasterio-buildroot/usr/lib/python3/site-packages/rasterio/rio/warp.py to warp.cpython-37.pyc
byte-compiling /usr/src/tmp/python3-module-rasterio-buildroot/usr/lib/python3/site-packages/rasterio/__init__.py to __init__.cpython-37.pyc
byte-compiling /usr/src/tmp/python3-module-rasterio-buildroot/usr/lib/python3/site-packages/rasterio/compat.py to compat.cpython-37.pyc
byte-compiling /usr/src/tmp/python3-module-rasterio-buildroot/usr/lib/python3/site-packages/rasterio/control.py to control.cpython-37.pyc
byte-compiling /usr/src/tmp/python3-module-rasterio-buildroot/usr/lib/python3/site-packages/rasterio/coords.py to coords.cpython-37.pyc
byte-compiling /usr/src/tmp/python3-module-rasterio-buildroot/usr/lib/python3/site-packages/rasterio/crs.py to crs.cpython-37.pyc
byte-compiling /usr/src/tmp/python3-module-rasterio-buildroot/usr/lib/python3/site-packages/rasterio/drivers.py to drivers.cpython-37.pyc
byte-compiling /usr/src/tmp/python3-module-rasterio-buildroot/usr/lib/python3/site-packages/rasterio/dtypes.py to dtypes.cpython-37.pyc
byte-compiling /usr/src/tmp/python3-module-rasterio-buildroot/usr/lib/python3/site-packages/rasterio/enums.py to enums.cpython-37.pyc
byte-compiling /usr/src/tmp/python3-module-rasterio-buildroot/usr/lib/python3/site-packages/rasterio/env.py to env.cpython-37.pyc
byte-compiling /usr/src/tmp/python3-module-rasterio-buildroot/usr/lib/python3/site-packages/rasterio/errors.py to errors.cpython-37.pyc
byte-compiling /usr/src/tmp/python3-module-rasterio-buildroot/usr/lib/python3/site-packages/rasterio/features.py to features.cpython-37.pyc
byte-compiling /usr/src/tmp/python3-module-rasterio-buildroot/usr/lib/python3/site-packages/rasterio/fill.py to fill.cpython-37.pyc
byte-compiling /usr/src/tmp/python3-module-rasterio-buildroot/usr/lib/python3/site-packages/rasterio/io.py to io.cpython-37.pyc
byte-compiling /usr/src/tmp/python3-module-rasterio-buildroot/usr/lib/python3/site-packages/rasterio/mask.py to mask.cpython-37.pyc
byte-compiling /usr/src/tmp/python3-module-rasterio-buildroot/usr/lib/python3/site-packages/rasterio/merge.py to merge.cpython-37.pyc
byte-compiling /usr/src/tmp/python3-module-rasterio-buildroot/usr/lib/python3/site-packages/rasterio/path.py to path.cpython-37.pyc
byte-compiling /usr/src/tmp/python3-module-rasterio-buildroot/usr/lib/python3/site-packages/rasterio/plot.py to plot.cpython-37.pyc
byte-compiling /usr/src/tmp/python3-module-rasterio-buildroot/usr/lib/python3/site-packages/rasterio/profiles.py to profiles.cpython-37.pyc
byte-compiling /usr/src/tmp/python3-module-rasterio-buildroot/usr/lib/python3/site-packages/rasterio/sample.py to sample.cpython-37.pyc
byte-compiling /usr/src/tmp/python3-module-rasterio-buildroot/usr/lib/python3/site-packages/rasterio/session.py to session.cpython-37.pyc
byte-compiling /usr/src/tmp/python3-module-rasterio-buildroot/usr/lib/python3/site-packages/rasterio/tools.py to tools.cpython-37.pyc
byte-compiling /usr/src/tmp/python3-module-rasterio-buildroot/usr/lib/python3/site-packages/rasterio/transform.py to transform.cpython-37.pyc
byte-compiling /usr/src/tmp/python3-module-rasterio-buildroot/usr/lib/python3/site-packages/rasterio/vrt.py to vrt.cpython-37.pyc
byte-compiling /usr/src/tmp/python3-module-rasterio-buildroot/usr/lib/python3/site-packages/rasterio/warp.py to warp.cpython-37.pyc
byte-compiling /usr/src/tmp/python3-module-rasterio-buildroot/usr/lib/python3/site-packages/rasterio/windows.py to windows.cpython-37.pyc
running install_egg_info
running egg_info
writing rasterio.egg-info/PKG-INFO
writing dependency_links to rasterio.egg-info/dependency_links.txt
writing entry points to rasterio.egg-info/entry_points.txt
writing requirements to rasterio.egg-info/requires.txt
writing top-level names to rasterio.egg-info/top_level.txt
reading manifest file 'rasterio.egg-info/SOURCES.txt'
writing manifest file 'rasterio.egg-info/SOURCES.txt'
Copying rasterio.egg-info to /usr/src/tmp/python3-module-rasterio-buildroot/usr/lib/python3/site-packages/rasterio-1.1.8-py3.7.egg-info
running install_scripts
Installing rio script to /usr/src/tmp/python3-module-rasterio-buildroot/usr/bin
+ for i in /usr/src/tmp/python3-module-rasterio-buildroot/usr/lib/python3/site-packages/ /usr/src/tmp/python3-module-rasterio-buildroot/usr/lib/python3/site-packages/
+ find /usr/src/tmp/python3-module-rasterio-buildroot/usr/lib/python3/site-packages/ -name tests -type d -print0
+ xargs -0 rm -rfv
+ find /usr/src/tmp/python3-module-rasterio-buildroot/usr/lib/python3/site-packages/ -name test -type d -print0
+ xargs -0 rm -rfv
+ for i in /usr/src/tmp/python3-module-rasterio-buildroot/usr/lib/python3/site-packages/ /usr/src/tmp/python3-module-rasterio-buildroot/usr/lib/python3/site-packages/
+ find /usr/src/tmp/python3-module-rasterio-buildroot/usr/lib/python3/site-packages/ -name tests -type d -print0
+ xargs -0 rm -rfv
+ find /usr/src/tmp/python3-module-rasterio-buildroot/usr/lib/python3/site-packages/ -name test -type d -print0
+ xargs -0 rm -rfv
+ /usr/lib/rpm/brp-alt
Cleaning files in /usr/src/tmp/python3-module-rasterio-buildroot (auto)
mode of './usr/lib/python3/site-packages/rasterio/_base.cpython-37m.so' changed from 0755 (rwxr-xr-x) to 0644 (rw-r--r--)
mode of './usr/lib/python3/site-packages/rasterio/_io.cpython-37m.so' changed from 0755 (rwxr-xr-x) to 0644 (rw-r--r--)
mode of './usr/lib/python3/site-packages/rasterio/_features.cpython-37m.so' changed from 0755 (rwxr-xr-x) to 0644 (rw-r--r--)
mode of './usr/lib/python3/site-packages/rasterio/_env.cpython-37m.so' changed from 0755 (rwxr-xr-x) to 0644 (rw-r--r--)
mode of './usr/lib/python3/site-packages/rasterio/_warp.cpython-37m.so' changed from 0755 (rwxr-xr-x) to 0644 (rw-r--r--)
mode of './usr/lib/python3/site-packages/rasterio/_fill.cpython-37m.so' changed from 0755 (rwxr-xr-x) to 0644 (rw-r--r--)
mode of './usr/lib/python3/site-packages/rasterio/_err.cpython-37m.so' changed from 0755 (rwxr-xr-x) to 0644 (rw-r--r--)
mode of './usr/lib/python3/site-packages/rasterio/_example.cpython-37m.so' changed from 0755 (rwxr-xr-x) to 0644 (rw-r--r--)
mode of './usr/lib/python3/site-packages/rasterio/_crs.cpython-37m.so' changed from 0755 (rwxr-xr-x) to 0644 (rw-r--r--)
mode of './usr/lib/python3/site-packages/rasterio/shutil.cpython-37m.so' changed from 0755 (rwxr-xr-x) to 0644 (rw-r--r--)
mode of './usr/lib/python3/site-packages/rasterio/_transform.cpython-37m.so' changed from 0755 (rwxr-xr-x) to 0644 (rw-r--r--)
mode of './usr/lib/python3/site-packages/rasterio/_shim.cpython-37m.so' changed from 0755 (rwxr-xr-x) to 0644 (rw-r--r--)
Verifying and fixing files in /usr/src/tmp/python3-module-rasterio-buildroot (binconfig,pkgconfig,libtool,desktop,gnuconfig)
Checking contents of files in /usr/src/tmp/python3-module-rasterio-buildroot/ (default)
Compressing files in /usr/src/tmp/python3-module-rasterio-buildroot (auto)
Adjusting library links in /usr/src/tmp/python3-module-rasterio-buildroot
./usr/lib:
Verifying ELF objects in /usr/src/tmp/python3-module-rasterio-buildroot (arch=normal,fhs=normal,lfs=relaxed,lint=relaxed,rpath=normal,stack=normal,textrel=normal,unresolved=normal)
Bytecompiling python modules in /usr/src/tmp/python3-module-rasterio-buildroot using /usr/bin/python
Bytecompiling python modules with optimization in /usr/src/tmp/python3-module-rasterio-buildroot using /usr/bin/python -O
Bytecompiling python3 modules in /usr/src/tmp/python3-module-rasterio-buildroot using /usr/bin/python3
unlink /usr/src/tmp/python3-module-rasterio-buildroot/usr/lib/python3/site-packages/rasterio/__pycache__/__init__.cpython-37.pyc
unlink /usr/src/tmp/python3-module-rasterio-buildroot/usr/lib/python3/site-packages/rasterio/__pycache__/compat.cpython-37.pyc
unlink /usr/src/tmp/python3-module-rasterio-buildroot/usr/lib/python3/site-packages/rasterio/__pycache__/control.cpython-37.pyc
unlink /usr/src/tmp/python3-module-rasterio-buildroot/usr/lib/python3/site-packages/rasterio/__pycache__/coords.cpython-37.pyc
unlink /usr/src/tmp/python3-module-rasterio-buildroot/usr/lib/python3/site-packages/rasterio/__pycache__/crs.cpython-37.pyc
unlink /usr/src/tmp/python3-module-rasterio-buildroot/usr/lib/python3/site-packages/rasterio/__pycache__/drivers.cpython-37.pyc
unlink /usr/src/tmp/python3-module-rasterio-buildroot/usr/lib/python3/site-packages/rasterio/__pycache__/dtypes.cpython-37.pyc
unlink /usr/src/tmp/python3-module-rasterio-buildroot/usr/lib/python3/site-packages/rasterio/__pycache__/enums.cpython-37.pyc
unlink /usr/src/tmp/python3-module-rasterio-buildroot/usr/lib/python3/site-packages/rasterio/__pycache__/env.cpython-37.pyc
unlink /usr/src/tmp/python3-module-rasterio-buildroot/usr/lib/python3/site-packages/rasterio/__pycache__/errors.cpython-37.pyc
unlink /usr/src/tmp/python3-module-rasterio-buildroot/usr/lib/python3/site-packages/rasterio/__pycache__/features.cpython-37.pyc
unlink /usr/src/tmp/python3-module-rasterio-buildroot/usr/lib/python3/site-packages/rasterio/__pycache__/fill.cpython-37.pyc
unlink /usr/src/tmp/python3-module-rasterio-buildroot/usr/lib/python3/site-packages/rasterio/__pycache__/io.cpython-37.pyc
unlink /usr/src/tmp/python3-module-rasterio-buildroot/usr/lib/python3/site-packages/rasterio/__pycache__/mask.cpython-37.pyc
unlink /usr/src/tmp/python3-module-rasterio-buildroot/usr/lib/python3/site-packages/rasterio/__pycache__/merge.cpython-37.pyc
unlink /usr/src/tmp/python3-module-rasterio-buildroot/usr/lib/python3/site-packages/rasterio/__pycache__/path.cpython-37.pyc
unlink /usr/src/tmp/python3-module-rasterio-buildroot/usr/lib/python3/site-packages/rasterio/__pycache__/plot.cpython-37.pyc
unlink /usr/src/tmp/python3-module-rasterio-buildroot/usr/lib/python3/site-packages/rasterio/__pycache__/profiles.cpython-37.pyc
unlink /usr/src/tmp/python3-module-rasterio-buildroot/usr/lib/python3/site-packages/rasterio/__pycache__/sample.cpython-37.pyc
unlink /usr/src/tmp/python3-module-rasterio-buildroot/usr/lib/python3/site-packages/rasterio/__pycache__/session.cpython-37.pyc
unlink /usr/src/tmp/python3-module-rasterio-buildroot/usr/lib/python3/site-packages/rasterio/__pycache__/tools.cpython-37.pyc
unlink /usr/src/tmp/python3-module-rasterio-buildroot/usr/lib/python3/site-packages/rasterio/__pycache__/transform.cpython-37.pyc
unlink /usr/src/tmp/python3-module-rasterio-buildroot/usr/lib/python3/site-packages/rasterio/__pycache__/vrt.cpython-37.pyc
unlink /usr/src/tmp/python3-module-rasterio-buildroot/usr/lib/python3/site-packages/rasterio/__pycache__/warp.cpython-37.pyc
unlink /usr/src/tmp/python3-module-rasterio-buildroot/usr/lib/python3/site-packages/rasterio/__pycache__/windows.cpython-37.pyc
unlink /usr/src/tmp/python3-module-rasterio-buildroot/usr/lib/python3/site-packages/rasterio/rio/__pycache__/__init__.cpython-37.pyc
unlink /usr/src/tmp/python3-module-rasterio-buildroot/usr/lib/python3/site-packages/rasterio/rio/__pycache__/blocks.cpython-37.pyc
unlink /usr/src/tmp/python3-module-rasterio-buildroot/usr/lib/python3/site-packages/rasterio/rio/__pycache__/bounds.cpython-37.pyc
unlink /usr/src/tmp/python3-module-rasterio-buildroot/usr/lib/python3/site-packages/rasterio/rio/__pycache__/calc.cpython-37.pyc
unlink /usr/src/tmp/python3-module-rasterio-buildroot/usr/lib/python3/site-packages/rasterio/rio/__pycache__/clip.cpython-37.pyc
unlink /usr/src/tmp/python3-module-rasterio-buildroot/usr/lib/python3/site-packages/rasterio/rio/__pycache__/convert.cpython-37.pyc
unlink /usr/src/tmp/python3-module-rasterio-buildroot/usr/lib/python3/site-packages/rasterio/rio/__pycache__/edit_info.cpython-37.pyc
unlink /usr/src/tmp/python3-module-rasterio-buildroot/usr/lib/python3/site-packages/rasterio/rio/__pycache__/env.cpython-37.pyc
unlink /usr/src/tmp/python3-module-rasterio-buildroot/usr/lib/python3/site-packages/rasterio/rio/__pycache__/gcps.cpython-37.pyc
unlink /usr/src/tmp/python3-module-rasterio-buildroot/usr/lib/python3/site-packages/rasterio/rio/__pycache__/helpers.cpython-37.pyc
unlink /usr/src/tmp/python3-module-rasterio-buildroot/usr/lib/python3/site-packages/rasterio/rio/__pycache__/info.cpython-37.pyc
unlink /usr/src/tmp/python3-module-rasterio-buildroot/usr/lib/python3/site-packages/rasterio/rio/__pycache__/insp.cpython-37.pyc
unlink /usr/src/tmp/python3-module-rasterio-buildroot/usr/lib/python3/site-packages/rasterio/rio/__pycache__/main.cpython-37.pyc
unlink /usr/src/tmp/python3-module-rasterio-buildroot/usr/lib/python3/site-packages/rasterio/rio/__pycache__/mask.cpython-37.pyc
unlink /usr/src/tmp/python3-module-rasterio-buildroot/usr/lib/python3/site-packages/rasterio/rio/__pycache__/merge.cpython-37.pyc
unlink /usr/src/tmp/python3-module-rasterio-buildroot/usr/lib/python3/site-packages/rasterio/rio/__pycache__/options.cpython-37.pyc
unlink /usr/src/tmp/python3-module-rasterio-buildroot/usr/lib/python3/site-packages/rasterio/rio/__pycache__/overview.cpython-37.pyc
unlink /usr/src/tmp/python3-module-rasterio-buildroot/usr/lib/python3/site-packages/rasterio/rio/__pycache__/rasterize.cpython-37.pyc
unlink /usr/src/tmp/python3-module-rasterio-buildroot/usr/lib/python3/site-packages/rasterio/rio/__pycache__/rm.cpython-37.pyc
unlink /usr/src/tmp/python3-module-rasterio-buildroot/usr/lib/python3/site-packages/rasterio/rio/__pycache__/sample.cpython-37.pyc
unlink /usr/src/tmp/python3-module-rasterio-buildroot/usr/lib/python3/site-packages/rasterio/rio/__pycache__/shapes.cpython-37.pyc
unlink /usr/src/tmp/python3-module-rasterio-buildroot/usr/lib/python3/site-packages/rasterio/rio/__pycache__/stack.cpython-37.pyc
unlink /usr/src/tmp/python3-module-rasterio-buildroot/usr/lib/python3/site-packages/rasterio/rio/__pycache__/transform.cpython-37.pyc
unlink /usr/src/tmp/python3-module-rasterio-buildroot/usr/lib/python3/site-packages/rasterio/rio/__pycache__/warp.cpython-37.pyc
compile /usr/src/tmp/python3-module-rasterio-buildroot/usr/lib/python3/site-packages/rasterio/rio/__init__.py
compile /usr/src/tmp/python3-module-rasterio-buildroot/usr/lib/python3/site-packages/rasterio/rio/blocks.py
compile /usr/src/tmp/python3-module-rasterio-buildroot/usr/lib/python3/site-packages/rasterio/rio/bounds.py
compile /usr/src/tmp/python3-module-rasterio-buildroot/usr/lib/python3/site-packages/rasterio/rio/calc.py
compile /usr/src/tmp/python3-module-rasterio-buildroot/usr/lib/python3/site-packages/rasterio/rio/clip.py
compile /usr/src/tmp/python3-module-rasterio-buildroot/usr/lib/python3/site-packages/rasterio/rio/convert.py
compile /usr/src/tmp/python3-module-rasterio-buildroot/usr/lib/python3/site-packages/rasterio/rio/edit_info.py
compile /usr/src/tmp/python3-module-rasterio-buildroot/usr/lib/python3/site-packages/rasterio/rio/env.py
compile /usr/src/tmp/python3-module-rasterio-buildroot/usr/lib/python3/site-packages/rasterio/rio/gcps.py
compile /usr/src/tmp/python3-module-rasterio-buildroot/usr/lib/python3/site-packages/rasterio/rio/helpers.py
compile /usr/src/tmp/python3-module-rasterio-buildroot/usr/lib/python3/site-packages/rasterio/rio/info.py
compile /usr/src/tmp/python3-module-rasterio-buildroot/usr/lib/python3/site-packages/rasterio/rio/insp.py
compile /usr/src/tmp/python3-module-rasterio-buildroot/usr/lib/python3/site-packages/rasterio/rio/main.py
compile /usr/src/tmp/python3-module-rasterio-buildroot/usr/lib/python3/site-packages/rasterio/rio/mask.py
compile /usr/src/tmp/python3-module-rasterio-buildroot/usr/lib/python3/site-packages/rasterio/rio/merge.py
compile /usr/src/tmp/python3-module-rasterio-buildroot/usr/lib/python3/site-packages/rasterio/rio/options.py
compile /usr/src/tmp/python3-module-rasterio-buildroot/usr/lib/python3/site-packages/rasterio/rio/overview.py
compile /usr/src/tmp/python3-module-rasterio-buildroot/usr/lib/python3/site-packages/rasterio/rio/rasterize.py
compile /usr/src/tmp/python3-module-rasterio-buildroot/usr/lib/python3/site-packages/rasterio/rio/rm.py
compile /usr/src/tmp/python3-module-rasterio-buildroot/usr/lib/python3/site-packages/rasterio/rio/sample.py
compile /usr/src/tmp/python3-module-rasterio-buildroot/usr/lib/python3/site-packages/rasterio/rio/shapes.py
compile /usr/src/tmp/python3-module-rasterio-buildroot/usr/lib/python3/site-packages/rasterio/rio/stack.py
compile /usr/src/tmp/python3-module-rasterio-buildroot/usr/lib/python3/site-packages/rasterio/rio/transform.py
compile /usr/src/tmp/python3-module-rasterio-buildroot/usr/lib/python3/site-packages/rasterio/rio/warp.py
compile /usr/src/tmp/python3-module-rasterio-buildroot/usr/lib/python3/site-packages/rasterio/__init__.py
compile /usr/src/tmp/python3-module-rasterio-buildroot/usr/lib/python3/site-packages/rasterio/compat.py
compile /usr/src/tmp/python3-module-rasterio-buildroot/usr/lib/python3/site-packages/rasterio/control.py
compile /usr/src/tmp/python3-module-rasterio-buildroot/usr/lib/python3/site-packages/rasterio/coords.py
compile /usr/src/tmp/python3-module-rasterio-buildroot/usr/lib/python3/site-packages/rasterio/crs.py
compile /usr/src/tmp/python3-module-rasterio-buildroot/usr/lib/python3/site-packages/rasterio/drivers.py
compile /usr/src/tmp/python3-module-rasterio-buildroot/usr/lib/python3/site-packages/rasterio/dtypes.py
compile /usr/src/tmp/python3-module-rasterio-buildroot/usr/lib/python3/site-packages/rasterio/enums.py
compile /usr/src/tmp/python3-module-rasterio-buildroot/usr/lib/python3/site-packages/rasterio/env.py
compile /usr/src/tmp/python3-module-rasterio-buildroot/usr/lib/python3/site-packages/rasterio/errors.py
compile /usr/src/tmp/python3-module-rasterio-buildroot/usr/lib/python3/site-packages/rasterio/features.py
compile /usr/src/tmp/python3-module-rasterio-buildroot/usr/lib/python3/site-packages/rasterio/fill.py
compile /usr/src/tmp/python3-module-rasterio-buildroot/usr/lib/python3/site-packages/rasterio/io.py
compile /usr/src/tmp/python3-module-rasterio-buildroot/usr/lib/python3/site-packages/rasterio/mask.py
compile /usr/src/tmp/python3-module-rasterio-buildroot/usr/lib/python3/site-packages/rasterio/merge.py
compile /usr/src/tmp/python3-module-rasterio-buildroot/usr/lib/python3/site-packages/rasterio/path.py
compile /usr/src/tmp/python3-module-rasterio-buildroot/usr/lib/python3/site-packages/rasterio/plot.py
compile /usr/src/tmp/python3-module-rasterio-buildroot/usr/lib/python3/site-packages/rasterio/profiles.py
compile /usr/src/tmp/python3-module-rasterio-buildroot/usr/lib/python3/site-packages/rasterio/sample.py
compile /usr/src/tmp/python3-module-rasterio-buildroot/usr/lib/python3/site-packages/rasterio/session.py
compile /usr/src/tmp/python3-module-rasterio-buildroot/usr/lib/python3/site-packages/rasterio/tools.py
compile /usr/src/tmp/python3-module-rasterio-buildroot/usr/lib/python3/site-packages/rasterio/transform.py
compile /usr/src/tmp/python3-module-rasterio-buildroot/usr/lib/python3/site-packages/rasterio/vrt.py
compile /usr/src/tmp/python3-module-rasterio-buildroot/usr/lib/python3/site-packages/rasterio/warp.py
compile /usr/src/tmp/python3-module-rasterio-buildroot/usr/lib/python3/site-packages/rasterio/windows.py
Bytecompiling python3 modules with optimization in /usr/src/tmp/python3-module-rasterio-buildroot using /usr/bin/python3 -O
compile /usr/src/tmp/python3-module-rasterio-buildroot/usr/lib/python3/site-packages/rasterio/rio/__init__.py
compile /usr/src/tmp/python3-module-rasterio-buildroot/usr/lib/python3/site-packages/rasterio/rio/blocks.py
compile /usr/src/tmp/python3-module-rasterio-buildroot/usr/lib/python3/site-packages/rasterio/rio/bounds.py
compile /usr/src/tmp/python3-module-rasterio-buildroot/usr/lib/python3/site-packages/rasterio/rio/calc.py
compile /usr/src/tmp/python3-module-rasterio-buildroot/usr/lib/python3/site-packages/rasterio/rio/clip.py
compile /usr/src/tmp/python3-module-rasterio-buildroot/usr/lib/python3/site-packages/rasterio/rio/convert.py
compile /usr/src/tmp/python3-module-rasterio-buildroot/usr/lib/python3/site-packages/rasterio/rio/edit_info.py
compile /usr/src/tmp/python3-module-rasterio-buildroot/usr/lib/python3/site-packages/rasterio/rio/env.py
compile /usr/src/tmp/python3-module-rasterio-buildroot/usr/lib/python3/site-packages/rasterio/rio/gcps.py
compile /usr/src/tmp/python3-module-rasterio-buildroot/usr/lib/python3/site-packages/rasterio/rio/helpers.py
compile /usr/src/tmp/python3-module-rasterio-buildroot/usr/lib/python3/site-packages/rasterio/rio/info.py
compile /usr/src/tmp/python3-module-rasterio-buildroot/usr/lib/python3/site-packages/rasterio/rio/insp.py
compile /usr/src/tmp/python3-module-rasterio-buildroot/usr/lib/python3/site-packages/rasterio/rio/main.py
compile /usr/src/tmp/python3-module-rasterio-buildroot/usr/lib/python3/site-packages/rasterio/rio/mask.py
compile /usr/src/tmp/python3-module-rasterio-buildroot/usr/lib/python3/site-packages/rasterio/rio/merge.py
compile /usr/src/tmp/python3-module-rasterio-buildroot/usr/lib/python3/site-packages/rasterio/rio/options.py
compile /usr/src/tmp/python3-module-rasterio-buildroot/usr/lib/python3/site-packages/rasterio/rio/overview.py
compile /usr/src/tmp/python3-module-rasterio-buildroot/usr/lib/python3/site-packages/rasterio/rio/rasterize.py
compile /usr/src/tmp/python3-module-rasterio-buildroot/usr/lib/python3/site-packages/rasterio/rio/rm.py
compile /usr/src/tmp/python3-module-rasterio-buildroot/usr/lib/python3/site-packages/rasterio/rio/sample.py
compile /usr/src/tmp/python3-module-rasterio-buildroot/usr/lib/python3/site-packages/rasterio/rio/shapes.py
compile /usr/src/tmp/python3-module-rasterio-buildroot/usr/lib/python3/site-packages/rasterio/rio/stack.py
compile /usr/src/tmp/python3-module-rasterio-buildroot/usr/lib/python3/site-packages/rasterio/rio/transform.py
compile /usr/src/tmp/python3-module-rasterio-buildroot/usr/lib/python3/site-packages/rasterio/rio/warp.py
compile /usr/src/tmp/python3-module-rasterio-buildroot/usr/lib/python3/site-packages/rasterio/__init__.py
compile /usr/src/tmp/python3-module-rasterio-buildroot/usr/lib/python3/site-packages/rasterio/compat.py
compile /usr/src/tmp/python3-module-rasterio-buildroot/usr/lib/python3/site-packages/rasterio/control.py
compile /usr/src/tmp/python3-module-rasterio-buildroot/usr/lib/python3/site-packages/rasterio/coords.py
compile /usr/src/tmp/python3-module-rasterio-buildroot/usr/lib/python3/site-packages/rasterio/crs.py
compile /usr/src/tmp/python3-module-rasterio-buildroot/usr/lib/python3/site-packages/rasterio/drivers.py
compile /usr/src/tmp/python3-module-rasterio-buildroot/usr/lib/python3/site-packages/rasterio/dtypes.py
compile /usr/src/tmp/python3-module-rasterio-buildroot/usr/lib/python3/site-packages/rasterio/enums.py
compile /usr/src/tmp/python3-module-rasterio-buildroot/usr/lib/python3/site-packages/rasterio/env.py
compile /usr/src/tmp/python3-module-rasterio-buildroot/usr/lib/python3/site-packages/rasterio/errors.py
compile /usr/src/tmp/python3-module-rasterio-buildroot/usr/lib/python3/site-packages/rasterio/features.py
compile /usr/src/tmp/python3-module-rasterio-buildroot/usr/lib/python3/site-packages/rasterio/fill.py
compile /usr/src/tmp/python3-module-rasterio-buildroot/usr/lib/python3/site-packages/rasterio/io.py
compile /usr/src/tmp/python3-module-rasterio-buildroot/usr/lib/python3/site-packages/rasterio/mask.py
compile /usr/src/tmp/python3-module-rasterio-buildroot/usr/lib/python3/site-packages/rasterio/merge.py
compile /usr/src/tmp/python3-module-rasterio-buildroot/usr/lib/python3/site-packages/rasterio/path.py
compile /usr/src/tmp/python3-module-rasterio-buildroot/usr/lib/python3/site-packages/rasterio/plot.py
compile /usr/src/tmp/python3-module-rasterio-buildroot/usr/lib/python3/site-packages/rasterio/profiles.py
compile /usr/src/tmp/python3-module-rasterio-buildroot/usr/lib/python3/site-packages/rasterio/sample.py
compile /usr/src/tmp/python3-module-rasterio-buildroot/usr/lib/python3/site-packages/rasterio/session.py
compile /usr/src/tmp/python3-module-rasterio-buildroot/usr/lib/python3/site-packages/rasterio/tools.py
compile /usr/src/tmp/python3-module-rasterio-buildroot/usr/lib/python3/site-packages/rasterio/transform.py
compile /usr/src/tmp/python3-module-rasterio-buildroot/usr/lib/python3/site-packages/rasterio/vrt.py
compile /usr/src/tmp/python3-module-rasterio-buildroot/usr/lib/python3/site-packages/rasterio/warp.py
compile /usr/src/tmp/python3-module-rasterio-buildroot/usr/lib/python3/site-packages/rasterio/windows.py
Bytecompiling python3 modules with optimization-2 in /usr/src/tmp/python3-module-rasterio-buildroot using /usr/bin/python3 -OO
compile /usr/src/tmp/python3-module-rasterio-buildroot/usr/lib/python3/site-packages/rasterio/rio/__init__.py
compile /usr/src/tmp/python3-module-rasterio-buildroot/usr/lib/python3/site-packages/rasterio/rio/blocks.py
compile /usr/src/tmp/python3-module-rasterio-buildroot/usr/lib/python3/site-packages/rasterio/rio/bounds.py
compile /usr/src/tmp/python3-module-rasterio-buildroot/usr/lib/python3/site-packages/rasterio/rio/calc.py
compile /usr/src/tmp/python3-module-rasterio-buildroot/usr/lib/python3/site-packages/rasterio/rio/clip.py
compile /usr/src/tmp/python3-module-rasterio-buildroot/usr/lib/python3/site-packages/rasterio/rio/convert.py
compile /usr/src/tmp/python3-module-rasterio-buildroot/usr/lib/python3/site-packages/rasterio/rio/edit_info.py
compile /usr/src/tmp/python3-module-rasterio-buildroot/usr/lib/python3/site-packages/rasterio/rio/env.py
compile /usr/src/tmp/python3-module-rasterio-buildroot/usr/lib/python3/site-packages/rasterio/rio/gcps.py
compile /usr/src/tmp/python3-module-rasterio-buildroot/usr/lib/python3/site-packages/rasterio/rio/helpers.py
compile /usr/src/tmp/python3-module-rasterio-buildroot/usr/lib/python3/site-packages/rasterio/rio/info.py
compile /usr/src/tmp/python3-module-rasterio-buildroot/usr/lib/python3/site-packages/rasterio/rio/insp.py
compile /usr/src/tmp/python3-module-rasterio-buildroot/usr/lib/python3/site-packages/rasterio/rio/main.py
compile /usr/src/tmp/python3-module-rasterio-buildroot/usr/lib/python3/site-packages/rasterio/rio/mask.py
compile /usr/src/tmp/python3-module-rasterio-buildroot/usr/lib/python3/site-packages/rasterio/rio/merge.py
compile /usr/src/tmp/python3-module-rasterio-buildroot/usr/lib/python3/site-packages/rasterio/rio/options.py
compile /usr/src/tmp/python3-module-rasterio-buildroot/usr/lib/python3/site-packages/rasterio/rio/overview.py
compile /usr/src/tmp/python3-module-rasterio-buildroot/usr/lib/python3/site-packages/rasterio/rio/rasterize.py
compile /usr/src/tmp/python3-module-rasterio-buildroot/usr/lib/python3/site-packages/rasterio/rio/rm.py
compile /usr/src/tmp/python3-module-rasterio-buildroot/usr/lib/python3/site-packages/rasterio/rio/sample.py
compile /usr/src/tmp/python3-module-rasterio-buildroot/usr/lib/python3/site-packages/rasterio/rio/shapes.py
compile /usr/src/tmp/python3-module-rasterio-buildroot/usr/lib/python3/site-packages/rasterio/rio/stack.py
compile /usr/src/tmp/python3-module-rasterio-buildroot/usr/lib/python3/site-packages/rasterio/rio/transform.py
compile /usr/src/tmp/python3-module-rasterio-buildroot/usr/lib/python3/site-packages/rasterio/rio/warp.py
compile /usr/src/tmp/python3-module-rasterio-buildroot/usr/lib/python3/site-packages/rasterio/__init__.py
compile /usr/src/tmp/python3-module-rasterio-buildroot/usr/lib/python3/site-packages/rasterio/compat.py
compile /usr/src/tmp/python3-module-rasterio-buildroot/usr/lib/python3/site-packages/rasterio/control.py
compile /usr/src/tmp/python3-module-rasterio-buildroot/usr/lib/python3/site-packages/rasterio/coords.py
compile /usr/src/tmp/python3-module-rasterio-buildroot/usr/lib/python3/site-packages/rasterio/crs.py
compile /usr/src/tmp/python3-module-rasterio-buildroot/usr/lib/python3/site-packages/rasterio/drivers.py
compile /usr/src/tmp/python3-module-rasterio-buildroot/usr/lib/python3/site-packages/rasterio/dtypes.py
compile /usr/src/tmp/python3-module-rasterio-buildroot/usr/lib/python3/site-packages/rasterio/enums.py
compile /usr/src/tmp/python3-module-rasterio-buildroot/usr/lib/python3/site-packages/rasterio/env.py
compile /usr/src/tmp/python3-module-rasterio-buildroot/usr/lib/python3/site-packages/rasterio/errors.py
compile /usr/src/tmp/python3-module-rasterio-buildroot/usr/lib/python3/site-packages/rasterio/features.py
compile /usr/src/tmp/python3-module-rasterio-buildroot/usr/lib/python3/site-packages/rasterio/fill.py
compile /usr/src/tmp/python3-module-rasterio-buildroot/usr/lib/python3/site-packages/rasterio/io.py
compile /usr/src/tmp/python3-module-rasterio-buildroot/usr/lib/python3/site-packages/rasterio/mask.py
compile /usr/src/tmp/python3-module-rasterio-buildroot/usr/lib/python3/site-packages/rasterio/merge.py
compile /usr/src/tmp/python3-module-rasterio-buildroot/usr/lib/python3/site-packages/rasterio/path.py
compile /usr/src/tmp/python3-module-rasterio-buildroot/usr/lib/python3/site-packages/rasterio/plot.py
compile /usr/src/tmp/python3-module-rasterio-buildroot/usr/lib/python3/site-packages/rasterio/profiles.py
compile /usr/src/tmp/python3-module-rasterio-buildroot/usr/lib/python3/site-packages/rasterio/sample.py
compile /usr/src/tmp/python3-module-rasterio-buildroot/usr/lib/python3/site-packages/rasterio/session.py
compile /usr/src/tmp/python3-module-rasterio-buildroot/usr/lib/python3/site-packages/rasterio/tools.py
compile /usr/src/tmp/python3-module-rasterio-buildroot/usr/lib/python3/site-packages/rasterio/transform.py
compile /usr/src/tmp/python3-module-rasterio-buildroot/usr/lib/python3/site-packages/rasterio/vrt.py
compile /usr/src/tmp/python3-module-rasterio-buildroot/usr/lib/python3/site-packages/rasterio/warp.py
compile /usr/src/tmp/python3-module-rasterio-buildroot/usr/lib/python3/site-packages/rasterio/windows.py
Hardlinking identical .pyc and .opt-?.pyc files
'./usr/lib/python3/site-packages/rasterio/__pycache__/windows.cpython-37.opt-1.pyc' => './usr/lib/python3/site-packages/rasterio/__pycache__/windows.cpython-37.pyc'
'./usr/lib/python3/site-packages/rasterio/__pycache__/warp.cpython-37.opt-1.pyc' => './usr/lib/python3/site-packages/rasterio/__pycache__/warp.cpython-37.pyc'
'./usr/lib/python3/site-packages/rasterio/__pycache__/vrt.cpython-37.opt-1.pyc' => './usr/lib/python3/site-packages/rasterio/__pycache__/vrt.cpython-37.pyc'
'./usr/lib/python3/site-packages/rasterio/__pycache__/transform.cpython-37.opt-1.pyc' => './usr/lib/python3/site-packages/rasterio/__pycache__/transform.cpython-37.pyc'
'./usr/lib/python3/site-packages/rasterio/__pycache__/tools.cpython-37.opt-1.pyc' => './usr/lib/python3/site-packages/rasterio/__pycache__/tools.cpython-37.pyc'
'./usr/lib/python3/site-packages/rasterio/__pycache__/session.cpython-37.opt-1.pyc' => './usr/lib/python3/site-packages/rasterio/__pycache__/session.cpython-37.pyc'
'./usr/lib/python3/site-packages/rasterio/__pycache__/sample.cpython-37.opt-1.pyc' => './usr/lib/python3/site-packages/rasterio/__pycache__/sample.cpython-37.pyc'
'./usr/lib/python3/site-packages/rasterio/__pycache__/profiles.cpython-37.opt-1.pyc' => './usr/lib/python3/site-packages/rasterio/__pycache__/profiles.cpython-37.pyc'
'./usr/lib/python3/site-packages/rasterio/__pycache__/plot.cpython-37.opt-1.pyc' => './usr/lib/python3/site-packages/rasterio/__pycache__/plot.cpython-37.pyc'
'./usr/lib/python3/site-packages/rasterio/__pycache__/path.cpython-37.opt-1.pyc' => './usr/lib/python3/site-packages/rasterio/__pycache__/path.cpython-37.pyc'
'./usr/lib/python3/site-packages/rasterio/__pycache__/merge.cpython-37.opt-1.pyc' => './usr/lib/python3/site-packages/rasterio/__pycache__/merge.cpython-37.pyc'
'./usr/lib/python3/site-packages/rasterio/__pycache__/mask.cpython-37.opt-1.pyc' => './usr/lib/python3/site-packages/rasterio/__pycache__/mask.cpython-37.pyc'
'./usr/lib/python3/site-packages/rasterio/__pycache__/io.cpython-37.opt-1.pyc' => './usr/lib/python3/site-packages/rasterio/__pycache__/io.cpython-37.pyc'
'./usr/lib/python3/site-packages/rasterio/__pycache__/fill.cpython-37.opt-1.pyc' => './usr/lib/python3/site-packages/rasterio/__pycache__/fill.cpython-37.pyc'
'./usr/lib/python3/site-packages/rasterio/__pycache__/features.cpython-37.opt-1.pyc' => './usr/lib/python3/site-packages/rasterio/__pycache__/features.cpython-37.pyc'
'./usr/lib/python3/site-packages/rasterio/__pycache__/errors.cpython-37.opt-1.pyc' => './usr/lib/python3/site-packages/rasterio/__pycache__/errors.cpython-37.pyc'
'./usr/lib/python3/site-packages/rasterio/__pycache__/env.cpython-37.opt-1.pyc' => './usr/lib/python3/site-packages/rasterio/__pycache__/env.cpython-37.pyc'
'./usr/lib/python3/site-packages/rasterio/__pycache__/enums.cpython-37.opt-1.pyc' => './usr/lib/python3/site-packages/rasterio/__pycache__/enums.cpython-37.pyc'
'./usr/lib/python3/site-packages/rasterio/__pycache__/dtypes.cpython-37.opt-1.pyc' => './usr/lib/python3/site-packages/rasterio/__pycache__/dtypes.cpython-37.pyc'
'./usr/lib/python3/site-packages/rasterio/__pycache__/drivers.cpython-37.opt-1.pyc' => './usr/lib/python3/site-packages/rasterio/__pycache__/drivers.cpython-37.pyc'
'./usr/lib/python3/site-packages/rasterio/__pycache__/crs.cpython-37.opt-1.pyc' => './usr/lib/python3/site-packages/rasterio/__pycache__/crs.cpython-37.pyc'
'./usr/lib/python3/site-packages/rasterio/__pycache__/coords.cpython-37.opt-1.pyc' => './usr/lib/python3/site-packages/rasterio/__pycache__/coords.cpython-37.pyc'
'./usr/lib/python3/site-packages/rasterio/__pycache__/control.cpython-37.opt-1.pyc' => './usr/lib/python3/site-packages/rasterio/__pycache__/control.cpython-37.pyc'
'./usr/lib/python3/site-packages/rasterio/__pycache__/compat.cpython-37.opt-1.pyc' => './usr/lib/python3/site-packages/rasterio/__pycache__/compat.cpython-37.pyc'
'./usr/lib/python3/site-packages/rasterio/__pycache__/__init__.cpython-37.opt-1.pyc' => './usr/lib/python3/site-packages/rasterio/__pycache__/__init__.cpython-37.pyc'
'./usr/lib/python3/site-packages/rasterio/rio/__pycache__/warp.cpython-37.opt-1.pyc' => './usr/lib/python3/site-packages/rasterio/rio/__pycache__/warp.cpython-37.pyc'
'./usr/lib/python3/site-packages/rasterio/rio/__pycache__/transform.cpython-37.opt-1.pyc' => './usr/lib/python3/site-packages/rasterio/rio/__pycache__/transform.cpython-37.pyc'
'./usr/lib/python3/site-packages/rasterio/rio/__pycache__/stack.cpython-37.opt-1.pyc' => './usr/lib/python3/site-packages/rasterio/rio/__pycache__/stack.cpython-37.pyc'
'./usr/lib/python3/site-packages/rasterio/rio/__pycache__/shapes.cpython-37.opt-1.pyc' => './usr/lib/python3/site-packages/rasterio/rio/__pycache__/shapes.cpython-37.pyc'
'./usr/lib/python3/site-packages/rasterio/rio/__pycache__/sample.cpython-37.opt-1.pyc' => './usr/lib/python3/site-packages/rasterio/rio/__pycache__/sample.cpython-37.pyc'
'./usr/lib/python3/site-packages/rasterio/rio/__pycache__/rm.cpython-37.opt-1.pyc' => './usr/lib/python3/site-packages/rasterio/rio/__pycache__/rm.cpython-37.pyc'
'./usr/lib/python3/site-packages/rasterio/rio/__pycache__/rasterize.cpython-37.opt-1.pyc' => './usr/lib/python3/site-packages/rasterio/rio/__pycache__/rasterize.cpython-37.pyc'
'./usr/lib/python3/site-packages/rasterio/rio/__pycache__/overview.cpython-37.opt-1.pyc' => './usr/lib/python3/site-packages/rasterio/rio/__pycache__/overview.cpython-37.pyc'
'./usr/lib/python3/site-packages/rasterio/rio/__pycache__/merge.cpython-37.opt-1.pyc' => './usr/lib/python3/site-packages/rasterio/rio/__pycache__/merge.cpython-37.pyc'
'./usr/lib/python3/site-packages/rasterio/rio/__pycache__/mask.cpython-37.opt-1.pyc' => './usr/lib/python3/site-packages/rasterio/rio/__pycache__/mask.cpython-37.pyc'
'./usr/lib/python3/site-packages/rasterio/rio/__pycache__/main.cpython-37.opt-1.pyc' => './usr/lib/python3/site-packages/rasterio/rio/__pycache__/main.cpython-37.pyc'
'./usr/lib/python3/site-packages/rasterio/rio/__pycache__/insp.cpython-37.opt-1.pyc' => './usr/lib/python3/site-packages/rasterio/rio/__pycache__/insp.cpython-37.pyc'
'./usr/lib/python3/site-packages/rasterio/rio/__pycache__/info.cpython-37.opt-1.pyc' => './usr/lib/python3/site-packages/rasterio/rio/__pycache__/info.cpython-37.pyc'
'./usr/lib/python3/site-packages/rasterio/rio/__pycache__/helpers.cpython-37.opt-1.pyc' => './usr/lib/python3/site-packages/rasterio/rio/__pycache__/helpers.cpython-37.pyc'
'./usr/lib/python3/site-packages/rasterio/rio/__pycache__/gcps.cpython-37.opt-1.pyc' => './usr/lib/python3/site-packages/rasterio/rio/__pycache__/gcps.cpython-37.pyc'
'./usr/lib/python3/site-packages/rasterio/rio/__pycache__/env.cpython-37.opt-1.pyc' => './usr/lib/python3/site-packages/rasterio/rio/__pycache__/env.cpython-37.pyc'
'./usr/lib/python3/site-packages/rasterio/rio/__pycache__/edit_info.cpython-37.opt-1.pyc' => './usr/lib/python3/site-packages/rasterio/rio/__pycache__/edit_info.cpython-37.pyc'
'./usr/lib/python3/site-packages/rasterio/rio/__pycache__/convert.cpython-37.opt-1.pyc' => './usr/lib/python3/site-packages/rasterio/rio/__pycache__/convert.cpython-37.pyc'
'./usr/lib/python3/site-packages/rasterio/rio/__pycache__/clip.cpython-37.opt-1.pyc' => './usr/lib/python3/site-packages/rasterio/rio/__pycache__/clip.cpython-37.pyc'
'./usr/lib/python3/site-packages/rasterio/rio/__pycache__/calc.cpython-37.opt-1.pyc' => './usr/lib/python3/site-packages/rasterio/rio/__pycache__/calc.cpython-37.pyc'
'./usr/lib/python3/site-packages/rasterio/rio/__pycache__/bounds.cpython-37.opt-1.pyc' => './usr/lib/python3/site-packages/rasterio/rio/__pycache__/bounds.cpython-37.pyc'
'./usr/lib/python3/site-packages/rasterio/rio/__pycache__/blocks.cpython-37.opt-1.pyc' => './usr/lib/python3/site-packages/rasterio/rio/__pycache__/blocks.cpython-37.pyc'
'./usr/lib/python3/site-packages/rasterio/rio/__pycache__/__init__.cpython-37.opt-1.pyc' => './usr/lib/python3/site-packages/rasterio/rio/__pycache__/__init__.cpython-37.pyc'
Hardlinking identical .pyc and .pyo files
Executing(%check): /bin/sh -e /usr/src/tmp/rpm-tmp.5578
+ umask 022
+ /bin/mkdir -p /usr/src/RPM/BUILD
+ cd /usr/src/RPM/BUILD
+ cd python3-module-rasterio-1.1.8
+ xvfb-run python3 setup.py test
_XSERVTransmkdir: ERROR: euid != 0,directory /tmp/.X11-unix will not be created.
The XKEYBOARD keymap compiler (xkbcomp) reports:
> Warning:          Unsupported high keycode 372 for name <I372> ignored
>                   X11 cannot support keycodes above 255.
>                   This warning only shows for the first high keycode.
Errors from xkbcomp are not fatal to the X server
INFO:root:GDAL API version obtained from gdal-config: 3.0.4
running test
running egg_info
writing rasterio.egg-info/PKG-INFO
writing dependency_links to rasterio.egg-info/dependency_links.txt
writing entry points to rasterio.egg-info/entry_points.txt
deleting rasterio.egg-info/requires.txt
writing top-level names to rasterio.egg-info/top_level.txt
reading manifest file 'rasterio.egg-info/SOURCES.txt'
writing manifest file 'rasterio.egg-info/SOURCES.txt'
running build_ext
copying build/lib.linux-i686-3.7/rasterio/_base.cpython-37m.so -> ./rasterio
copying build/lib.linux-i686-3.7/rasterio/_io.cpython-37m.so -> ./rasterio
copying build/lib.linux-i686-3.7/rasterio/_features.cpython-37m.so -> ./rasterio
copying build/lib.linux-i686-3.7/rasterio/_env.cpython-37m.so -> ./rasterio
copying build/lib.linux-i686-3.7/rasterio/_warp.cpython-37m.so -> ./rasterio
copying build/lib.linux-i686-3.7/rasterio/_fill.cpython-37m.so -> ./rasterio
copying build/lib.linux-i686-3.7/rasterio/_err.cpython-37m.so -> ./rasterio
copying build/lib.linux-i686-3.7/rasterio/_example.cpython-37m.so -> ./rasterio
copying build/lib.linux-i686-3.7/rasterio/_crs.cpython-37m.so -> ./rasterio
copying build/lib.linux-i686-3.7/rasterio/shutil.cpython-37m.so -> ./rasterio
copying build/lib.linux-i686-3.7/rasterio/_transform.cpython-37m.so -> ./rasterio
copying build/lib.linux-i686-3.7/rasterio/_shim.cpython-37m.so -> ./rasterio
INFO:matplotlib.font_manager:font search path ['/usr/lib/python3/site-packages/matplotlib/mpl-data/fonts/ttf', '/usr/lib/python3/site-packages/matplotlib/mpl-data/fonts/afm', '/usr/lib/python3/site-packages/matplotlib/mpl-data/fonts/pdfcorefonts']
INFO:matplotlib.font_manager:generated new fontManager
<30>Jun 27 12:35:09 dbus-daemon[1910409]: [session uid=619 pid=1910407] Activating service name='org.a11y.Bus' requested by ':1.0' (uid=619 pid=1909810 comm="")
<30>Jun 27 12:35:09 dbus-daemon[1910409]: [session uid=619 pid=1910407] Successfully activated service 'org.a11y.Bus'
/usr/src/RPM/BUILD/python3-module-rasterio-1.1.8/tests/test_reshape_image.py:8: UserWarning: 
This call to matplotlib.use() has no effect because the backend has already
been chosen; matplotlib.use() must be called *before* pylab, matplotlib.pyplot,
or matplotlib.backends is imported for the first time.

The backend was *originally* set to 'GTK3Cairo' by the following code:
  File "setup.py", line 435, in <module>
    setup(**setup_args)
  File "/usr/lib/python3/site-packages/setuptools/__init__.py", line 145, in setup
    return distutils.core.setup(**attrs)
  File "/usr/lib/python3.7/distutils/core.py", line 148, in setup
    dist.run_commands()
  File "/usr/lib/python3.7/distutils/dist.py", line 966, in run_commands
    self.run_command(cmd)
  File "/usr/lib/python3.7/distutils/dist.py", line 985, in run_command
    cmd_obj.run()
  File "/usr/lib/python3/site-packages/setuptools/command/test.py", line 233, in run
    self.run_tests()
  File "/usr/lib/python3/site-packages/setuptools/command/test.py", line 255, in run_tests
    exit=False,
  File "/usr/lib/python3.7/unittest/main.py", line 100, in __init__
    self.parseArgs(argv)
  File "/usr/lib/python3.7/unittest/main.py", line 124, in parseArgs
    self._do_discovery(argv[2:])
  File "/usr/lib/python3.7/unittest/main.py", line 244, in _do_discovery
    self.createTests(from_discovery=True, Loader=Loader)
  File "/usr/lib/python3.7/unittest/main.py", line 154, in createTests
    self.test = loader.discover(self.start, self.pattern, self.top)
  File "/usr/lib/python3.7/unittest/loader.py", line 349, in discover
    tests = list(self._find_tests(start_dir, pattern))
  File "/usr/lib/python3.7/unittest/loader.py", line 406, in _find_tests
    full_path, pattern, namespace)
  File "/usr/lib/python3.7/unittest/loader.py", line 483, in _find_test_path
    tests = self.loadTestsFromModule(package, pattern=pattern)
  File "/usr/lib/python3/site-packages/setuptools/command/test.py", line 54, in loadTestsFromModule
    tests.append(self.loadTestsFromName(submodule))
  File "/usr/lib/python3.7/unittest/loader.py", line 191, in loadTestsFromName
    return self.loadTestsFromModule(obj)
  File "/usr/lib/python3/site-packages/setuptools/command/test.py", line 54, in loadTestsFromModule
    tests.append(self.loadTestsFromName(submodule))
  File "/usr/lib/python3.7/unittest/loader.py", line 154, in loadTestsFromName
    module = __import__(module_name)
  File "/usr/src/RPM/BUILD/python3-module-rasterio-1.1.8/rasterio/rio/main.py", line 77, in <module>
    @click.pass_context
  File "/usr/lib/python3/site-packages/click_plugins/core.py", line 37, in decorator
    group.add_command(entry_point.load())
  File "/usr/lib/python3/site-packages/pkg_resources/__init__.py", line 2411, in load
    return self.resolve()
  File "/usr/lib/python3/site-packages/pkg_resources/__init__.py", line 2417, in resolve
    module = __import__(self.module_name, fromlist=['__name__'], level=0)
  File "/usr/src/RPM/BUILD/python3-module-rasterio-1.1.8/rasterio/rio/insp.py", line 18, in <module>
    import matplotlib.pyplot as plt
  File "/usr/lib/python3/site-packages/matplotlib/pyplot.py", line 71, in <module>
    from matplotlib.backends import pylab_setup
  File "/usr/lib/python3/site-packages/matplotlib/backends/__init__.py", line 16, in <module>
    line for line in traceback.format_stack()


  mpl.use('agg')
/usr/src/RPM/BUILD/python3-module-rasterio-1.1.8/tests/test_plot.py:9: UserWarning: 
This call to matplotlib.use() has no effect because the backend has already
been chosen; matplotlib.use() must be called *before* pylab, matplotlib.pyplot,
or matplotlib.backends is imported for the first time.

The backend was *originally* set to 'GTK3Cairo' by the following code:
  File "setup.py", line 435, in <module>
    setup(**setup_args)
  File "/usr/lib/python3/site-packages/setuptools/__init__.py", line 145, in setup
    return distutils.core.setup(**attrs)
  File "/usr/lib/python3.7/distutils/core.py", line 148, in setup
    dist.run_commands()
  File "/usr/lib/python3.7/distutils/dist.py", line 966, in run_commands
    self.run_command(cmd)
  File "/usr/lib/python3.7/distutils/dist.py", line 985, in run_command
    cmd_obj.run()
  File "/usr/lib/python3/site-packages/setuptools/command/test.py", line 233, in run
    self.run_tests()
  File "/usr/lib/python3/site-packages/setuptools/command/test.py", line 255, in run_tests
    exit=False,
  File "/usr/lib/python3.7/unittest/main.py", line 100, in __init__
    self.parseArgs(argv)
  File "/usr/lib/python3.7/unittest/main.py", line 124, in parseArgs
    self._do_discovery(argv[2:])
  File "/usr/lib/python3.7/unittest/main.py", line 244, in _do_discovery
    self.createTests(from_discovery=True, Loader=Loader)
  File "/usr/lib/python3.7/unittest/main.py", line 154, in createTests
    self.test = loader.discover(self.start, self.pattern, self.top)
  File "/usr/lib/python3.7/unittest/loader.py", line 349, in discover
    tests = list(self._find_tests(start_dir, pattern))
  File "/usr/lib/python3.7/unittest/loader.py", line 406, in _find_tests
    full_path, pattern, namespace)
  File "/usr/lib/python3.7/unittest/loader.py", line 483, in _find_test_path
    tests = self.loadTestsFromModule(package, pattern=pattern)
  File "/usr/lib/python3/site-packages/setuptools/command/test.py", line 54, in loadTestsFromModule
    tests.append(self.loadTestsFromName(submodule))
  File "/usr/lib/python3.7/unittest/loader.py", line 191, in loadTestsFromName
    return self.loadTestsFromModule(obj)
  File "/usr/lib/python3/site-packages/setuptools/command/test.py", line 54, in loadTestsFromModule
    tests.append(self.loadTestsFromName(submodule))
  File "/usr/lib/python3.7/unittest/loader.py", line 154, in loadTestsFromName
    module = __import__(module_name)
  File "/usr/src/RPM/BUILD/python3-module-rasterio-1.1.8/rasterio/rio/main.py", line 77, in <module>
    @click.pass_context
  File "/usr/lib/python3/site-packages/click_plugins/core.py", line 37, in decorator
    group.add_command(entry_point.load())
  File "/usr/lib/python3/site-packages/pkg_resources/__init__.py", line 2411, in load
    return self.resolve()
  File "/usr/lib/python3/site-packages/pkg_resources/__init__.py", line 2417, in resolve
    module = __import__(self.module_name, fromlist=['__name__'], level=0)
  File "/usr/src/RPM/BUILD/python3-module-rasterio-1.1.8/rasterio/rio/insp.py", line 18, in <module>
    import matplotlib.pyplot as plt
  File "/usr/lib/python3/site-packages/matplotlib/pyplot.py", line 71, in <module>
    from matplotlib.backends import pylab_setup
  File "/usr/lib/python3/site-packages/matplotlib/backends/__init__.py", line 16, in <module>
    line for line in traceback.format_stack()


  mpl.use('agg')
/usr/src/RPM/BUILD/python3-module-rasterio-1.1.8/tests/test_dataset_mask.py:9: UserWarning: 
This call to matplotlib.use() has no effect because the backend has already
been chosen; matplotlib.use() must be called *before* pylab, matplotlib.pyplot,
or matplotlib.backends is imported for the first time.

The backend was *originally* set to 'GTK3Cairo' by the following code:
  File "setup.py", line 435, in <module>
    setup(**setup_args)
  File "/usr/lib/python3/site-packages/setuptools/__init__.py", line 145, in setup
    return distutils.core.setup(**attrs)
  File "/usr/lib/python3.7/distutils/core.py", line 148, in setup
    dist.run_commands()
  File "/usr/lib/python3.7/distutils/dist.py", line 966, in run_commands
    self.run_command(cmd)
  File "/usr/lib/python3.7/distutils/dist.py", line 985, in run_command
    cmd_obj.run()
  File "/usr/lib/python3/site-packages/setuptools/command/test.py", line 233, in run
    self.run_tests()
  File "/usr/lib/python3/site-packages/setuptools/command/test.py", line 255, in run_tests
    exit=False,
  File "/usr/lib/python3.7/unittest/main.py", line 100, in __init__
    self.parseArgs(argv)
  File "/usr/lib/python3.7/unittest/main.py", line 124, in parseArgs
    self._do_discovery(argv[2:])
  File "/usr/lib/python3.7/unittest/main.py", line 244, in _do_discovery
    self.createTests(from_discovery=True, Loader=Loader)
  File "/usr/lib/python3.7/unittest/main.py", line 154, in createTests
    self.test = loader.discover(self.start, self.pattern, self.top)
  File "/usr/lib/python3.7/unittest/loader.py", line 349, in discover
    tests = list(self._find_tests(start_dir, pattern))
  File "/usr/lib/python3.7/unittest/loader.py", line 406, in _find_tests
    full_path, pattern, namespace)
  File "/usr/lib/python3.7/unittest/loader.py", line 483, in _find_test_path
    tests = self.loadTestsFromModule(package, pattern=pattern)
  File "/usr/lib/python3/site-packages/setuptools/command/test.py", line 54, in loadTestsFromModule
    tests.append(self.loadTestsFromName(submodule))
  File "/usr/lib/python3.7/unittest/loader.py", line 191, in loadTestsFromName
    return self.loadTestsFromModule(obj)
  File "/usr/lib/python3/site-packages/setuptools/command/test.py", line 54, in loadTestsFromModule
    tests.append(self.loadTestsFromName(submodule))
  File "/usr/lib/python3.7/unittest/loader.py", line 154, in loadTestsFromName
    module = __import__(module_name)
  File "/usr/src/RPM/BUILD/python3-module-rasterio-1.1.8/rasterio/rio/main.py", line 77, in <module>
    @click.pass_context
  File "/usr/lib/python3/site-packages/click_plugins/core.py", line 37, in decorator
    group.add_command(entry_point.load())
  File "/usr/lib/python3/site-packages/pkg_resources/__init__.py", line 2411, in load
    return self.resolve()
  File "/usr/lib/python3/site-packages/pkg_resources/__init__.py", line 2417, in resolve
    module = __import__(self.module_name, fromlist=['__name__'], level=0)
  File "/usr/src/RPM/BUILD/python3-module-rasterio-1.1.8/rasterio/rio/insp.py", line 18, in <module>
    import matplotlib.pyplot as plt
  File "/usr/lib/python3/site-packages/matplotlib/pyplot.py", line 71, in <module>
    from matplotlib.backends import pylab_setup
  File "/usr/lib/python3/site-packages/matplotlib/backends/__init__.py", line 16, in <module>
    line for line in traceback.format_stack()


  mpl.use('agg')
/usr/src/RPM/BUILD/python3-module-rasterio-1.1.8/tests/test_dataset_mask.py:9: UserWarning: 
This call to matplotlib.use() has no effect because the backend has already
been chosen; matplotlib.use() must be called *before* pylab, matplotlib.pyplot,
or matplotlib.backends is imported for the first time.

The backend was *originally* set to 'GTK3Cairo' by the following code:
  File "setup.py", line 435, in <module>
    setup(**setup_args)
  File "/usr/lib/python3/site-packages/setuptools/__init__.py", line 145, in setup
    return distutils.core.setup(**attrs)
  File "/usr/lib/python3.7/distutils/core.py", line 148, in setup
    dist.run_commands()
  File "/usr/lib/python3.7/distutils/dist.py", line 966, in run_commands
    self.run_command(cmd)
  File "/usr/lib/python3.7/distutils/dist.py", line 985, in run_command
    cmd_obj.run()
  File "/usr/lib/python3/site-packages/setuptools/command/test.py", line 233, in run
    self.run_tests()
  File "/usr/lib/python3/site-packages/setuptools/command/test.py", line 255, in run_tests
    exit=False,
  File "/usr/lib/python3.7/unittest/main.py", line 100, in __init__
    self.parseArgs(argv)
  File "/usr/lib/python3.7/unittest/main.py", line 124, in parseArgs
    self._do_discovery(argv[2:])
  File "/usr/lib/python3.7/unittest/main.py", line 244, in _do_discovery
    self.createTests(from_discovery=True, Loader=Loader)
  File "/usr/lib/python3.7/unittest/main.py", line 154, in createTests
    self.test = loader.discover(self.start, self.pattern, self.top)
  File "/usr/lib/python3.7/unittest/loader.py", line 349, in discover
    tests = list(self._find_tests(start_dir, pattern))
  File "/usr/lib/python3.7/unittest/loader.py", line 406, in _find_tests
    full_path, pattern, namespace)
  File "/usr/lib/python3.7/unittest/loader.py", line 483, in _find_test_path
    tests = self.loadTestsFromModule(package, pattern=pattern)
  File "/usr/lib/python3/site-packages/setuptools/command/test.py", line 54, in loadTestsFromModule
    tests.append(self.loadTestsFromName(submodule))
  File "/usr/lib/python3.7/unittest/loader.py", line 191, in loadTestsFromName
    return self.loadTestsFromModule(obj)
  File "/usr/lib/python3/site-packages/setuptools/command/test.py", line 54, in loadTestsFromModule
    tests.append(self.loadTestsFromName(submodule))
  File "/usr/lib/python3.7/unittest/loader.py", line 154, in loadTestsFromName
    module = __import__(module_name)
  File "/usr/src/RPM/BUILD/python3-module-rasterio-1.1.8/rasterio/rio/main.py", line 77, in <module>
    @click.pass_context
  File "/usr/lib/python3/site-packages/click_plugins/core.py", line 37, in decorator
    group.add_command(entry_point.load())
  File "/usr/lib/python3/site-packages/pkg_resources/__init__.py", line 2411, in load
    return self.resolve()
  File "/usr/lib/python3/site-packages/pkg_resources/__init__.py", line 2417, in resolve
    module = __import__(self.module_name, fromlist=['__name__'], level=0)
  File "/usr/src/RPM/BUILD/python3-module-rasterio-1.1.8/rasterio/rio/insp.py", line 18, in <module>
    import matplotlib.pyplot as plt
  File "/usr/lib/python3/site-packages/matplotlib/pyplot.py", line 71, in <module>
    from matplotlib.backends import pylab_setup
  File "/usr/lib/python3/site-packages/matplotlib/backends/__init__.py", line 16, in <module>
    line for line in traceback.format_stack()


  mpl.use('agg')
test_windows_mixins (unittest.loader._FailedTest) ... ERROR
test_windows (unittest.loader._FailedTest) ... ERROR
test_warpedvrt (unittest.loader._FailedTest) ... ERROR
test_warp (unittest.loader._FailedTest) ... ERROR
test_update (unittest.loader._FailedTest) ... ERROR
test_multiopen (tests.test_threading.TestThreading) ... FAIL
test_reliability (tests.test_threading.TestThreading)
Allow for nondeterminism of race condition ... FAIL
test_tag_item (unittest.loader._FailedTest) ... ERROR
test_subdatasets (unittest.loader._FailedTest) ... ERROR
test_rio_warp (unittest.loader._FailedTest) ... ERROR
test_rio_stack (unittest.loader._FailedTest) ... ERROR
test_rio_sample (unittest.loader._FailedTest) ... ERROR
test_rio_overview (unittest.loader._FailedTest) ... ERROR
test_rio_merge (unittest.loader._FailedTest) ... ERROR
test_rio_mask (unittest.loader._FailedTest) ... ERROR
test_rio_main (unittest.loader._FailedTest) ... ERROR
test_rio_info (unittest.loader._FailedTest) ... ERROR
test_rio_gcp (unittest.loader._FailedTest) ... ERROR
test_rio_edit_info (unittest.loader._FailedTest) ... ERROR
test_rio_convert (unittest.loader._FailedTest) ... ERROR
test_rio_calc (unittest.loader._FailedTest) ... ERROR
test_write_colormap_revolving_door (tests.test_revolvingdoor.RevolvingDoorTest) ... ERROR
test_read_resample (unittest.loader._FailedTest) ... ERROR
test_context (tests.test_read.ReaderContextTest) ... ERROR
test_derived_spatial (tests.test_read.ReaderContextTest) ... ERROR
test_read_basic (tests.test_read.ReaderContextTest) ... ERROR
test_read_indexes (tests.test_read.ReaderContextTest) ... ERROR
test_read_nan_nodata (tests.test_read.ReaderContextTest) ... ERROR
test_read_no_band (tests.test_read.ReaderContextTest) ... ERROR
test_read_out (tests.test_read.ReaderContextTest) ... ERROR
test_read_out_dtype_fail (tests.test_read.ReaderContextTest) ... ERROR
test_read_ubyte (tests.test_read.ReaderContextTest) ... ERROR
test_read_ubyte_bad_index (tests.test_read.ReaderContextTest) ... ERROR
test_read_ubyte_out (tests.test_read.ReaderContextTest) ... ERROR
test_read_window (tests.test_read.ReaderContextTest) ... ERROR
test_read_window_beyond (tests.test_read.ReaderContextTest)
Test graceful Numpy-like handling of windows beyond ... ERROR
test_read_window_overflow (tests.test_read.ReaderContextTest)
Test graceful Numpy-like handling of windows that overflow ... ERROR
test_read_window_overlap (tests.test_read.ReaderContextTest)
Test graceful Numpy-like handling of windows beyond ... ERROR
test_overviews (unittest.loader._FailedTest) ... ERROR
test_open_sharing (unittest.loader._FailedTest) ... ERROR
test_open_overview_level (unittest.loader._FailedTest) ... ERROR
test_open_options (unittest.loader._FailedTest) ... ERROR
test_mask (unittest.loader._FailedTest) ... ERROR
test_features (unittest.loader._FailedTest) ... ERROR
test_env (unittest.loader._FailedTest) ... ERROR
test_dataset_mask (unittest.loader._FailedTest) ... ERROR
test_data_paths (unittest.loader._FailedTest) ... ERROR
test_crs (unittest.loader._FailedTest) ... ERROR
test_creation_options (unittest.loader._FailedTest) ... ERROR
test_colorinterp (unittest.loader._FailedTest) ... ERROR
test_cli_main (unittest.loader._FailedTest) ... ERROR
test_boundless_read (unittest.loader._FailedTest) ... ERROR
test_blocks (unittest.loader._FailedTest) ... ERROR
test__env (unittest.loader._FailedTest) ... ERROR
test__crs (unittest.loader._FailedTest) ... ERROR
conftest (unittest.loader._FailedTest) ... ERROR
tests.test__crs (unittest.loader._FailedTest) ... ERROR
tests.test__env (unittest.loader._FailedTest) ... ERROR
tests.test_blocks (unittest.loader._FailedTest) ... ERROR
tests.test_boundless_read (unittest.loader._FailedTest) ... ERROR
tests.test_cli_main (unittest.loader._FailedTest) ... ERROR
tests.test_colorinterp (unittest.loader._FailedTest) ... ERROR
tests.test_creation_options (unittest.loader._FailedTest) ... ERROR
tests.test_crs (unittest.loader._FailedTest) ... ERROR
tests.test_data_paths (unittest.loader._FailedTest) ... ERROR
tests.test_dataset_mask (unittest.loader._FailedTest) ... ERROR
tests.test_env (unittest.loader._FailedTest) ... ERROR
tests.test_features (unittest.loader._FailedTest) ... ERROR
tests.test_mask (unittest.loader._FailedTest) ... ERROR
tests.test_open_options (unittest.loader._FailedTest) ... ERROR
tests.test_open_overview_level (unittest.loader._FailedTest) ... ERROR
tests.test_open_sharing (unittest.loader._FailedTest) ... ERROR
tests.test_overviews (unittest.loader._FailedTest) ... ERROR
tests.test_read_resample (unittest.loader._FailedTest) ... ERROR
tests.test_rio_calc (unittest.loader._FailedTest) ... ERROR
tests.test_rio_convert (unittest.loader._FailedTest) ... ERROR
tests.test_rio_edit_info (unittest.loader._FailedTest) ... ERROR
tests.test_rio_gcp (unittest.loader._FailedTest) ... ERROR
tests.test_rio_info (unittest.loader._FailedTest) ... ERROR
tests.test_rio_main (unittest.loader._FailedTest) ... ERROR
tests.test_rio_mask (unittest.loader._FailedTest) ... ERROR
tests.test_rio_merge (unittest.loader._FailedTest) ... ERROR
tests.test_rio_overview (unittest.loader._FailedTest) ... ERROR
tests.test_rio_sample (unittest.loader._FailedTest) ... ERROR
tests.test_rio_stack (unittest.loader._FailedTest) ... ERROR
tests.test_rio_warp (unittest.loader._FailedTest) ... ERROR
tests.test_subdatasets (unittest.loader._FailedTest) ... ERROR
tests.test_tag_item (unittest.loader._FailedTest) ... ERROR
tests.test_update (unittest.loader._FailedTest) ... ERROR
tests.test_warp (unittest.loader._FailedTest) ... ERROR
tests.test_warpedvrt (unittest.loader._FailedTest) ... ERROR
tests.test_windows (unittest.loader._FailedTest) ... ERROR
tests.test_windows_mixins (unittest.loader._FailedTest) ... ERROR

======================================================================
ERROR: test_windows_mixins (unittest.loader._FailedTest)
----------------------------------------------------------------------
ImportError: Failed to import test module: test_windows_mixins
Traceback (most recent call last):
  File "/usr/lib/python3.7/unittest/loader.py", line 154, in loadTestsFromName
    module = __import__(module_name)
  File "/usr/src/RPM/BUILD/python3-module-rasterio-1.1.8/tests/test_windows_mixins.py", line 1, in <module>
    from hypothesis import given
ModuleNotFoundError: No module named 'hypothesis'


======================================================================
ERROR: test_windows (unittest.loader._FailedTest)
----------------------------------------------------------------------
ImportError: Failed to import test module: test_windows
Traceback (most recent call last):
  File "/usr/lib/python3.7/unittest/loader.py", line 154, in loadTestsFromName
    module = __import__(module_name)
  File "/usr/src/RPM/BUILD/python3-module-rasterio-1.1.8/tests/test_windows.py", line 8, in <module>
    from hypothesis import given, assume, settings, HealthCheck
ModuleNotFoundError: No module named 'hypothesis'


======================================================================
ERROR: test_warpedvrt (unittest.loader._FailedTest)
----------------------------------------------------------------------
ImportError: Failed to import test module: test_warpedvrt
Traceback (most recent call last):
  File "/usr/lib/python3.7/unittest/loader.py", line 154, in loadTestsFromName
    module = __import__(module_name)
  File "/usr/src/RPM/BUILD/python3-module-rasterio-1.1.8/tests/test_warpedvrt.py", line 22, in <module>
    from .conftest import requires_gdal21, requires_gdal2
  File "/usr/src/RPM/BUILD/python3-module-rasterio-1.1.8/tests/conftest.py", line 13, in <module>
    from click.testing import CliRunner
ModuleNotFoundError: No module named 'click.testing'


======================================================================
ERROR: test_warp (unittest.loader._FailedTest)
----------------------------------------------------------------------
ImportError: Failed to import test module: test_warp
Traceback (most recent call last):
  File "/usr/lib/python3.7/unittest/loader.py", line 154, in loadTestsFromName
    module = __import__(module_name)
  File "/usr/src/RPM/BUILD/python3-module-rasterio-1.1.8/tests/test_warp.py", line 8, in <module>
    from numpy.testing import assert_almost_equal
ModuleNotFoundError: No module named 'numpy.testing'


======================================================================
ERROR: test_update (unittest.loader._FailedTest)
----------------------------------------------------------------------
ImportError: Failed to import test module: test_update
Traceback (most recent call last):
  File "/usr/lib/python3.7/unittest/loader.py", line 154, in loadTestsFromName
    module = __import__(module_name)
  File "/usr/src/RPM/BUILD/python3-module-rasterio-1.1.8/tests/test_update.py", line 11, in <module>
    from .conftest import requires_gdal21
  File "/usr/src/RPM/BUILD/python3-module-rasterio-1.1.8/tests/conftest.py", line 13, in <module>
    from click.testing import CliRunner
ModuleNotFoundError: No module named 'click.testing'


======================================================================
ERROR: test_tag_item (unittest.loader._FailedTest)
----------------------------------------------------------------------
ImportError: Failed to import test module: test_tag_item
Traceback (most recent call last):
  File "/usr/lib/python3.7/unittest/loader.py", line 154, in loadTestsFromName
    module = __import__(module_name)
  File "/usr/src/RPM/BUILD/python3-module-rasterio-1.1.8/tests/test_tag_item.py", line 7, in <module>
    from .conftest import requires_gdal22
  File "/usr/src/RPM/BUILD/python3-module-rasterio-1.1.8/tests/conftest.py", line 13, in <module>
    from click.testing import CliRunner
ModuleNotFoundError: No module named 'click.testing'


======================================================================
ERROR: test_subdatasets (unittest.loader._FailedTest)
----------------------------------------------------------------------
ImportError: Failed to import test module: test_subdatasets
Traceback (most recent call last):
  File "/usr/lib/python3.7/unittest/loader.py", line 154, in loadTestsFromName
    module = __import__(module_name)
  File "/usr/src/RPM/BUILD/python3-module-rasterio-1.1.8/tests/test_subdatasets.py", line 5, in <module>
    from .conftest import requires_gdal21
  File "/usr/src/RPM/BUILD/python3-module-rasterio-1.1.8/tests/conftest.py", line 13, in <module>
    from click.testing import CliRunner
ModuleNotFoundError: No module named 'click.testing'


======================================================================
ERROR: test_rio_warp (unittest.loader._FailedTest)
----------------------------------------------------------------------
ImportError: Failed to import test module: test_rio_warp
Traceback (most recent call last):
  File "/usr/lib/python3.7/unittest/loader.py", line 154, in loadTestsFromName
    module = __import__(module_name)
  File "/usr/src/RPM/BUILD/python3-module-rasterio-1.1.8/tests/test_rio_warp.py", line 18, in <module>
    from .conftest import requires_gdal_lt_3
  File "/usr/src/RPM/BUILD/python3-module-rasterio-1.1.8/tests/conftest.py", line 13, in <module>
    from click.testing import CliRunner
ModuleNotFoundError: No module named 'click.testing'


======================================================================
ERROR: test_rio_stack (unittest.loader._FailedTest)
----------------------------------------------------------------------
ImportError: Failed to import test module: test_rio_stack
Traceback (most recent call last):
  File "/usr/lib/python3.7/unittest/loader.py", line 154, in loadTestsFromName
    module = __import__(module_name)
  File "/usr/src/RPM/BUILD/python3-module-rasterio-1.1.8/tests/test_rio_stack.py", line 1, in <module>
    from click.testing import CliRunner
ModuleNotFoundError: No module named 'click.testing'


======================================================================
ERROR: test_rio_sample (unittest.loader._FailedTest)
----------------------------------------------------------------------
ImportError: Failed to import test module: test_rio_sample
Traceback (most recent call last):
  File "/usr/lib/python3.7/unittest/loader.py", line 154, in loadTestsFromName
    module = __import__(module_name)
  File "/usr/src/RPM/BUILD/python3-module-rasterio-1.1.8/tests/test_rio_sample.py", line 5, in <module>
    from click.testing import CliRunner
ModuleNotFoundError: No module named 'click.testing'


======================================================================
ERROR: test_rio_overview (unittest.loader._FailedTest)
----------------------------------------------------------------------
ImportError: Failed to import test module: test_rio_overview
Traceback (most recent call last):
  File "/usr/lib/python3.7/unittest/loader.py", line 154, in loadTestsFromName
    module = __import__(module_name)
  File "/usr/src/RPM/BUILD/python3-module-rasterio-1.1.8/tests/test_rio_overview.py", line 4, in <module>
    from click.testing import CliRunner
ModuleNotFoundError: No module named 'click.testing'


======================================================================
ERROR: test_rio_merge (unittest.loader._FailedTest)
----------------------------------------------------------------------
ImportError: Failed to import test module: test_rio_merge
Traceback (most recent call last):
  File "/usr/lib/python3.7/unittest/loader.py", line 154, in loadTestsFromName
    module = __import__(module_name)
  File "/usr/src/RPM/BUILD/python3-module-rasterio-1.1.8/tests/test_rio_merge.py", line 9, in <module>
    from click.testing import CliRunner
ModuleNotFoundError: No module named 'click.testing'


======================================================================
ERROR: test_rio_mask (unittest.loader._FailedTest)
----------------------------------------------------------------------
ImportError: Failed to import test module: test_rio_mask
Traceback (most recent call last):
  File "/usr/lib/python3.7/unittest/loader.py", line 154, in loadTestsFromName
    module = __import__(module_name)
  File "/usr/src/RPM/BUILD/python3-module-rasterio-1.1.8/tests/test_rio_mask.py", line 16, in <module>
    from .conftest import requires_gdal22
  File "/usr/src/RPM/BUILD/python3-module-rasterio-1.1.8/tests/conftest.py", line 13, in <module>
    from click.testing import CliRunner
ModuleNotFoundError: No module named 'click.testing'


======================================================================
ERROR: test_rio_main (unittest.loader._FailedTest)
----------------------------------------------------------------------
ImportError: Failed to import test module: test_rio_main
Traceback (most recent call last):
  File "/usr/lib/python3.7/unittest/loader.py", line 154, in loadTestsFromName
    module = __import__(module_name)
  File "/usr/src/RPM/BUILD/python3-module-rasterio-1.1.8/tests/test_rio_main.py", line 4, in <module>
    from click.testing import CliRunner
ModuleNotFoundError: No module named 'click.testing'


======================================================================
ERROR: test_rio_info (unittest.loader._FailedTest)
----------------------------------------------------------------------
ImportError: Failed to import test module: test_rio_info
Traceback (most recent call last):
  File "/usr/lib/python3.7/unittest/loader.py", line 154, in loadTestsFromName
    module = __import__(module_name)
  File "/usr/src/RPM/BUILD/python3-module-rasterio-1.1.8/tests/test_rio_info.py", line 3, in <module>
    from click.testing import CliRunner
ModuleNotFoundError: No module named 'click.testing'


======================================================================
ERROR: test_rio_gcp (unittest.loader._FailedTest)
----------------------------------------------------------------------
ImportError: Failed to import test module: test_rio_gcp
Traceback (most recent call last):
  File "/usr/lib/python3.7/unittest/loader.py", line 154, in loadTestsFromName
    module = __import__(module_name)
  File "/usr/src/RPM/BUILD/python3-module-rasterio-1.1.8/tests/test_rio_gcp.py", line 5, in <module>
    from click.testing import CliRunner
ModuleNotFoundError: No module named 'click.testing'


======================================================================
ERROR: test_rio_edit_info (unittest.loader._FailedTest)
----------------------------------------------------------------------
ImportError: Failed to import test module: test_rio_edit_info
Traceback (most recent call last):
  File "/usr/lib/python3.7/unittest/loader.py", line 154, in loadTestsFromName
    module = __import__(module_name)
  File "/usr/src/RPM/BUILD/python3-module-rasterio-1.1.8/tests/test_rio_edit_info.py", line 7, in <module>
    from click.testing import CliRunner
ModuleNotFoundError: No module named 'click.testing'


======================================================================
ERROR: test_rio_convert (unittest.loader._FailedTest)
----------------------------------------------------------------------
ImportError: Failed to import test module: test_rio_convert
Traceback (most recent call last):
  File "/usr/lib/python3.7/unittest/loader.py", line 154, in loadTestsFromName
    module = __import__(module_name)
  File "/usr/src/RPM/BUILD/python3-module-rasterio-1.1.8/tests/test_rio_convert.py", line 3, in <module>
    from click.testing import CliRunner
ModuleNotFoundError: No module named 'click.testing'


======================================================================
ERROR: test_rio_calc (unittest.loader._FailedTest)
----------------------------------------------------------------------
ImportError: Failed to import test module: test_rio_calc
Traceback (most recent call last):
  File "/usr/lib/python3.7/unittest/loader.py", line 154, in loadTestsFromName
    module = __import__(module_name)
  File "/usr/src/RPM/BUILD/python3-module-rasterio-1.1.8/tests/test_rio_calc.py", line 1, in <module>
    from click.testing import CliRunner
ModuleNotFoundError: No module named 'click.testing'


======================================================================
ERROR: test_write_colormap_revolving_door (tests.test_revolvingdoor.RevolvingDoorTest)
----------------------------------------------------------------------
Traceback (most recent call last):
  File "rasterio/_base.pyx", line 216, in rasterio._base.DatasetBase.__init__
  File "rasterio/_shim.pyx", line 78, in rasterio._shim.open_dataset
  File "rasterio/_err.pyx", line 213, in rasterio._err.exc_wrap_pointer
rasterio._err.CPLE_OpenFailedError: tests/data/shade.tif: No such file or directory

During handling of the above exception, another exception occurred:

Traceback (most recent call last):
  File "/usr/src/RPM/BUILD/python3-module-rasterio-1.1.8/tests/test_revolvingdoor.py", line 26, in test_write_colormap_revolving_door
    with rasterio.open('tests/data/shade.tif') as src:
  File "/usr/src/RPM/BUILD/python3-module-rasterio-1.1.8/rasterio/env.py", line 433, in wrapper
    return f(*args, **kwds)
  File "/usr/src/RPM/BUILD/python3-module-rasterio-1.1.8/rasterio/__init__.py", line 221, in open
    s = DatasetReader(path, driver=driver, sharing=sharing, **kwargs)
  File "rasterio/_base.pyx", line 218, in rasterio._base.DatasetBase.__init__
rasterio.errors.RasterioIOError: tests/data/shade.tif: No such file or directory

======================================================================
ERROR: test_read_resample (unittest.loader._FailedTest)
----------------------------------------------------------------------
ImportError: Failed to import test module: test_read_resample
Traceback (most recent call last):
  File "/usr/lib/python3.7/unittest/loader.py", line 154, in loadTestsFromName
    module = __import__(module_name)
  File "/usr/src/RPM/BUILD/python3-module-rasterio-1.1.8/tests/test_read_resample.py", line 14, in <module>
    from .conftest import requires_gdal2
  File "/usr/src/RPM/BUILD/python3-module-rasterio-1.1.8/tests/conftest.py", line 13, in <module>
    from click.testing import CliRunner
ModuleNotFoundError: No module named 'click.testing'


======================================================================
ERROR: test_context (tests.test_read.ReaderContextTest)
----------------------------------------------------------------------
Traceback (most recent call last):
  File "rasterio/_base.pyx", line 216, in rasterio._base.DatasetBase.__init__
  File "rasterio/_shim.pyx", line 78, in rasterio._shim.open_dataset
  File "rasterio/_err.pyx", line 213, in rasterio._err.exc_wrap_pointer
rasterio._err.CPLE_OpenFailedError: tests/data/RGB.byte.tif: No such file or directory

During handling of the above exception, another exception occurred:

Traceback (most recent call last):
  File "/usr/src/RPM/BUILD/python3-module-rasterio-1.1.8/tests/test_read.py", line 27, in test_context
    with rasterio.open('tests/data/RGB.byte.tif') as s:
  File "/usr/src/RPM/BUILD/python3-module-rasterio-1.1.8/rasterio/env.py", line 433, in wrapper
    return f(*args, **kwds)
  File "/usr/src/RPM/BUILD/python3-module-rasterio-1.1.8/rasterio/__init__.py", line 221, in open
    s = DatasetReader(path, driver=driver, sharing=sharing, **kwargs)
  File "rasterio/_base.pyx", line 218, in rasterio._base.DatasetBase.__init__
rasterio.errors.RasterioIOError: tests/data/RGB.byte.tif: No such file or directory

======================================================================
ERROR: test_derived_spatial (tests.test_read.ReaderContextTest)
----------------------------------------------------------------------
Traceback (most recent call last):
  File "rasterio/_base.pyx", line 216, in rasterio._base.DatasetBase.__init__
  File "rasterio/_shim.pyx", line 78, in rasterio._shim.open_dataset
  File "rasterio/_err.pyx", line 213, in rasterio._err.exc_wrap_pointer
rasterio._err.CPLE_OpenFailedError: tests/data/RGB.byte.tif: No such file or directory

During handling of the above exception, another exception occurred:

Traceback (most recent call last):
  File "/usr/src/RPM/BUILD/python3-module-rasterio-1.1.8/tests/test_read.py", line 71, in test_derived_spatial
    with rasterio.open('tests/data/RGB.byte.tif') as s:
  File "/usr/src/RPM/BUILD/python3-module-rasterio-1.1.8/rasterio/env.py", line 433, in wrapper
    return f(*args, **kwds)
  File "/usr/src/RPM/BUILD/python3-module-rasterio-1.1.8/rasterio/__init__.py", line 221, in open
    s = DatasetReader(path, driver=driver, sharing=sharing, **kwargs)
  File "rasterio/_base.pyx", line 218, in rasterio._base.DatasetBase.__init__
rasterio.errors.RasterioIOError: tests/data/RGB.byte.tif: No such file or directory

======================================================================
ERROR: test_read_basic (tests.test_read.ReaderContextTest)
----------------------------------------------------------------------
Traceback (most recent call last):
  File "rasterio/_base.pyx", line 216, in rasterio._base.DatasetBase.__init__
  File "rasterio/_shim.pyx", line 78, in rasterio._shim.open_dataset
  File "rasterio/_err.pyx", line 213, in rasterio._err.exc_wrap_pointer
rasterio._err.CPLE_OpenFailedError: tests/data/shade.tif: No such file or directory

During handling of the above exception, another exception occurred:

Traceback (most recent call last):
  File "/usr/src/RPM/BUILD/python3-module-rasterio-1.1.8/tests/test_read.py", line 105, in test_read_basic
    with rasterio.open('tests/data/shade.tif') as s:
  File "/usr/src/RPM/BUILD/python3-module-rasterio-1.1.8/rasterio/env.py", line 433, in wrapper
    return f(*args, **kwds)
  File "/usr/src/RPM/BUILD/python3-module-rasterio-1.1.8/rasterio/__init__.py", line 221, in open
    s = DatasetReader(path, driver=driver, sharing=sharing, **kwargs)
  File "rasterio/_base.pyx", line 218, in rasterio._base.DatasetBase.__init__
rasterio.errors.RasterioIOError: tests/data/shade.tif: No such file or directory

======================================================================
ERROR: test_read_indexes (tests.test_read.ReaderContextTest)
----------------------------------------------------------------------
Traceback (most recent call last):
  File "rasterio/_base.pyx", line 216, in rasterio._base.DatasetBase.__init__
  File "rasterio/_shim.pyx", line 78, in rasterio._shim.open_dataset
  File "rasterio/_err.pyx", line 213, in rasterio._err.exc_wrap_pointer
rasterio._err.CPLE_OpenFailedError: tests/data/RGB.byte.tif: No such file or directory

During handling of the above exception, another exception occurred:

Traceback (most recent call last):
  File "/usr/src/RPM/BUILD/python3-module-rasterio-1.1.8/tests/test_read.py", line 135, in test_read_indexes
    with rasterio.open('tests/data/RGB.byte.tif') as s:
  File "/usr/src/RPM/BUILD/python3-module-rasterio-1.1.8/rasterio/env.py", line 433, in wrapper
    return f(*args, **kwds)
  File "/usr/src/RPM/BUILD/python3-module-rasterio-1.1.8/rasterio/__init__.py", line 221, in open
    s = DatasetReader(path, driver=driver, sharing=sharing, **kwargs)
  File "rasterio/_base.pyx", line 218, in rasterio._base.DatasetBase.__init__
rasterio.errors.RasterioIOError: tests/data/RGB.byte.tif: No such file or directory

======================================================================
ERROR: test_read_nan_nodata (tests.test_read.ReaderContextTest)
----------------------------------------------------------------------
Traceback (most recent call last):
  File "rasterio/_base.pyx", line 216, in rasterio._base.DatasetBase.__init__
  File "rasterio/_shim.pyx", line 78, in rasterio._shim.open_dataset
  File "rasterio/_err.pyx", line 213, in rasterio._err.exc_wrap_pointer
rasterio._err.CPLE_OpenFailedError: tests/data/float_nan.tif: No such file or directory

During handling of the above exception, another exception occurred:

Traceback (most recent call last):
  File "/usr/src/RPM/BUILD/python3-module-rasterio-1.1.8/tests/test_read.py", line 244, in test_read_nan_nodata
    with rasterio.open('tests/data/float_nan.tif') as s:
  File "/usr/src/RPM/BUILD/python3-module-rasterio-1.1.8/rasterio/env.py", line 433, in wrapper
    return f(*args, **kwds)
  File "/usr/src/RPM/BUILD/python3-module-rasterio-1.1.8/rasterio/__init__.py", line 221, in open
    s = DatasetReader(path, driver=driver, sharing=sharing, **kwargs)
  File "rasterio/_base.pyx", line 218, in rasterio._base.DatasetBase.__init__
rasterio.errors.RasterioIOError: tests/data/float_nan.tif: No such file or directory

======================================================================
ERROR: test_read_no_band (tests.test_read.ReaderContextTest)
----------------------------------------------------------------------
Traceback (most recent call last):
  File "rasterio/_base.pyx", line 216, in rasterio._base.DatasetBase.__init__
  File "rasterio/_shim.pyx", line 78, in rasterio._shim.open_dataset
  File "rasterio/_err.pyx", line 213, in rasterio._err.exc_wrap_pointer
rasterio._err.CPLE_OpenFailedError: tests/data/no_band.h5: No such file or directory

During handling of the above exception, another exception occurred:

Traceback (most recent call last):
  File "/usr/src/RPM/BUILD/python3-module-rasterio-1.1.8/tests/test_read.py", line 264, in test_read_no_band
    with rasterio.open('tests/data/no_band.h5') as s:
  File "/usr/src/RPM/BUILD/python3-module-rasterio-1.1.8/rasterio/env.py", line 433, in wrapper
    return f(*args, **kwds)
  File "/usr/src/RPM/BUILD/python3-module-rasterio-1.1.8/rasterio/__init__.py", line 221, in open
    s = DatasetReader(path, driver=driver, sharing=sharing, **kwargs)
  File "rasterio/_base.pyx", line 218, in rasterio._base.DatasetBase.__init__
rasterio.errors.RasterioIOError: tests/data/no_band.h5: No such file or directory

======================================================================
ERROR: test_read_out (tests.test_read.ReaderContextTest)
----------------------------------------------------------------------
Traceback (most recent call last):
  File "rasterio/_base.pyx", line 216, in rasterio._base.DatasetBase.__init__
  File "rasterio/_shim.pyx", line 78, in rasterio._shim.open_dataset
  File "rasterio/_err.pyx", line 213, in rasterio._err.exc_wrap_pointer
rasterio._err.CPLE_OpenFailedError: tests/data/RGB.byte.tif: No such file or directory

During handling of the above exception, another exception occurred:

Traceback (most recent call last):
  File "/usr/src/RPM/BUILD/python3-module-rasterio-1.1.8/tests/test_read.py", line 214, in test_read_out
    with rasterio.open('tests/data/RGB.byte.tif') as s:
  File "/usr/src/RPM/BUILD/python3-module-rasterio-1.1.8/rasterio/env.py", line 433, in wrapper
    return f(*args, **kwds)
  File "/usr/src/RPM/BUILD/python3-module-rasterio-1.1.8/rasterio/__init__.py", line 221, in open
    s = DatasetReader(path, driver=driver, sharing=sharing, **kwargs)
  File "rasterio/_base.pyx", line 218, in rasterio._base.DatasetBase.__init__
rasterio.errors.RasterioIOError: tests/data/RGB.byte.tif: No such file or directory

======================================================================
ERROR: test_read_out_dtype_fail (tests.test_read.ReaderContextTest)
----------------------------------------------------------------------
Traceback (most recent call last):
  File "rasterio/_base.pyx", line 216, in rasterio._base.DatasetBase.__init__
  File "rasterio/_shim.pyx", line 78, in rasterio._shim.open_dataset
  File "rasterio/_err.pyx", line 213, in rasterio._err.exc_wrap_pointer
rasterio._err.CPLE_OpenFailedError: tests/data/RGB.byte.tif: No such file or directory

During handling of the above exception, another exception occurred:

Traceback (most recent call last):
  File "/usr/src/RPM/BUILD/python3-module-rasterio-1.1.8/tests/test_read.py", line 94, in test_read_out_dtype_fail
    with rasterio.open('tests/data/RGB.byte.tif') as s:
  File "/usr/src/RPM/BUILD/python3-module-rasterio-1.1.8/rasterio/env.py", line 433, in wrapper
    return f(*args, **kwds)
  File "/usr/src/RPM/BUILD/python3-module-rasterio-1.1.8/rasterio/__init__.py", line 221, in open
    s = DatasetReader(path, driver=driver, sharing=sharing, **kwargs)
  File "rasterio/_base.pyx", line 218, in rasterio._base.DatasetBase.__init__
rasterio.errors.RasterioIOError: tests/data/RGB.byte.tif: No such file or directory

======================================================================
ERROR: test_read_ubyte (tests.test_read.ReaderContextTest)
----------------------------------------------------------------------
Traceback (most recent call last):
  File "rasterio/_base.pyx", line 216, in rasterio._base.DatasetBase.__init__
  File "rasterio/_shim.pyx", line 78, in rasterio._shim.open_dataset
  File "rasterio/_err.pyx", line 213, in rasterio._err.exc_wrap_pointer
rasterio._err.CPLE_OpenFailedError: tests/data/RGB.byte.tif: No such file or directory

During handling of the above exception, another exception occurred:

Traceback (most recent call last):
  File "/usr/src/RPM/BUILD/python3-module-rasterio-1.1.8/tests/test_read.py", line 79, in test_read_ubyte
    with rasterio.open('tests/data/RGB.byte.tif') as s:
  File "/usr/src/RPM/BUILD/python3-module-rasterio-1.1.8/rasterio/env.py", line 433, in wrapper
    return f(*args, **kwds)
  File "/usr/src/RPM/BUILD/python3-module-rasterio-1.1.8/rasterio/__init__.py", line 221, in open
    s = DatasetReader(path, driver=driver, sharing=sharing, **kwargs)
  File "rasterio/_base.pyx", line 218, in rasterio._base.DatasetBase.__init__
rasterio.errors.RasterioIOError: tests/data/RGB.byte.tif: No such file or directory

======================================================================
ERROR: test_read_ubyte_bad_index (tests.test_read.ReaderContextTest)
----------------------------------------------------------------------
Traceback (most recent call last):
  File "rasterio/_base.pyx", line 216, in rasterio._base.DatasetBase.__init__
  File "rasterio/_shim.pyx", line 78, in rasterio._shim.open_dataset
  File "rasterio/_err.pyx", line 213, in rasterio._err.exc_wrap_pointer
rasterio._err.CPLE_OpenFailedError: tests/data/RGB.byte.tif: No such file or directory

During handling of the above exception, another exception occurred:

Traceback (most recent call last):
  File "/usr/src/RPM/BUILD/python3-module-rasterio-1.1.8/tests/test_read.py", line 84, in test_read_ubyte_bad_index
    with rasterio.open('tests/data/RGB.byte.tif') as s:
  File "/usr/src/RPM/BUILD/python3-module-rasterio-1.1.8/rasterio/env.py", line 433, in wrapper
    return f(*args, **kwds)
  File "/usr/src/RPM/BUILD/python3-module-rasterio-1.1.8/rasterio/__init__.py", line 221, in open
    s = DatasetReader(path, driver=driver, sharing=sharing, **kwargs)
  File "rasterio/_base.pyx", line 218, in rasterio._base.DatasetBase.__init__
rasterio.errors.RasterioIOError: tests/data/RGB.byte.tif: No such file or directory

======================================================================
ERROR: test_read_ubyte_out (tests.test_read.ReaderContextTest)
----------------------------------------------------------------------
Traceback (most recent call last):
  File "rasterio/_base.pyx", line 216, in rasterio._base.DatasetBase.__init__
  File "rasterio/_shim.pyx", line 78, in rasterio._shim.open_dataset
  File "rasterio/_err.pyx", line 213, in rasterio._err.exc_wrap_pointer
rasterio._err.CPLE_OpenFailedError: tests/data/RGB.byte.tif: No such file or directory

During handling of the above exception, another exception occurred:

Traceback (most recent call last):
  File "/usr/src/RPM/BUILD/python3-module-rasterio-1.1.8/tests/test_read.py", line 88, in test_read_ubyte_out
    with rasterio.open('tests/data/RGB.byte.tif') as s:
  File "/usr/src/RPM/BUILD/python3-module-rasterio-1.1.8/rasterio/env.py", line 433, in wrapper
    return f(*args, **kwds)
  File "/usr/src/RPM/BUILD/python3-module-rasterio-1.1.8/rasterio/__init__.py", line 221, in open
    s = DatasetReader(path, driver=driver, sharing=sharing, **kwargs)
  File "rasterio/_base.pyx", line 218, in rasterio._base.DatasetBase.__init__
rasterio.errors.RasterioIOError: tests/data/RGB.byte.tif: No such file or directory

======================================================================
ERROR: test_read_window (tests.test_read.ReaderContextTest)
----------------------------------------------------------------------
Traceback (most recent call last):
  File "rasterio/_base.pyx", line 216, in rasterio._base.DatasetBase.__init__
  File "rasterio/_shim.pyx", line 78, in rasterio._shim.open_dataset
  File "rasterio/_err.pyx", line 213, in rasterio._err.exc_wrap_pointer
rasterio._err.CPLE_OpenFailedError: tests/data/RGB.byte.tif: No such file or directory

During handling of the above exception, another exception occurred:

Traceback (most recent call last):
  File "/usr/src/RPM/BUILD/python3-module-rasterio-1.1.8/tests/test_read.py", line 171, in test_read_window
    with rasterio.open('tests/data/RGB.byte.tif') as s:
  File "/usr/src/RPM/BUILD/python3-module-rasterio-1.1.8/rasterio/env.py", line 433, in wrapper
    return f(*args, **kwds)
  File "/usr/src/RPM/BUILD/python3-module-rasterio-1.1.8/rasterio/__init__.py", line 221, in open
    s = DatasetReader(path, driver=driver, sharing=sharing, **kwargs)
  File "rasterio/_base.pyx", line 218, in rasterio._base.DatasetBase.__init__
rasterio.errors.RasterioIOError: tests/data/RGB.byte.tif: No such file or directory

======================================================================
ERROR: test_read_window_beyond (tests.test_read.ReaderContextTest)
Test graceful Numpy-like handling of windows beyond
----------------------------------------------------------------------
Traceback (most recent call last):
  File "rasterio/_base.pyx", line 216, in rasterio._base.DatasetBase.__init__
  File "rasterio/_shim.pyx", line 78, in rasterio._shim.open_dataset
  File "rasterio/_err.pyx", line 213, in rasterio._err.exc_wrap_pointer
rasterio._err.CPLE_OpenFailedError: tests/data/RGB.byte.tif: No such file or directory

During handling of the above exception, another exception occurred:

Traceback (most recent call last):
  File "/usr/src/RPM/BUILD/python3-module-rasterio-1.1.8/tests/test_read.py", line 202, in test_read_window_beyond
    with rasterio.open('tests/data/RGB.byte.tif') as s:
  File "/usr/src/RPM/BUILD/python3-module-rasterio-1.1.8/rasterio/env.py", line 433, in wrapper
    return f(*args, **kwds)
  File "/usr/src/RPM/BUILD/python3-module-rasterio-1.1.8/rasterio/__init__.py", line 221, in open
    s = DatasetReader(path, driver=driver, sharing=sharing, **kwargs)
  File "rasterio/_base.pyx", line 218, in rasterio._base.DatasetBase.__init__
rasterio.errors.RasterioIOError: tests/data/RGB.byte.tif: No such file or directory

======================================================================
ERROR: test_read_window_overflow (tests.test_read.ReaderContextTest)
Test graceful Numpy-like handling of windows that overflow
----------------------------------------------------------------------
Traceback (most recent call last):
  File "rasterio/_base.pyx", line 216, in rasterio._base.DatasetBase.__init__
  File "rasterio/_shim.pyx", line 78, in rasterio._shim.open_dataset
  File "rasterio/_err.pyx", line 213, in rasterio._err.exc_wrap_pointer
rasterio._err.CPLE_OpenFailedError: tests/data/RGB.byte.tif: No such file or directory

During handling of the above exception, another exception occurred:

Traceback (most recent call last):
  File "/usr/src/RPM/BUILD/python3-module-rasterio-1.1.8/tests/test_read.py", line 195, in test_read_window_overflow
    with rasterio.open('tests/data/RGB.byte.tif') as s:
  File "/usr/src/RPM/BUILD/python3-module-rasterio-1.1.8/rasterio/env.py", line 433, in wrapper
    return f(*args, **kwds)
  File "/usr/src/RPM/BUILD/python3-module-rasterio-1.1.8/rasterio/__init__.py", line 221, in open
    s = DatasetReader(path, driver=driver, sharing=sharing, **kwargs)
  File "rasterio/_base.pyx", line 218, in rasterio._base.DatasetBase.__init__
rasterio.errors.RasterioIOError: tests/data/RGB.byte.tif: No such file or directory

======================================================================
ERROR: test_read_window_overlap (tests.test_read.ReaderContextTest)
Test graceful Numpy-like handling of windows beyond
----------------------------------------------------------------------
Traceback (most recent call last):
  File "rasterio/_base.pyx", line 216, in rasterio._base.DatasetBase.__init__
  File "rasterio/_shim.pyx", line 78, in rasterio._shim.open_dataset
  File "rasterio/_err.pyx", line 213, in rasterio._err.exc_wrap_pointer
rasterio._err.CPLE_OpenFailedError: tests/data/RGB.byte.tif: No such file or directory

During handling of the above exception, another exception occurred:

Traceback (most recent call last):
  File "/usr/src/RPM/BUILD/python3-module-rasterio-1.1.8/tests/test_read.py", line 209, in test_read_window_overlap
    with rasterio.open('tests/data/RGB.byte.tif') as s:
  File "/usr/src/RPM/BUILD/python3-module-rasterio-1.1.8/rasterio/env.py", line 433, in wrapper
    return f(*args, **kwds)
  File "/usr/src/RPM/BUILD/python3-module-rasterio-1.1.8/rasterio/__init__.py", line 221, in open
    s = DatasetReader(path, driver=driver, sharing=sharing, **kwargs)
  File "rasterio/_base.pyx", line 218, in rasterio._base.DatasetBase.__init__
rasterio.errors.RasterioIOError: tests/data/RGB.byte.tif: No such file or directory

======================================================================
ERROR: test_overviews (unittest.loader._FailedTest)
----------------------------------------------------------------------
ImportError: Failed to import test module: test_overviews
Traceback (most recent call last):
  File "/usr/lib/python3.7/unittest/loader.py", line 154, in loadTestsFromName
    module = __import__(module_name)
  File "/usr/src/RPM/BUILD/python3-module-rasterio-1.1.8/tests/test_overviews.py", line 5, in <module>
    from .conftest import requires_gdal2
  File "/usr/src/RPM/BUILD/python3-module-rasterio-1.1.8/tests/conftest.py", line 13, in <module>
    from click.testing import CliRunner
ModuleNotFoundError: No module named 'click.testing'


======================================================================
ERROR: test_open_sharing (unittest.loader._FailedTest)
----------------------------------------------------------------------
ImportError: Failed to import test module: test_open_sharing
Traceback (most recent call last):
  File "/usr/lib/python3.7/unittest/loader.py", line 154, in loadTestsFromName
    module = __import__(module_name)
  File "/usr/src/RPM/BUILD/python3-module-rasterio-1.1.8/tests/test_open_sharing.py", line 5, in <module>
    from .conftest import requires_gdal2
  File "/usr/src/RPM/BUILD/python3-module-rasterio-1.1.8/tests/conftest.py", line 13, in <module>
    from click.testing import CliRunner
ModuleNotFoundError: No module named 'click.testing'


======================================================================
ERROR: test_open_overview_level (unittest.loader._FailedTest)
----------------------------------------------------------------------
ImportError: Failed to import test module: test_open_overview_level
Traceback (most recent call last):
  File "/usr/lib/python3.7/unittest/loader.py", line 154, in loadTestsFromName
    module = __import__(module_name)
  File "/usr/src/RPM/BUILD/python3-module-rasterio-1.1.8/tests/test_open_overview_level.py", line 5, in <module>
    from .conftest import requires_gdal2
  File "/usr/src/RPM/BUILD/python3-module-rasterio-1.1.8/tests/conftest.py", line 13, in <module>
    from click.testing import CliRunner
ModuleNotFoundError: No module named 'click.testing'


======================================================================
ERROR: test_open_options (unittest.loader._FailedTest)
----------------------------------------------------------------------
ImportError: Failed to import test module: test_open_options
Traceback (most recent call last):
  File "/usr/lib/python3.7/unittest/loader.py", line 154, in loadTestsFromName
    module = __import__(module_name)
  File "/usr/src/RPM/BUILD/python3-module-rasterio-1.1.8/tests/test_open_options.py", line 8, in <module>
    from .conftest import requires_only_gdal1, requires_gdal2, requires_gdal22
  File "/usr/src/RPM/BUILD/python3-module-rasterio-1.1.8/tests/conftest.py", line 13, in <module>
    from click.testing import CliRunner
ModuleNotFoundError: No module named 'click.testing'


======================================================================
ERROR: test_mask (unittest.loader._FailedTest)
----------------------------------------------------------------------
ImportError: Failed to import test module: test_mask
Traceback (most recent call last):
  File "/usr/lib/python3.7/unittest/loader.py", line 154, in loadTestsFromName
    module = __import__(module_name)
  File "/usr/src/RPM/BUILD/python3-module-rasterio-1.1.8/tests/test_mask.py", line 8, in <module>
    from .conftest import MockGeoInterface
  File "/usr/src/RPM/BUILD/python3-module-rasterio-1.1.8/tests/conftest.py", line 13, in <module>
    from click.testing import CliRunner
ModuleNotFoundError: No module named 'click.testing'


======================================================================
ERROR: test_features (unittest.loader._FailedTest)
----------------------------------------------------------------------
ImportError: Failed to import test module: test_features
Traceback (most recent call last):
  File "/usr/lib/python3.7/unittest/loader.py", line 154, in loadTestsFromName
    module = __import__(module_name)
  File "/usr/src/RPM/BUILD/python3-module-rasterio-1.1.8/tests/test_features.py", line 16, in <module>
    from .conftest import MockGeoInterface
  File "/usr/src/RPM/BUILD/python3-module-rasterio-1.1.8/tests/conftest.py", line 13, in <module>
    from click.testing import CliRunner
ModuleNotFoundError: No module named 'click.testing'


======================================================================
ERROR: test_env (unittest.loader._FailedTest)
----------------------------------------------------------------------
ImportError: Failed to import test module: test_env
Traceback (most recent call last):
  File "/usr/lib/python3.7/unittest/loader.py", line 154, in loadTestsFromName
    module = __import__(module_name)
  File "/usr/src/RPM/BUILD/python3-module-rasterio-1.1.8/tests/test_env.py", line 24, in <module>
    from .conftest import requires_gdal21
  File "/usr/src/RPM/BUILD/python3-module-rasterio-1.1.8/tests/conftest.py", line 13, in <module>
    from click.testing import CliRunner
ModuleNotFoundError: No module named 'click.testing'


======================================================================
ERROR: test_dataset_mask (unittest.loader._FailedTest)
----------------------------------------------------------------------
ImportError: Failed to import test module: test_dataset_mask
Traceback (most recent call last):
  File "/usr/lib/python3.7/unittest/loader.py", line 154, in loadTestsFromName
    module = __import__(module_name)
  File "/usr/src/RPM/BUILD/python3-module-rasterio-1.1.8/tests/test_dataset_mask.py", line 21, in <module>
    from .conftest import requires_gdal2
  File "/usr/src/RPM/BUILD/python3-module-rasterio-1.1.8/tests/conftest.py", line 13, in <module>
    from click.testing import CliRunner
ModuleNotFoundError: No module named 'click.testing'


======================================================================
ERROR: test_data_paths (unittest.loader._FailedTest)
----------------------------------------------------------------------
ImportError: Failed to import test module: test_data_paths
Traceback (most recent call last):
  File "/usr/lib/python3.7/unittest/loader.py", line 154, in loadTestsFromName
    module = __import__(module_name)
  File "/usr/src/RPM/BUILD/python3-module-rasterio-1.1.8/tests/test_data_paths.py", line 5, in <module>
    from click.testing import CliRunner
ModuleNotFoundError: No module named 'click.testing'


======================================================================
ERROR: test_crs (unittest.loader._FailedTest)
----------------------------------------------------------------------
ImportError: Failed to import test module: test_crs
Traceback (most recent call last):
  File "/usr/lib/python3.7/unittest/loader.py", line 154, in loadTestsFromName
    module = __import__(module_name)
  File "/usr/src/RPM/BUILD/python3-module-rasterio-1.1.8/tests/test_crs.py", line 18, in <module>
    from .conftest import requires_gdal21, requires_gdal22, requires_gdal_lt_3, requires_gdal3
  File "/usr/src/RPM/BUILD/python3-module-rasterio-1.1.8/tests/conftest.py", line 13, in <module>
    from click.testing import CliRunner
ModuleNotFoundError: No module named 'click.testing'


======================================================================
ERROR: test_creation_options (unittest.loader._FailedTest)
----------------------------------------------------------------------
ImportError: Failed to import test module: test_creation_options
Traceback (most recent call last):
  File "/usr/lib/python3.7/unittest/loader.py", line 154, in loadTestsFromName
    module = __import__(module_name)
  File "/usr/src/RPM/BUILD/python3-module-rasterio-1.1.8/tests/test_creation_options.py", line 8, in <module>
    from .conftest import requires_gdal2
  File "/usr/src/RPM/BUILD/python3-module-rasterio-1.1.8/tests/conftest.py", line 13, in <module>
    from click.testing import CliRunner
ModuleNotFoundError: No module named 'click.testing'


======================================================================
ERROR: test_colorinterp (unittest.loader._FailedTest)
----------------------------------------------------------------------
ImportError: Failed to import test module: test_colorinterp
Traceback (most recent call last):
  File "/usr/lib/python3.7/unittest/loader.py", line 154, in loadTestsFromName
    module = __import__(module_name)
  File "/usr/src/RPM/BUILD/python3-module-rasterio-1.1.8/tests/test_colorinterp.py", line 8, in <module>
    from .conftest import requires_gdal22
  File "/usr/src/RPM/BUILD/python3-module-rasterio-1.1.8/tests/conftest.py", line 13, in <module>
    from click.testing import CliRunner
ModuleNotFoundError: No module named 'click.testing'


======================================================================
ERROR: test_cli_main (unittest.loader._FailedTest)
----------------------------------------------------------------------
ImportError: Failed to import test module: test_cli_main
Traceback (most recent call last):
  File "/usr/lib/python3.7/unittest/loader.py", line 154, in loadTestsFromName
    module = __import__(module_name)
  File "/usr/src/RPM/BUILD/python3-module-rasterio-1.1.8/tests/test_cli_main.py", line 3, in <module>
    from click.testing import CliRunner
ModuleNotFoundError: No module named 'click.testing'


======================================================================
ERROR: test_boundless_read (unittest.loader._FailedTest)
----------------------------------------------------------------------
ImportError: Failed to import test module: test_boundless_read
Traceback (most recent call last):
  File "/usr/lib/python3.7/unittest/loader.py", line 154, in loadTestsFromName
    module = __import__(module_name)
  File "/usr/src/RPM/BUILD/python3-module-rasterio-1.1.8/tests/test_boundless_read.py", line 3, in <module>
    from hypothesis import given
ModuleNotFoundError: No module named 'hypothesis'


======================================================================
ERROR: test_blocks (unittest.loader._FailedTest)
----------------------------------------------------------------------
ImportError: Failed to import test module: test_blocks
Traceback (most recent call last):
  File "/usr/lib/python3.7/unittest/loader.py", line 154, in loadTestsFromName
    module = __import__(module_name)
  File "/usr/src/RPM/BUILD/python3-module-rasterio-1.1.8/tests/test_blocks.py", line 16, in <module>
    from .conftest import requires_gdal2
  File "/usr/src/RPM/BUILD/python3-module-rasterio-1.1.8/tests/conftest.py", line 13, in <module>
    from click.testing import CliRunner
ModuleNotFoundError: No module named 'click.testing'


======================================================================
ERROR: test__env (unittest.loader._FailedTest)
----------------------------------------------------------------------
ImportError: Failed to import test module: test__env
Traceback (most recent call last):
  File "/usr/lib/python3.7/unittest/loader.py", line 154, in loadTestsFromName
    module = __import__(module_name)
  File "/usr/src/RPM/BUILD/python3-module-rasterio-1.1.8/tests/test__env.py", line 7, in <module>
    from .conftest import gdal_version, requires_gdal_lt_3
  File "/usr/src/RPM/BUILD/python3-module-rasterio-1.1.8/tests/conftest.py", line 13, in <module>
    from click.testing import CliRunner
ModuleNotFoundError: No module named 'click.testing'


======================================================================
ERROR: test__crs (unittest.loader._FailedTest)
----------------------------------------------------------------------
ImportError: Failed to import test module: test__crs
Traceback (most recent call last):
  File "/usr/lib/python3.7/unittest/loader.py", line 154, in loadTestsFromName
    module = __import__(module_name)
  File "/usr/src/RPM/BUILD/python3-module-rasterio-1.1.8/tests/test__crs.py", line 15, in <module>
    from .conftest import requires_gdal21, requires_gdal22, requires_gdal_lt_3
  File "/usr/src/RPM/BUILD/python3-module-rasterio-1.1.8/tests/conftest.py", line 13, in <module>
    from click.testing import CliRunner
ModuleNotFoundError: No module named 'click.testing'


======================================================================
ERROR: conftest (unittest.loader._FailedTest)
----------------------------------------------------------------------
ImportError: Failed to import test module: conftest
Traceback (most recent call last):
  File "/usr/lib/python3.7/unittest/loader.py", line 154, in loadTestsFromName
    module = __import__(module_name)
  File "/usr/src/RPM/BUILD/python3-module-rasterio-1.1.8/tests/conftest.py", line 13, in <module>
    from click.testing import CliRunner
ModuleNotFoundError: No module named 'click.testing'


======================================================================
ERROR: tests.test__crs (unittest.loader._FailedTest)
----------------------------------------------------------------------
ImportError: Failed to import test module: tests.test__crs
Traceback (most recent call last):
  File "/usr/lib/python3.7/unittest/loader.py", line 436, in _find_test_path
    module = self._get_module_from_name(name)
  File "/usr/lib/python3.7/unittest/loader.py", line 377, in _get_module_from_name
    __import__(name)
  File "/usr/src/RPM/BUILD/python3-module-rasterio-1.1.8/tests/test__crs.py", line 15, in <module>
    from .conftest import requires_gdal21, requires_gdal22, requires_gdal_lt_3
  File "/usr/src/RPM/BUILD/python3-module-rasterio-1.1.8/tests/conftest.py", line 13, in <module>
    from click.testing import CliRunner
ModuleNotFoundError: No module named 'click.testing'


======================================================================
ERROR: tests.test__env (unittest.loader._FailedTest)
----------------------------------------------------------------------
ImportError: Failed to import test module: tests.test__env
Traceback (most recent call last):
  File "/usr/lib/python3.7/unittest/loader.py", line 436, in _find_test_path
    module = self._get_module_from_name(name)
  File "/usr/lib/python3.7/unittest/loader.py", line 377, in _get_module_from_name
    __import__(name)
  File "/usr/src/RPM/BUILD/python3-module-rasterio-1.1.8/tests/test__env.py", line 7, in <module>
    from .conftest import gdal_version, requires_gdal_lt_3
  File "/usr/src/RPM/BUILD/python3-module-rasterio-1.1.8/tests/conftest.py", line 13, in <module>
    from click.testing import CliRunner
ModuleNotFoundError: No module named 'click.testing'


======================================================================
ERROR: tests.test_blocks (unittest.loader._FailedTest)
----------------------------------------------------------------------
ImportError: Failed to import test module: tests.test_blocks
Traceback (most recent call last):
  File "/usr/lib/python3.7/unittest/loader.py", line 436, in _find_test_path
    module = self._get_module_from_name(name)
  File "/usr/lib/python3.7/unittest/loader.py", line 377, in _get_module_from_name
    __import__(name)
  File "/usr/src/RPM/BUILD/python3-module-rasterio-1.1.8/tests/test_blocks.py", line 16, in <module>
    from .conftest import requires_gdal2
  File "/usr/src/RPM/BUILD/python3-module-rasterio-1.1.8/tests/conftest.py", line 13, in <module>
    from click.testing import CliRunner
ModuleNotFoundError: No module named 'click.testing'


======================================================================
ERROR: tests.test_boundless_read (unittest.loader._FailedTest)
----------------------------------------------------------------------
ImportError: Failed to import test module: tests.test_boundless_read
Traceback (most recent call last):
  File "/usr/lib/python3.7/unittest/loader.py", line 436, in _find_test_path
    module = self._get_module_from_name(name)
  File "/usr/lib/python3.7/unittest/loader.py", line 377, in _get_module_from_name
    __import__(name)
  File "/usr/src/RPM/BUILD/python3-module-rasterio-1.1.8/tests/test_boundless_read.py", line 3, in <module>
    from hypothesis import given
ModuleNotFoundError: No module named 'hypothesis'


======================================================================
ERROR: tests.test_cli_main (unittest.loader._FailedTest)
----------------------------------------------------------------------
ImportError: Failed to import test module: tests.test_cli_main
Traceback (most recent call last):
  File "/usr/lib/python3.7/unittest/loader.py", line 436, in _find_test_path
    module = self._get_module_from_name(name)
  File "/usr/lib/python3.7/unittest/loader.py", line 377, in _get_module_from_name
    __import__(name)
  File "/usr/src/RPM/BUILD/python3-module-rasterio-1.1.8/tests/test_cli_main.py", line 3, in <module>
    from click.testing import CliRunner
ModuleNotFoundError: No module named 'click.testing'


======================================================================
ERROR: tests.test_colorinterp (unittest.loader._FailedTest)
----------------------------------------------------------------------
ImportError: Failed to import test module: tests.test_colorinterp
Traceback (most recent call last):
  File "/usr/lib/python3.7/unittest/loader.py", line 436, in _find_test_path
    module = self._get_module_from_name(name)
  File "/usr/lib/python3.7/unittest/loader.py", line 377, in _get_module_from_name
    __import__(name)
  File "/usr/src/RPM/BUILD/python3-module-rasterio-1.1.8/tests/test_colorinterp.py", line 8, in <module>
    from .conftest import requires_gdal22
  File "/usr/src/RPM/BUILD/python3-module-rasterio-1.1.8/tests/conftest.py", line 13, in <module>
    from click.testing import CliRunner
ModuleNotFoundError: No module named 'click.testing'


======================================================================
ERROR: tests.test_creation_options (unittest.loader._FailedTest)
----------------------------------------------------------------------
ImportError: Failed to import test module: tests.test_creation_options
Traceback (most recent call last):
  File "/usr/lib/python3.7/unittest/loader.py", line 436, in _find_test_path
    module = self._get_module_from_name(name)
  File "/usr/lib/python3.7/unittest/loader.py", line 377, in _get_module_from_name
    __import__(name)
  File "/usr/src/RPM/BUILD/python3-module-rasterio-1.1.8/tests/test_creation_options.py", line 8, in <module>
    from .conftest import requires_gdal2
  File "/usr/src/RPM/BUILD/python3-module-rasterio-1.1.8/tests/conftest.py", line 13, in <module>
    from click.testing import CliRunner
ModuleNotFoundError: No module named 'click.testing'


======================================================================
ERROR: tests.test_crs (unittest.loader._FailedTest)
----------------------------------------------------------------------
ImportError: Failed to import test module: tests.test_crs
Traceback (most recent call last):
  File "/usr/lib/python3.7/unittest/loader.py", line 436, in _find_test_path
    module = self._get_module_from_name(name)
  File "/usr/lib/python3.7/unittest/loader.py", line 377, in _get_module_from_name
    __import__(name)
  File "/usr/src/RPM/BUILD/python3-module-rasterio-1.1.8/tests/test_crs.py", line 18, in <module>
    from .conftest import requires_gdal21, requires_gdal22, requires_gdal_lt_3, requires_gdal3
  File "/usr/src/RPM/BUILD/python3-module-rasterio-1.1.8/tests/conftest.py", line 13, in <module>
    from click.testing import CliRunner
ModuleNotFoundError: No module named 'click.testing'


======================================================================
ERROR: tests.test_data_paths (unittest.loader._FailedTest)
----------------------------------------------------------------------
ImportError: Failed to import test module: tests.test_data_paths
Traceback (most recent call last):
  File "/usr/lib/python3.7/unittest/loader.py", line 436, in _find_test_path
    module = self._get_module_from_name(name)
  File "/usr/lib/python3.7/unittest/loader.py", line 377, in _get_module_from_name
    __import__(name)
  File "/usr/src/RPM/BUILD/python3-module-rasterio-1.1.8/tests/test_data_paths.py", line 5, in <module>
    from click.testing import CliRunner
ModuleNotFoundError: No module named 'click.testing'


======================================================================
ERROR: tests.test_dataset_mask (unittest.loader._FailedTest)
----------------------------------------------------------------------
ImportError: Failed to import test module: tests.test_dataset_mask
Traceback (most recent call last):
  File "/usr/lib/python3.7/unittest/loader.py", line 436, in _find_test_path
    module = self._get_module_from_name(name)
  File "/usr/lib/python3.7/unittest/loader.py", line 377, in _get_module_from_name
    __import__(name)
  File "/usr/src/RPM/BUILD/python3-module-rasterio-1.1.8/tests/test_dataset_mask.py", line 21, in <module>
    from .conftest import requires_gdal2
  File "/usr/src/RPM/BUILD/python3-module-rasterio-1.1.8/tests/conftest.py", line 13, in <module>
    from click.testing import CliRunner
ModuleNotFoundError: No module named 'click.testing'


======================================================================
ERROR: tests.test_env (unittest.loader._FailedTest)
----------------------------------------------------------------------
ImportError: Failed to import test module: tests.test_env
Traceback (most recent call last):
  File "/usr/lib/python3.7/unittest/loader.py", line 436, in _find_test_path
    module = self._get_module_from_name(name)
  File "/usr/lib/python3.7/unittest/loader.py", line 377, in _get_module_from_name
    __import__(name)
  File "/usr/src/RPM/BUILD/python3-module-rasterio-1.1.8/tests/test_env.py", line 24, in <module>
    from .conftest import requires_gdal21
  File "/usr/src/RPM/BUILD/python3-module-rasterio-1.1.8/tests/conftest.py", line 13, in <module>
    from click.testing import CliRunner
ModuleNotFoundError: No module named 'click.testing'


======================================================================
ERROR: tests.test_features (unittest.loader._FailedTest)
----------------------------------------------------------------------
ImportError: Failed to import test module: tests.test_features
Traceback (most recent call last):
  File "/usr/lib/python3.7/unittest/loader.py", line 436, in _find_test_path
    module = self._get_module_from_name(name)
  File "/usr/lib/python3.7/unittest/loader.py", line 377, in _get_module_from_name
    __import__(name)
  File "/usr/src/RPM/BUILD/python3-module-rasterio-1.1.8/tests/test_features.py", line 16, in <module>
    from .conftest import MockGeoInterface
  File "/usr/src/RPM/BUILD/python3-module-rasterio-1.1.8/tests/conftest.py", line 13, in <module>
    from click.testing import CliRunner
ModuleNotFoundError: No module named 'click.testing'


======================================================================
ERROR: tests.test_mask (unittest.loader._FailedTest)
----------------------------------------------------------------------
ImportError: Failed to import test module: tests.test_mask
Traceback (most recent call last):
  File "/usr/lib/python3.7/unittest/loader.py", line 436, in _find_test_path
    module = self._get_module_from_name(name)
  File "/usr/lib/python3.7/unittest/loader.py", line 377, in _get_module_from_name
    __import__(name)
  File "/usr/src/RPM/BUILD/python3-module-rasterio-1.1.8/tests/test_mask.py", line 8, in <module>
    from .conftest import MockGeoInterface
  File "/usr/src/RPM/BUILD/python3-module-rasterio-1.1.8/tests/conftest.py", line 13, in <module>
    from click.testing import CliRunner
ModuleNotFoundError: No module named 'click.testing'


======================================================================
ERROR: tests.test_open_options (unittest.loader._FailedTest)
----------------------------------------------------------------------
ImportError: Failed to import test module: tests.test_open_options
Traceback (most recent call last):
  File "/usr/lib/python3.7/unittest/loader.py", line 436, in _find_test_path
    module = self._get_module_from_name(name)
  File "/usr/lib/python3.7/unittest/loader.py", line 377, in _get_module_from_name
    __import__(name)
  File "/usr/src/RPM/BUILD/python3-module-rasterio-1.1.8/tests/test_open_options.py", line 8, in <module>
    from .conftest import requires_only_gdal1, requires_gdal2, requires_gdal22
  File "/usr/src/RPM/BUILD/python3-module-rasterio-1.1.8/tests/conftest.py", line 13, in <module>
    from click.testing import CliRunner
ModuleNotFoundError: No module named 'click.testing'


======================================================================
ERROR: tests.test_open_overview_level (unittest.loader._FailedTest)
----------------------------------------------------------------------
ImportError: Failed to import test module: tests.test_open_overview_level
Traceback (most recent call last):
  File "/usr/lib/python3.7/unittest/loader.py", line 436, in _find_test_path
    module = self._get_module_from_name(name)
  File "/usr/lib/python3.7/unittest/loader.py", line 377, in _get_module_from_name
    __import__(name)
  File "/usr/src/RPM/BUILD/python3-module-rasterio-1.1.8/tests/test_open_overview_level.py", line 5, in <module>
    from .conftest import requires_gdal2
  File "/usr/src/RPM/BUILD/python3-module-rasterio-1.1.8/tests/conftest.py", line 13, in <module>
    from click.testing import CliRunner
ModuleNotFoundError: No module named 'click.testing'


======================================================================
ERROR: tests.test_open_sharing (unittest.loader._FailedTest)
----------------------------------------------------------------------
ImportError: Failed to import test module: tests.test_open_sharing
Traceback (most recent call last):
  File "/usr/lib/python3.7/unittest/loader.py", line 436, in _find_test_path
    module = self._get_module_from_name(name)
  File "/usr/lib/python3.7/unittest/loader.py", line 377, in _get_module_from_name
    __import__(name)
  File "/usr/src/RPM/BUILD/python3-module-rasterio-1.1.8/tests/test_open_sharing.py", line 5, in <module>
    from .conftest import requires_gdal2
  File "/usr/src/RPM/BUILD/python3-module-rasterio-1.1.8/tests/conftest.py", line 13, in <module>
    from click.testing import CliRunner
ModuleNotFoundError: No module named 'click.testing'


======================================================================
ERROR: tests.test_overviews (unittest.loader._FailedTest)
----------------------------------------------------------------------
ImportError: Failed to import test module: tests.test_overviews
Traceback (most recent call last):
  File "/usr/lib/python3.7/unittest/loader.py", line 436, in _find_test_path
    module = self._get_module_from_name(name)
  File "/usr/lib/python3.7/unittest/loader.py", line 377, in _get_module_from_name
    __import__(name)
  File "/usr/src/RPM/BUILD/python3-module-rasterio-1.1.8/tests/test_overviews.py", line 5, in <module>
    from .conftest import requires_gdal2
  File "/usr/src/RPM/BUILD/python3-module-rasterio-1.1.8/tests/conftest.py", line 13, in <module>
    from click.testing import CliRunner
ModuleNotFoundError: No module named 'click.testing'


======================================================================
ERROR: tests.test_read_resample (unittest.loader._FailedTest)
----------------------------------------------------------------------
ImportError: Failed to import test module: tests.test_read_resample
Traceback (most recent call last):
  File "/usr/lib/python3.7/unittest/loader.py", line 436, in _find_test_path
    module = self._get_module_from_name(name)
  File "/usr/lib/python3.7/unittest/loader.py", line 377, in _get_module_from_name
    __import__(name)
  File "/usr/src/RPM/BUILD/python3-module-rasterio-1.1.8/tests/test_read_resample.py", line 14, in <module>
    from .conftest import requires_gdal2
  File "/usr/src/RPM/BUILD/python3-module-rasterio-1.1.8/tests/conftest.py", line 13, in <module>
    from click.testing import CliRunner
ModuleNotFoundError: No module named 'click.testing'


======================================================================
ERROR: tests.test_rio_calc (unittest.loader._FailedTest)
----------------------------------------------------------------------
ImportError: Failed to import test module: tests.test_rio_calc
Traceback (most recent call last):
  File "/usr/lib/python3.7/unittest/loader.py", line 436, in _find_test_path
    module = self._get_module_from_name(name)
  File "/usr/lib/python3.7/unittest/loader.py", line 377, in _get_module_from_name
    __import__(name)
  File "/usr/src/RPM/BUILD/python3-module-rasterio-1.1.8/tests/test_rio_calc.py", line 1, in <module>
    from click.testing import CliRunner
ModuleNotFoundError: No module named 'click.testing'


======================================================================
ERROR: tests.test_rio_convert (unittest.loader._FailedTest)
----------------------------------------------------------------------
ImportError: Failed to import test module: tests.test_rio_convert
Traceback (most recent call last):
  File "/usr/lib/python3.7/unittest/loader.py", line 436, in _find_test_path
    module = self._get_module_from_name(name)
  File "/usr/lib/python3.7/unittest/loader.py", line 377, in _get_module_from_name
    __import__(name)
  File "/usr/src/RPM/BUILD/python3-module-rasterio-1.1.8/tests/test_rio_convert.py", line 3, in <module>
    from click.testing import CliRunner
ModuleNotFoundError: No module named 'click.testing'


======================================================================
ERROR: tests.test_rio_edit_info (unittest.loader._FailedTest)
----------------------------------------------------------------------
ImportError: Failed to import test module: tests.test_rio_edit_info
Traceback (most recent call last):
  File "/usr/lib/python3.7/unittest/loader.py", line 436, in _find_test_path
    module = self._get_module_from_name(name)
  File "/usr/lib/python3.7/unittest/loader.py", line 377, in _get_module_from_name
    __import__(name)
  File "/usr/src/RPM/BUILD/python3-module-rasterio-1.1.8/tests/test_rio_edit_info.py", line 7, in <module>
    from click.testing import CliRunner
ModuleNotFoundError: No module named 'click.testing'


======================================================================
ERROR: tests.test_rio_gcp (unittest.loader._FailedTest)
----------------------------------------------------------------------
ImportError: Failed to import test module: tests.test_rio_gcp
Traceback (most recent call last):
  File "/usr/lib/python3.7/unittest/loader.py", line 436, in _find_test_path
    module = self._get_module_from_name(name)
  File "/usr/lib/python3.7/unittest/loader.py", line 377, in _get_module_from_name
    __import__(name)
  File "/usr/src/RPM/BUILD/python3-module-rasterio-1.1.8/tests/test_rio_gcp.py", line 5, in <module>
    from click.testing import CliRunner
ModuleNotFoundError: No module named 'click.testing'


======================================================================
ERROR: tests.test_rio_info (unittest.loader._FailedTest)
----------------------------------------------------------------------
ImportError: Failed to import test module: tests.test_rio_info
Traceback (most recent call last):
  File "/usr/lib/python3.7/unittest/loader.py", line 436, in _find_test_path
    module = self._get_module_from_name(name)
  File "/usr/lib/python3.7/unittest/loader.py", line 377, in _get_module_from_name
    __import__(name)
  File "/usr/src/RPM/BUILD/python3-module-rasterio-1.1.8/tests/test_rio_info.py", line 3, in <module>
    from click.testing import CliRunner
ModuleNotFoundError: No module named 'click.testing'


======================================================================
ERROR: tests.test_rio_main (unittest.loader._FailedTest)
----------------------------------------------------------------------
ImportError: Failed to import test module: tests.test_rio_main
Traceback (most recent call last):
  File "/usr/lib/python3.7/unittest/loader.py", line 436, in _find_test_path
    module = self._get_module_from_name(name)
  File "/usr/lib/python3.7/unittest/loader.py", line 377, in _get_module_from_name
    __import__(name)
  File "/usr/src/RPM/BUILD/python3-module-rasterio-1.1.8/tests/test_rio_main.py", line 4, in <module>
    from click.testing import CliRunner
ModuleNotFoundError: No module named 'click.testing'


======================================================================
ERROR: tests.test_rio_mask (unittest.loader._FailedTest)
----------------------------------------------------------------------
ImportError: Failed to import test module: tests.test_rio_mask
Traceback (most recent call last):
  File "/usr/lib/python3.7/unittest/loader.py", line 436, in _find_test_path
    module = self._get_module_from_name(name)
  File "/usr/lib/python3.7/unittest/loader.py", line 377, in _get_module_from_name
    __import__(name)
  File "/usr/src/RPM/BUILD/python3-module-rasterio-1.1.8/tests/test_rio_mask.py", line 16, in <module>
    from .conftest import requires_gdal22
  File "/usr/src/RPM/BUILD/python3-module-rasterio-1.1.8/tests/conftest.py", line 13, in <module>
    from click.testing import CliRunner
ModuleNotFoundError: No module named 'click.testing'


======================================================================
ERROR: tests.test_rio_merge (unittest.loader._FailedTest)
----------------------------------------------------------------------
ImportError: Failed to import test module: tests.test_rio_merge
Traceback (most recent call last):
  File "/usr/lib/python3.7/unittest/loader.py", line 436, in _find_test_path
    module = self._get_module_from_name(name)
  File "/usr/lib/python3.7/unittest/loader.py", line 377, in _get_module_from_name
    __import__(name)
  File "/usr/src/RPM/BUILD/python3-module-rasterio-1.1.8/tests/test_rio_merge.py", line 9, in <module>
    from click.testing import CliRunner
ModuleNotFoundError: No module named 'click.testing'


======================================================================
ERROR: tests.test_rio_overview (unittest.loader._FailedTest)
----------------------------------------------------------------------
ImportError: Failed to import test module: tests.test_rio_overview
Traceback (most recent call last):
  File "/usr/lib/python3.7/unittest/loader.py", line 436, in _find_test_path
    module = self._get_module_from_name(name)
  File "/usr/lib/python3.7/unittest/loader.py", line 377, in _get_module_from_name
    __import__(name)
  File "/usr/src/RPM/BUILD/python3-module-rasterio-1.1.8/tests/test_rio_overview.py", line 4, in <module>
    from click.testing import CliRunner
ModuleNotFoundError: No module named 'click.testing'


======================================================================
ERROR: tests.test_rio_sample (unittest.loader._FailedTest)
----------------------------------------------------------------------
ImportError: Failed to import test module: tests.test_rio_sample
Traceback (most recent call last):
  File "/usr/lib/python3.7/unittest/loader.py", line 436, in _find_test_path
    module = self._get_module_from_name(name)
  File "/usr/lib/python3.7/unittest/loader.py", line 377, in _get_module_from_name
    __import__(name)
  File "/usr/src/RPM/BUILD/python3-module-rasterio-1.1.8/tests/test_rio_sample.py", line 5, in <module>
    from click.testing import CliRunner
ModuleNotFoundError: No module named 'click.testing'


======================================================================
ERROR: tests.test_rio_stack (unittest.loader._FailedTest)
----------------------------------------------------------------------
ImportError: Failed to import test module: tests.test_rio_stack
Traceback (most recent call last):
  File "/usr/lib/python3.7/unittest/loader.py", line 436, in _find_test_path
    module = self._get_module_from_name(name)
  File "/usr/lib/python3.7/unittest/loader.py", line 377, in _get_module_from_name
    __import__(name)
  File "/usr/src/RPM/BUILD/python3-module-rasterio-1.1.8/tests/test_rio_stack.py", line 1, in <module>
    from click.testing import CliRunner
ModuleNotFoundError: No module named 'click.testing'


======================================================================
ERROR: tests.test_rio_warp (unittest.loader._FailedTest)
----------------------------------------------------------------------
ImportError: Failed to import test module: tests.test_rio_warp
Traceback (most recent call last):
  File "/usr/lib/python3.7/unittest/loader.py", line 436, in _find_test_path
    module = self._get_module_from_name(name)
  File "/usr/lib/python3.7/unittest/loader.py", line 377, in _get_module_from_name
    __import__(name)
  File "/usr/src/RPM/BUILD/python3-module-rasterio-1.1.8/tests/test_rio_warp.py", line 18, in <module>
    from .conftest import requires_gdal_lt_3
  File "/usr/src/RPM/BUILD/python3-module-rasterio-1.1.8/tests/conftest.py", line 13, in <module>
    from click.testing import CliRunner
ModuleNotFoundError: No module named 'click.testing'


======================================================================
ERROR: tests.test_subdatasets (unittest.loader._FailedTest)
----------------------------------------------------------------------
ImportError: Failed to import test module: tests.test_subdatasets
Traceback (most recent call last):
  File "/usr/lib/python3.7/unittest/loader.py", line 436, in _find_test_path
    module = self._get_module_from_name(name)
  File "/usr/lib/python3.7/unittest/loader.py", line 377, in _get_module_from_name
    __import__(name)
  File "/usr/src/RPM/BUILD/python3-module-rasterio-1.1.8/tests/test_subdatasets.py", line 5, in <module>
    from .conftest import requires_gdal21
  File "/usr/src/RPM/BUILD/python3-module-rasterio-1.1.8/tests/conftest.py", line 13, in <module>
    from click.testing import CliRunner
ModuleNotFoundError: No module named 'click.testing'


======================================================================
ERROR: tests.test_tag_item (unittest.loader._FailedTest)
----------------------------------------------------------------------
ImportError: Failed to import test module: tests.test_tag_item
Traceback (most recent call last):
  File "/usr/lib/python3.7/unittest/loader.py", line 436, in _find_test_path
    module = self._get_module_from_name(name)
  File "/usr/lib/python3.7/unittest/loader.py", line 377, in _get_module_from_name
    __import__(name)
  File "/usr/src/RPM/BUILD/python3-module-rasterio-1.1.8/tests/test_tag_item.py", line 7, in <module>
    from .conftest import requires_gdal22
  File "/usr/src/RPM/BUILD/python3-module-rasterio-1.1.8/tests/conftest.py", line 13, in <module>
    from click.testing import CliRunner
ModuleNotFoundError: No module named 'click.testing'


======================================================================
ERROR: tests.test_update (unittest.loader._FailedTest)
----------------------------------------------------------------------
ImportError: Failed to import test module: tests.test_update
Traceback (most recent call last):
  File "/usr/lib/python3.7/unittest/loader.py", line 436, in _find_test_path
    module = self._get_module_from_name(name)
  File "/usr/lib/python3.7/unittest/loader.py", line 377, in _get_module_from_name
    __import__(name)
  File "/usr/src/RPM/BUILD/python3-module-rasterio-1.1.8/tests/test_update.py", line 11, in <module>
    from .conftest import requires_gdal21
  File "/usr/src/RPM/BUILD/python3-module-rasterio-1.1.8/tests/conftest.py", line 13, in <module>
    from click.testing import CliRunner
ModuleNotFoundError: No module named 'click.testing'


======================================================================
ERROR: tests.test_warp (unittest.loader._FailedTest)
----------------------------------------------------------------------
ImportError: Failed to import test module: tests.test_warp
Traceback (most recent call last):
  File "/usr/lib/python3.7/unittest/loader.py", line 436, in _find_test_path
    module = self._get_module_from_name(name)
  File "/usr/lib/python3.7/unittest/loader.py", line 377, in _get_module_from_name
    __import__(name)
  File "/usr/src/RPM/BUILD/python3-module-rasterio-1.1.8/tests/test_warp.py", line 8, in <module>
    from numpy.testing import assert_almost_equal
ModuleNotFoundError: No module named 'numpy.testing'


======================================================================
ERROR: tests.test_warpedvrt (unittest.loader._FailedTest)
----------------------------------------------------------------------
ImportError: Failed to import test module: tests.test_warpedvrt
Traceback (most recent call last):
  File "/usr/lib/python3.7/unittest/loader.py", line 436, in _find_test_path
    module = self._get_module_from_name(name)
  File "/usr/lib/python3.7/unittest/loader.py", line 377, in _get_module_from_name
    __import__(name)
  File "/usr/src/RPM/BUILD/python3-module-rasterio-1.1.8/tests/test_warpedvrt.py", line 22, in <module>
    from .conftest import requires_gdal21, requires_gdal2
  File "/usr/src/RPM/BUILD/python3-module-rasterio-1.1.8/tests/conftest.py", line 13, in <module>
    from click.testing import CliRunner
ModuleNotFoundError: No module named 'click.testing'


======================================================================
ERROR: tests.test_windows (unittest.loader._FailedTest)
----------------------------------------------------------------------
ImportError: Failed to import test module: tests.test_windows
Traceback (most recent call last):
  File "/usr/lib/python3.7/unittest/loader.py", line 436, in _find_test_path
    module = self._get_module_from_name(name)
  File "/usr/lib/python3.7/unittest/loader.py", line 377, in _get_module_from_name
    __import__(name)
  File "/usr/src/RPM/BUILD/python3-module-rasterio-1.1.8/tests/test_windows.py", line 8, in <module>
    from hypothesis import given, assume, settings, HealthCheck
ModuleNotFoundError: No module named 'hypothesis'


======================================================================
ERROR: tests.test_windows_mixins (unittest.loader._FailedTest)
----------------------------------------------------------------------
ImportError: Failed to import test module: tests.test_windows_mixins
Traceback (most recent call last):
  File "/usr/lib/python3.7/unittest/loader.py", line 436, in _find_test_path
    module = self._get_module_from_name(name)
  File "/usr/lib/python3.7/unittest/loader.py", line 377, in _get_module_from_name
    __import__(name)
  File "/usr/src/RPM/BUILD/python3-module-rasterio-1.1.8/tests/test_windows_mixins.py", line 1, in <module>
    from hypothesis import given
ModuleNotFoundError: No module named 'hypothesis'


======================================================================
FAIL: test_multiopen (tests.test_threading.TestThreading)
----------------------------------------------------------------------
Traceback (most recent call last):
  File "/usr/src/RPM/BUILD/python3-module-rasterio-1.1.8/tests/test_threading.py", line 38, in test_multiopen
    assert not exceptions
AssertionError

======================================================================
FAIL: test_reliability (tests.test_threading.TestThreading)
Allow for nondeterminism of race condition
----------------------------------------------------------------------
Traceback (most recent call last):
  File "/usr/src/RPM/BUILD/python3-module-rasterio-1.1.8/tests/test_threading.py", line 43, in test_reliability
    self.test_multiopen()
  File "/usr/src/RPM/BUILD/python3-module-rasterio-1.1.8/tests/test_threading.py", line 38, in test_multiopen
    assert not exceptions
AssertionError

----------------------------------------------------------------------
Ran 93 tests in 0.193s

FAILED (failures=2, errors=91)
Test failed: <unittest.runner.TextTestResult run=93 errors=91 failures=2>
error: Test failed: <unittest.runner.TextTestResult run=93 errors=91 failures=2>
+ :
+ xvfb-run py.test3
_XSERVTransmkdir: Owner of /tmp/.X11-unix should be set to root
The XKEYBOARD keymap compiler (xkbcomp) reports:
> Warning:          Unsupported high keycode 372 for name <I372> ignored
>                   X11 cannot support keycodes above 255.
>                   This warning only shows for the first high keycode.
Errors from xkbcomp are not fatal to the X server
ImportError while loading conftest '/usr/src/RPM/BUILD/python3-module-rasterio-1.1.8/tests/conftest.py'.
tests/conftest.py:13: in <module>
    from click.testing import CliRunner
E   ModuleNotFoundError: No module named 'click.testing'
+ :
+ exit 0
Processing files: python3-module-rasterio-1.1.8-alt3
Executing(%doc): /bin/sh -e /usr/src/tmp/rpm-tmp.85974
+ umask 022
+ /bin/mkdir -p /usr/src/RPM/BUILD
+ cd /usr/src/RPM/BUILD
+ cd python3-module-rasterio-1.1.8
+ DOCDIR=/usr/src/tmp/python3-module-rasterio-buildroot/usr/share/doc/python3-module-rasterio-1.1.8
+ export DOCDIR
+ rm -rf /usr/src/tmp/python3-module-rasterio-buildroot/usr/share/doc/python3-module-rasterio-1.1.8
+ /bin/mkdir -p /usr/src/tmp/python3-module-rasterio-buildroot/usr/share/doc/python3-module-rasterio-1.1.8
+ cp -prL AUTHORS.txt CHANGES.txt LICENSE.txt VERSION.txt README.rst docs/ examples/ /usr/src/tmp/python3-module-rasterio-buildroot/usr/share/doc/python3-module-rasterio-1.1.8
+ chmod -R go-w /usr/src/tmp/python3-module-rasterio-buildroot/usr/share/doc/python3-module-rasterio-1.1.8
+ chmod -R a+rX /usr/src/tmp/python3-module-rasterio-buildroot/usr/share/doc/python3-module-rasterio-1.1.8
+ exit 0
Finding Provides (using /usr/lib/rpm/find-provides)
Executing: /bin/sh -e /usr/src/tmp/rpm-tmp.E4htPJ
find-provides: running scripts (alternatives,debuginfo,lib,pam,perl,pkgconfig,python,python3,shell)
Finding Requires (using /usr/lib/rpm/find-requires)
Executing: /bin/sh -e /usr/src/tmp/rpm-tmp.AWwWbV
find-requires: running scripts (cpp,debuginfo,files,lib,pam,perl,pkgconfig,pkgconfiglib,python,python3,rpmlib,shebang,shell,static,symlinks,systemd-services)
python3.req: /usr/src/tmp/python3-module-rasterio-buildroot/usr/bin/rio: skipping sys
/usr/lib/rpm/python3.req.py: /usr/src/tmp/python3-module-rasterio-buildroot/usr/lib/python3/site-packages/rasterio/__init__.py: line=10 IGNORE (for REQ=slight and deep=8) module=pathlib
/usr/lib/rpm/python3.req.py: /usr/src/tmp/python3-module-rasterio-buildroot/usr/lib/python3/site-packages/rasterio/__init__.py: line=16 IGNORE (for REQ=slight and deep=8) module=logging
/usr/lib/rpm/python3.req.py: /usr/src/tmp/python3-module-rasterio-buildroot/usr/lib/python3/site-packages/rasterio/__init__.py: line=290 IGNORE (for REQ=slight and deep=8) module=numpy
python3.req: /usr/src/tmp/python3-module-rasterio-buildroot/usr/lib/python3/site-packages/rasterio/compat.py: skipping itertools
python3.req: /usr/src/tmp/python3-module-rasterio-buildroot/usr/lib/python3/site-packages/rasterio/compat.py: skipping sys
/usr/lib/rpm/python3.req.py: /usr/src/tmp/python3-module-rasterio-buildroot/usr/lib/python3/site-packages/rasterio/compat.py: line=13 IGNORE (for REQ=slight and deep=8) module=configparser
/usr/lib/rpm/python3.req.py: /usr/src/tmp/python3-module-rasterio-buildroot/usr/lib/python3/site-packages/rasterio/compat.py: line=14 IGNORE (for REQ=slight and deep=8) module=urllib.parse
/usr/lib/rpm/python3.req.py: /usr/src/tmp/python3-module-rasterio-buildroot/usr/lib/python3/site-packages/rasterio/compat.py: line=15 IGNORE (for REQ=slight and deep=8) module=collections
/usr/lib/rpm/python3.req.py: /usr/src/tmp/python3-module-rasterio-buildroot/usr/lib/python3/site-packages/rasterio/compat.py: line=16 IGNORE (for REQ=slight and deep=8) module=collections.abc
/usr/lib/rpm/python3.req.py: /usr/src/tmp/python3-module-rasterio-buildroot/usr/lib/python3/site-packages/rasterio/compat.py: line=17 IGNORE (for REQ=slight and deep=8) module=inspect
/usr/lib/rpm/python3.req.py: /usr/src/tmp/python3-module-rasterio-buildroot/usr/lib/python3/site-packages/rasterio/compat.py: line=18 IGNORE (for REQ=slight and deep=8) module=pathlib
/usr/lib/rpm/python3.req.py: /usr/src/tmp/python3-module-rasterio-buildroot/usr/lib/python3/site-packages/rasterio/compat.py: line=26 IGNORE (for REQ=slight and deep=8) module=ConfigParser
/usr/lib/rpm/python3.req.py: /usr/src/tmp/python3-module-rasterio-buildroot/usr/lib/python3/site-packages/rasterio/compat.py: line=27 IGNORE (for REQ=slight and deep=8) module=urlparse
/usr/lib/rpm/python3.req.py: /usr/src/tmp/python3-module-rasterio-buildroot/usr/lib/python3/site-packages/rasterio/compat.py: line=28 IGNORE (for REQ=slight and deep=8) module=UserDict
/usr/lib/rpm/python3.req.py: /usr/src/tmp/python3-module-rasterio-buildroot/usr/lib/python3/site-packages/rasterio/compat.py: line=29 IGNORE (for REQ=slight and deep=8) module=inspect
/usr/lib/rpm/python3.req.py: /usr/src/tmp/python3-module-rasterio-buildroot/usr/lib/python3/site-packages/rasterio/compat.py: line=30 IGNORE (for REQ=slight and deep=8) module=collections
/usr/lib/rpm/python3.req.py: /usr/src/tmp/python3-module-rasterio-buildroot/usr/lib/python3/site-packages/rasterio/dtypes.py: line=105 IGNORE (for REQ=slight and deep=8) module=numpy
/usr/lib/rpm/python3.req.py: /usr/src/tmp/python3-module-rasterio-buildroot/usr/lib/python3/site-packages/rasterio/dtypes.py: line=134 IGNORE (for REQ=slight and deep=8) module=numpy
/usr/lib/rpm/python3.req.py: /usr/src/tmp/python3-module-rasterio-buildroot/usr/lib/python3/site-packages/rasterio/dtypes.py: line=152 IGNORE (for REQ=slight and deep=8) module=numpy
/usr/lib/rpm/python3.req.py: /usr/src/tmp/python3-module-rasterio-buildroot/usr/lib/python3/site-packages/rasterio/dtypes.py: line=181 IGNORE (for REQ=slight and deep=8) module=numpy
/usr/lib/rpm/python3.req.py: /usr/src/tmp/python3-module-rasterio-buildroot/usr/lib/python3/site-packages/rasterio/env.py: line=496 IGNORE (for REQ=slight and deep=13) module=rasterio._base
python3.req: /usr/src/tmp/python3-module-rasterio-buildroot/usr/lib/python3/site-packages/rasterio/path.py: skipping sys
/usr/lib/rpm/python3.req.py: /usr/src/tmp/python3-module-rasterio-buildroot/usr/lib/python3/site-packages/rasterio/plot.py: line=29 IGNORE (for REQ=slight and deep=12) module=matplotlib.pyplot
/usr/lib/rpm/python3.req.py: /usr/src/tmp/python3-module-rasterio-buildroot/usr/lib/python3/site-packages/rasterio/rio/bounds.py: line=11 possible relative import from ., UNIMPLEMENTED
/usr/lib/rpm/python3.req.py: /usr/src/tmp/python3-module-rasterio-buildroot/usr/lib/python3/site-packages/rasterio/rio/bounds.py: line=49 IGNORE (for REQ=slight and deep=9) module=rasterio.warp
/usr/lib/rpm/python3.req.py: /usr/src/tmp/python3-module-rasterio-buildroot/usr/lib/python3/site-packages/rasterio/rio/calc.py: line=138 IGNORE (for REQ=slight and deep=9) module=numpy
/usr/lib/rpm/python3.req.py: /usr/src/tmp/python3-module-rasterio-buildroot/usr/lib/python3/site-packages/rasterio/rio/clip.py: line=8 possible relative import from ., UNIMPLEMENTED
/usr/lib/rpm/python3.req.py: /usr/src/tmp/python3-module-rasterio-buildroot/usr/lib/python3/site-packages/rasterio/rio/clip.py: line=9 possible relative import from ., UNIMPLEMENTED
/usr/lib/rpm/python3.req.py: /usr/src/tmp/python3-module-rasterio-buildroot/usr/lib/python3/site-packages/rasterio/rio/clip.py: line=91 IGNORE (for REQ=slight and deep=9) module=rasterio.warp
/usr/lib/rpm/python3.req.py: /usr/src/tmp/python3-module-rasterio-buildroot/usr/lib/python3/site-packages/rasterio/rio/edit_info.py: line=167 IGNORE (for REQ=slight and deep=9) module=numpy
python3.req: /usr/src/tmp/python3-module-rasterio-buildroot/usr/lib/python3/site-packages/rasterio/rio/insp.py: skipping sys
/usr/lib/rpm/python3.req.py: /usr/src/tmp/python3-module-rasterio-buildroot/usr/lib/python3/site-packages/rasterio/rio/insp.py: line=13 possible relative import from ., UNIMPLEMENTED
/usr/lib/rpm/python3.req.py: /usr/src/tmp/python3-module-rasterio-buildroot/usr/lib/python3/site-packages/rasterio/rio/insp.py: line=18 IGNORE (for REQ=slight and deep=8) module=matplotlib.pyplot
/usr/lib/rpm/python3.req.py: /usr/src/tmp/python3-module-rasterio-buildroot/usr/lib/python3/site-packages/rasterio/rio/insp.py: line=52 IGNORE (for REQ=slight and deep=12) module=IPython
python3.req: /usr/src/tmp/python3-module-rasterio-buildroot/usr/lib/python3/site-packages/rasterio/rio/main.py: skipping sys
/usr/lib/rpm/python3.req.py: /usr/src/tmp/python3-module-rasterio-buildroot/usr/lib/python3/site-packages/rasterio/rio/main.py: line=42 possible relative import from ., UNIMPLEMENTED
/usr/lib/rpm/python3.req.py: /usr/src/tmp/python3-module-rasterio-buildroot/usr/lib/python3/site-packages/rasterio/rio/mask.py: line=7 possible relative import from ., UNIMPLEMENTED
/usr/lib/rpm/python3.req.py: /usr/src/tmp/python3-module-rasterio-buildroot/usr/lib/python3/site-packages/rasterio/rio/mask.py: line=8 possible relative import from ., UNIMPLEMENTED
/usr/lib/rpm/python3.req.py: /usr/src/tmp/python3-module-rasterio-buildroot/usr/lib/python3/site-packages/rasterio/rio/merge.py: line=52 IGNORE (for REQ=slight and deep=9) module=rasterio.merge
/usr/lib/rpm/python3.req.py: /usr/src/tmp/python3-module-rasterio-buildroot/usr/lib/python3/site-packages/rasterio/rio/overview.py: line=10 possible relative import from ., UNIMPLEMENTED
/usr/lib/rpm/python3.req.py: /usr/src/tmp/python3-module-rasterio-buildroot/usr/lib/python3/site-packages/rasterio/rio/rasterize.py: line=122 IGNORE (for REQ=slight and deep=9) module=rasterio.crs
/usr/lib/rpm/python3.req.py: /usr/src/tmp/python3-module-rasterio-buildroot/usr/lib/python3/site-packages/rasterio/rio/rasterize.py: line=123 IGNORE (for REQ=slight and deep=9) module=rasterio.features
/usr/lib/rpm/python3.req.py: /usr/src/tmp/python3-module-rasterio-buildroot/usr/lib/python3/site-packages/rasterio/rio/rasterize.py: line=124 IGNORE (for REQ=slight and deep=9) module=rasterio.features
/usr/lib/rpm/python3.req.py: /usr/src/tmp/python3-module-rasterio-buildroot/usr/lib/python3/site-packages/rasterio/rio/transform.py: line=21 IGNORE (for REQ=slight and deep=9) module=rasterio.warp
/usr/lib/rpm/python3.req.py: /usr/src/tmp/python3-module-rasterio-buildroot/usr/lib/python3/site-packages/rasterio/session.py: line=12 IGNORE (for REQ=slight and deep=8) module=boto3
/usr/lib/rpm/python3.req.py: /usr/src/tmp/python3-module-rasterio-buildroot/usr/lib/python3/site-packages/rasterio/session.py: line=496 IGNORE (for REQ=slight and deep=15) module=swiftclient.client
/usr/lib/rpm/python3.req.py: /usr/src/tmp/python3-module-rasterio-buildroot/usr/lib/python3/site-packages/rasterio/windows.py: line=239 IGNORE (for REQ=slight and deep=9) module=itertools
Provides: python3(rasterio), python3(rasterio._base), python3(rasterio._crs), python3(rasterio._env), python3(rasterio._err), python3(rasterio._example), python3(rasterio._features), python3(rasterio._fill), python3(rasterio._io), python3(rasterio._shim), python3(rasterio._transform), python3(rasterio._warp), python3(rasterio.compat), python3(rasterio.control), python3(rasterio.coords), python3(rasterio.crs), python3(rasterio.drivers), python3(rasterio.dtypes), python3(rasterio.enums), python3(rasterio.env), python3(rasterio.errors), python3(rasterio.features), python3(rasterio.fill), python3(rasterio.io), python3(rasterio.mask), python3(rasterio.merge), python3(rasterio.path), python3(rasterio.plot), python3(rasterio.profiles), python3(rasterio.rio), python3(rasterio.rio.blocks), python3(rasterio.rio.bounds), python3(rasterio.rio.calc), python3(rasterio.rio.clip), python3(rasterio.rio.convert), python3(rasterio.rio.edit_info), python3(rasterio.rio.env), python3(rasterio.rio.gcps), python3(rasterio.rio.helpers), python3(rasterio.rio.info), python3(rasterio.rio.insp), python3(rasterio.rio.main), python3(rasterio.rio.mask), python3(rasterio.rio.merge), python3(rasterio.rio.options), python3(rasterio.rio.overview), python3(rasterio.rio.rasterize), python3(rasterio.rio.rm), python3(rasterio.rio.sample), python3(rasterio.rio.shapes), python3(rasterio.rio.stack), python3(rasterio.rio.transform), python3(rasterio.rio.warp), python3(rasterio.sample), python3(rasterio.session), python3(rasterio.shutil), python3(rasterio.tools), python3(rasterio.transform), python3(rasterio.vrt), python3(rasterio.warp), python3(rasterio.windows)
Requires: python3(numpy) < 0, python3(IPython) < 0, /usr/bin/python3, /usr/lib/python3/site-packages, libc.so.6(GLIBC_2.0), libc.so.6(GLIBC_2.1.3), libc.so.6(GLIBC_2.3.4), libc.so.6(GLIBC_2.4), libgcc_s.so.1(GCC_3.0), libgdal.so.26 >= set:umZGhd1RNym1fQhRd3QBLoluXJ6jeFKzr5vQUZfdPoKZhxaSNJkATShQUibOXpnkPU0OwxEGnIqzU0Pjil7cxYesmwCELZcAgzMEwW1WG0liDDkPxirCuqZ387W0q2dHqs4JX6ZqT4mLKMLd5oMGkykVOSu1SrjZdMZyoPFvZvVMURviVxej32JkIpBtfWZyzAKegwhR85FrtIdyUQGZHWtoXvG7vcbwMFxVkuDZoyGlZDBicrCWs8FVc7pSdcl7kLJMikk9BULlPZmX3jsEFqZnkQKC6aSipZmA2A7chyAYe9YooxdZtRsOHOnMMFGpZweouK9XM3p1VFd1zlXZml6XDE7RYmx9PN5jD8nqGvveLZ6wfeUm8kaTZ159YsnU1tgHslKAPI9Nfg9r0MIA4EOP49t5Uszp6Bkyonidfp2mYylTZb8xP5t5DDMkFrGMS8Wu8z5ldae2zSVZ8YPIZ9JUtDuojH4I5HyPNjvTLZj5HQQtSDBEcx3NeE1tFA43mEndR8SK5etsliLdhL3dSuO7pgWHeScHySBmRnfj7FkhJRxMAsYhmGgrSfdFDTNi9Ek42Kzu97Pfp4XpJYtCD1qO0DAub2v6rcxwWPnIWGRsh4Z7IE9kn70SE5Sl5ujRHr88NMFjXNrcagL91Sa51CSSPWYGnPyzi6p0, libpython3.7m.so.1.0 >= set:ogcAJjg3ysZ6TQZpV2eL6Dmd9aLdcEoswhIoRW2PrRcADNwm2GknjMcfoR5zOJswiZ4w0FNiXB59I4tj72c0n04Ns28Fjt0wiRui87EZpE3Zp9Oqppc2GDStv3mxUJuZHYazT8eYdXEhCyFXEU19mVrnCU4s4C2BL4yoZgdGAOWfIdKcA3FOb9wWcuuNQYZFmyVI5h2LnZ70g9bcXyfm2FW9G45eSqZGvkqZ5P5b3zGl6vPTrb14jFnHGM7AaPzpfQcBjoj1W6YxSlY6Mt4tzMJjYkxbb4XCp0KO9SIueKkVoeLZ9mChZADPMnnCiGKK7r4ZjhYEHHjD6s0lhxxy2fnonraEwC30Q79M68yo4aX1n68DpyjYDVigQNTS8qUWUgrXZwbHDtogDlZr2cMpewZh6ZqSg0iToCz7LtQSuefSoQAzvgu5BLKRN69lrz9CZq6G3k7eORRgZ8oYFItd9EQ6hXy1qjFb15m1iWZtcNKR7FwdkaFTMZDsSearCG8KYov2Jtj1ijN6JbTUFnA63Qh9PJpvcz4ItCuvaCcR6nFCZDkMZLC6nc4lRzctPQrJugfp0, libstdc++.so.6(CXXABI_1.3), libstdc++.so.6(GLIBCXX_3.4), libstdc++.so.6(GLIBCXX_3.4.21), python3(__future__) < 0, python3(affine) < 0, python3(attr) < 0, python3(click) < 0, python3(click_plugins) < 0, python3(cligj) < 0, python3(code) < 0, python3(collections) < 0, python3(contextlib) < 0, python3(distutils.version) < 0, python3(enum) < 0, python3(functools) < 0, python3(json) < 0, python3(logging) < 0, python3(math) < 0, python3(numpy.ma) < 0, python3(operator) < 0, python3(os) < 0, python3(os.path) < 0, python3(pickle) < 0, python3(pkg_resources) < 0, python3(rasterio._base) < 0, python3(rasterio._crs) < 0, python3(rasterio._env) < 0, python3(rasterio._err) < 0, python3(rasterio._features) < 0, python3(rasterio._fill) < 0, python3(rasterio._io) < 0, python3(rasterio._transform) < 0, python3(rasterio._warp) < 0, python3(rasterio.shutil) < 0, python3(re) < 0, python3(snuggs) < 0, python3(threading) < 0, python3(uuid) < 0, python3(warnings) < 0, python3(xml.etree.ElementTree) < 0, python3.7-ABI, rtld(GNU_HASH)
Requires(rpmlib): rpmlib(SetVersions)
Finding debuginfo files (using /usr/lib/rpm/find-debuginfo-files)
Executing: /bin/sh -e /usr/src/tmp/rpm-tmp.E3yEUU
Creating python3-module-rasterio-debuginfo package
Processing files: python3-module-rasterio-debuginfo-1.1.8-alt3
Finding Provides (using /usr/lib/rpm/find-provides)
Executing: /bin/sh -e /usr/src/tmp/rpm-tmp.wFbojC
find-provides: running scripts (debuginfo)
Finding Requires (using /usr/lib/rpm/find-requires)
Executing: /bin/sh -e /usr/src/tmp/rpm-tmp.yfYHFS
find-requires: running scripts (debuginfo)
Requires: python3-module-rasterio = 1.1.8-alt3, debug(libc.so.6), debug(libgcc_s.so.1), debug(libgdal.so.26), debug(libpython3.7m.so.1.0), debug(libstdc++.so.6)
Adding to python3-module-rasterio-debuginfo a strict dependency on python3-module-rasterio
Wrote: /usr/src/RPM/RPMS/i586/python3-module-rasterio-1.1.8-alt3.i586.rpm (w2.lzdio)
Wrote: /usr/src/RPM/RPMS/i586/python3-module-rasterio-debuginfo-1.1.8-alt3.i586.rpm (w2T8.xzdio)
224.86user 25.06system 4:01.58elapsed 103%CPU (0avgtext+0avgdata 387540maxresident)k
0inputs+0outputs (0major+2404760minor)pagefaults 0swaps
262.67user 36.99system 4:51.43elapsed 102%CPU (0avgtext+0avgdata 387540maxresident)k
27952inputs+0outputs (0major+3043265minor)pagefaults 0swaps
--- python3-module-rasterio-1.1.8-alt3.i586.rpm.repo	2021-04-27 15:08:09.000000000 +0000
+++ python3-module-rasterio-1.1.8-alt3.i586.rpm.hasher	2021-06-27 12:35:51.450743554 +0000
@@ -452,2 +452,2 @@
 Provides: python3-module-rasterio = 1.1.8-alt3:p9+251936.3560.44.1
-RPMIdentity: 37894f4cd0f3a6f17f80e45d1d5594d5
+RPMIdentity: 9c6b7030f1039c9eca5ed072db5ef081
--- python3-module-rasterio-debuginfo-1.1.8-alt3.i586.rpm.repo	2021-04-27 15:08:09.000000000 +0000
+++ python3-module-rasterio-debuginfo-1.1.8-alt3.i586.rpm.hasher	2021-06-27 12:35:51.578738912 +0000
@@ -36,2 +36,2 @@
 Provides: python3-module-rasterio-debuginfo = 1.1.8-alt3:p9+251936.3560.44.1
-RPMIdentity: 3e75c7a209d82d344526db91c05b4572
+RPMIdentity: 9132f528d98da171dcd03f6f830128c2