86>Jun 20 13:36:18 userdel[2549017]: delete user 'rooter'
<86>Jun 20 13:36:18 userdel[2549017]: removed group 'rooter' owned by 'rooter'
<86>Jun 20 13:36:18 userdel[2549017]: removed shadow group 'rooter' owned by 'rooter'
<86>Jun 20 13:36:18 groupadd[2549033]: group added to /etc/group: name=rooter, GID=675
<86>Jun 20 13:36:18 groupadd[2549033]: group added to /etc/gshadow: name=rooter
<86>Jun 20 13:36:18 groupadd[2549033]: new group: name=rooter, GID=675
<86>Jun 20 13:36:18 useradd[2549051]: new user: name=rooter, UID=675, GID=675, home=/root, shell=/bin/bash
<86>Jun 20 13:36:18 userdel[2549074]: delete user 'builder'
<86>Jun 20 13:36:18 userdel[2549074]: removed group 'builder' owned by 'builder'
<86>Jun 20 13:36:18 userdel[2549074]: removed shadow group 'builder' owned by 'builder'
<86>Jun 20 13:36:18 groupadd[2549098]: group added to /etc/group: name=builder, GID=676
<86>Jun 20 13:36:18 groupadd[2549098]: group added to /etc/gshadow: name=builder
<86>Jun 20 13:36:18 groupadd[2549098]: new group: name=builder, GID=676
<86>Jun 20 13:36:18 useradd[2549111]: new user: name=builder, UID=676, GID=676, home=/usr/src, shell=/bin/bash
warning: user igor does not exist - using root
warning: group igor does not exist - using root
warning: user igor does not exist - using root
warning: group igor does not exist - using root
warning: user igor does not exist - using root
warning: group igor does not exist - using root
warning: Macro %pom_xpath_set not found
warning: Macro %pom_change_dep not found
warning: Macro %pom_remove_plugin not found
warning: Macro %pom_remove_plugin not found
warning: Macro %pom_remove_plugin not found
warning: Macro %pom_remove_plugin not found
warning: Macro %pom_xpath_set not found
warning: Macro %pom_add_plugin not found
warning: Macro %pom_change_dep not found
warning: Macro %mvn_build not found
warning: Macro %mvn_install not found
<13>Jun 20 13:36:27 rpmi: javapackages-tools-1:5.0.0-alt1_12jpp8.M90P.1 p9+263388.100.2.1 1608141549 installed
<13>Jun 20 13:36:27 rpmi: plexus-utils-0:3.0.24-alt1_5jpp8 1524376364 installed
<13>Jun 20 13:36:27 rpmi: apache-commons-io-1:2.6-alt1_3jpp8 1526474591 installed
<13>Jun 20 13:36:27 rpmi: maven-shared-utils-3.2.1-alt1_0.1jpp8 1527848452 installed
<13>Jun 20 13:36:27 rpmi: apache-commons-logging-0:1.2-alt1_14jpp8 sisyphus+220622.100.1.1 1549363457 installed
<13>Jun 20 13:36:27 rpmi: plexus-containers-component-annotations-0:1.7.1-alt1_6jpp8 1527990031 installed
<13>Jun 20 13:36:27 rpmi: slf4j-0:1.7.25-alt1_4jpp8 1525924634 installed
<13>Jun 20 13:36:27 rpmi: plexus-interpolation-0:1.22-alt1_9jpp8 1524313082 installed
<13>Jun 20 13:36:27 rpmi: maven-wagon-provider-api-0:3.0.0-alt1_1jpp8 1511394275 installed
<13>Jun 20 13:36:28 rpmi: xml-commons-apis-1.4.01-alt3_26jpp8 sisyphus+220521.100.1.1 1549294732 installed
<13>Jun 20 13:36:28 rpmi: maven-artifact-1:2.2.1-alt6_56jpp8 1510505131 installed
<13>Jun 20 13:36:28 rpmi: apache-commons-codec-0:1.11-alt1_4jpp8 sisyphus+220604.100.1.1 1549341232 installed
<13>Jun 20 13:36:28 rpmi: apache-commons-lang3-3.7-alt1_4jpp8 sisyphus+220620.100.1.1 1549356987 installed
<13>Jun 20 13:36:28 rpmi: httpcomponents-core-4.4.9-alt1_4jpp8 1525820092 installed
<13>Jun 20 13:36:28 rpmi: plexus-classworlds-0:2.5.2-alt2_9jpp8 1524311141 installed
<13>Jun 20 13:36:28 rpmi: maven-model-1:2.2.1-alt6_56jpp8 1510505131 installed
<13>Jun 20 13:36:28 rpmi: atinject-0:1-alt7_29.20100611svn86jpp8 sisyphus+220650.100.1.1 1549392067 installed
<13>Jun 20 13:36:28 rpmi: hawtjni-runtime-0:1.16-alt1_1jpp8 1527820189 installed
<13>Jun 20 13:36:28 rpmi: guava20-20.0-alt1_5jpp8 1526562255 installed
<13>Jun 20 13:36:28 rpmi: maven-resolver-api-1:1.1.1-alt1_2jpp8 1527821514 installed
<13>Jun 20 13:36:28 rpmi: maven-resolver-util-1:1.1.1-alt1_2jpp8 1527821514 installed
<13>Jun 20 13:36:28 rpmi: maven-resolver-spi-1:1.1.1-alt1_2jpp8 1527821514 installed
<13>Jun 20 13:36:28 rpmi: xmvn-api-3.0.0-alt1_18jpp8 1527991448 installed
<13>Jun 20 13:36:28 rpmi: xmvn-core-3.0.0-alt1_18jpp8 1527991448 installed
<13>Jun 20 13:36:28 rpmi: jansi-native-0:1.7-alt1_5jpp8 1523818758 installed
<13>Jun 20 13:36:28 rpmi: jcl-over-slf4j-0:1.7.25-alt1_4jpp8 1525924634 installed
<13>Jun 20 13:36:28 rpmi: aopalliance-0:1.0-alt6_17jpp8 1526473615 installed
<13>Jun 20 13:36:28 rpmi: apache-commons-cli-0:1.4-alt1_5jpp8 sisyphus+220603.100.1.1 1549340562 installed
<13>Jun 20 13:36:28 rpmi: apache-commons-collections-0:3.2.2-alt1_8jpp8 1527882341 installed
<13>Jun 20 13:36:28 rpmi: osgi-core-6.0.0-alt1_6jpp8 1524308153 installed
<13>Jun 20 13:36:28 rpmi: plexus-cipher-1.7-alt3_14jpp8 1524310885 installed
<13>Jun 20 13:36:28 rpmi: xorg-proto-devel-2021.4-alt1 p9+272150.100.1.1 1621427342 installed
<13>Jun 20 13:36:28 rpmi: libjpeg-2:2.0.2-alt1 sisyphus+226996.100.1.1 1554902907 installed
<13>Jun 20 13:36:28 rpmi: libpng16-1.6.36-alt1 sisyphus+219478.100.1.1 1547633314 installed
<13>Jun 20 13:36:28 rpmi: libexpat-2.2.10-alt1 p9+261554.100.1.1 1605103337 installed
<13>Jun 20 13:36:28 rpmi: plexus-sec-dispatcher-1.4-alt4_24jpp8 1524313702 installed
<13>Jun 20 13:36:28 rpmi: google-guice-0:4.1-alt1_12jpp8 sisyphus+221708.100.1.1 1550375735 installed
<13>Jun 20 13:36:28 rpmi: maven-resolver-connector-basic-1:1.1.1-alt1_2jpp8 1527821514 installed
<13>Jun 20 13:36:28 rpmi: maven-resolver-impl-1:1.1.1-alt1_2jpp8 1527821514 installed
<13>Jun 20 13:36:28 rpmi: maven-resolver-transport-wagon-1:1.1.1-alt1_2jpp8 1527821514 installed
<13>Jun 20 13:36:28 rpmi: maven-wagon-file-0:3.0.0-alt1_1jpp8 1511394275 installed
<13>Jun 20 13:36:28 rpmi: objenesis-0:2.6-alt1_1jpp8 1511395274 installed
<13>Jun 20 13:36:28 rpmi: apache-commons-lang-0:2.6-alt5_22jpp8 sisyphus+220619.100.1.1 1549325921 installed
<13>Jun 20 13:36:28 rpmi: hamcrest-core-0:1.3-alt3_23jpp8 1525893879 installed
<13>Jun 20 13:36:28 rpmi: junit-1:4.12-alt1_8jpp8 1525900612 installed
<13>Jun 20 13:36:28 rpmi: qdox-1:2.0-alt1_0.12.M7jpp8 1525919952 installed
<13>Jun 20 13:36:28 rpmi: beust-jcommander-1.71-alt1_3jpp8 1523858260 installed
<13>Jun 20 13:36:28 rpmi: geronimo-annotation-1.0-alt4_24jpp8 sisyphus+221131.100.1.2 1549788027 installed
<13>Jun 20 13:36:28 rpmi: xpp3-1:1.1.4-alt1_19.cjpp8 sisyphus+220580.100.1.1 1549324731 installed
<13>Jun 20 13:36:28 rpmi: libICE-1.0.9-alt1 1409902721 installed
<13>Jun 20 13:36:28 rpmi: xml-utils-1:2.9.10-alt6 p9+266566.100.3.1 1614357035 installed
<13>Jun 20 13:36:28 rpmi: libSM-1.2.3-alt1 sisyphus+226734.100.2.1 1554586158 installed
<13>Jun 20 13:36:28 rpmi: velocity-1:1.7-alt3_22jpp8 1525930039 installed
<13>Jun 20 13:36:28 rpmi: apache-commons-compress-0:1.16.1-alt1_1jpp8 1526491832 installed
<13>Jun 20 13:36:28 rpmi: xmvn-connector-aether-3.0.0-alt1_18jpp8 1527991448 installed
<13>Jun 20 13:36:28 rpmi: xmlgraphics-commons-0:2.2-alt1_2jpp8 sisyphus+220498.100.1.1 1549281765 installed
<13>Jun 20 13:36:28 rpmi: plexus-build-api-0:0.0.7-alt3_20jpp8 1525915372 installed
<13>Jun 20 13:36:28 rpmi: ant-lib-0:1.10.3-alt1_2jpp8 1528243545 installed
<13>Jun 20 13:36:29 rpmi: osgi-compendium-6.0.0-alt1_5jpp8 1524307639 installed
<13>Jun 20 13:36:29 rpmi: felix-utils-1.10.4-alt1_3jpp8 sisyphus+221058.100.1.2 1549747041 installed
<13>Jun 20 13:36:29 rpmi: liblksctp-1.0.17-alt2 1523113261 installed
<13>Jun 20 13:36:29 rpmi: libnettle6-3.4.1-alt1 sisyphus+226533.100.2.1 1554512222 installed
<13>Jun 20 13:36:29 rpmi: libglvnd-7:1.3.2-alt0.p9 p9+265957.240.8.1 1617618230 installed
<13>Jun 20 13:36:29 rpmi: libwayland-server-1.18.0-alt1 p9+260591.100.12.1 1606212861 installed
<13>Jun 20 13:36:29 rpmi: sgml-common-0.6.3-alt15 1423664786 installed
<13>Jun 20 13:36:29 rpmi: log4j12-1.2.17-alt1_23jpp8 sisyphus+220162.100.2.1 1549021303 installed
<13>Jun 20 13:36:29 rpmi: libp11-kit-0.23.15-alt2 p9+254920.2400.19.1 1601385903 installed
<13>Jun 20 13:36:29 rpmi: libtasn1-4.14-alt1 p9+235792.100.2.1 1565425233 installed
<13>Jun 20 13:36:29 rpmi: docbook-dtds-4.5-alt1 1223476557 installed
<13>Jun 20 13:36:29 rpmi: docbook-style-xsl-1.79.1-alt2 sisyphus.213665.100 1537949315 installed
<13>Jun 20 13:36:29 rpmi: libhogweed4-3.4.1-alt1 sisyphus+226533.100.2.1 1554512222 installed
<13>Jun 20 13:36:29 rpmi: lksctp-tools-1.0.17-alt2 1523113261 installed
<13>Jun 20 13:36:29 rpmi: felix-bundlerepository-2.0.10-alt1_4jpp8 sisyphus+220992.100.1.2 1549693453 installed
<13>Jun 20 13:36:29 rpmi: libICE-devel-1.0.9-alt1 1409902721 installed
<13>Jun 20 13:36:29 rpmi: libSM-devel-1.2.3-alt1 sisyphus+226734.100.2.1 1554586158 installed
<13>Jun 20 13:36:29 rpmi: kxml-2.3.0-alt3_16jpp8 1524305282 installed
<13>Jun 20 13:36:29 rpmi: maven-verifier-1.6-alt1_5jpp8 1510518576 installed
<13>Jun 20 13:36:29 rpmi: apache-commons-configuration-0:1.10-alt1_12jpp8 sisyphus+220606.100.1.1 1549344005 installed
<13>Jun 20 13:36:29 rpmi: libjasper-2.0.22-alt1 p9+259398.100.5.1 1602695044 installed
<13>Jun 20 13:36:30 rpmi: jcsp-1.1-alt1_0.10.rc5jpp8 sisyphus+221980.100.1.1 1550546630 installed
<13>Jun 20 13:36:30 rpmi: xmvn-mojo-3.0.0-alt1_18jpp8 1527991448 installed
<13>Jun 20 13:36:30 rpmi: maven-dependency-tree-3.0-alt1_4jpp8 1510507072 installed
<13>Jun 20 13:36:30 rpmi: plexus-component-api-1.0-alt4_0.24.alpha15jpp8 1524311381 installed
<13>Jun 20 13:36:30 rpmi: plexus-interactivity-api-0:1.0-alt6_0.25.alpha6jpp8 1525919089 installed
<13>Jun 20 13:36:30 rpmi: apache-commons-httpclient-1:3.1-alt6_27jpp8 1510082305 installed
<13>Jun 20 13:36:30 rpmi: maven-invoker-2.2-alt1_6jpp8 1510802103 installed
<13>Jun 20 13:36:30 rpmi: bsf-1:2.4.0-alt3_28jpp8 1525885352 installed
<13>Jun 20 13:36:30 rpmi: fontbox-0:1.8.13-alt2_4jpp8 1525914053 installed
<13>Jun 20 13:36:30 rpmi: plexus-io-0:3.0.0-alt1_2jpp8 1527187473 installed
<13>Jun 20 13:36:30 rpmi: plexus-compiler-0:2.8.2-alt1_2jpp8 1525918408 installed
<13>Jun 20 13:36:30 rpmi: apache-commons-exec-0:1.3-alt1_8jpp8 1524218803 installed
<13>Jun 20 13:36:30 rpmi: apache-ivy-0:2.4.0-alt1_12jpp8 1527882603 installed
<13>Jun 20 13:36:30 rpmi: osgi-annotation-6.0.0-alt1_7jpp8 1524306983 installed
<13>Jun 20 13:36:30 rpmi: aqute-bndlib-0:3.5.0-alt1_2jpp8 1523847009 installed
<13>Jun 20 13:36:30 rpmi: avalon-logkit-0:2.1-alt2_29jpp8 1525884624 installed
<13>Jun 20 13:36:30 rpmi: avalon-framework-0:4.3-alt4_19jpp8 1525884383 installed
<13>Jun 20 13:36:30 rpmi: jai-imageio-core-1.2-alt1_0.24.20100217cvsjpp8 sisyphus+221788.100.1.1 1550423410 installed
<13>Jun 20 13:36:30 rpmi: fusesource-pom-0:1.11-alt1_4jpp8 sisyphus+221128.100.1.1 1549752021 installed
<13>Jun 20 13:36:30 rpmi: jansi-0:1.17-alt1_1jpp8 1527875993 installed
<13>Jun 20 13:36:30 rpmi: jline-0:2.14.6-alt1_1jpp8 1527875899 installed
<13>Jun 20 13:36:30 rpmi: glassfish-el-api-3.0.1-alt1_0.9.b08jpp8 sisyphus+221160.100.1.1 1549796961 installed
<13>Jun 20 13:36:30 rpmi: jboss-interceptors-1.2-api-1.0.0-alt1_9jpp8 sisyphus+221843.100.1.1 1550450624 installed
<13>Jun 20 13:36:30 rpmi: cdi-api-1.2-alt1_9jpp8 sisyphus+220672.100.1.1 1549401296 installed
<13>Jun 20 13:36:30 rpmi: sisu-inject-2:0.3.3-alt1_3jpp8 1525924258 installed
<13>Jun 20 13:36:30 rpmi: sisu-plexus-2:0.3.3-alt1_3jpp8 1525924258 installed
<13>Jun 20 13:36:30 rpmi: dain-snappy-0.4-alt1_6jpp8 sisyphus+220815.100.1.1 1549458793 installed
<13>Jun 20 13:36:30 rpmi: jsoup-1.11.3-alt1_1jpp8 1527820709 installed
<13>Jun 20 13:36:30 rpmi: maven-filesystem-0.01-alt2.1 1460115697 installed
<13>Jun 20 13:36:30 rpmi: xpp3-minimal-1:1.1.4-alt1_19.cjpp8 sisyphus+220580.100.1.1 1549324731 installed
<13>Jun 20 13:36:30 rpmi: xstream-0:1.4.9-alt1_7jpp8 1524214178 installed
<13>Jun 20 13:36:30 rpmi: extra166y-1.7.0-alt1_10jpp8 sisyphus+220916.100.1.3 1549643912 installed
<13>Jun 20 13:36:30 rpmi: jzlib-0:1.1.3-alt1_8jpp8 1525901378 installed
<13>Jun 20 13:36:30 rpmi: netty3-3.10.6-alt2_5jpp8 sisyphus+220441.100.1.1 1549124381 installed
<13>Jun 20 13:36:30 rpmi: multiverse-0.7.0-alt1_8jpp8 1527807673 installed
<13>Jun 20 13:36:30 rpmi: java-common-1.6.0-alt1 p9+234085.100.1.1 1562573623 installed
<13>Jun 20 13:36:30 rpmi: jdeparser-2.0.0-alt1_5jpp8 sisyphus+221984.100.1.3 1550633935 installed
<13>Jun 20 13:36:30 rpmi: xz-java-1.8-alt1_2jpp8 1525824473 installed
<13>Jun 20 13:36:30 rpmi: plexus-archiver-0:3.6.0-alt1_1jpp8 1527822734 installed
<13>Jun 20 13:36:30 rpmi: zip-30000000:3.0-alt1 1332241772 installed
<13>Jun 20 13:36:30 rpmi: rpm-macros-java-1:5.0.0-alt1_12jpp8.M90P.1 p9+263388.100.2.1 1608141549 installed
<13>Jun 20 13:36:30 rpmi: libprotobuf17-3.6.1.3-alt2 sisyphus+227259.100.1.1 1555610584 installed
<13>Jun 20 13:36:31 rpmi: libnatspec-0.3.1-alt2 1445691580 installed
<13>Jun 20 13:36:31 rpmi: unzip-6.0-alt4 p9+261695.100.1.1 1605219254 installed
<13>Jun 20 13:36:31 rpmi: libpcsclite-1.9.0-alt1 p9+260393.100.3.1 1604003804 installed
<13>Jun 20 13:36:31 rpmi: libsqlite3-3.33.0-alt1 p9+258834.40.2.1 1601365057 installed
<13>Jun 20 13:36:31 rpmi: libnspr-1:4.28-alt1 p9+254920.20.18.1 1601209854 installed
<13>Jun 20 13:36:31 rpmi: javazi-2021a-alt1 p9+265336.400.3.1 1612252875 installed
<13>Jun 20 13:36:31 rpmi: libgif-4.1.6-alt3 1299634261 installed
<13>Jun 20 13:36:31 rpmi: libidn2-2.2.0-alt1 p9+229971.100.2.1 1558696281 installed
<13>Jun 20 13:36:31 rpmi: libgnutls30-3.6.16-alt1 p9+273087.100.1.1 1622487001 installed
<13>Jun 20 13:36:31 rpmi: liblz4-1:1.9.2-alt1 p9+238696.500.1.1 1570228299 installed
<13>Jun 20 13:36:31 rpmi: libgpg-error-1.36-alt1 p9+261942.140.4.1 1606237675 installed
<13>Jun 20 13:36:31 rpmi: libgcrypt20-1.8.5-alt3 p9+261942.200.4.1 1606237923 installed
<13>Jun 20 13:36:31 rpmi: libsystemd-1:246.13-alt1 p9+265718.640.15.1 1618506331 installed
<13>Jun 20 13:36:31 rpmi: libdbus-1.12.16-alt2 p9+240607.100.1.1 1573553687 installed
<13>Jun 20 13:36:31 rpmi: libavahi-0.8-alt2 p9+270905.100.1.1 1619639865 installed
<13>Jun 20 13:36:31 rpmi: libcups-2.3.3-alt2.op2 p9+267729.100.2.1 1616001940 installed
<13>Jun 20 13:36:31 rpmi: libxslt-1.1.34-alt1.p9.1 p9+261811.300.3.1 1605513919 installed
<13>Jun 20 13:36:31 rpmi: icon-theme-hicolor-0.17-alt2 p9+248347.100.1.1 1584981172 installed
<13>Jun 20 13:36:31 rpmi: libwebp7-1.0.3-alt1 p9+234901.200.1.1 1563552457 installed
<13>Jun 20 13:36:31 rpmi: libjbig-2.1-alt1 1401380926 installed
<13>Jun 20 13:36:31 rpmi: libtiff5-4.0.10.0.57.f9fc01c3-alt1 sisyphus+226958.100.1.1 1554850940 installed
<13>Jun 20 13:36:31 rpmi: shared-mime-info-1.13.1-alt1 p9+238204.100.1.1 1569496447 installed
<13>Jun 20 13:36:31 rpmi: gsettings-desktop-schemas-data-3.32.0-alt1 sisyphus+225059.300.3.2 1552843929 installed
<13>Jun 20 13:36:31 rpmi: libgio-2.60.7-alt1 p9+237353.100.2.2 1568373081 installed
<13>Jun 20 13:36:31 rpmi: gsettings-desktop-schemas-3.32.0-alt1 sisyphus+225059.300.3.2 1552843980 installed
<13>Jun 20 13:36:31 rpmi: libgdk-pixbuf-locales-2.38.2-alt1 p9+237353.1000.2.2 1568374008 installed
<13>Jun 20 13:36:31 rpmi: libgdk-pixbuf-2.38.2-alt1 p9+237353.1000.2.2 1568374336 installed
<13>Jun 20 13:36:31 rpmi: gtk-update-icon-cache-3.24.11-alt1.M90P.1 p9+270534.40.3.1 1621245189 installed
<13>Jun 20 13:36:32 rpmi: libgtk+2-locales-2.24.32-alt3 sisyphus+227306.100.1.3 1555646039 installed
<13>Jun 20 13:36:32 rpmi: libdatrie-0.2.9-alt1_6 1511686676 installed
<13>Jun 20 13:36:32 rpmi: libthai-0.1.28-alt1_1 sisyphus+226107.100.1.1 1554123079 installed
<13>Jun 20 13:36:32 rpmi: libfribidi-1.0.7-alt1 p9+238309.200.1.1 1569787058 installed
<13>Jun 20 13:36:32 rpmi: libpixman-3:0.38.4-alt1 sisyphus+228006.100.1.1 1556013870 installed
<13>Jun 20 13:36:32 rpmi: libxshmfence-1.3-alt1 sisyphus+223149.1000.2.1 1551268571 installed
<13>Jun 20 13:36:32 rpmi: libwayland-client-1.18.0-alt1 p9+260591.100.12.1 1606212861 installed
<13>Jun 20 13:36:32 rpmi: libpciaccess-1:0.14-alt1 1528969252 installed
<13>Jun 20 13:36:32 rpmi: libdrm-1:2.4.105-alt2 p9+271012.100.1.1 1619786697 installed
<13>Jun 20 13:36:32 rpmi: libgbm-4:21.0.3-alt1 p9+271012.200.3.1 1621244977 installed
<13>Jun 20 13:36:33 rpmi: libatk-locales-2.32.0-alt1 sisyphus+225059.600.3.2 1552845198 installed
<13>Jun 20 13:36:33 rpmi: libatk-2.32.0-alt1 sisyphus+225059.600.3.2 1552845362 installed
<13>Jun 20 13:36:33 rpmi: libX11-locales-3:1.7.2-alt1 p9+273972.100.2.1 1623924318 installed
<13>Jun 20 13:36:33 rpmi: libXdmcp-1.1.3-alt1 sisyphus+225206.600.1.2 1552949353 installed
<13>Jun 20 13:36:33 rpmi: libXau-1.0.9-alt1 sisyphus+223149.200.2.1 1551268152 installed
<13>Jun 20 13:36:33 rpmi: libxcb-1.13.1-alt1 sisyphus+226527.100.2.2 1554593801 installed
<13>Jun 20 13:36:33 rpmi: libX11-3:1.7.2-alt1 p9+273972.100.2.1 1623924397 installed
<13>Jun 20 13:36:33 rpmi: libXext-1.3.4-alt1 sisyphus+225206.700.1.2 1552949429 installed
<13>Jun 20 13:36:33 rpmi: libXrender-0.9.10-alt1 p9+261891.200.2.1 1606149111 installed
<13>Jun 20 13:36:33 rpmi: libXfixes-5.0.3-alt1 sisyphus+226736.100.2.2 1554614841 installed
<13>Jun 20 13:36:33 rpmi: libXi-1.7.9-alt2 sisyphus+226377.100.1.2 1554260260 installed
<13>Jun 20 13:36:33 rpmi: libXcomposite-0.4.5-alt1 sisyphus+225206.300.1.2 1552949137 installed
<13>Jun 20 13:36:33 rpmi: libXcursor-1.2.0-alt1 sisyphus+225206.400.1.2 1552949218 installed
<13>Jun 20 13:36:33 rpmi: libXrandr-1.5.2-alt1 sisyphus+225206.1300.1.2 1552949710 installed
<13>Jun 20 13:36:33 rpmi: libXxf86vm-1.1.4-alt2 1527672187 installed
<13>Jun 20 13:36:33 rpmi: libGLX-mesa-4:21.0.3-alt1 p9+271012.200.3.1 1621244977 installed
<13>Jun 20 13:36:33 rpmi: libEGL-mesa-4:21.0.3-alt1 p9+271012.200.3.1 1621244977 installed
<13>Jun 20 13:36:33 rpmi: libEGL-7:1.3.2-alt0.p9 p9+265957.240.8.1 1617618230 installed
<13>Jun 20 13:36:33 rpmi: libGLX-7:1.3.2-alt0.p9 p9+265957.240.8.1 1617618230 installed
<13>Jun 20 13:36:33 rpmi: libGL-7:1.3.2-alt0.p9 p9+265957.240.8.1 1617618230 installed
<13>Jun 20 13:36:33 rpmi: libXinerama-1.1.4-alt1 sisyphus+223149.300.2.1 1551268216 installed
<13>Jun 20 13:36:33 rpmi: libXtst-1.2.3-alt1 p9+261891.100.2.1 1606149069 installed
<13>Jun 20 13:36:33 rpmi: libXdamage-1.1.5-alt1 sisyphus+225206.500.1.2 1552949286 installed
<13>Jun 20 13:36:34 rpmi: libXt-1.1.4-alt1 1369984722 installed
<13>Jun 20 13:36:37 rpmi: libxcb-devel-1.13.1-alt1 sisyphus+226527.100.2.2 1554593801 installed
<13>Jun 20 13:36:37 rpmi: libX11-devel-3:1.7.2-alt1 p9+273972.100.2.1 1623924397 installed
<13>Jun 20 13:36:37 rpmi: libXt-devel-1.1.4-alt1 1369984722 installed
<13>Jun 20 13:36:37 rpmi: libgraphite2-1.3.13-alt2 sisyphus+226799.100.1.1 1554648241 installed
<13>Jun 20 13:36:37 rpmi: libharfbuzz-2.6.2-alt1 p9+238790.200.1.1 1570435826 installed
<13>Jun 20 13:36:37 rpmi: libfreetype-2.10.1-alt1.1.p9.1 p9+260179.200.3.1 1603971407 installed
<13>Jun 20 13:36:37 rpmi: fontconfig-2.13.1-alt1 p9+247340.200.3.1 1583400517 installed
Updating fonts cache: [ DONE ]
<29>Jun 20 13:36:38 fontconfig: Updating fonts cache: succeeded
<13>Jun 20 13:36:38 rpmi: libcairo-1:1.16.0-alt1 sisyphus+226534.100.2.3 1554515535 installed
<13>Jun 20 13:36:38 rpmi: fonts-type1-xorg-7.0.0-alt4 1188553211 installed
<13>Jun 20 13:36:39 rpmi: libXft-2.3.3-alt1 sisyphus+225206.1000.3.2 1552987708 installed
<13>Jun 20 13:36:39 rpmi: libpango-1.44.6-alt1 p9+237353.700.2.2 1568374131 installed
<13>Jun 20 13:36:40 rpmi: libgtk+2-2.24.32-alt3 sisyphus+227306.100.1.3 1555646092 installed
<13>Jun 20 13:36:40 rpmi: libgail-2.24.32-alt3 sisyphus+227306.100.1.3 1555646092 installed
<13>Jun 20 13:36:40 rpmi: publicsuffix-list-20210419-alt1 p9+270359.100.1.1 1618926138 installed
<13>Jun 20 13:36:40 rpmi: httpcomponents-client-4.5.5-alt1_5jpp8 sisyphus+221731.100.1.1 1550391382 installed
<13>Jun 20 13:36:40 rpmi: maven-wagon-http-shared-0:3.0.0-alt1_1jpp8 1511394275 installed
<13>Jun 20 13:36:40 rpmi: maven-wagon-http-0:3.0.0-alt1_1jpp8 1511394275 installed
<13>Jun 20 13:36:40 rpmi: maven-1:3.5.3-alt1_1jpp8 1528125011 installed
<13>Jun 20 13:36:40 rpmi: maven-lib-1:3.5.3-alt1_1jpp8 1528125011 installed
<13>Jun 20 13:36:40 rpmi: maven-archiver-0:3.2.0-alt1_1jpp8 1511392070 installed
<13>Jun 20 13:36:40 rpmi: maven-common-artifact-filters-3.0.1-alt1_3jpp8 1510506852 installed
<13>Jun 20 13:36:40 rpmi: maven-artifact-transfer-1:0.9.0-alt1_3jpp8 1511478032 installed
<13>Jun 20 13:36:40 rpmi: maven-source-plugin-3.0.1-alt1_3jpp8 1510517811 installed
<13>Jun 20 13:36:40 rpmi: maven-jar-plugin-3.1.0-alt1_1jpp8 1527821052 installed
<13>Jun 20 13:36:40 rpmi: maven-toolchain-1:2.2.1-alt6_56jpp8 1510505131 installed
<13>Jun 20 13:36:41 rpmi: maven-shared-incremental-1.1-alt1_13jpp8 1510516163 installed
<13>Jun 20 13:36:41 rpmi: maven-filtering-3.1.1-alt1_4jpp8 1510509696 installed
<13>Jun 20 13:36:41 rpmi: maven-resources-plugin-3.1.0-alt1_1jpp8 1527822052 installed
<13>Jun 20 13:36:41 rpmi: xmvn-minimal-3.0.0-alt1_18jpp8 1527991448 installed
<13>Jun 20 13:36:41 rpmi: libgdbm-1.8.3-alt10 1454943334 installed
<13>Jun 20 13:36:41 rpmi: rpm-macros-alternatives-0.5.1-alt1 sisyphus+226946.100.1.1 1554830426 installed
<13>Jun 20 13:36:41 rpmi: alternatives-0.5.1-alt1 sisyphus+226946.100.1.1 1554830426 installed
<13>Jun 20 13:36:41 rpmi: ca-certificates-2020.06.29-alt1 p9+258899.100.3.1 1601998604 installed
<13>Jun 20 13:36:41 rpmi: ca-trust-0.1.2-alt1 p9+233349.100.1.1 1561655062 installed
<13>Jun 20 13:36:41 rpmi: p11-kit-trust-0.23.15-alt2 p9+254920.2400.19.1 1601385903 installed
<13>Jun 20 13:36:41 rpmi: libcrypto1.1-1.1.1k-alt1 p9+268376.100.3.1 1616721011 installed
<13>Jun 20 13:36:41 rpmi: libssl1.1-1.1.1k-alt1 p9+268376.100.3.1 1616721011 installed
<13>Jun 20 13:36:41 rpmi: libpython3-3.7.4-alt3 p9+249932.100.2.1 1587127349 installed
<13>Jun 20 13:36:41 rpmi: python3-3.7.4-alt3 p9+249932.100.2.1 1587127349 installed
<13>Jun 20 13:36:42 rpmi: python3-base-3.7.4-alt3 p9+249932.100.2.1 1587127349 installed
<13>Jun 20 13:36:42 rpmi: python3-module-sugarbowl-0.52.1-alt1.git20141130.1.1 sisyphus+227470.1100.1.1 1555687657 installed
<13>Jun 20 13:36:42 rpmi: python3-module-six-1.12.0-alt1 sisyphus+219665.100.2.1 1548148570 installed
<13>Jun 20 13:36:42 rpmi: python3-module-markupsafe-1.1.1-alt1 p9+254838.60.14.1 1602882139 installed
<13>Jun 20 13:36:42 rpmi: python3-module-jinja2-2.11.2-alt1 p9+254838.40.14.1 1602882082 installed
<13>Jun 20 13:36:42 rpmi: python3-module-clyde-0.8.0-alt1.git20141130.2.1 sisyphus+227465.1600.1.2 1555756906 installed
<13>Jun 20 13:36:42 rpmi: python3-module-pkg_resources-1:40.8.0-alt2 sisyphus+229158.200.2.1 1557735221 installed
<13>Jun 20 13:36:42 rpmi: python3-module-runfile-0.46.1-alt1.git20141130.2.1 sisyphus+227469.1300.2.3 1555706376 installed
<13>Jun 20 13:36:42 rpmi: objectweb-asm-0:6.1.1-alt1_1jpp8 1528136365 installed
<13>Jun 20 13:36:42 rpmi: plexus-languages-0.9.3-alt2_4jpp8 1528196710 installed
<13>Jun 20 13:36:42 rpmi: cglib-0:3.2.4-alt1_8jpp8 sisyphus+220673.100.1.2 1549447239 installed
<13>Jun 20 13:36:42 rpmi: easymock-0:3.5-alt1_2jpp8 1524176696 installed
<13>Jun 20 13:36:42 rpmi: hamcrest-0:1.3-alt3_23jpp8 1525893879 installed
<13>Jun 20 13:36:42 rpmi: mockito-0:1.10.19-alt1_15jpp8 1525908038 installed
<13>Jun 20 13:36:42 rpmi: maven-compiler-plugin-3.7.0-alt1_1jpp8 1527175304 installed
<13>Jun 20 13:36:42 rpmi: xmvn-install-3.0.0-alt1_18jpp8 1527991448 installed
<13>Jun 20 13:36:42 rpmi: parboiled-1.1.6-alt1_13jpp8 1524290710 installed
<13>Jun 20 13:36:42 rpmi: pegdown-1.4.2-alt1_12jpp8 1524309539 installed
<13>Jun 20 13:36:42 rpmi: antlr-tool-0:2.7.7-alt12_53jpp8 1525882426 installed
<13>Jun 20 13:36:43 rpmi: gpars-1.2.1-alt1_12jpp8 sisyphus+221710.100.1.1 1550377267 installed
<13>Jun 20 13:36:43 rpmi: groovy-lib-0:2.4.8-alt1_5jpp8 1524261040 installed
<13>Jun 20 13:36:43 rpmi: xbean-0:4.8-alt1_1jpp8 1527831195 installed
<13>Jun 20 13:36:43 rpmi: plexus-containers-container-default-0:1.7.1-alt1_6jpp8 1527990031 installed
<13>Jun 20 13:36:43 rpmi: maven-artifact-manager-1:2.2.1-alt6_56jpp8 1510505131 installed
<13>Jun 20 13:36:43 rpmi: maven-plugin-registry-1:2.2.1-alt6_56jpp8 1510505131 installed
<13>Jun 20 13:36:43 rpmi: maven-doxia-logging-api-0:1.7-alt1_9jpp8 sisyphus+220185.100.1.1 1548779496 installed
<13>Jun 20 13:36:43 rpmi: maven-doxia-sink-api-0:1.7-alt1_9jpp8 sisyphus+220185.100.1.1 1548779496 installed
<13>Jun 20 13:36:43 rpmi: maven-reporting-api-1:3.0-alt3_13jpp8 1510514759 installed
<13>Jun 20 13:36:43 rpmi: maven-plugin-annotations-0:3.5.1-alt1_1jpp8 1525824925 installed
<13>Jun 20 13:36:43 rpmi: maven-surefire-0:2.21.0-alt1_1jpp8 1527848673 installed
<13>Jun 20 13:36:43 rpmi: maven-surefire-plugin-0:2.21.0-alt1_1jpp8 1527848673 installed
<13>Jun 20 13:36:43 rpmi: maven-surefire-provider-junit-0:2.21.0-alt1_1jpp8 1527848673 installed
<13>Jun 20 13:36:43 rpmi: maven-surefire-provider-testng-0:2.21.0-alt1_1jpp8 1527848673 installed
<13>Jun 20 13:36:43 rpmi: maven-surefire-report-parser-0:2.21.0-alt1_1jpp8 1527848673 installed
<13>Jun 20 13:36:43 rpmi: maven-profile-1:2.2.1-alt6_56jpp8 1510505131 installed
<13>Jun 20 13:36:43 rpmi: maven-settings-1:2.2.1-alt6_56jpp8 1510505131 installed
<13>Jun 20 13:36:43 rpmi: maven-project-1:2.2.1-alt6_56jpp8 1510505131 installed
<13>Jun 20 13:36:43 rpmi: plexus-i18n-0:1.0-alt7_0.11.b10.4jpp8 1524312824 installed
<13>Jun 20 13:36:43 rpmi: plexus-velocity-0:1.2-alt1_4jpp8 1524376629 installed
<13>Jun 20 13:36:43 rpmi: xml-commons-resolver-0:1.2-alt1_24jpp8 1525932051 installed
<13>Jun 20 13:36:43 rpmi: xalan-j2-0:2.7.1-alt4_34jpp8 1525931290 installed
<13>Jun 20 13:36:43 rpmi: xerces-j2-0:2.11.0-alt3_31jpp8 1524211519 installed
<13>Jun 20 13:36:44 rpmi: batik-css-0:1.10-alt1_2jpp8 sisyphus+220497.100.1.2 1549284940 installed
<13>Jun 20 13:36:44 rpmi: batik-0:1.10-alt1_2jpp8 sisyphus+220497.100.1.2 1549284940 installed
<13>Jun 20 13:36:44 rpmi: xmlunit-0:1.6-alt1_7jpp8 1525933352 installed
<13>Jun 20 13:36:44 rpmi: maven-doxia-core-0:1.7-alt1_9jpp8 sisyphus+220185.100.1.1 1548779496 installed
<13>Jun 20 13:36:44 rpmi: maven-doxia-module-xhtml-0:1.7-alt1_9jpp8 sisyphus+220185.100.1.1 1548779496 installed
<13>Jun 20 13:36:44 rpmi: maven-doxia-module-markdown-0:1.7-alt1_9jpp8 sisyphus+220185.100.1.1 1548779496 installed
<13>Jun 20 13:36:44 rpmi: maven-doxia-module-apt-0:1.7-alt1_9jpp8 sisyphus+220185.100.1.1 1548779496 installed
<13>Jun 20 13:36:45 rpmi: maven-doxia-module-fml-0:1.7-alt1_9jpp8 sisyphus+220185.100.1.1 1548779496 installed
<13>Jun 20 13:36:45 rpmi: maven-doxia-module-xdoc-0:1.7-alt1_9jpp8 sisyphus+220185.100.1.1 1548779496 installed
<13>Jun 20 13:36:45 rpmi: bsh-0:2.0-alt1_9.b6jpp8 1525885592 installed
<13>Jun 20 13:36:45 rpmi: xmvn-subst-3.0.0-alt1_18jpp8 1527991448 installed
<13>Jun 20 13:36:45 rpmi: xmvn-resolve-3.0.0-alt1_18jpp8 1527991448 installed
<13>Jun 20 13:36:45 rpmi: python3-module-genshi-0.7-alt2 sisyphus+229363.100.1.1 1557847335 installed
<13>Jun 20 13:36:45 rpmi: python3-module-webencodings-0.5.1-alt1.1 1517943573 installed
<13>Jun 20 13:36:45 rpmi: python3-module-cssselect-0.9.1-alt1.2 sisyphus+227479.1100.1.2 1555757152 installed
<13>Jun 20 13:36:45 rpmi: python3-module-html5lib-1:0.999999999-alt4.qa1 sisyphus+227493.600.1.3 1555835341 installed
<13>Jun 20 13:36:45 rpmi: python3-module-lxml-4.4.2-alt1 p9+244111.100.1.1 1578758819 installed
<13>Jun 20 13:36:45 rpmi: python3-module-javapackages-1:5.0.0-alt1_12jpp8.M90P.1 p9+263388.100.2.1 1608141549 installed
<13>Jun 20 13:36:45 rpmi: javapackages-local-1:5.0.0-alt1_12jpp8.M90P.1 p9+263388.100.2.1 1608141549 installed
<13>Jun 20 13:36:45 rpmi: rpm-build-java-1:5.0.0-alt1_12jpp8.M90P.1 p9+263388.100.2.1 1608141549 installed
<13>Jun 20 13:36:45 rpmi: ca-trust-java-0.1.2-alt1 p9+233349.100.1.1 1561655062 installed
<13>Jun 20 13:36:46 rpmi: libnss-3.56.0-alt1 p9+254920.30.20.1 1601657872 installed
<13>Jun 20 13:36:50 rpmi: java-1.8.0-openjdk-headless-0:1.8.0.212.b04-alt2_0jpp8 p9+234508.100.3.1 1563175746 installed
<13>Jun 20 13:36:52 rpmi: java-stub-javadoc-0.1-alt1 1229813340 installed
<13>Jun 20 13:36:52 rpmi: alsa-ucm-conf-1.2.4-alt1 p9+250722.2300.14.1 1614269485 installed
<13>Jun 20 13:36:52 rpmi: alsa-topology-conf-1.2.4-alt1 p9+250722.2200.14.1 1614269467 installed
<13>Jun 20 13:36:52 rpmi: libalsa-1:1.2.4-alt1 p9+250722.2400.14.1 1614269556 installed
<13>Jun 20 13:36:53 rpmi: java-1.8.0-openjdk-0:1.8.0.212.b04-alt2_0jpp8 p9+234508.100.3.1 1563175746 installed
<13>Jun 20 13:36:53 rpmi: fop-0:2.0-alt1_9jpp8 1524189893 installed
<13>Jun 20 13:36:53 rpmi: maven-doxia-module-fo-0:1.7-alt1_9jpp8 sisyphus+220185.100.1.1 1548779496 installed
<13>Jun 20 13:36:53 rpmi: maven-doxia-sitetools-0:1.7.5-alt1_1jpp8 1511392380 installed
<13>Jun 20 13:36:53 rpmi: maven-reporting-impl-3.0.0-alt1_1jpp8 1511427039 installed
<13>Jun 20 13:36:53 rpmi: maven-javadoc-plugin-3.0.0-alt1_4jpp8 1527985821 installed
<13>Jun 20 13:36:55 rpmi: java-1.8.0-openjdk-devel-0:1.8.0.212.b04-alt2_0jpp8 p9+234508.100.3.1 1563175746 installed
<13>Jun 20 13:36:55 rpmi: jpackage-generic-compat-0.29-alt1 1523537205 installed
<13>Jun 20 13:36:55 rpmi: maven-local-1:5.0.0-alt1_12jpp8.M90P.1 p9+263388.100.2.1 1608141549 installed
<13>Jun 20 13:36:55 rpmi: maven-plugin-bundle-3.5.0-alt1_1jpp8 1525822813 installed
<13>Jun 20 13:36:55 rpmi: maven-surefire-report-plugin-0:2.21.0-alt1_1jpp8 1527848673 installed
<13>Jun 20 13:36:55 rpmi: maven-plugin-build-helper-1.9.1-alt1_5jpp8 1510513188 installed
<13>Jun 20 13:36:55 rpmi: exec-maven-plugin-1.6.0-alt1_4jpp8 sisyphus+220915.100.1.2 1549635346 installed
<13>Jun 20 13:36:55 rpmi: maven-antrun-plugin-1.8-alt1_5jpp8 1510505790 installed
<13>Jun 20 13:36:55 rpmi: assertj-core-3.8.0-alt1_3jpp8 sisyphus+220649.100.1.2 1549437602 installed
<13>Jun 20 13:36:55 rpmi: jboss-parent-0:20-alt1_5jpp8 sisyphus+221881.100.1.1 1550460473 installed
<13>Jun 20 13:36:55 rpmi: protobuf-compiler-3.6.1.3-alt2 sisyphus+227259.100.1.1 1555610584 installed
<13>Jun 20 13:36:55 rpmi: jboss-logging-tools-2.0.1-alt1_7jpp8 sisyphus+221872.100.1.1 1550464230 installed
<13>Jun 20 13:36:55 rpmi: javassist-0:3.18.1-alt1_9jpp8 sisyphus+221818.100.1.1 1550433048 installed
<13>Jun 20 13:36:55 rpmi: jboss-logging-3.3.0-alt1_5jpp8 sisyphus+221870.100.1.1 1550465412 installed
<13>Jun 20 13:36:55 rpmi: jboss-marshalling-1.4.11-alt1_5jpp8 sisyphus+221875.100.1.1 1550466866 installed
<13>Jun 20 13:36:55 rpmi: jcip-annotations-1:1-alt3_24.20060626jpp8 sisyphus+221976.100.1.1 1550544445 installed
<13>Jun 20 13:36:55 rpmi: protobuf-java-3.6.1.3-alt2 sisyphus+227259.100.1.1 1555610513 installed
<13>Jun 20 13:36:55 rpmi: protoparser-3.1.5-alt1_4jpp8 1524377471 installed
Building target platforms: i586
Building for target i586
Wrote: /usr/src/in/nosrpm/protostream-3.0.4-alt1_5jpp8.nosrc.rpm (w1.gzdio)
Installing protostream-3.0.4-alt1_5jpp8.src.rpm
Building target platforms: i586
Building for target i586
Executing(%prep): /bin/sh -e /usr/src/tmp/rpm-tmp.82551
+ umask 022
+ /bin/mkdir -p /usr/src/RPM/BUILD
+ cd /usr/src/RPM/BUILD
+ cd /usr/src/RPM/BUILD
+ rm -rf protostream-3.0.4.Final
+ echo 'Source #0 (protostream-3.0.4.Final.tar.gz):'
Source #0 (protostream-3.0.4.Final.tar.gz):
+ /bin/tar -xf -
+ /bin/gzip -dc /usr/src/RPM/SOURCES/protostream-3.0.4.Final.tar.gz
+ cd protostream-3.0.4.Final
+ /bin/chmod -c -Rf u+rwX,go-w .
+ /usr/bin/python3 /usr/share/java-utils/pom_editor.py pom_xpath_set pom:properties/pom:version.log4j 12 parent
/usr/share/java-utils/pom_editor.py:203: DeprecationWarning: inspect.getargspec() is deprecated since Python 3.0, use inspect.signature() or inspect.getfullargspec()
(arglist, _, _, defaults) = inspect.getargspec(function)
+ /usr/bin/python3 /usr/share/java-utils/pom_editor.py pom_change_dep :log4j '::${version.log4j}' core
/usr/share/java-utils/pom_editor.py:203: DeprecationWarning: inspect.getargspec() is deprecated since Python 3.0, use inspect.signature() or inspect.getfullargspec()
(arglist, _, _, defaults) = inspect.getargspec(function)
+ /usr/bin/python3 /usr/share/java-utils/pom_editor.py pom_remove_plugin -r :maven-source-plugin
/usr/share/java-utils/pom_editor.py:203: DeprecationWarning: inspect.getargspec() is deprecated since Python 3.0, use inspect.signature() or inspect.getfullargspec()
(arglist, _, _, defaults) = inspect.getargspec(function)
+ /usr/bin/python3 /usr/share/java-utils/pom_editor.py pom_remove_plugin -r :maven-compiler-plugin
/usr/share/java-utils/pom_editor.py:203: DeprecationWarning: inspect.getargspec() is deprecated since Python 3.0, use inspect.signature() or inspect.getfullargspec()
(arglist, _, _, defaults) = inspect.getargspec(function)
+ /usr/bin/python3 /usr/share/java-utils/pom_editor.py pom_remove_plugin :maven-shade-plugin core
/usr/share/java-utils/pom_editor.py:203: DeprecationWarning: inspect.getargspec() is deprecated since Python 3.0, use inspect.signature() or inspect.getfullargspec()
(arglist, _, _, defaults) = inspect.getargspec(function)
+ /usr/bin/python3 /usr/share/java-utils/pom_editor.py pom_remove_plugin :maven-bundle-plugin core
/usr/share/java-utils/pom_editor.py:203: DeprecationWarning: inspect.getargspec() is deprecated since Python 3.0, use inspect.signature() or inspect.getfullargspec()
(arglist, _, _, defaults) = inspect.getargspec(function)
+ /usr/bin/python3 /usr/share/java-utils/pom_editor.py pom_xpath_set pom:project/pom:packaging bundle core
/usr/share/java-utils/pom_editor.py:203: DeprecationWarning: inspect.getargspec() is deprecated since Python 3.0, use inspect.signature() or inspect.getfullargspec()
(arglist, _, _, defaults) = inspect.getargspec(function)
+ /usr/bin/python3 /usr/share/java-utils/pom_editor.py pom_add_plugin org.apache.felix:maven-bundle-plugin core '
true
true
${project.groupId}.sampledomain.*;version=${project.version};-split-package:=error
bundle-manifest
process-classes
manifest
'
/usr/share/java-utils/pom_editor.py:203: DeprecationWarning: inspect.getargspec() is deprecated since Python 3.0, use inspect.signature() or inspect.getfullargspec()
(arglist, _, _, defaults) = inspect.getargspec(function)
+ /usr/bin/python3 /usr/share/java-utils/pom_editor.py pom_change_dep org.easytesting:fest-assert-core org.assertj:assertj-core:2.0.0 core
/usr/share/java-utils/pom_editor.py:203: DeprecationWarning: inspect.getargspec() is deprecated since Python 3.0, use inspect.signature() or inspect.getfullargspec()
(arglist, _, _, defaults) = inspect.getargspec(function)
+ find ./core -name '*.java' -exec sed -i s/org.fest.assertions/org.assertj.core/g '{}' +
+ rm core/src/test/java/org/infinispan/protostream/impl/parser/impl/DescriptorsTest.java core/src/test/java/org/infinispan/protostream/annotations/impl/ProtoSchemaBuilderTest.java
+ exit 0
Executing(%build): /bin/sh -e /usr/src/tmp/rpm-tmp.96519
+ umask 022
+ /bin/mkdir -p /usr/src/RPM/BUILD
+ cd /usr/src/RPM/BUILD
+ cd protostream-3.0.4.Final
+ /usr/bin/python3 /usr/share/java-utils/mvn_build.py
Executing: xmvn --batch-mode --offline verify org.fedoraproject.xmvn:xmvn-mojo:install org.apache.maven.plugins:maven-javadoc-plugin:aggregate org.fedoraproject.xmvn:xmvn-mojo:builddep
['xmvn', '--batch-mode', '--offline', 'verify', 'org.fedoraproject.xmvn:xmvn-mojo:install', 'org.apache.maven.plugins:maven-javadoc-plugin:aggregate', 'org.fedoraproject.xmvn:xmvn-mojo:builddep']
[INFO] Scanning for projects...
[WARNING]
[WARNING] Some problems were encountered while building the effective model for org.infinispan.protostream:sample-domain-definition:bundle:3.0.4.Final
[WARNING] 'build.plugins.plugin.version' for org.apache.felix:maven-bundle-plugin is missing. @ org.infinispan.protostream:sample-domain-definition:[unknown-version], /usr/src/RPM/BUILD/protostream-3.0.4.Final/sample-domain-definition/pom.xml, line 32, column 18
[WARNING]
[WARNING] Some problems were encountered while building the effective model for org.infinispan.protostream:sample-domain-implementation:bundle:3.0.4.Final
[WARNING] 'build.plugins.plugin.version' for org.apache.felix:maven-bundle-plugin is missing. @ org.infinispan.protostream:sample-domain-implementation:[unknown-version], /usr/src/RPM/BUILD/protostream-3.0.4.Final/sample-domain-implementation/pom.xml, line 39, column 21
[WARNING]
[WARNING] It is highly recommended to fix these problems because they threaten the stability of your build.
[WARNING]
[WARNING] For this reason, future Maven versions might no longer support building such malformed projects.
[WARNING]
[INFO] ------------------------------------------------------------------------
[INFO] Reactor Build Order:
[INFO]
[INFO] Parent for all ProtoStream modules [pom]
[INFO] Sample domain model definitions in proto file [bundle]
[INFO] ProtoStream - core [bundle]
[INFO] Sample domain model implementation, including marshallers [bundle]
[INFO] Aggregator module for the ProtoStream project [pom]
[INFO]
[INFO] -----------------< org.infinispan.protostream:parent >------------------
[INFO] Building Parent for all ProtoStream modules 3.0.4.Final [1/5]
[INFO] --------------------------------[ pom ]---------------------------------
[INFO]
[INFO] --------< org.infinispan.protostream:sample-domain-definition >---------
[INFO] Building Sample domain model definitions in proto file 3.0.4.Final [2/5]
[INFO] -------------------------------[ bundle ]-------------------------------
[INFO]
[INFO] --- maven-resources-plugin:3.1.0:resources (default-resources) @ sample-domain-definition ---
[INFO] Using 'UTF-8' encoding to copy filtered resources.
[INFO] Copying 1 resource
[INFO]
[INFO] --- maven-compiler-plugin:3.7.0:compile (default-compile) @ sample-domain-definition ---
[INFO] No sources to compile
[INFO]
[INFO] --- maven-resources-plugin:3.1.0:testResources (default-testResources) @ sample-domain-definition ---
[INFO] Using 'UTF-8' encoding to copy filtered resources.
[INFO] skip non existing resourceDirectory /usr/src/RPM/BUILD/protostream-3.0.4.Final/sample-domain-definition/src/test/resources
[INFO]
[INFO] --- maven-compiler-plugin:3.7.0:testCompile (default-testCompile) @ sample-domain-definition ---
[INFO] No sources to compile
[INFO]
[INFO] --- maven-surefire-plugin:2.21.0:test (default-test) @ sample-domain-definition ---
[INFO] No tests to run.
[INFO]
[INFO] --- maven-bundle-plugin:3.5.0:bundle (default-bundle) @ sample-domain-definition ---
[INFO]
[INFO] ---------------< org.infinispan.protostream:protostream >---------------
[INFO] Building ProtoStream - core 3.0.4.Final [3/5]
[INFO] -------------------------------[ bundle ]-------------------------------
[WARNING] The POM for com.sun:tools:jar:any is missing, no dependency information available
[INFO]
[INFO] --- maven-resources-plugin:3.1.0:resources (default-resources) @ protostream ---
[INFO] Using 'UTF-8' encoding to copy filtered resources.
[INFO] Copying 1 resource
[INFO] Copying 1 resource
[INFO]
[INFO] --- maven-compiler-plugin:3.7.0:compile (default-compile) @ protostream ---
[INFO] Changes detected - recompiling the module!
[INFO] Compiling 94 source files to /usr/src/RPM/BUILD/protostream-3.0.4.Final/core/target/classes
[INFO] /usr/src/RPM/BUILD/protostream-3.0.4.Final/core/src/main/java/org/infinispan/protostream/impl/MessageMarshallerDelegate.java: Some input files use or override a deprecated API.
[INFO] /usr/src/RPM/BUILD/protostream-3.0.4.Final/core/src/main/java/org/infinispan/protostream/impl/MessageMarshallerDelegate.java: Recompile with -Xlint:deprecation for details.
[INFO] /usr/src/RPM/BUILD/protostream-3.0.4.Final/core/src/main/java/org/infinispan/protostream/impl/AnnotatedDescriptorImpl.java: Some input files use unchecked or unsafe operations.
[INFO] /usr/src/RPM/BUILD/protostream-3.0.4.Final/core/src/main/java/org/infinispan/protostream/impl/AnnotatedDescriptorImpl.java: Recompile with -Xlint:unchecked for details.
[INFO]
[INFO] --- maven-bundle-plugin:3.5.0:manifest (bundle-manifest) @ protostream ---
[WARNING] Manifest org.infinispan.protostream:protostream:bundle:3.0.4.Final : Unused Export-Package instructions: [org.infinispan.protostream.sampledomain.*]
[INFO]
[INFO] --- maven-resources-plugin:3.1.0:testResources (default-testResources) @ protostream ---
[INFO] Using 'UTF-8' encoding to copy filtered resources.
[INFO] Copying 4 resources
[INFO]
[INFO] --- maven-compiler-plugin:3.7.0:testCompile (default-testCompile) @ protostream ---
[INFO] Changes detected - recompiling the module!
[INFO] Compiling 36 source files to /usr/src/RPM/BUILD/protostream-3.0.4.Final/core/target/test-classes
[INFO] /usr/src/RPM/BUILD/protostream-3.0.4.Final/core/src/test/java/org/infinispan/protostream/domain/User.java: Some input files use or override a deprecated API.
[INFO] /usr/src/RPM/BUILD/protostream-3.0.4.Final/core/src/test/java/org/infinispan/protostream/domain/User.java: Recompile with -Xlint:deprecation for details.
[INFO] /usr/src/RPM/BUILD/protostream-3.0.4.Final/core/src/test/java/org/infinispan/protostream/WrappingTest.java: /usr/src/RPM/BUILD/protostream-3.0.4.Final/core/src/test/java/org/infinispan/protostream/WrappingTest.java uses unchecked or unsafe operations.
[INFO] /usr/src/RPM/BUILD/protostream-3.0.4.Final/core/src/test/java/org/infinispan/protostream/WrappingTest.java: Recompile with -Xlint:unchecked for details.
[INFO]
[INFO] --- maven-surefire-plugin:2.21.0:test (default-test) @ protostream ---
[INFO]
[INFO] -------------------------------------------------------
[INFO] T E S T S
[INFO] -------------------------------------------------------
[INFO] Running org.infinispan.protostream.config.AnnotationConfigTest
[INFO] Tests run: 3, Failures: 0, Errors: 0, Skipped: 0, Time elapsed: 0.156 s - in org.infinispan.protostream.config.AnnotationConfigTest
[INFO] Running org.infinispan.protostream.MarshallingTest
13:37:29,395 (main) DEBUG SerializationContextImpl - Registering proto files : [org/infinispan/protostream/message-wrapping.proto]
13:37:29,426 (main) DEBUG SerializationContextImpl - Registering file descriptor : fileName=org/infinispan/protostream/message-wrapping.proto types=[org.infinispan.protostream.WrappedMessage]
13:37:29,430 (main) DEBUG SerializationContextImpl - Registering proto files : [sample_bank_account/bank.proto]
13:37:29,442 (main) DEBUG SerializationContextImpl - Registering file descriptor : fileName=org/infinispan/protostream/message-wrapping.proto types=[org.infinispan.protostream.WrappedMessage]
13:37:29,443 (main) DEBUG SerializationContextImpl - Registering file descriptor : fileName=sample_bank_account/bank.proto types=[sample_bank_account.Transaction, sample_bank_account.User, sample_bank_account.Account, sample_bank_account.Account.Limits, sample_bank_account.int_array, sample_bank_account.User.Gender, sample_bank_account.User.Address, sample_bank_account.user_list]
13:37:29,546 (main) DEBUG SerializationContextImpl - Registering proto files : [org/infinispan/protostream/message-wrapping.proto]
13:37:29,547 (main) DEBUG SerializationContextImpl - Registering file descriptor : fileName=org/infinispan/protostream/message-wrapping.proto types=[org.infinispan.protostream.WrappedMessage]
13:37:29,547 (main) DEBUG SerializationContextImpl - Registering proto files : [sample_bank_account/bank.proto]
13:37:29,562 (main) DEBUG SerializationContextImpl - Registering file descriptor : fileName=org/infinispan/protostream/message-wrapping.proto types=[org.infinispan.protostream.WrappedMessage]
13:37:29,563 (main) DEBUG SerializationContextImpl - Registering file descriptor : fileName=sample_bank_account/bank.proto types=[sample_bank_account.Transaction, sample_bank_account.User, sample_bank_account.Account, sample_bank_account.Account.Limits, sample_bank_account.int_array, sample_bank_account.User.Gender, sample_bank_account.User.Address, sample_bank_account.user_list]
13:37:29,564 (main) WARN ProtoStreamReaderImpl - PROTOSTREAM000001: Field sample_bank_account.User.name was read out of sequence leading to sub-optimal performance
[INFO] Tests run: 2, Failures: 0, Errors: 0, Skipped: 0, Time elapsed: 0.239 s - in org.infinispan.protostream.MarshallingTest
[INFO] Running org.infinispan.protostream.ProtobufParserTest
13:37:29,576 (main) DEBUG SerializationContextImpl - Registering proto files : [org/infinispan/protostream/message-wrapping.proto]
13:37:29,577 (main) DEBUG SerializationContextImpl - Registering file descriptor : fileName=org/infinispan/protostream/message-wrapping.proto types=[org.infinispan.protostream.WrappedMessage]
13:37:29,578 (main) DEBUG SerializationContextImpl - Registering proto files : [sample_bank_account/bank.proto]
13:37:29,578 (main) DEBUG SerializationContextImpl - Registering file descriptor : fileName=org/infinispan/protostream/message-wrapping.proto types=[org.infinispan.protostream.WrappedMessage]
13:37:29,579 (main) DEBUG SerializationContextImpl - Registering file descriptor : fileName=sample_bank_account/bank.proto types=[sample_bank_account.Transaction, sample_bank_account.User, sample_bank_account.Account, sample_bank_account.Account.Limits, sample_bank_account.int_array, sample_bank_account.User.Gender, sample_bank_account.User.Address, sample_bank_account.user_list]
13:37:29,580 (main) TRACE ProtobufParserTest - onStart
13:37:29,581 (main) TRACE ProtobufParserTest - onTag wrappedDescriptorId 42
13:37:29,581 (main) TRACE ProtobufParserTest - onTag wrappedMessageBytes [B@9f9fb0
13:37:29,581 (main) TRACE ProtobufParserTest - onStart
13:37:29,581 (main) TRACE ProtobufParserTest - onTag id 1
13:37:29,581 (main) TRACE ProtobufParserTest - onTag accountIds 1
13:37:29,581 (main) TRACE ProtobufParserTest - onTag accountIds 3
13:37:29,581 (main) TRACE ProtobufParserTest - onTag name John
13:37:29,581 (main) TRACE ProtobufParserTest - onTag surname Batman
13:37:29,581 (main) TRACE ProtobufParserTest - onStartNested addresses
13:37:29,581 (main) TRACE ProtobufParserTest - onTag street Old Street
13:37:29,582 (main) TRACE ProtobufParserTest - onTag postCode XYZ42
13:37:29,582 (main) TRACE ProtobufParserTest - onTag number -12
13:37:29,582 (main) TRACE ProtobufParserTest - onEndNested addresses
13:37:29,582 (main) TRACE ProtobufParserTest - onTag gender 0
13:37:29,582 (main) TRACE ProtobufParserTest - onEnd
13:37:29,582 (main) TRACE ProtobufParserTest - onEnd
[INFO] Tests run: 1, Failures: 0, Errors: 0, Skipped: 0, Time elapsed: 0.019 s - in org.infinispan.protostream.ProtobufParserTest
[INFO] Running org.infinispan.protostream.impl.SerializationContextImplTest
13:37:29,583 (main) DEBUG SerializationContextImpl - Registering proto files : [org/infinispan/protostream/message-wrapping.proto]
13:37:29,584 (main) DEBUG SerializationContextImpl - Registering file descriptor : fileName=org/infinispan/protostream/message-wrapping.proto types=[org.infinispan.protostream.WrappedMessage]
13:37:29,584 (main) DEBUG SerializationContextImpl - Registering proto files : [file2.proto, file1.proto]
13:37:29,584 (main) DEBUG SerializationContextImpl - Registering file descriptor : fileName=org/infinispan/protostream/message-wrapping.proto types=[org.infinispan.protostream.WrappedMessage]
13:37:29,584 (main) DEBUG FileDescriptor - File resolved successfully : file1.proto
13:37:29,585 (main) DEBUG FileDescriptor - File has errors : file2.proto
13:37:29,585 (main) DEBUG SerializationContextImpl - Registering file descriptor : fileName=file1.proto types=[p.A]
[INFO] Tests run: 1, Failures: 0, Errors: 0, Skipped: 0, Time elapsed: 0.001 s - in org.infinispan.protostream.impl.SerializationContextImplTest
[INFO] Running org.infinispan.protostream.impl.UnknownFieldSetImplTest
13:37:29,586 (main) DEBUG SerializationContextImpl - Registering proto files : [org/infinispan/protostream/message-wrapping.proto]
13:37:29,591 (main) DEBUG SerializationContextImpl - Registering file descriptor : fileName=org/infinispan/protostream/message-wrapping.proto types=[org.infinispan.protostream.WrappedMessage]
13:37:29,592 (main) DEBUG SerializationContextImpl - Registering proto files : [sample_bank_account/bank.proto]
13:37:29,593 (main) DEBUG SerializationContextImpl - Registering file descriptor : fileName=org/infinispan/protostream/message-wrapping.proto types=[org.infinispan.protostream.WrappedMessage]
13:37:29,593 (main) DEBUG SerializationContextImpl - Registering file descriptor : fileName=sample_bank_account/bank.proto types=[sample_bank_account.Transaction, sample_bank_account.User, sample_bank_account.Account, sample_bank_account.Account.Limits, sample_bank_account.int_array, sample_bank_account.User.Gender, sample_bank_account.User.Address, sample_bank_account.user_list]
13:37:29,636 (main) DEBUG SerializationContextImpl - Registering proto files : [org/infinispan/protostream/message-wrapping.proto]
13:37:29,636 (main) DEBUG SerializationContextImpl - Registering file descriptor : fileName=org/infinispan/protostream/message-wrapping.proto types=[org.infinispan.protostream.WrappedMessage]
13:37:29,637 (main) DEBUG SerializationContextImpl - Registering proto files : [sample_bank_account/bank.proto]
13:37:29,646 (main) DEBUG SerializationContextImpl - Registering file descriptor : fileName=org/infinispan/protostream/message-wrapping.proto types=[org.infinispan.protostream.WrappedMessage]
13:37:29,646 (main) DEBUG SerializationContextImpl - Registering file descriptor : fileName=sample_bank_account/bank.proto types=[sample_bank_account.Transaction, sample_bank_account.User, sample_bank_account.Account, sample_bank_account.Account.Limits, sample_bank_account.int_array, sample_bank_account.User.Gender, sample_bank_account.User.Address, sample_bank_account.user_list]
[INFO] Tests run: 2, Failures: 0, Errors: 0, Skipped: 0, Time elapsed: 0.043 s - in org.infinispan.protostream.impl.UnknownFieldSetImplTest
[INFO] Running org.infinispan.protostream.impl.parser.AnnotationParserTest
13:37:29,648 (main) DEBUG AnnotationParserTest -
13:37:29,664 (main) DEBUG AnnotationParserTest - @XXX.yyy.zzzz(
value=false
)
@ABC(
x=some.class.or.enum,
y=45,
z=333333
)
@IndexedField2(
)
@IndexedField3(
value=Store.NO
)
@IndexedField4(
x=Store.NO,
y=true
)
@IndexedField5(
store=Store.YES,
quickAndDirty=true
)
@Test(
x=9,
cc={
34,
0,
{
34,
44
}
},
y=true,
y2=false,
y3=null,
b=45.9,
v=f,
xx=axxxxx\\xxxxxxxb,
_xx=,
yy=@Moooo(
)
)
@XXX.yyy.zz(
value=false
)
@ABCd(
)
@XXX(
)
@XXX2(
)
13:37:29,664 (main) DEBUG AnnotationParserTest - @Indexed(
)
[INFO] Tests run: 3, Failures: 0, Errors: 0, Skipped: 0, Time elapsed: 0.011 s - in org.infinispan.protostream.impl.parser.AnnotationParserTest
[INFO] Running org.infinispan.protostream.WrappingTest
13:37:29,673 (main) DEBUG SerializationContextImpl - Registering proto files : [org/infinispan/protostream/message-wrapping.proto]
13:37:29,673 (main) DEBUG SerializationContextImpl - Registering file descriptor : fileName=org/infinispan/protostream/message-wrapping.proto types=[org.infinispan.protostream.WrappedMessage]
13:37:29,674 (main) DEBUG SerializationContextImpl - Registering proto files : [sample_bank_account/bank.proto]
13:37:29,674 (main) DEBUG SerializationContextImpl - Registering file descriptor : fileName=org/infinispan/protostream/message-wrapping.proto types=[org.infinispan.protostream.WrappedMessage]
13:37:29,674 (main) DEBUG SerializationContextImpl - Registering file descriptor : fileName=sample_bank_account/bank.proto types=[sample_bank_account.Transaction, sample_bank_account.User, sample_bank_account.Account, sample_bank_account.Account.Limits, sample_bank_account.int_array, sample_bank_account.User.Gender, sample_bank_account.User.Address, sample_bank_account.user_list]
13:37:29,694 (main) DEBUG SerializationContextImpl - Registering proto files : [org/infinispan/protostream/message-wrapping.proto]
13:37:29,695 (main) DEBUG SerializationContextImpl - Registering file descriptor : fileName=org/infinispan/protostream/message-wrapping.proto types=[org.infinispan.protostream.WrappedMessage]
13:37:29,695 (main) DEBUG SerializationContextImpl - Registering proto files : [sample_bank_account/bank.proto]
13:37:29,696 (main) DEBUG SerializationContextImpl - Registering file descriptor : fileName=org/infinispan/protostream/message-wrapping.proto types=[org.infinispan.protostream.WrappedMessage]
13:37:29,696 (main) DEBUG SerializationContextImpl - Registering file descriptor : fileName=sample_bank_account/bank.proto types=[sample_bank_account.Transaction, sample_bank_account.User, sample_bank_account.Account, sample_bank_account.Account.Limits, sample_bank_account.int_array, sample_bank_account.User.Gender, sample_bank_account.User.Address, sample_bank_account.user_list]
13:37:29,697 (main) DEBUG SerializationContextImpl - Registering proto files : [org/infinispan/protostream/message-wrapping.proto]
13:37:29,698 (main) DEBUG SerializationContextImpl - Registering file descriptor : fileName=org/infinispan/protostream/message-wrapping.proto types=[org.infinispan.protostream.WrappedMessage]
13:37:29,698 (main) DEBUG SerializationContextImpl - Registering proto files : [sample_bank_account/bank.proto]
13:37:29,721 (main) DEBUG SerializationContextImpl - Registering file descriptor : fileName=org/infinispan/protostream/message-wrapping.proto types=[org.infinispan.protostream.WrappedMessage]
13:37:29,721 (main) DEBUG SerializationContextImpl - Registering file descriptor : fileName=sample_bank_account/bank.proto types=[sample_bank_account.Transaction, sample_bank_account.User, sample_bank_account.Account, sample_bank_account.Account.Limits, sample_bank_account.int_array, sample_bank_account.User.Gender, sample_bank_account.User.Address, sample_bank_account.user_list]
13:37:29,722 (main) DEBUG SerializationContextImpl - Registering proto files : [org/infinispan/protostream/message-wrapping.proto]
13:37:29,723 (main) DEBUG SerializationContextImpl - Registering file descriptor : fileName=org/infinispan/protostream/message-wrapping.proto types=[org.infinispan.protostream.WrappedMessage]
13:37:29,723 (main) DEBUG SerializationContextImpl - Registering proto files : [sample_bank_account/bank.proto]
13:37:29,723 (main) DEBUG SerializationContextImpl - Registering file descriptor : fileName=org/infinispan/protostream/message-wrapping.proto types=[org.infinispan.protostream.WrappedMessage]
13:37:29,724 (main) DEBUG SerializationContextImpl - Registering file descriptor : fileName=sample_bank_account/bank.proto types=[sample_bank_account.Transaction, sample_bank_account.User, sample_bank_account.Account, sample_bank_account.Account.Limits, sample_bank_account.int_array, sample_bank_account.User.Gender, sample_bank_account.User.Address, sample_bank_account.user_list]
13:37:29,749 (main) DEBUG SerializationContextImpl - Registering proto files : [org/infinispan/protostream/message-wrapping.proto]
13:37:29,749 (main) DEBUG SerializationContextImpl - Registering file descriptor : fileName=org/infinispan/protostream/message-wrapping.proto types=[org.infinispan.protostream.WrappedMessage]
13:37:29,750 (main) DEBUG SerializationContextImpl - Registering proto files : [sample_bank_account/bank.proto]
13:37:29,751 (main) DEBUG SerializationContextImpl - Registering file descriptor : fileName=org/infinispan/protostream/message-wrapping.proto types=[org.infinispan.protostream.WrappedMessage]
13:37:29,751 (main) DEBUG SerializationContextImpl - Registering file descriptor : fileName=sample_bank_account/bank.proto types=[sample_bank_account.Transaction, sample_bank_account.User, sample_bank_account.Account, sample_bank_account.Account.Limits, sample_bank_account.int_array, sample_bank_account.User.Gender, sample_bank_account.User.Address, sample_bank_account.user_list]
13:37:29,751 (main) DEBUG SerializationContextImpl - Registering proto files : [org/infinispan/protostream/message-wrapping.proto]
13:37:29,752 (main) DEBUG SerializationContextImpl - Registering file descriptor : fileName=org/infinispan/protostream/message-wrapping.proto types=[org.infinispan.protostream.WrappedMessage]
13:37:29,752 (main) DEBUG SerializationContextImpl - Registering proto files : [sample_bank_account/bank.proto]
13:37:29,772 (main) DEBUG SerializationContextImpl - Registering file descriptor : fileName=org/infinispan/protostream/message-wrapping.proto types=[org.infinispan.protostream.WrappedMessage]
13:37:29,773 (main) DEBUG SerializationContextImpl - Registering file descriptor : fileName=sample_bank_account/bank.proto types=[sample_bank_account.Transaction, sample_bank_account.User, sample_bank_account.Account, sample_bank_account.Account.Limits, sample_bank_account.int_array, sample_bank_account.User.Gender, sample_bank_account.User.Address, sample_bank_account.user_list]
13:37:29,773 (main) WARN ProtoStreamReaderImpl - PROTOSTREAM000001: Field sample_bank_account.User.name was read out of sequence leading to sub-optimal performance
13:37:29,774 (main) DEBUG SerializationContextImpl - Registering proto files : [org/infinispan/protostream/message-wrapping.proto]
13:37:29,774 (main) DEBUG SerializationContextImpl - Registering file descriptor : fileName=org/infinispan/protostream/message-wrapping.proto types=[org.infinispan.protostream.WrappedMessage]
13:37:29,774 (main) DEBUG SerializationContextImpl - Registering proto files : [sample_bank_account/bank.proto]
13:37:29,775 (main) DEBUG SerializationContextImpl - Registering file descriptor : fileName=org/infinispan/protostream/message-wrapping.proto types=[org.infinispan.protostream.WrappedMessage]
13:37:29,775 (main) DEBUG SerializationContextImpl - Registering file descriptor : fileName=sample_bank_account/bank.proto types=[sample_bank_account.Transaction, sample_bank_account.User, sample_bank_account.Account, sample_bank_account.Account.Limits, sample_bank_account.int_array, sample_bank_account.User.Gender, sample_bank_account.User.Address, sample_bank_account.user_list]
13:37:29,796 (main) WARN ProtoStreamReaderImpl - PROTOSTREAM000001: Field sample_bank_account.User.name was read out of sequence leading to sub-optimal performance
13:37:29,796 (main) WARN ProtoStreamReaderImpl - PROTOSTREAM000001: Field sample_bank_account.User.name was read out of sequence leading to sub-optimal performance
13:37:29,796 (main) WARN ProtoStreamReaderImpl - PROTOSTREAM000001: Field sample_bank_account.User.name was read out of sequence leading to sub-optimal performance
13:37:29,797 (main) DEBUG SerializationContextImpl - Registering proto files : [org/infinispan/protostream/message-wrapping.proto]
13:37:29,797 (main) DEBUG SerializationContextImpl - Registering file descriptor : fileName=org/infinispan/protostream/message-wrapping.proto types=[org.infinispan.protostream.WrappedMessage]
13:37:29,798 (main) DEBUG SerializationContextImpl - Registering proto files : [sample_bank_account/bank.proto]
13:37:29,816 (main) DEBUG SerializationContextImpl - Registering file descriptor : fileName=org/infinispan/protostream/message-wrapping.proto types=[org.infinispan.protostream.WrappedMessage]
13:37:29,817 (main) DEBUG SerializationContextImpl - Registering file descriptor : fileName=sample_bank_account/bank.proto types=[sample_bank_account.Transaction, sample_bank_account.User, sample_bank_account.Account, sample_bank_account.Account.Limits, sample_bank_account.int_array, sample_bank_account.User.Gender, sample_bank_account.User.Address, sample_bank_account.user_list]
13:37:29,817 (main) DEBUG SerializationContextImpl - Registering proto files : [org/infinispan/protostream/message-wrapping.proto]
13:37:29,818 (main) DEBUG SerializationContextImpl - Registering file descriptor : fileName=org/infinispan/protostream/message-wrapping.proto types=[org.infinispan.protostream.WrappedMessage]
13:37:29,818 (main) DEBUG SerializationContextImpl - Registering proto files : [sample_bank_account/bank.proto]
13:37:29,818 (main) DEBUG SerializationContextImpl - Registering file descriptor : fileName=org/infinispan/protostream/message-wrapping.proto types=[org.infinispan.protostream.WrappedMessage]
13:37:29,819 (main) DEBUG SerializationContextImpl - Registering file descriptor : fileName=sample_bank_account/bank.proto types=[sample_bank_account.Transaction, sample_bank_account.User, sample_bank_account.Account, sample_bank_account.Account.Limits, sample_bank_account.int_array, sample_bank_account.User.Gender, sample_bank_account.User.Address, sample_bank_account.user_list]
13:37:29,844 (main) DEBUG SerializationContextImpl - Registering proto files : [org/infinispan/protostream/message-wrapping.proto]
13:37:29,844 (main) DEBUG SerializationContextImpl - Registering file descriptor : fileName=org/infinispan/protostream/message-wrapping.proto types=[org.infinispan.protostream.WrappedMessage]
13:37:29,844 (main) DEBUG SerializationContextImpl - Registering proto files : [sample_bank_account/bank.proto]
13:37:29,845 (main) DEBUG SerializationContextImpl - Registering file descriptor : fileName=org/infinispan/protostream/message-wrapping.proto types=[org.infinispan.protostream.WrappedMessage]
13:37:29,845 (main) DEBUG SerializationContextImpl - Registering file descriptor : fileName=sample_bank_account/bank.proto types=[sample_bank_account.Transaction, sample_bank_account.User, sample_bank_account.Account, sample_bank_account.Account.Limits, sample_bank_account.int_array, sample_bank_account.User.Gender, sample_bank_account.User.Address, sample_bank_account.user_list]
13:37:29,846 (main) DEBUG SerializationContextImpl - Registering proto files : [org/infinispan/protostream/message-wrapping.proto]
13:37:29,846 (main) DEBUG SerializationContextImpl - Registering file descriptor : fileName=org/infinispan/protostream/message-wrapping.proto types=[org.infinispan.protostream.WrappedMessage]
13:37:29,869 (main) DEBUG SerializationContextImpl - Registering proto files : [sample_bank_account/bank.proto]
13:37:29,869 (main) DEBUG SerializationContextImpl - Registering file descriptor : fileName=org/infinispan/protostream/message-wrapping.proto types=[org.infinispan.protostream.WrappedMessage]
13:37:29,870 (main) DEBUG SerializationContextImpl - Registering file descriptor : fileName=sample_bank_account/bank.proto types=[sample_bank_account.Transaction, sample_bank_account.User, sample_bank_account.Account, sample_bank_account.Account.Limits, sample_bank_account.int_array, sample_bank_account.User.Gender, sample_bank_account.User.Address, sample_bank_account.user_list]
13:37:29,870 (main) DEBUG SerializationContextImpl - Registering proto files : [org/infinispan/protostream/message-wrapping.proto]
13:37:29,871 (main) DEBUG SerializationContextImpl - Registering file descriptor : fileName=org/infinispan/protostream/message-wrapping.proto types=[org.infinispan.protostream.WrappedMessage]
13:37:29,871 (main) DEBUG SerializationContextImpl - Registering proto files : [sample_bank_account/bank.proto]
13:37:29,871 (main) DEBUG SerializationContextImpl - Registering file descriptor : fileName=org/infinispan/protostream/message-wrapping.proto types=[org.infinispan.protostream.WrappedMessage]
13:37:29,871 (main) DEBUG SerializationContextImpl - Registering file descriptor : fileName=sample_bank_account/bank.proto types=[sample_bank_account.Transaction, sample_bank_account.User, sample_bank_account.Account, sample_bank_account.Account.Limits, sample_bank_account.int_array, sample_bank_account.User.Gender, sample_bank_account.User.Address, sample_bank_account.user_list]
13:37:29,872 (main) DEBUG SerializationContextImpl - Registering proto files : [org/infinispan/protostream/message-wrapping.proto]
13:37:29,896 (main) DEBUG SerializationContextImpl - Registering file descriptor : fileName=org/infinispan/protostream/message-wrapping.proto types=[org.infinispan.protostream.WrappedMessage]
13:37:29,897 (main) DEBUG SerializationContextImpl - Registering proto files : [sample_bank_account/bank.proto]
13:37:29,897 (main) DEBUG SerializationContextImpl - Registering file descriptor : fileName=org/infinispan/protostream/message-wrapping.proto types=[org.infinispan.protostream.WrappedMessage]
13:37:29,897 (main) DEBUG SerializationContextImpl - Registering file descriptor : fileName=sample_bank_account/bank.proto types=[sample_bank_account.Transaction, sample_bank_account.User, sample_bank_account.Account, sample_bank_account.Account.Limits, sample_bank_account.int_array, sample_bank_account.User.Gender, sample_bank_account.User.Address, sample_bank_account.user_list]
13:37:29,898 (main) DEBUG SerializationContextImpl - Registering proto files : [org/infinispan/protostream/message-wrapping.proto]
13:37:29,898 (main) DEBUG SerializationContextImpl - Registering file descriptor : fileName=org/infinispan/protostream/message-wrapping.proto types=[org.infinispan.protostream.WrappedMessage]
13:37:29,899 (main) DEBUG SerializationContextImpl - Registering proto files : [sample_bank_account/bank.proto]
13:37:29,899 (main) DEBUG SerializationContextImpl - Registering file descriptor : fileName=org/infinispan/protostream/message-wrapping.proto types=[org.infinispan.protostream.WrappedMessage]
13:37:29,919 (main) DEBUG SerializationContextImpl - Registering file descriptor : fileName=sample_bank_account/bank.proto types=[sample_bank_account.Transaction, sample_bank_account.User, sample_bank_account.Account, sample_bank_account.Account.Limits, sample_bank_account.int_array, sample_bank_account.User.Gender, sample_bank_account.User.Address, sample_bank_account.user_list]
13:37:29,920 (main) DEBUG SerializationContextImpl - Registering proto files : [org/infinispan/protostream/message-wrapping.proto]
13:37:29,920 (main) DEBUG SerializationContextImpl - Registering file descriptor : fileName=org/infinispan/protostream/message-wrapping.proto types=[org.infinispan.protostream.WrappedMessage]
13:37:29,920 (main) DEBUG SerializationContextImpl - Registering proto files : [sample_bank_account/bank.proto]
13:37:29,921 (main) DEBUG SerializationContextImpl - Registering file descriptor : fileName=org/infinispan/protostream/message-wrapping.proto types=[org.infinispan.protostream.WrappedMessage]
13:37:29,921 (main) DEBUG SerializationContextImpl - Registering file descriptor : fileName=sample_bank_account/bank.proto types=[sample_bank_account.Transaction, sample_bank_account.User, sample_bank_account.Account, sample_bank_account.Account.Limits, sample_bank_account.int_array, sample_bank_account.User.Gender, sample_bank_account.User.Address, sample_bank_account.user_list]
[INFO] Tests run: 14, Failures: 0, Errors: 0, Skipped: 0, Time elapsed: 0.396 s - in org.infinispan.protostream.WrappingTest
[INFO] Running org.infinispan.protostream.test.AnnotationsPerformanceTest
[WARNING] Tests run: 1, Failures: 0, Errors: 0, Skipped: 1, Time elapsed: 0.001 s - in org.infinispan.protostream.test.AnnotationsPerformanceTest
[INFO] Running org.infinispan.protostream.test.PerformanceTest
[WARNING] Tests run: 1, Failures: 0, Errors: 0, Skipped: 1, Time elapsed: 0.001 s - in org.infinispan.protostream.test.PerformanceTest
[INFO]
[INFO] Results:
[INFO]
[WARNING] Tests run: 28, Failures: 0, Errors: 0, Skipped: 2
[INFO]
[INFO]
[INFO] --- maven-bundle-plugin:3.5.0:bundle (default-bundle) @ protostream ---
[WARNING] Bundle org.infinispan.protostream:protostream:bundle:3.0.4.Final : Unused Export-Package instructions: [org.infinispan.protostream.sampledomain.*]
[INFO]
[INFO] --- build-helper-maven-plugin:1.9.1:attach-artifact (attach-artifacts) @ protostream ---
[INFO]
[INFO] >>> maven-surefire-report-plugin:2.21.0:report (default) > [surefire]test @ protostream >>>
[INFO]
[INFO] --- maven-resources-plugin:3.1.0:resources (default-resources) @ protostream ---
[INFO] Using 'UTF-8' encoding to copy filtered resources.
[INFO] Copying 1 resource
[INFO] Copying 1 resource
[INFO]
[INFO] --- maven-compiler-plugin:3.7.0:compile (default-compile) @ protostream ---
[INFO] Changes detected - recompiling the module!
[INFO] Compiling 94 source files to /usr/src/RPM/BUILD/protostream-3.0.4.Final/core/target/classes
[INFO] /usr/src/RPM/BUILD/protostream-3.0.4.Final/core/src/main/java/org/infinispan/protostream/impl/MessageMarshallerDelegate.java: Some input files use or override a deprecated API.
[INFO] /usr/src/RPM/BUILD/protostream-3.0.4.Final/core/src/main/java/org/infinispan/protostream/impl/MessageMarshallerDelegate.java: Recompile with -Xlint:deprecation for details.
[INFO] /usr/src/RPM/BUILD/protostream-3.0.4.Final/core/src/main/java/org/infinispan/protostream/impl/AnnotatedDescriptorImpl.java: Some input files use unchecked or unsafe operations.
[INFO] /usr/src/RPM/BUILD/protostream-3.0.4.Final/core/src/main/java/org/infinispan/protostream/impl/AnnotatedDescriptorImpl.java: Recompile with -Xlint:unchecked for details.
[INFO]
[INFO] --- maven-bundle-plugin:3.5.0:manifest (bundle-manifest) @ protostream ---
[WARNING] Manifest org.infinispan.protostream:protostream:bundle:3.0.4.Final : Unused Export-Package instructions: [org.infinispan.protostream.sampledomain.*]
[INFO]
[INFO] --- maven-resources-plugin:3.1.0:testResources (default-testResources) @ protostream ---
[INFO] Using 'UTF-8' encoding to copy filtered resources.
[INFO] Copying 4 resources
[INFO]
[INFO] --- maven-compiler-plugin:3.7.0:testCompile (default-testCompile) @ protostream ---
[INFO] Nothing to compile - all classes are up to date
[INFO]
[INFO] --- maven-surefire-plugin:2.21.0:test (default-test) @ protostream ---
[INFO] Skipping execution of surefire because it has already been run for this configuration
[INFO]
[INFO] <<< maven-surefire-report-plugin:2.21.0:report (default) < [surefire]test @ protostream <<<
[INFO]
[INFO]
[INFO] --- maven-surefire-report-plugin:2.21.0:report (default) @ protostream ---
[WARNING] Unable to locate Test Source XRef to link to - DISABLED
[INFO]
[INFO] ------< org.infinispan.protostream:sample-domain-implementation >-------
[INFO] Building Sample domain model implementation, including marshallers 3.0.4.Final [4/5]
[INFO] -------------------------------[ bundle ]-------------------------------
[INFO]
[INFO] --- maven-resources-plugin:3.1.0:resources (default-resources) @ sample-domain-implementation ---
[INFO] Using 'UTF-8' encoding to copy filtered resources.
[INFO] skip non existing resourceDirectory /usr/src/RPM/BUILD/protostream-3.0.4.Final/sample-domain-implementation/src/main/resources
[INFO]
[INFO] --- maven-compiler-plugin:3.7.0:compile (default-compile) @ sample-domain-implementation ---
[INFO] Changes detected - recompiling the module!
[INFO] Compiling 12 source files to /usr/src/RPM/BUILD/protostream-3.0.4.Final/sample-domain-implementation/target/classes
[INFO] /usr/src/RPM/BUILD/protostream-3.0.4.Final/sample-domain-implementation/src/main/java/org/infinispan/protostream/sampledomain/Address.java: Some input files use or override a deprecated API.
[INFO] /usr/src/RPM/BUILD/protostream-3.0.4.Final/sample-domain-implementation/src/main/java/org/infinispan/protostream/sampledomain/Address.java: Recompile with -Xlint:deprecation for details.
[INFO]
[INFO] --- maven-resources-plugin:3.1.0:testResources (default-testResources) @ sample-domain-implementation ---
[INFO] Using 'UTF-8' encoding to copy filtered resources.
[INFO] skip non existing resourceDirectory /usr/src/RPM/BUILD/protostream-3.0.4.Final/sample-domain-implementation/src/test/resources
[INFO]
[INFO] --- maven-compiler-plugin:3.7.0:testCompile (default-testCompile) @ sample-domain-implementation ---
[INFO] No sources to compile
[INFO]
[INFO] --- maven-surefire-plugin:2.21.0:test (default-test) @ sample-domain-implementation ---
[INFO] No tests to run.
[INFO]
[INFO] --- maven-bundle-plugin:3.5.0:bundle (default-bundle) @ sample-domain-implementation ---
[INFO]
[INFO] >>> maven-surefire-report-plugin:2.21.0:report (default) > [surefire]test @ sample-domain-implementation >>>
[INFO]
[INFO] --- maven-resources-plugin:3.1.0:resources (default-resources) @ sample-domain-implementation ---
[INFO] Using 'UTF-8' encoding to copy filtered resources.
[INFO] skip non existing resourceDirectory /usr/src/RPM/BUILD/protostream-3.0.4.Final/sample-domain-implementation/src/main/resources
[INFO]
[INFO] --- maven-compiler-plugin:3.7.0:compile (default-compile) @ sample-domain-implementation ---
[INFO] Nothing to compile - all classes are up to date
[INFO]
[INFO] --- maven-resources-plugin:3.1.0:testResources (default-testResources) @ sample-domain-implementation ---
[INFO] Using 'UTF-8' encoding to copy filtered resources.
[INFO] skip non existing resourceDirectory /usr/src/RPM/BUILD/protostream-3.0.4.Final/sample-domain-implementation/src/test/resources
[INFO]
[INFO] --- maven-compiler-plugin:3.7.0:testCompile (default-testCompile) @ sample-domain-implementation ---
[INFO] No sources to compile
[INFO]
[INFO] --- maven-surefire-plugin:2.21.0:test (default-test) @ sample-domain-implementation ---
[INFO] No tests to run.
[INFO] Skipping execution of surefire because it has already been run for this configuration
[INFO]
[INFO] <<< maven-surefire-report-plugin:2.21.0:report (default) < [surefire]test @ sample-domain-implementation <<<
[INFO]
[INFO]
[INFO] --- maven-surefire-report-plugin:2.21.0:report (default) @ sample-domain-implementation ---
[WARNING] Unable to locate Test Source XRef to link to - DISABLED
[INFO]
[INFO] ---------< org.infinispan.protostream:protostream-aggregator >----------
[INFO] Building Aggregator module for the ProtoStream project 3.0.4.Final [5/5]
[INFO] --------------------------------[ pom ]---------------------------------
[INFO]
[INFO] >>> maven-surefire-report-plugin:2.21.0:report (default) > [surefire]test @ protostream-aggregator >>>
[INFO]
[INFO] <<< maven-surefire-report-plugin:2.21.0:report (default) < [surefire]test @ protostream-aggregator <<<
[INFO]
[INFO]
[INFO] --- maven-surefire-report-plugin:2.21.0:report (default) @ protostream-aggregator ---
[WARNING] Unable to locate Test Source XRef to link to - DISABLED
[INFO]
[INFO] ---------< org.infinispan.protostream:protostream-aggregator >----------
[INFO] Building Aggregator module for the ProtoStream project 3.0.4.Final [6/5]
[INFO] --------------------------------[ pom ]---------------------------------
[INFO]
[INFO] --- xmvn-mojo:3.0.0:install (default-cli) @ protostream-aggregator ---
[INFO]
[INFO] >>> maven-javadoc-plugin:3.0.0:aggregate (default-cli) > compile @ protostream-aggregator >>>
[INFO]
[INFO] >>>>>>>>>>>>>>>>>>>>>>>>>>>>>>>>>>>>>>>>>>>>>>>>>>>>>>>>>>>>>>>>>>>>>>>>
[INFO] Forking Sample domain model definitions in proto file 3.0.4.Final
[INFO] >>>>>>>>>>>>>>>>>>>>>>>>>>>>>>>>>>>>>>>>>>>>>>>>>>>>>>>>>>>>>>>>>>>>>>>>
[INFO]
[INFO] --- maven-resources-plugin:3.1.0:resources (default-resources) @ sample-domain-definition ---
[INFO] Using 'UTF-8' encoding to copy filtered resources.
[INFO] Copying 1 resource
[INFO]
[INFO] --- maven-compiler-plugin:3.7.0:compile (default-compile) @ sample-domain-definition ---
[INFO] No sources to compile
[INFO]
[INFO] >>>>>>>>>>>>>>>>>>>>>>>>>>>>>>>>>>>>>>>>>>>>>>>>>>>>>>>>>>>>>>>>>>>>>>>>
[INFO] Forking ProtoStream - core 3.0.4.Final
[INFO] >>>>>>>>>>>>>>>>>>>>>>>>>>>>>>>>>>>>>>>>>>>>>>>>>>>>>>>>>>>>>>>>>>>>>>>>
[INFO]
[INFO] --- maven-resources-plugin:3.1.0:resources (default-resources) @ protostream ---
[INFO] Using 'UTF-8' encoding to copy filtered resources.
[INFO] Copying 1 resource
[INFO] Copying 1 resource
[INFO]
[INFO] --- maven-compiler-plugin:3.7.0:compile (default-compile) @ protostream ---
[INFO] Changes detected - recompiling the module!
[INFO] Compiling 94 source files to /usr/src/RPM/BUILD/protostream-3.0.4.Final/core/target/classes
[INFO] /usr/src/RPM/BUILD/protostream-3.0.4.Final/core/src/main/java/org/infinispan/protostream/impl/MessageMarshallerDelegate.java: Some input files use or override a deprecated API.
[INFO] /usr/src/RPM/BUILD/protostream-3.0.4.Final/core/src/main/java/org/infinispan/protostream/impl/MessageMarshallerDelegate.java: Recompile with -Xlint:deprecation for details.
[INFO] /usr/src/RPM/BUILD/protostream-3.0.4.Final/core/src/main/java/org/infinispan/protostream/impl/AnnotatedDescriptorImpl.java: Some input files use unchecked or unsafe operations.
[INFO] /usr/src/RPM/BUILD/protostream-3.0.4.Final/core/src/main/java/org/infinispan/protostream/impl/AnnotatedDescriptorImpl.java: Recompile with -Xlint:unchecked for details.
[INFO]
[INFO] >>>>>>>>>>>>>>>>>>>>>>>>>>>>>>>>>>>>>>>>>>>>>>>>>>>>>>>>>>>>>>>>>>>>>>>>
[INFO] Forking Sample domain model implementation, including marshallers 3.0.4.Final
[INFO] >>>>>>>>>>>>>>>>>>>>>>>>>>>>>>>>>>>>>>>>>>>>>>>>>>>>>>>>>>>>>>>>>>>>>>>>
[INFO]
[INFO] --- maven-resources-plugin:3.1.0:resources (default-resources) @ sample-domain-implementation ---
[INFO] Using 'UTF-8' encoding to copy filtered resources.
[INFO] skip non existing resourceDirectory /usr/src/RPM/BUILD/protostream-3.0.4.Final/sample-domain-implementation/src/main/resources
[INFO]
[INFO] --- maven-compiler-plugin:3.7.0:compile (default-compile) @ sample-domain-implementation ---
[INFO] Nothing to compile - all classes are up to date
[INFO]
[INFO] <<< maven-javadoc-plugin:3.0.0:aggregate (default-cli) < compile @ protostream-aggregator <<<
[INFO]
[INFO]
[INFO] --- maven-javadoc-plugin:3.0.0:aggregate (default-cli) @ protostream-aggregator ---
[ERROR] no module descriptor for org.infinispan.protostream:protostream-aggregator
[ERROR] no module descriptor for org.infinispan.protostream:parent
[ERROR] no module descriptor for org.infinispan.protostream:sample-domain-definition
[ERROR] no module descriptor for org.infinispan.protostream:protostream
[ERROR] no module descriptor for org.infinispan.protostream:sample-domain-implementation
[INFO]
Loading source files for package org.infinispan.protostream...
Loading source files for package org.infinispan.protostream.impl...
Loading source files for package org.infinispan.protostream.impl.parser...
Loading source files for package org.infinispan.protostream.impl.parser.mappers...
Loading source files for package org.infinispan.protostream.descriptors...
Loading source files for package org.infinispan.protostream.config...
Loading source files for package org.infinispan.protostream.annotations...
Loading source files for package org.infinispan.protostream.annotations.impl...
Loading source files for package org.infinispan.protostream.sampledomain.marshallers...
Loading source files for package org.infinispan.protostream.sampledomain...
Constructing Javadoc information...
Standard Doclet version 1.8.0_212
Building tree for all the packages and classes...
Generating /usr/src/RPM/BUILD/protostream-3.0.4.Final/target/site/apidocs/org/infinispan/protostream/AnnotationMetadataCreator.html...
Generating /usr/src/RPM/BUILD/protostream-3.0.4.Final/target/site/apidocs/org/infinispan/protostream/AnnotationParserException.html...
Generating /usr/src/RPM/BUILD/protostream-3.0.4.Final/target/site/apidocs/org/infinispan/protostream/BaseMarshaller.html...
Generating /usr/src/RPM/BUILD/protostream-3.0.4.Final/target/site/apidocs/org/infinispan/protostream/BaseMessage.html...
Generating /usr/src/RPM/BUILD/protostream-3.0.4.Final/target/site/apidocs/org/infinispan/protostream/DescriptorParser.html...
Generating /usr/src/RPM/BUILD/protostream-3.0.4.Final/target/site/apidocs/org/infinispan/protostream/DescriptorParserException.html...
Generating /usr/src/RPM/BUILD/protostream-3.0.4.Final/target/site/apidocs/org/infinispan/protostream/EnumMarshaller.html...
Generating /usr/src/RPM/BUILD/protostream-3.0.4.Final/target/site/apidocs/org/infinispan/protostream/FileDescriptorSource.html...
Generating /usr/src/RPM/BUILD/protostream-3.0.4.Final/target/site/apidocs/org/infinispan/protostream/FileDescriptorSource.ProgressCallback.html...
Generating /usr/src/RPM/BUILD/protostream-3.0.4.Final/target/site/apidocs/org/infinispan/protostream/Message.html...
Generating /usr/src/RPM/BUILD/protostream-3.0.4.Final/target/site/apidocs/org/infinispan/protostream/MessageContext.html...
Generating /usr/src/RPM/BUILD/protostream-3.0.4.Final/target/site/apidocs/org/infinispan/protostream/MessageMarshaller.html...
Generating /usr/src/RPM/BUILD/protostream-3.0.4.Final/target/site/apidocs/org/infinispan/protostream/MessageMarshaller.ProtoStreamReader.html...
Generating /usr/src/RPM/BUILD/protostream-3.0.4.Final/target/site/apidocs/org/infinispan/protostream/MessageMarshaller.ProtoStreamWriter.html...
Generating /usr/src/RPM/BUILD/protostream-3.0.4.Final/target/site/apidocs/org/infinispan/protostream/ProtobufParser.html...
Generating /usr/src/RPM/BUILD/protostream-3.0.4.Final/target/site/apidocs/org/infinispan/protostream/ProtobufUtil.html...
Generating /usr/src/RPM/BUILD/protostream-3.0.4.Final/target/site/apidocs/org/infinispan/protostream/RawProtobufMarshaller.html...
Generating /usr/src/RPM/BUILD/protostream-3.0.4.Final/target/site/apidocs/org/infinispan/protostream/RawProtoStreamReader.html...
Generating /usr/src/RPM/BUILD/protostream-3.0.4.Final/target/site/apidocs/org/infinispan/protostream/RawProtoStreamWriter.html...
Generating /usr/src/RPM/BUILD/protostream-3.0.4.Final/target/site/apidocs/org/infinispan/protostream/SerializationContext.html...
Generating /usr/src/RPM/BUILD/protostream-3.0.4.Final/target/site/apidocs/org/infinispan/protostream/TagHandler.html...
Generating /usr/src/RPM/BUILD/protostream-3.0.4.Final/target/site/apidocs/org/infinispan/protostream/UnknownFieldSet.html...
Generating /usr/src/RPM/BUILD/protostream-3.0.4.Final/target/site/apidocs/org/infinispan/protostream/UnknownFieldSetHandler.html...
Generating /usr/src/RPM/BUILD/protostream-3.0.4.Final/target/site/apidocs/org/infinispan/protostream/WrappedMessage.html...
Generating /usr/src/RPM/BUILD/protostream-3.0.4.Final/target/site/apidocs/org/infinispan/protostream/WrappedMessage.Marshaller.html...
Generating /usr/src/RPM/BUILD/protostream-3.0.4.Final/target/site/apidocs/org/infinispan/protostream/impl/AnnotatedDescriptorImpl.html...
Generating /usr/src/RPM/BUILD/protostream-3.0.4.Final/target/site/apidocs/org/infinispan/protostream/impl/BaseMarshallerDelegate.html...
Generating /usr/src/RPM/BUILD/protostream-3.0.4.Final/target/site/apidocs/org/infinispan/protostream/impl/ByteArrayOutputStreamEx.html...
Generating /usr/src/RPM/BUILD/protostream-3.0.4.Final/target/site/apidocs/org/infinispan/protostream/impl/EnumMarshallerDelegate.html...
Generating /usr/src/RPM/BUILD/protostream-3.0.4.Final/target/site/apidocs/org/infinispan/protostream/impl/Log.html...
Generating /usr/src/RPM/BUILD/protostream-3.0.4.Final/target/site/apidocs/org/infinispan/protostream/impl/Log.LogFactory.html...
Generating /usr/src/RPM/BUILD/protostream-3.0.4.Final/target/site/apidocs/org/infinispan/protostream/impl/ProtocMessageMarshaller.html...
Generating /usr/src/RPM/BUILD/protostream-3.0.4.Final/target/site/apidocs/org/infinispan/protostream/impl/RawProtoStreamReaderImpl.html...
Generating /usr/src/RPM/BUILD/protostream-3.0.4.Final/target/site/apidocs/org/infinispan/protostream/impl/RawProtoStreamWriterImpl.html...
Generating /usr/src/RPM/BUILD/protostream-3.0.4.Final/target/site/apidocs/org/infinispan/protostream/impl/SerializationContextImpl.html...
Generating /usr/src/RPM/BUILD/protostream-3.0.4.Final/target/site/apidocs/org/infinispan/protostream/impl/WireFormat.html...
Generating /usr/src/RPM/BUILD/protostream-3.0.4.Final/target/site/apidocs/org/infinispan/protostream/impl/parser/AnnotationParser.html...
Generating /usr/src/RPM/BUILD/protostream-3.0.4.Final/target/site/apidocs/org/infinispan/protostream/impl/parser/SquareProtoParser.html...
Generating /usr/src/RPM/BUILD/protostream-3.0.4.Final/target/site/apidocs/org/infinispan/protostream/impl/parser/mappers/ProtofileMapper.html...
Generating /usr/src/RPM/BUILD/protostream-3.0.4.Final/target/site/apidocs/org/infinispan/protostream/descriptors/AnnotatedDescriptor.html...
Generating /usr/src/RPM/BUILD/protostream-3.0.4.Final/target/site/apidocs/org/infinispan/protostream/descriptors/AnnotationElement.html...
Generating /usr/src/RPM/BUILD/protostream-3.0.4.Final/target/site/apidocs/org/infinispan/protostream/descriptors/AnnotationElement.Annotation.html...
Generating /usr/src/RPM/BUILD/protostream-3.0.4.Final/target/site/apidocs/org/infinispan/protostream/descriptors/AnnotationElement.Array.html...
Generating /usr/src/RPM/BUILD/protostream-3.0.4.Final/target/site/apidocs/org/infinispan/protostream/descriptors/AnnotationElement.Attribute.html...
Generating /usr/src/RPM/BUILD/protostream-3.0.4.Final/target/site/apidocs/org/infinispan/protostream/descriptors/AnnotationElement.Identifier.html...
Generating /usr/src/RPM/BUILD/protostream-3.0.4.Final/target/site/apidocs/org/infinispan/protostream/descriptors/AnnotationElement.Literal.html...
Generating /usr/src/RPM/BUILD/protostream-3.0.4.Final/target/site/apidocs/org/infinispan/protostream/descriptors/AnnotationElement.Value.html...
Generating /usr/src/RPM/BUILD/protostream-3.0.4.Final/target/site/apidocs/org/infinispan/protostream/descriptors/AnnotationElement.Visitor.html...
Generating /usr/src/RPM/BUILD/protostream-3.0.4.Final/target/site/apidocs/org/infinispan/protostream/descriptors/Descriptor.html...
Generating /usr/src/RPM/BUILD/protostream-3.0.4.Final/target/site/apidocs/org/infinispan/protostream/descriptors/Descriptor.Builder.html...
Generating /usr/src/RPM/BUILD/protostream-3.0.4.Final/target/site/apidocs/org/infinispan/protostream/descriptors/EnumDescriptor.html...
Generating /usr/src/RPM/BUILD/protostream-3.0.4.Final/target/site/apidocs/org/infinispan/protostream/descriptors/EnumDescriptor.Builder.html...
Generating /usr/src/RPM/BUILD/protostream-3.0.4.Final/target/site/apidocs/org/infinispan/protostream/descriptors/EnumValueDescriptor.html...
Generating /usr/src/RPM/BUILD/protostream-3.0.4.Final/target/site/apidocs/org/infinispan/protostream/descriptors/EnumValueDescriptor.Builder.html...
Generating /usr/src/RPM/BUILD/protostream-3.0.4.Final/target/site/apidocs/org/infinispan/protostream/descriptors/ExtendDescriptor.html...
Generating /usr/src/RPM/BUILD/protostream-3.0.4.Final/target/site/apidocs/org/infinispan/protostream/descriptors/ExtendDescriptor.Builder.html...
Generating /usr/src/RPM/BUILD/protostream-3.0.4.Final/target/site/apidocs/org/infinispan/protostream/descriptors/FieldDescriptor.html...
Generating /usr/src/RPM/BUILD/protostream-3.0.4.Final/target/site/apidocs/org/infinispan/protostream/descriptors/FieldDescriptor.Builder.html...
Generating /usr/src/RPM/BUILD/protostream-3.0.4.Final/target/site/apidocs/org/infinispan/protostream/descriptors/FileDescriptor.html...
Generating /usr/src/RPM/BUILD/protostream-3.0.4.Final/target/site/apidocs/org/infinispan/protostream/descriptors/FileDescriptor.Builder.html...
Generating /usr/src/RPM/BUILD/protostream-3.0.4.Final/target/site/apidocs/org/infinispan/protostream/descriptors/GenericDescriptor.html...
Generating /usr/src/RPM/BUILD/protostream-3.0.4.Final/target/site/apidocs/org/infinispan/protostream/descriptors/JavaType.html...
Generating /usr/src/RPM/BUILD/protostream-3.0.4.Final/target/site/apidocs/org/infinispan/protostream/descriptors/Option.html...
Generating /usr/src/RPM/BUILD/protostream-3.0.4.Final/target/site/apidocs/org/infinispan/protostream/descriptors/Rule.html...
Generating /usr/src/RPM/BUILD/protostream-3.0.4.Final/target/site/apidocs/org/infinispan/protostream/descriptors/Type.html...
Generating /usr/src/RPM/BUILD/protostream-3.0.4.Final/target/site/apidocs/org/infinispan/protostream/config/AnnotationAttributeConfig.html...
Generating /usr/src/RPM/BUILD/protostream-3.0.4.Final/target/site/apidocs/org/infinispan/protostream/config/AnnotationAttributeConfig.AttributeType.html...
Generating /usr/src/RPM/BUILD/protostream-3.0.4.Final/target/site/apidocs/org/infinispan/protostream/config/AnnotationAttributeConfig.Builder.html...
Generating /usr/src/RPM/BUILD/protostream-3.0.4.Final/target/site/apidocs/org/infinispan/protostream/config/AnnotationConfig.html...
Generating /usr/src/RPM/BUILD/protostream-3.0.4.Final/target/site/apidocs/org/infinispan/protostream/config/AnnotationConfig.Builder.html...
Generating /usr/src/RPM/BUILD/protostream-3.0.4.Final/target/site/apidocs/org/infinispan/protostream/config/Configuration.html...
Generating /usr/src/RPM/BUILD/protostream-3.0.4.Final/target/site/apidocs/org/infinispan/protostream/config/Configuration.Builder.html...
Generating /usr/src/RPM/BUILD/protostream-3.0.4.Final/target/site/apidocs/org/infinispan/protostream/annotations/ProtoDoc.html...
Generating /usr/src/RPM/BUILD/protostream-3.0.4.Final/target/site/apidocs/org/infinispan/protostream/annotations/ProtoEnum.html...
Generating /usr/src/RPM/BUILD/protostream-3.0.4.Final/target/site/apidocs/org/infinispan/protostream/annotations/ProtoEnumValue.html...
Generating /usr/src/RPM/BUILD/protostream-3.0.4.Final/target/site/apidocs/org/infinispan/protostream/annotations/ProtoField.html...
Generating /usr/src/RPM/BUILD/protostream-3.0.4.Final/target/site/apidocs/org/infinispan/protostream/annotations/ProtoMessage.html...
Generating /usr/src/RPM/BUILD/protostream-3.0.4.Final/target/site/apidocs/org/infinispan/protostream/annotations/ProtoSchemaBuilder.html...
Generating /usr/src/RPM/BUILD/protostream-3.0.4.Final/target/site/apidocs/org/infinispan/protostream/annotations/ProtoSchemaBuilderException.html...
Generating /usr/src/RPM/BUILD/protostream-3.0.4.Final/target/site/apidocs/org/infinispan/protostream/annotations/ProtoUnknownFieldSet.html...
Generating /usr/src/RPM/BUILD/protostream-3.0.4.Final/target/site/apidocs/org/infinispan/protostream/annotations/impl/GeneratedMarshallerBase.html...
Generating /usr/src/RPM/BUILD/protostream-3.0.4.Final/target/site/apidocs/org/infinispan/protostream/annotations/impl/ProtoSchemaGenerator.html...
Generating /usr/src/RPM/BUILD/protostream-3.0.4.Final/target/site/apidocs/org/infinispan/protostream/sampledomain/marshallers/AccountMarshaller.html...
Generating /usr/src/RPM/BUILD/protostream-3.0.4.Final/target/site/apidocs/org/infinispan/protostream/sampledomain/marshallers/AddressMarshaller.html...
Generating /usr/src/RPM/BUILD/protostream-3.0.4.Final/target/site/apidocs/org/infinispan/protostream/sampledomain/marshallers/GenderMarshaller.html...
Generating /usr/src/RPM/BUILD/protostream-3.0.4.Final/target/site/apidocs/org/infinispan/protostream/sampledomain/marshallers/LimitsMarshaller.html...
Generating /usr/src/RPM/BUILD/protostream-3.0.4.Final/target/site/apidocs/org/infinispan/protostream/sampledomain/marshallers/MarshallerRegistration.html...
Generating /usr/src/RPM/BUILD/protostream-3.0.4.Final/target/site/apidocs/org/infinispan/protostream/sampledomain/marshallers/TransactionMarshaller.html...
Generating /usr/src/RPM/BUILD/protostream-3.0.4.Final/target/site/apidocs/org/infinispan/protostream/sampledomain/marshallers/UserMarshaller.html...
Generating /usr/src/RPM/BUILD/protostream-3.0.4.Final/target/site/apidocs/org/infinispan/protostream/sampledomain/Account.html...
Generating /usr/src/RPM/BUILD/protostream-3.0.4.Final/target/site/apidocs/org/infinispan/protostream/sampledomain/Account.Limits.html...
Generating /usr/src/RPM/BUILD/protostream-3.0.4.Final/target/site/apidocs/org/infinispan/protostream/sampledomain/Address.html...
Generating /usr/src/RPM/BUILD/protostream-3.0.4.Final/target/site/apidocs/org/infinispan/protostream/sampledomain/Note.html...
Generating /usr/src/RPM/BUILD/protostream-3.0.4.Final/target/site/apidocs/org/infinispan/protostream/sampledomain/Transaction.html...
Generating /usr/src/RPM/BUILD/protostream-3.0.4.Final/target/site/apidocs/org/infinispan/protostream/sampledomain/User.html...
Generating /usr/src/RPM/BUILD/protostream-3.0.4.Final/target/site/apidocs/org/infinispan/protostream/sampledomain/User.Gender.html...
Generating /usr/src/RPM/BUILD/protostream-3.0.4.Final/target/site/apidocs/overview-frame.html...
Generating /usr/src/RPM/BUILD/protostream-3.0.4.Final/target/site/apidocs/org/infinispan/protostream/package-frame.html...
Generating /usr/src/RPM/BUILD/protostream-3.0.4.Final/target/site/apidocs/org/infinispan/protostream/package-summary.html...
Generating /usr/src/RPM/BUILD/protostream-3.0.4.Final/target/site/apidocs/org/infinispan/protostream/package-tree.html...
Generating /usr/src/RPM/BUILD/protostream-3.0.4.Final/target/site/apidocs/org/infinispan/protostream/annotations/package-frame.html...
Generating /usr/src/RPM/BUILD/protostream-3.0.4.Final/target/site/apidocs/org/infinispan/protostream/annotations/package-summary.html...
Generating /usr/src/RPM/BUILD/protostream-3.0.4.Final/target/site/apidocs/org/infinispan/protostream/annotations/package-tree.html...
Generating /usr/src/RPM/BUILD/protostream-3.0.4.Final/target/site/apidocs/org/infinispan/protostream/annotations/impl/package-frame.html...
Generating /usr/src/RPM/BUILD/protostream-3.0.4.Final/target/site/apidocs/org/infinispan/protostream/annotations/impl/package-summary.html...
Generating /usr/src/RPM/BUILD/protostream-3.0.4.Final/target/site/apidocs/org/infinispan/protostream/annotations/impl/package-tree.html...
Generating /usr/src/RPM/BUILD/protostream-3.0.4.Final/target/site/apidocs/org/infinispan/protostream/config/package-frame.html...
Generating /usr/src/RPM/BUILD/protostream-3.0.4.Final/target/site/apidocs/org/infinispan/protostream/config/package-summary.html...
Generating /usr/src/RPM/BUILD/protostream-3.0.4.Final/target/site/apidocs/org/infinispan/protostream/config/package-tree.html...
Generating /usr/src/RPM/BUILD/protostream-3.0.4.Final/target/site/apidocs/org/infinispan/protostream/descriptors/package-frame.html...
Generating /usr/src/RPM/BUILD/protostream-3.0.4.Final/target/site/apidocs/org/infinispan/protostream/descriptors/package-summary.html...
Generating /usr/src/RPM/BUILD/protostream-3.0.4.Final/target/site/apidocs/org/infinispan/protostream/descriptors/package-tree.html...
Generating /usr/src/RPM/BUILD/protostream-3.0.4.Final/target/site/apidocs/org/infinispan/protostream/impl/package-frame.html...
Generating /usr/src/RPM/BUILD/protostream-3.0.4.Final/target/site/apidocs/org/infinispan/protostream/impl/package-summary.html...
Generating /usr/src/RPM/BUILD/protostream-3.0.4.Final/target/site/apidocs/org/infinispan/protostream/impl/package-tree.html...
Generating /usr/src/RPM/BUILD/protostream-3.0.4.Final/target/site/apidocs/org/infinispan/protostream/impl/parser/package-frame.html...
Generating /usr/src/RPM/BUILD/protostream-3.0.4.Final/target/site/apidocs/org/infinispan/protostream/impl/parser/package-summary.html...
Generating /usr/src/RPM/BUILD/protostream-3.0.4.Final/target/site/apidocs/org/infinispan/protostream/impl/parser/package-tree.html...
Generating /usr/src/RPM/BUILD/protostream-3.0.4.Final/target/site/apidocs/org/infinispan/protostream/impl/parser/mappers/package-frame.html...
Generating /usr/src/RPM/BUILD/protostream-3.0.4.Final/target/site/apidocs/org/infinispan/protostream/impl/parser/mappers/package-summary.html...
Generating /usr/src/RPM/BUILD/protostream-3.0.4.Final/target/site/apidocs/org/infinispan/protostream/impl/parser/mappers/package-tree.html...
Generating /usr/src/RPM/BUILD/protostream-3.0.4.Final/target/site/apidocs/org/infinispan/protostream/sampledomain/package-frame.html...
Generating /usr/src/RPM/BUILD/protostream-3.0.4.Final/target/site/apidocs/org/infinispan/protostream/sampledomain/package-summary.html...
Generating /usr/src/RPM/BUILD/protostream-3.0.4.Final/target/site/apidocs/org/infinispan/protostream/sampledomain/package-tree.html...
Generating /usr/src/RPM/BUILD/protostream-3.0.4.Final/target/site/apidocs/org/infinispan/protostream/sampledomain/marshallers/package-frame.html...
Generating /usr/src/RPM/BUILD/protostream-3.0.4.Final/target/site/apidocs/org/infinispan/protostream/sampledomain/marshallers/package-summary.html...
Generating /usr/src/RPM/BUILD/protostream-3.0.4.Final/target/site/apidocs/org/infinispan/protostream/sampledomain/marshallers/package-tree.html...
Generating /usr/src/RPM/BUILD/protostream-3.0.4.Final/target/site/apidocs/constant-values.html...
Generating /usr/src/RPM/BUILD/protostream-3.0.4.Final/target/site/apidocs/serialized-form.html...
Generating /usr/src/RPM/BUILD/protostream-3.0.4.Final/target/site/apidocs/org/infinispan/protostream/class-use/AnnotationParserException.html...
Generating /usr/src/RPM/BUILD/protostream-3.0.4.Final/target/site/apidocs/org/infinispan/protostream/class-use/FileDescriptorSource.html...
Generating /usr/src/RPM/BUILD/protostream-3.0.4.Final/target/site/apidocs/org/infinispan/protostream/class-use/FileDescriptorSource.ProgressCallback.html...
Generating /usr/src/RPM/BUILD/protostream-3.0.4.Final/target/site/apidocs/org/infinispan/protostream/class-use/DescriptorParserException.html...
Generating /usr/src/RPM/BUILD/protostream-3.0.4.Final/target/site/apidocs/org/infinispan/protostream/class-use/AnnotationMetadataCreator.html...
Generating /usr/src/RPM/BUILD/protostream-3.0.4.Final/target/site/apidocs/org/infinispan/protostream/class-use/MessageMarshaller.html...
Generating /usr/src/RPM/BUILD/protostream-3.0.4.Final/target/site/apidocs/org/infinispan/protostream/class-use/MessageMarshaller.ProtoStreamReader.html...
Generating /usr/src/RPM/BUILD/protostream-3.0.4.Final/target/site/apidocs/org/infinispan/protostream/class-use/MessageMarshaller.ProtoStreamWriter.html...
Generating /usr/src/RPM/BUILD/protostream-3.0.4.Final/target/site/apidocs/org/infinispan/protostream/class-use/BaseMarshaller.html...
Generating /usr/src/RPM/BUILD/protostream-3.0.4.Final/target/site/apidocs/org/infinispan/protostream/class-use/SerializationContext.html...
Generating /usr/src/RPM/BUILD/protostream-3.0.4.Final/target/site/apidocs/org/infinispan/protostream/class-use/MessageContext.html...
Generating /usr/src/RPM/BUILD/protostream-3.0.4.Final/target/site/apidocs/org/infinispan/protostream/class-use/RawProtoStreamReader.html...
Generating /usr/src/RPM/BUILD/protostream-3.0.4.Final/target/site/apidocs/org/infinispan/protostream/class-use/UnknownFieldSet.html...
Generating /usr/src/RPM/BUILD/protostream-3.0.4.Final/target/site/apidocs/org/infinispan/protostream/class-use/DescriptorParser.html...
Generating /usr/src/RPM/BUILD/protostream-3.0.4.Final/target/site/apidocs/org/infinispan/protostream/class-use/RawProtoStreamWriter.html...
Generating /usr/src/RPM/BUILD/protostream-3.0.4.Final/target/site/apidocs/org/infinispan/protostream/class-use/WrappedMessage.html...
Generating /usr/src/RPM/BUILD/protostream-3.0.4.Final/target/site/apidocs/org/infinispan/protostream/class-use/WrappedMessage.Marshaller.html...
Generating /usr/src/RPM/BUILD/protostream-3.0.4.Final/target/site/apidocs/org/infinispan/protostream/class-use/RawProtobufMarshaller.html...
Generating /usr/src/RPM/BUILD/protostream-3.0.4.Final/target/site/apidocs/org/infinispan/protostream/class-use/EnumMarshaller.html...
Generating /usr/src/RPM/BUILD/protostream-3.0.4.Final/target/site/apidocs/org/infinispan/protostream/class-use/BaseMessage.html...
Generating /usr/src/RPM/BUILD/protostream-3.0.4.Final/target/site/apidocs/org/infinispan/protostream/class-use/Message.html...
Generating /usr/src/RPM/BUILD/protostream-3.0.4.Final/target/site/apidocs/org/infinispan/protostream/class-use/ProtobufParser.html...
Generating /usr/src/RPM/BUILD/protostream-3.0.4.Final/target/site/apidocs/org/infinispan/protostream/class-use/TagHandler.html...
Generating /usr/src/RPM/BUILD/protostream-3.0.4.Final/target/site/apidocs/org/infinispan/protostream/class-use/ProtobufUtil.html...
Generating /usr/src/RPM/BUILD/protostream-3.0.4.Final/target/site/apidocs/org/infinispan/protostream/class-use/UnknownFieldSetHandler.html...
Generating /usr/src/RPM/BUILD/protostream-3.0.4.Final/target/site/apidocs/org/infinispan/protostream/impl/class-use/WireFormat.html...
Generating /usr/src/RPM/BUILD/protostream-3.0.4.Final/target/site/apidocs/org/infinispan/protostream/impl/class-use/AnnotatedDescriptorImpl.html...
Generating /usr/src/RPM/BUILD/protostream-3.0.4.Final/target/site/apidocs/org/infinispan/protostream/impl/class-use/Log.html...
Generating /usr/src/RPM/BUILD/protostream-3.0.4.Final/target/site/apidocs/org/infinispan/protostream/impl/class-use/Log.LogFactory.html...
Generating /usr/src/RPM/BUILD/protostream-3.0.4.Final/target/site/apidocs/org/infinispan/protostream/impl/class-use/SerializationContextImpl.html...
Generating /usr/src/RPM/BUILD/protostream-3.0.4.Final/target/site/apidocs/org/infinispan/protostream/impl/class-use/BaseMarshallerDelegate.html...
Generating /usr/src/RPM/BUILD/protostream-3.0.4.Final/target/site/apidocs/org/infinispan/protostream/impl/class-use/RawProtoStreamWriterImpl.html...
Generating /usr/src/RPM/BUILD/protostream-3.0.4.Final/target/site/apidocs/org/infinispan/protostream/impl/class-use/ProtocMessageMarshaller.html...
Generating /usr/src/RPM/BUILD/protostream-3.0.4.Final/target/site/apidocs/org/infinispan/protostream/impl/class-use/ByteArrayOutputStreamEx.html...
Generating /usr/src/RPM/BUILD/protostream-3.0.4.Final/target/site/apidocs/org/infinispan/protostream/impl/class-use/RawProtoStreamReaderImpl.html...
Generating /usr/src/RPM/BUILD/protostream-3.0.4.Final/target/site/apidocs/org/infinispan/protostream/impl/class-use/EnumMarshallerDelegate.html...
Generating /usr/src/RPM/BUILD/protostream-3.0.4.Final/target/site/apidocs/org/infinispan/protostream/impl/parser/class-use/AnnotationParser.html...
Generating /usr/src/RPM/BUILD/protostream-3.0.4.Final/target/site/apidocs/org/infinispan/protostream/impl/parser/class-use/SquareProtoParser.html...
Generating /usr/src/RPM/BUILD/protostream-3.0.4.Final/target/site/apidocs/org/infinispan/protostream/impl/parser/mappers/class-use/ProtofileMapper.html...
Generating /usr/src/RPM/BUILD/protostream-3.0.4.Final/target/site/apidocs/org/infinispan/protostream/descriptors/class-use/Type.html...
Generating /usr/src/RPM/BUILD/protostream-3.0.4.Final/target/site/apidocs/org/infinispan/protostream/descriptors/class-use/JavaType.html...
Generating /usr/src/RPM/BUILD/protostream-3.0.4.Final/target/site/apidocs/org/infinispan/protostream/descriptors/class-use/ExtendDescriptor.html...
Generating /usr/src/RPM/BUILD/protostream-3.0.4.Final/target/site/apidocs/org/infinispan/protostream/descriptors/class-use/ExtendDescriptor.Builder.html...
Generating /usr/src/RPM/BUILD/protostream-3.0.4.Final/target/site/apidocs/org/infinispan/protostream/descriptors/class-use/FieldDescriptor.html...
Generating /usr/src/RPM/BUILD/protostream-3.0.4.Final/target/site/apidocs/org/infinispan/protostream/descriptors/class-use/FieldDescriptor.Builder.html...
Generating /usr/src/RPM/BUILD/protostream-3.0.4.Final/target/site/apidocs/org/infinispan/protostream/descriptors/class-use/AnnotatedDescriptor.html...
Generating /usr/src/RPM/BUILD/protostream-3.0.4.Final/target/site/apidocs/org/infinispan/protostream/descriptors/class-use/EnumDescriptor.html...
Generating /usr/src/RPM/BUILD/protostream-3.0.4.Final/target/site/apidocs/org/infinispan/protostream/descriptors/class-use/EnumDescriptor.Builder.html...
Generating /usr/src/RPM/BUILD/protostream-3.0.4.Final/target/site/apidocs/org/infinispan/protostream/descriptors/class-use/GenericDescriptor.html...
Generating /usr/src/RPM/BUILD/protostream-3.0.4.Final/target/site/apidocs/org/infinispan/protostream/descriptors/class-use/EnumValueDescriptor.html...
Generating /usr/src/RPM/BUILD/protostream-3.0.4.Final/target/site/apidocs/org/infinispan/protostream/descriptors/class-use/EnumValueDescriptor.Builder.html...
Generating /usr/src/RPM/BUILD/protostream-3.0.4.Final/target/site/apidocs/org/infinispan/protostream/descriptors/class-use/Descriptor.html...
Generating /usr/src/RPM/BUILD/protostream-3.0.4.Final/target/site/apidocs/org/infinispan/protostream/descriptors/class-use/Descriptor.Builder.html...
Generating /usr/src/RPM/BUILD/protostream-3.0.4.Final/target/site/apidocs/org/infinispan/protostream/descriptors/class-use/Option.html...
Generating /usr/src/RPM/BUILD/protostream-3.0.4.Final/target/site/apidocs/org/infinispan/protostream/descriptors/class-use/FileDescriptor.html...
Generating /usr/src/RPM/BUILD/protostream-3.0.4.Final/target/site/apidocs/org/infinispan/protostream/descriptors/class-use/FileDescriptor.Builder.html...
Generating /usr/src/RPM/BUILD/protostream-3.0.4.Final/target/site/apidocs/org/infinispan/protostream/descriptors/class-use/Rule.html...
Generating /usr/src/RPM/BUILD/protostream-3.0.4.Final/target/site/apidocs/org/infinispan/protostream/descriptors/class-use/AnnotationElement.html...
Generating /usr/src/RPM/BUILD/protostream-3.0.4.Final/target/site/apidocs/org/infinispan/protostream/descriptors/class-use/AnnotationElement.Value.html...
Generating /usr/src/RPM/BUILD/protostream-3.0.4.Final/target/site/apidocs/org/infinispan/protostream/descriptors/class-use/AnnotationElement.Annotation.html...
Generating /usr/src/RPM/BUILD/protostream-3.0.4.Final/target/site/apidocs/org/infinispan/protostream/descriptors/class-use/AnnotationElement.Attribute.html...
Generating /usr/src/RPM/BUILD/protostream-3.0.4.Final/target/site/apidocs/org/infinispan/protostream/descriptors/class-use/AnnotationElement.Identifier.html...
Generating /usr/src/RPM/BUILD/protostream-3.0.4.Final/target/site/apidocs/org/infinispan/protostream/descriptors/class-use/AnnotationElement.Array.html...
Generating /usr/src/RPM/BUILD/protostream-3.0.4.Final/target/site/apidocs/org/infinispan/protostream/descriptors/class-use/AnnotationElement.Literal.html...
Generating /usr/src/RPM/BUILD/protostream-3.0.4.Final/target/site/apidocs/org/infinispan/protostream/descriptors/class-use/AnnotationElement.Visitor.html...
Generating /usr/src/RPM/BUILD/protostream-3.0.4.Final/target/site/apidocs/org/infinispan/protostream/config/class-use/AnnotationConfig.html...
Generating /usr/src/RPM/BUILD/protostream-3.0.4.Final/target/site/apidocs/org/infinispan/protostream/config/class-use/AnnotationConfig.Builder.html...
Generating /usr/src/RPM/BUILD/protostream-3.0.4.Final/target/site/apidocs/org/infinispan/protostream/config/class-use/AnnotationAttributeConfig.html...
Generating /usr/src/RPM/BUILD/protostream-3.0.4.Final/target/site/apidocs/org/infinispan/protostream/config/class-use/AnnotationAttributeConfig.AttributeType.html...
Generating /usr/src/RPM/BUILD/protostream-3.0.4.Final/target/site/apidocs/org/infinispan/protostream/config/class-use/AnnotationAttributeConfig.Builder.html...
Generating /usr/src/RPM/BUILD/protostream-3.0.4.Final/target/site/apidocs/org/infinispan/protostream/config/class-use/Configuration.html...
Generating /usr/src/RPM/BUILD/protostream-3.0.4.Final/target/site/apidocs/org/infinispan/protostream/config/class-use/Configuration.Builder.html...
Generating /usr/src/RPM/BUILD/protostream-3.0.4.Final/target/site/apidocs/org/infinispan/protostream/annotations/class-use/ProtoSchemaBuilderException.html...
Generating /usr/src/RPM/BUILD/protostream-3.0.4.Final/target/site/apidocs/org/infinispan/protostream/annotations/class-use/ProtoField.html...
Generating /usr/src/RPM/BUILD/protostream-3.0.4.Final/target/site/apidocs/org/infinispan/protostream/annotations/class-use/ProtoMessage.html...
Generating /usr/src/RPM/BUILD/protostream-3.0.4.Final/target/site/apidocs/org/infinispan/protostream/annotations/class-use/ProtoUnknownFieldSet.html...
Generating /usr/src/RPM/BUILD/protostream-3.0.4.Final/target/site/apidocs/org/infinispan/protostream/annotations/class-use/ProtoEnum.html...
Generating /usr/src/RPM/BUILD/protostream-3.0.4.Final/target/site/apidocs/org/infinispan/protostream/annotations/class-use/ProtoDoc.html...
Generating /usr/src/RPM/BUILD/protostream-3.0.4.Final/target/site/apidocs/org/infinispan/protostream/annotations/class-use/ProtoEnumValue.html...
Generating /usr/src/RPM/BUILD/protostream-3.0.4.Final/target/site/apidocs/org/infinispan/protostream/annotations/class-use/ProtoSchemaBuilder.html...
Generating /usr/src/RPM/BUILD/protostream-3.0.4.Final/target/site/apidocs/org/infinispan/protostream/annotations/impl/class-use/ProtoSchemaGenerator.html...
Generating /usr/src/RPM/BUILD/protostream-3.0.4.Final/target/site/apidocs/org/infinispan/protostream/annotations/impl/class-use/GeneratedMarshallerBase.html...
Generating /usr/src/RPM/BUILD/protostream-3.0.4.Final/target/site/apidocs/org/infinispan/protostream/sampledomain/marshallers/class-use/MarshallerRegistration.html...
Generating /usr/src/RPM/BUILD/protostream-3.0.4.Final/target/site/apidocs/org/infinispan/protostream/sampledomain/marshallers/class-use/GenderMarshaller.html...
Generating /usr/src/RPM/BUILD/protostream-3.0.4.Final/target/site/apidocs/org/infinispan/protostream/sampledomain/marshallers/class-use/AccountMarshaller.html...
Generating /usr/src/RPM/BUILD/protostream-3.0.4.Final/target/site/apidocs/org/infinispan/protostream/sampledomain/marshallers/class-use/TransactionMarshaller.html...
Generating /usr/src/RPM/BUILD/protostream-3.0.4.Final/target/site/apidocs/org/infinispan/protostream/sampledomain/marshallers/class-use/LimitsMarshaller.html...
Generating /usr/src/RPM/BUILD/protostream-3.0.4.Final/target/site/apidocs/org/infinispan/protostream/sampledomain/marshallers/class-use/UserMarshaller.html...
Generating /usr/src/RPM/BUILD/protostream-3.0.4.Final/target/site/apidocs/org/infinispan/protostream/sampledomain/marshallers/class-use/AddressMarshaller.html...
Generating /usr/src/RPM/BUILD/protostream-3.0.4.Final/target/site/apidocs/org/infinispan/protostream/sampledomain/class-use/User.html...
Generating /usr/src/RPM/BUILD/protostream-3.0.4.Final/target/site/apidocs/org/infinispan/protostream/sampledomain/class-use/User.Gender.html...
Generating /usr/src/RPM/BUILD/protostream-3.0.4.Final/target/site/apidocs/org/infinispan/protostream/sampledomain/class-use/Address.html...
Generating /usr/src/RPM/BUILD/protostream-3.0.4.Final/target/site/apidocs/org/infinispan/protostream/sampledomain/class-use/Note.html...
Generating /usr/src/RPM/BUILD/protostream-3.0.4.Final/target/site/apidocs/org/infinispan/protostream/sampledomain/class-use/Account.html...
Generating /usr/src/RPM/BUILD/protostream-3.0.4.Final/target/site/apidocs/org/infinispan/protostream/sampledomain/class-use/Account.Limits.html...
Generating /usr/src/RPM/BUILD/protostream-3.0.4.Final/target/site/apidocs/org/infinispan/protostream/sampledomain/class-use/Transaction.html...
Generating /usr/src/RPM/BUILD/protostream-3.0.4.Final/target/site/apidocs/org/infinispan/protostream/package-use.html...
Generating /usr/src/RPM/BUILD/protostream-3.0.4.Final/target/site/apidocs/org/infinispan/protostream/annotations/package-use.html...
Generating /usr/src/RPM/BUILD/protostream-3.0.4.Final/target/site/apidocs/org/infinispan/protostream/annotations/impl/package-use.html...
Generating /usr/src/RPM/BUILD/protostream-3.0.4.Final/target/site/apidocs/org/infinispan/protostream/config/package-use.html...
Generating /usr/src/RPM/BUILD/protostream-3.0.4.Final/target/site/apidocs/org/infinispan/protostream/descriptors/package-use.html...
Generating /usr/src/RPM/BUILD/protostream-3.0.4.Final/target/site/apidocs/org/infinispan/protostream/impl/package-use.html...
Generating /usr/src/RPM/BUILD/protostream-3.0.4.Final/target/site/apidocs/org/infinispan/protostream/impl/parser/package-use.html...
Generating /usr/src/RPM/BUILD/protostream-3.0.4.Final/target/site/apidocs/org/infinispan/protostream/impl/parser/mappers/package-use.html...
Generating /usr/src/RPM/BUILD/protostream-3.0.4.Final/target/site/apidocs/org/infinispan/protostream/sampledomain/package-use.html...
Generating /usr/src/RPM/BUILD/protostream-3.0.4.Final/target/site/apidocs/org/infinispan/protostream/sampledomain/marshallers/package-use.html...
Building index for all the packages and classes...
Generating /usr/src/RPM/BUILD/protostream-3.0.4.Final/target/site/apidocs/overview-tree.html...
Generating /usr/src/RPM/BUILD/protostream-3.0.4.Final/target/site/apidocs/index-all.html...
Generating /usr/src/RPM/BUILD/protostream-3.0.4.Final/target/site/apidocs/deprecated-list.html...
Building index for all classes...
Generating /usr/src/RPM/BUILD/protostream-3.0.4.Final/target/site/apidocs/allclasses-frame.html...
Generating /usr/src/RPM/BUILD/protostream-3.0.4.Final/target/site/apidocs/allclasses-noframe.html...
Generating /usr/src/RPM/BUILD/protostream-3.0.4.Final/target/site/apidocs/index.html...
Generating /usr/src/RPM/BUILD/protostream-3.0.4.Final/target/site/apidocs/overview-summary.html...
Generating /usr/src/RPM/BUILD/protostream-3.0.4.Final/target/site/apidocs/help-doc.html...
2 warnings
[WARNING] Javadoc Warnings
[WARNING] /usr/src/RPM/BUILD/protostream-3.0.4.Final/core/src/main/java/org/infinispan/protostream/ProtobufUtil.java:97: warning - @return tag has no arguments.
[WARNING] /usr/src/RPM/BUILD/protostream-3.0.4.Final/core/src/main/java/org/infinispan/protostream/descriptors/AnnotatedDescriptor.java:38: warning - @return tag has no arguments.
[INFO]
[INFO] --- xmvn-mojo:3.0.0:builddep (default-cli) @ protostream-aggregator ---
[INFO] ------------------------------------------------------------------------
[INFO] Reactor Summary:
[INFO]
[INFO] Parent for all ProtoStream modules ................. SUCCESS [ 0.007 s]
[INFO] Sample domain model definitions in proto file ...... SUCCESS [ 2.120 s]
[INFO] ProtoStream - core ................................. SUCCESS [ 19.222 s]
[INFO] Sample domain model implementation, including marshallers SUCCESS [ 0.441 s]
[INFO] Aggregator module for the ProtoStream project 3.0.4.Final SUCCESS [ 3.069 s]
[INFO] ------------------------------------------------------------------------
[INFO] BUILD SUCCESS
[INFO] ------------------------------------------------------------------------
[INFO] Total time: 29.322 s
[INFO] Finished at: 2021-06-20T13:37:44Z
[INFO] ------------------------------------------------------------------------
-----BEGIN MAVEN BUILD DEPENDENCIES-----
H4sIAAAAAAACA8WVwW7bMAyG730KLXcq67Cjm2LbKYedigG7yjajyJBFjZSM9u0nN8maXJQtLrCb
Rf7gx58g4ebxefRqQhZH4WF1rz+uFIaOehfsw+rHE3x5+rbdrh43d80HAPU1O9+rHiOGvsgcirIY
kE3CXrUv6uf3KSiAoj7XbO6Uegu8zM8SsEw5bvsNsdUmmm6PeofePTfrU+agM5zcznSpBEYzYYA2
h94jRJ+tC836LD9z1pegOrcYxb3JokcaqAJuZ9+wRx+R4dDFe+CPtl8L6kNBuWpfMuPOMQJjJE6L
G/FkPw8V6jF/Wb5Ijkuzuf/UrE/f/zyBoSURXRDFgq008aqDP7olQ78JCZGpQxHi2+EdjdoSWY+6
VEvU5l0Ff5LAYCazDCq/smHM8RotGhbkhdMt3Yo4SbXJvmkW2BopCHTeVUAXqkWHKmUwqXYlRwV0
xHg7a8jBVSd3yN9aPmDSQ+dqizCnwYRAyaRy0fIetzaWvdob7//m3i60/w0N7KZrl3D2mv9xvwHS
NwQlSgcAAA==
-----END MAVEN BUILD DEPENDENCIES-----
+ exit 0
Executing(%install): /bin/sh -e /usr/src/tmp/rpm-tmp.57565
+ umask 022
+ /bin/mkdir -p /usr/src/RPM/BUILD
+ cd /usr/src/RPM/BUILD
+ /bin/chmod -Rf u+rwX -- /usr/src/tmp/protostream-buildroot
+ :
+ /bin/rm -rf -- /usr/src/tmp/protostream-buildroot
+ PATH=/usr/libexec/rpm-build:/usr/src/bin:/bin:/usr/bin:/usr/X11R6/bin:/usr/games
+ cd protostream-3.0.4.Final
+ xmvn-install -R .xmvn-reactor -n protostream -d /usr/src/tmp/protostream-buildroot
[INFO] Installing artifact org.infinispan.protostream:parent:pom:3.0.4.Final
[INFO] Installing artifact org.infinispan.protostream:sample-domain-definition:jar:3.0.4.Final
[INFO] Installing artifact org.infinispan.protostream:sample-domain-definition:pom:3.0.4.Final
[INFO] Installing artifact org.infinispan.protostream:protostream:jar:3.0.4.Final
[INFO] Installing artifact org.infinispan.protostream:protostream:pom:3.0.4.Final
[INFO] Installing artifact org.infinispan.protostream:sample-domain-implementation:jar:3.0.4.Final
[INFO] Installing artifact org.infinispan.protostream:sample-domain-implementation:pom:3.0.4.Final
[INFO] Installing artifact org.infinispan.protostream:protostream-aggregator:pom:3.0.4.Final
[INFO] Installation successful
+ jdir=target/site/apidocs
+ '[' -d .xmvn/apidocs ']'
+ jdir=.xmvn/apidocs
+ /bin/mkdir -p /usr/src/tmp/protostream-buildroot/usr/share/license
+ '[' -d .xmvn/apidocs ']'
+ install -dm755 /usr/src/tmp/protostream-buildroot/usr/share/javadoc/protostream
+ cp -pr .xmvn/apidocs/allclasses-frame.html .xmvn/apidocs/allclasses-noframe.html .xmvn/apidocs/constant-values.html .xmvn/apidocs/deprecated-list.html .xmvn/apidocs/help-doc.html .xmvn/apidocs/index-all.html .xmvn/apidocs/index.html .xmvn/apidocs/org .xmvn/apidocs/overview-frame.html .xmvn/apidocs/overview-summary.html .xmvn/apidocs/overview-tree.html .xmvn/apidocs/package-list .xmvn/apidocs/script.js .xmvn/apidocs/serialized-form.html .xmvn/apidocs/stylesheet.css /usr/src/tmp/protostream-buildroot/usr/share/javadoc/protostream
+ echo /usr/share/javadoc/protostream
+ /usr/lib/rpm/brp-alt
Cleaning files in /usr/src/tmp/protostream-buildroot (auto)
Verifying and fixing files in /usr/src/tmp/protostream-buildroot (binconfig,pkgconfig,libtool,desktop,gnuconfig)
Checking contents of files in /usr/src/tmp/protostream-buildroot/ (default)
Compressing files in /usr/src/tmp/protostream-buildroot (auto)
Verifying ELF objects in /usr/src/tmp/protostream-buildroot (arch=normal,fhs=normal,lfs=relaxed,lint=relaxed,rpath=normal,stack=normal,textrel=normal,unresolved=normal)
Hardlinking identical .pyc and .pyo files
Processing files: protostream-3.0.4-alt1_5jpp8
Executing(%doc): /bin/sh -e /usr/src/tmp/rpm-tmp.60974
+ umask 022
+ /bin/mkdir -p /usr/src/RPM/BUILD
+ cd /usr/src/RPM/BUILD
+ cd protostream-3.0.4.Final
+ DOCDIR=/usr/src/tmp/protostream-buildroot/usr/share/doc/protostream-3.0.4
+ export DOCDIR
+ rm -rf /usr/src/tmp/protostream-buildroot/usr/share/doc/protostream-3.0.4
+ /bin/mkdir -p /usr/src/tmp/protostream-buildroot/usr/share/doc/protostream-3.0.4
+ cp -prL README.md /usr/src/tmp/protostream-buildroot/usr/share/doc/protostream-3.0.4
+ chmod -R go-w /usr/src/tmp/protostream-buildroot/usr/share/doc/protostream-3.0.4
+ chmod -R a+rX /usr/src/tmp/protostream-buildroot/usr/share/doc/protostream-3.0.4
+ cp -prL --no-dereference LICENSE PROTOPARSER_LICENSE.txt /usr/src/tmp/protostream-buildroot/usr/share/doc/protostream-3.0.4
+ chmod -R go-w /usr/src/tmp/protostream-buildroot/usr/share/doc/protostream-3.0.4
+ chmod -R a+rX /usr/src/tmp/protostream-buildroot/usr/share/doc/protostream-3.0.4
+ exit 0
Finding Provides (using /usr/lib/rpm/find-provides)
Executing: /bin/sh -e /usr/src/tmp/rpm-tmp.TP67Oo
find-provides: running scripts (alternatives,debuginfo,lib,maven,osgi-fc,pam,perl,pkgconfig,python,shell)
[INFO maven.prov] input: ['/usr/src/tmp/protostream-buildroot/usr/share/maven-metadata/protostream.xml']
[INFO maven.prov] mvn(org.infinispan.protostream:protostream) = 3.0.4.Final, mvn(org.infinispan.protostream:sample-domain-definition) = 3.0.4.Final, mvn(org.infinispan.protostream:protostream-aggregator:pom:) = 3.0.4.Final, mvn(org.infinispan.protostream:sample-domain-definition:pom:) = 3.0.4.Final, mvn(org.infinispan.protostream:parent:pom:) = 3.0.4.Final, mvn(org.infinispan.protostream:protostream:pom:) = 3.0.4.Final, mvn(org.infinispan.protostream:sample-domain-implementation) = 3.0.4.Final, mvn(org.infinispan.protostream:sample-domain-implementation:pom:) = 3.0.4.Final
[INFO osgi.prov] input: ['/usr/src/tmp/protostream-buildroot/usr/share/java/protostream/protostream.jar', '/usr/src/tmp/protostream-buildroot/usr/share/java/protostream/sample-domain-definition.jar', '/usr/src/tmp/protostream-buildroot/usr/share/java/protostream/sample-domain-implementation.jar']
[INFO osgi.prov] osgi(org.infinispan.protostream) = 3.0.4, osgi(org.infinispan.protostream.sample-domain-definition) = 3.0.4, osgi(org.infinispan.protostream.sample-domain-implementation) = 3.0.4
Finding Requires (using /usr/lib/rpm/find-requires)
Executing: /bin/sh -e /usr/src/tmp/rpm-tmp.3BprmR
find-requires: running scripts (cpp,debuginfo,files,javadoc,lib,maven,osgi-fc,pam,perl,pkgconfig,pkgconfiglib,python,rpmlib,shebang,shell,static,symlinks,systemd-services)
[INFO maven.req] input: ['/usr/src/tmp/protostream-buildroot/usr/share/maven-metadata/protostream.xml']
[INFO maven.req] mvn(com.squareup:protoparser), mvn(com.google.protobuf:protobuf-java), javapackages-tools, mvn(commons-cli:commons-cli), mvn(org.jboss.logging:jboss-logging)
[INFO osgi.req] input: ['/usr/src/tmp/protostream-buildroot/usr/share/java/protostream/protostream.jar', '/usr/src/tmp/protostream-buildroot/usr/share/java/protostream/sample-domain-definition.jar', '/usr/src/tmp/protostream-buildroot/usr/share/java/protostream/sample-domain-implementation.jar']
Provides: mvn(org.infinispan.protostream:parent:pom:) = 3.0.4.Final, mvn(org.infinispan.protostream:protostream) = 3.0.4.Final, mvn(org.infinispan.protostream:protostream-aggregator:pom:) = 3.0.4.Final, mvn(org.infinispan.protostream:protostream:pom:) = 3.0.4.Final, mvn(org.infinispan.protostream:sample-domain-definition) = 3.0.4.Final, mvn(org.infinispan.protostream:sample-domain-definition:pom:) = 3.0.4.Final, mvn(org.infinispan.protostream:sample-domain-implementation) = 3.0.4.Final, mvn(org.infinispan.protostream:sample-domain-implementation:pom:) = 3.0.4.Final, osgi(org.infinispan.protostream) = 3.0.4, osgi(org.infinispan.protostream.sample-domain-definition) = 3.0.4, osgi(org.infinispan.protostream.sample-domain-implementation) = 3.0.4
Requires: javapackages-tools, mvn(com.google.protobuf:protobuf-java), mvn(com.squareup:protoparser), mvn(commons-cli:commons-cli), mvn(org.jboss.logging:jboss-logging)
Processing files: protostream-javadoc-3.0.4-alt1_5jpp8
Executing(%doc): /bin/sh -e /usr/src/tmp/rpm-tmp.72932
+ umask 022
+ /bin/mkdir -p /usr/src/RPM/BUILD
+ cd /usr/src/RPM/BUILD
+ cd protostream-3.0.4.Final
+ DOCDIR=/usr/src/tmp/protostream-buildroot/usr/share/doc/protostream-javadoc-3.0.4
+ export DOCDIR
+ rm -rf /usr/src/tmp/protostream-buildroot/usr/share/doc/protostream-javadoc-3.0.4
+ /bin/mkdir -p /usr/src/tmp/protostream-buildroot/usr/share/doc/protostream-javadoc-3.0.4
+ cp -prL --no-dereference LICENSE PROTOPARSER_LICENSE.txt /usr/src/tmp/protostream-buildroot/usr/share/doc/protostream-javadoc-3.0.4
+ chmod -R go-w /usr/src/tmp/protostream-buildroot/usr/share/doc/protostream-javadoc-3.0.4
+ chmod -R a+rX /usr/src/tmp/protostream-buildroot/usr/share/doc/protostream-javadoc-3.0.4
+ exit 0
Finding Provides (using /usr/lib/rpm/find-provides)
Executing: /bin/sh -e /usr/src/tmp/rpm-tmp.eHGwHR
find-provides: running scripts (alternatives,debuginfo,lib,maven,osgi-fc,pam,perl,pkgconfig,python,shell)
Finding Requires (using /usr/lib/rpm/find-requires)
Executing: /bin/sh -e /usr/src/tmp/rpm-tmp.HsZ5HX
find-requires: running scripts (cpp,debuginfo,files,javadoc,lib,maven,osgi-fc,pam,perl,pkgconfig,pkgconfiglib,python,rpmlib,shebang,shell,static,symlinks,systemd-services)
Requires: javapackages-tools
Wrote: /usr/src/RPM/RPMS/noarch/protostream-3.0.4-alt1_5jpp8.noarch.rpm (w2.lzdio)
Wrote: /usr/src/RPM/RPMS/noarch/protostream-javadoc-3.0.4-alt1_5jpp8.noarch.rpm (w2.lzdio)
48.55user 1.48system 0:40.29elapsed 124%CPU (0avgtext+0avgdata 495332maxresident)k
0inputs+0outputs (0major+272545minor)pagefaults 0swaps
75.41user 5.50system 1:35.72elapsed 84%CPU (0avgtext+0avgdata 495332maxresident)k
184inputs+0outputs (0major+868347minor)pagefaults 0swaps