86>Jun 20 13:56:02 userdel[2733876]: delete user 'rooter'
<86>Jun 20 13:56:02 userdel[2733876]: removed group 'rooter' owned by 'rooter'
<86>Jun 20 13:56:02 userdel[2733876]: removed shadow group 'rooter' owned by 'rooter'
<86>Jun 20 13:56:02 groupadd[2733886]: group added to /etc/group: name=rooter, GID=618
<86>Jun 20 13:56:02 groupadd[2733886]: group added to /etc/gshadow: name=rooter
<86>Jun 20 13:56:02 groupadd[2733886]: new group: name=rooter, GID=618
<86>Jun 20 13:56:02 useradd[2733893]: new user: name=rooter, UID=618, GID=618, home=/root, shell=/bin/bash
<86>Jun 20 13:56:02 userdel[2733901]: delete user 'builder'
<86>Jun 20 13:56:02 userdel[2733901]: removed group 'builder' owned by 'builder'
<86>Jun 20 13:56:02 userdel[2733901]: removed shadow group 'builder' owned by 'builder'
<86>Jun 20 13:56:02 groupadd[2733906]: group added to /etc/group: name=builder, GID=619
<86>Jun 20 13:56:02 groupadd[2733906]: group added to /etc/gshadow: name=builder
<86>Jun 20 13:56:02 groupadd[2733906]: new group: name=builder, GID=619
<86>Jun 20 13:56:02 useradd[2733913]: new user: name=builder, UID=619, GID=619, home=/usr/src, shell=/bin/bash
warning: user igor does not exist - using root
warning: group igor does not exist - using root
warning: user igor does not exist - using root
warning: group igor does not exist - using root
warning: user igor does not exist - using root
warning: group igor does not exist - using root
<13>Jun 20 13:56:09 rpmi: libjpeg-2:2.0.2-alt1 sisyphus+226996.100.1.1 1554902907 installed
<13>Jun 20 13:56:09 rpmi: libpng16-1.6.36-alt1 sisyphus+219478.100.1.1 1547633314 installed
<13>Jun 20 13:56:09 rpmi: libexpat-2.2.10-alt1 p9+261554.100.1.1 1605103337 installed
<13>Jun 20 13:56:09 rpmi: perl-Try-Tiny-0.30-alt1 1514318058 installed
<13>Jun 20 13:56:09 rpmi: perl-libnet-1:3.11-alt1 1511423541 installed
<13>Jun 20 13:56:09 rpmi: sgml-common-0.6.3-alt15 1423664786 installed
<13>Jun 20 13:56:09 rpmi: perl-Module-Runtime-0.016-alt1 1509549848 installed
<13>Jun 20 13:56:09 rpmi: perl-HTTP-Date-6.02-alt1 1348645274 installed
<13>Jun 20 13:56:09 rpmi: perl-Term-ANSIColor-4.06-alt1 1479407083 installed
<13>Jun 20 13:56:09 rpmi: libgdbm-1.8.3-alt10 1454943334 installed
<13>Jun 20 13:56:09 rpmi: libjasper-2.0.22-alt1 p9+259398.100.5.1 1602695044 installed
<13>Jun 20 13:56:09 rpmi: xml-utils-1:2.9.10-alt6 p9+266566.100.3.1 1614357035 installed
<13>Jun 20 13:56:09 rpmi: docbook-dtds-4.5-alt1 1223476557 installed
<13>Jun 20 13:56:09 rpmi: libnspr-1:4.28-alt1 p9+254920.20.18.1 1601209854 installed
<13>Jun 20 13:56:09 rpmi: tex-common-0.2-alt4 1244804096 installed
<13>Jun 20 13:56:09 rpmi: libsqlite3-3.33.0-alt1 p9+258834.40.2.1 1601365057 installed
<13>Jun 20 13:56:09 rpmi: liblcms2-2.9-alt1 1516411892 installed
<13>Jun 20 13:56:09 rpmi: libgomp1-8.4.1-alt0.p9.1 p9+247559.100.2.1 1585587912 installed
<13>Jun 20 13:56:09 rpmi: libpaper-1.1.26-alt1 sisyphus+221360.100.1.1 1549974197 installed
<13>Jun 20 13:56:09 rpmi: libopenjpeg2.0-2.3.1-alt1 sisyphus+226454.100.1.1 1554284337 installed
<13>Jun 20 13:56:09 rpmi: libidn2-2.2.0-alt1 p9+229971.100.2.1 1558696281 installed
<13>Jun 20 13:56:09 rpmi: libwebp7-1.0.3-alt1 p9+234901.200.1.1 1563552457 installed
<13>Jun 20 13:56:09 rpmi: libjbig-2.1-alt1 1401380926 installed
<13>Jun 20 13:56:10 rpmi: libtiff5-4.0.10.0.57.f9fc01c3-alt1 sisyphus+226958.100.1.1 1554850940 installed
<13>Jun 20 13:56:10 rpmi: libICE-1.0.9-alt1 1409902721 installed
<13>Jun 20 13:56:10 rpmi: libSM-1.2.3-alt1 sisyphus+226734.100.2.1 1554586158 installed
<13>Jun 20 13:56:10 rpmi: psutils-2:1.23-alt2 sisyphus+226711.100.1.1 1554520843 installed
<13>Jun 20 13:56:10 rpmi: rpm-build-gir-0.7.3-alt2 p9+234356.40.2.1 1562933848 installed
<13>Jun 20 13:56:10 rpmi: perl-Dist-CheckConflicts-0.11-alt1 1397076608 installed
<13>Jun 20 13:56:10 rpmi: perl-Module-Implementation-0.09-alt1 1418836057 installed
<13>Jun 20 13:56:10 rpmi: libtcl-8.6.9-alt1 sisyphus+227145.100.1.2 1555606538 installed
<13>Jun 20 13:56:10 rpmi: python-sphinx-objects.inv-1:2.3.8.20190514-alt1 p9+229421.100.1.1 1557927689 installed
<13>Jun 20 13:56:10 rpmi: python-module-sphinxcontrib-2.1.1-alt2.1.2 sisyphus+227529.1100.1.2 1555924423 installed
<13>Jun 20 13:56:10 rpmi: libopenblas-0.2.20-alt2 p9+229427.100.2.1 1558020066 installed
<13>Jun 20 13:56:10 rpmi: perl-IO-stringy-2.111-alt1 1432302202 installed
<13>Jun 20 13:56:10 rpmi: perl-Devel-StackTrace-1:2.03-alt1 1511420922 installed
<13>Jun 20 13:56:10 rpmi: perl-Sub-Exporter-Progressive-0.001013-alt1 1479395404 installed
<13>Jun 20 13:56:10 rpmi: perl-Unicode-Normalize-1:5.28.3-alt1 p9+261964.100.3.1 1606316313 installed
<13>Jun 20 13:56:10 rpmi: perl-File-Which-1.23-alt1 sisyphus.218871.100 1546337313 installed
<13>Jun 20 13:56:10 rpmi: perl-Tie-RefHash-1.39-alt1 1316492563 installed
<13>Jun 20 13:56:10 rpmi: perl-TimeDate-2.32-alt1 p9+252601.500.11.1 1592659283 installed
<13>Jun 20 13:56:10 rpmi: perl-IO-Socket-IP-0.39-alt1 1494508514 installed
<13>Jun 20 13:56:10 rpmi: perl-LWP-MediaTypes-6.04-alt1 sisyphus+225468.100.1.1 1553186684 installed
<13>Jun 20 13:56:10 rpmi: perl-Compress-Raw-Zlib-2.086-alt1 sisyphus+226395.100.1.2 1554269783 installed
<13>Jun 20 13:56:10 rpmi: perl-HTML-Tagset-3.20-alt2 1317725093 installed
<13>Jun 20 13:56:10 rpmi: libltdl7-2.4.6-alt1 sisyphus+226971.100.2.1 1554906368 installed
<13>Jun 20 13:56:10 rpmi: libnettle6-3.4.1-alt1 sisyphus+226533.100.2.1 1554512222 installed
<13>Jun 20 13:56:10 rpmi: libfribidi-1.0.7-alt1 p9+238309.200.1.1 1569787058 installed
<13>Jun 20 13:56:10 rpmi: libpixman-3:0.38.4-alt1 sisyphus+228006.100.1.1 1556013870 installed
<13>Jun 20 13:56:10 rpmi: libglvnd-7:1.3.2-alt0.p9 p9+265957.240.8.1 1617618230 installed
<13>Jun 20 13:56:10 rpmi: libwayland-server-1.18.0-alt1 p9+260591.100.12.1 1606212861 installed
<13>Jun 20 13:56:10 rpmi: ilmbase25-common-2.5.6-alt1 p9+272589.100.3.1 1622734937 installed
<13>Jun 20 13:56:10 rpmi: libiex25-2.5.6-alt1 p9+272589.100.3.1 1622734937 installed
<13>Jun 20 13:56:10 rpmi: libp11-kit-0.23.15-alt2 p9+254920.2400.19.1 1601385903 installed
<13>Jun 20 13:56:10 rpmi: libtasn1-4.14-alt1 p9+235792.100.2.1 1565425233 installed
<13>Jun 20 13:56:10 rpmi: libilmthread25-2.5.6-alt1 p9+272589.100.3.1 1622734937 installed
<13>Jun 20 13:56:10 rpmi: libimath25-2.5.6-alt1 p9+272589.100.3.1 1622734937 installed
<13>Jun 20 13:56:10 rpmi: libhalf25-2.5.6-alt1 p9+272589.100.3.1 1622734937 installed
<13>Jun 20 13:56:10 rpmi: libhogweed4-3.4.1-alt1 sisyphus+226533.100.2.1 1554512222 installed
<13>Jun 20 13:56:10 rpmi: libgnutls30-3.6.16-alt1 p9+273087.100.1.1 1622487001 installed
<13>Jun 20 13:56:10 rpmi: perl-autodie-2.29-alt1 1445013559 installed
<13>Jun 20 13:56:10 rpmi: perl-File-HomeDir-1.004-alt1 1525450444 installed
<13>Jun 20 13:56:10 rpmi: perl-unicore-1:5.28.3-alt1 p9+261964.100.3.1 1606316185 installed
<13>Jun 20 13:56:10 rpmi: perl-Net-IDN-Encode-2.500-alt1 sisyphus+221481.100.1.1 1550127196 installed
<13>Jun 20 13:56:10 rpmi: perl-Devel-GlobalDestruction-1:0.14-alt1 1479389769 installed
<13>Jun 20 13:56:10 rpmi: perl-OLE-Storage_Lite-0.20-alt1 p9+252601.400.11.1 1592659257 installed
<13>Jun 20 13:56:10 rpmi: tcl-8.6.9-alt1 sisyphus+227145.100.1.2 1555606538 installed
<13>Jun 20 13:56:10 rpmi: libraw-0.19.5-alt1 p9+236466.300.1.1 1566485894 installed
<13>Jun 20 13:56:10 rpmi: docbook-style-xsl-1.79.1-alt2 sisyphus.213665.100 1537949315 installed
<13>Jun 20 13:56:11 rpmi: libgdbm-devel-1.8.3-alt10 1454943334 installed
<13>Jun 20 13:56:11 rpmi: perl-Data-Dump-1.23-alt1 1444601978 installed
<13>Jun 20 13:56:11 rpmi: perl-File-Listing-6.04-alt1 1329758996 installed
<13>Jun 20 13:56:11 rpmi: libflif-0.3-alt1 sisyphus+223364.100.1.1 1551501723 installed
<13>Jun 20 13:56:11 rpmi: libcheck-20180202:0.12.0-alt1 1524573474 installed
<13>Jun 20 13:56:11 rpmi: perl-Algorithm-Diff-1.1903-alt1 1418755800 installed
<13>Jun 20 13:56:11 rpmi: libOpenSP-1.5.2-alt3.qa1 1365943435 installed
<13>Jun 20 13:56:11 rpmi: openjade-1.3.2-alt15 sisyphus+219815.100.1.1 1548167857 installed
<13>Jun 20 13:56:11 rpmi: docbook-style-dsssl-1.79-alt3 1324062818 installed
<13>Jun 20 13:56:11 rpmi: highlight-3.38-alt1 1499785557 installed
<13>Jun 20 13:56:11 rpmi: libffi-devel-1:3.2.1-alt3 p9+251949.100.1.1 1589887635 installed
<13>Jun 20 13:56:11 rpmi: libkpathsea6-2019-alt1_2 p9+238369.100.3.1 1569961575 installed
<13>Jun 20 13:56:11 rpmi: libptexenc1-2019-alt1_2 p9+238369.100.3.1 1569961575 installed
<13>Jun 20 13:56:11 rpmi: libsynctex2-2019-alt1_2 p9+238369.100.3.1 1569961575 installed
<13>Jun 20 13:56:11 rpmi: libtexlua5-2019-alt1_2 p9+238369.100.3.1 1569961575 installed
<13>Jun 20 13:56:11 rpmi: zziplib-0.13.69-alt3 p9+240930.100.1.1 1574080049 installed
<13>Jun 20 13:56:11 rpmi: publicsuffix-list-dafsa-20210419-alt1 p9+270359.100.1.1 1618926138 installed
<13>Jun 20 13:56:11 rpmi: libpsl-0.21.1-alt1 p9+255207.100.1.1 1595355048 installed
<13>Jun 20 13:56:11 rpmi: libnghttp2-1.41.0-alt1 p9+256449.100.1.1 1597829547 installed
<13>Jun 20 13:56:11 rpmi: libbrotlicommon-1.0.7-alt1 sisyphus+226738.100.2.1 1554554568 installed
<13>Jun 20 13:56:11 rpmi: libbrotlidec-1.0.7-alt1 sisyphus+226738.100.2.1 1554554568 installed
<13>Jun 20 13:56:12 rpmi: poppler-data-0.4.9-alt1 sisyphus.216033.100 1541141723 installed
<13>Jun 20 13:56:13 rpmi: libicu64-1:6.4.2-alt3 p9+270873.100.1.1 1619612666 installed
<13>Jun 20 13:56:13 rpmi: t1utils-1.41-alt1 1502978415 installed
<13>Jun 20 13:56:13 rpmi: libqqwing-1.3.4-alt2 1436192940 installed
<13>Jun 20 13:56:13 rpmi: qqwing-1.3.4-alt2 1436192940 installed
<13>Jun 20 13:56:13 rpmi: python-module-iniconfig-1.0.0-alt1 sisyphus+227494.1100.1.3 1555839106 installed
<13>Jun 20 13:56:13 rpmi: python-module-apipkg-1.5-alt1 1531926894 installed
<13>Jun 20 13:56:13 rpmi: python-module-imagesize-1.1.0-alt1 sisyphus+229015.100.2.1 1557233756 installed
<13>Jun 20 13:56:13 rpmi: libxapian-1.4.15-alt1 p9+258827.100.1.1 1601305423 installed
<13>Jun 20 13:56:13 rpmi: python-module-google-0.4.2-alt2.1 sisyphus+228356.1500.3.1 1556633057 installed
<13>Jun 20 13:56:13 rpmi: python-module-markupsafe-1.1.1-alt1 p9+254838.60.14.1 1602882139 installed
<13>Jun 20 13:56:13 rpmi: python-module-enum34-1.1.6-alt3 1527251693 installed
<13>Jun 20 13:56:13 rpmi: libnumpy-1:1.15.4-alt5 p9+255957.40.47.1 1599835883 installed
<13>Jun 20 13:56:13 rpmi: libxblas-1.0.248-alt1.3 sisyphus+229150.100.1.1 1557388786 installed
<13>Jun 20 13:56:13 rpmi: libquadmath0-8.4.1-alt0.p9.1 p9+247559.100.2.1 1585587912 installed
<13>Jun 20 13:56:13 rpmi: libgfortran5-8.4.1-alt0.p9.1 p9+247559.100.2.1 1585587912 installed
<13>Jun 20 13:56:14 rpmi: liblapack-1:3.8.0-alt3 sisyphus+221521.100.1.1 1550134903 installed
<13>Jun 20 13:56:14 rpmi: perl-Text-Unidecode-1.30-alt1 1480505027 installed
<13>Jun 20 13:56:14 rpmi: perl-Unicode-Map-0.112-alt7.1 sisyphus+219907.5000.1.1 1548350262 installed
<13>Jun 20 13:56:14 rpmi: perl-Digest-Perl-MD5-1.9-alt1 1394057208 installed
<13>Jun 20 13:56:14 rpmi: perl-Crypt-RC4-2.02-alt1 1319549646 installed
<13>Jun 20 13:56:14 rpmi: perl-Math-Complex-1.59-alt1 1334229876 installed
<13>Jun 20 13:56:14 rpmi: perl-XML-RegExp-0.04-alt1 1348526543 installed
<13>Jun 20 13:56:14 rpmi: perl-DBI-1.642-alt1.1 sisyphus+219907.3200.1.1 1548345365 installed
<13>Jun 20 13:56:14 rpmi: perl-Package-Stash-XS-0.29-alt1.1 sisyphus+219907.3400.1.1 1548345496 installed
<13>Jun 20 13:56:14 rpmi: perl-Package-Stash-0.38-alt1 sisyphus.218845.100 1546250118 installed
<13>Jun 20 13:56:14 rpmi: perl-Sub-Identify-0.14-alt1.2 sisyphus+219907.3700.1.1 1548345622 installed
<13>Jun 20 13:56:14 rpmi: perl-Variable-Magic-0.62-alt1.2 sisyphus+219907.3600.1.1 1548345581 installed
<13>Jun 20 13:56:14 rpmi: perl-B-Hooks-EndOfScope-0.24-alt1 1524680298 installed
<13>Jun 20 13:56:14 rpmi: perl-namespace-clean-0.27-alt1 1464272543 installed
<13>Jun 20 13:56:14 rpmi: perl-namespace-autoclean-0.28-alt1 1444994071 installed
<13>Jun 20 13:56:14 rpmi: perl-Sub-Quote-2.006003-alt1 sisyphus+224895.100.1.1 1552434926 installed
<13>Jun 20 13:56:14 rpmi: perl-Role-Tiny-2.000006-alt1 1513709006 installed
<13>Jun 20 13:56:14 rpmi: perl-MRO-Compat-0.13-alt2 p9+261964.200.3.1 1606316246 installed
<13>Jun 20 13:56:14 rpmi: perl-Class-Data-Inheritable-0.08-alt2 1316996762 installed
<13>Jun 20 13:56:14 rpmi: perl-Exception-Class-1.44-alt1 1513614520 installed
<13>Jun 20 13:56:14 rpmi: perl-PadWalker-2.3-alt1.2 sisyphus+219907.3500.1.1 1548345536 installed
<13>Jun 20 13:56:14 rpmi: perl-Devel-Caller-2.06-alt2.2 sisyphus+219907.4000.1.1 1548345662 installed
<13>Jun 20 13:56:14 rpmi: perl-Devel-LexAlias-0.05-alt3_17 sisyphus+219907.4100.1.1 1548345709 installed
<13>Jun 20 13:56:14 rpmi: perl-Eval-Closure-0.14-alt1 1465147597 installed
<13>Jun 20 13:56:14 rpmi: perl-Params-ValidationCompiler-0.30-alt1 1533170707 installed
<13>Jun 20 13:56:14 rpmi: perl-Mail-Sendmail-0.80-alt1 1504118031 installed
<13>Jun 20 13:56:14 rpmi: perl-Mail-Sender-1:0.903-alt1 1479576662 installed
<13>Jun 20 13:56:14 rpmi: perl-Email-Date-Format-1.005-alt1 1413796337 installed
<13>Jun 20 13:56:14 rpmi: ppp-common-0.5.1-alt1 1244040597 installed
<13>Jun 20 13:56:14 rpmi: sendmail-common-1.7-alt3 1353029717 installed
<13>Jun 20 13:56:14 rpmi: perl-Locale-Maketext-Simple-0.21-alt3 1321333616 installed
<13>Jun 20 13:56:14 rpmi: perl-IPC-System-Simple-1.25-alt2_1 1388863478 installed
<13>Jun 20 13:56:14 rpmi: perl-Term-Cap-1.17-alt1 1445018869 installed
<13>Jun 20 13:56:14 rpmi: perl-Pod-Escapes-1.07-alt1 1418767892 installed
<13>Jun 20 13:56:14 rpmi: perl-File-Copy-Recursive-0.44-alt1 1525447381 installed
<13>Jun 20 13:56:14 rpmi: perl-Digest-SHA1-2.13-alt5.2 sisyphus+219907.4500.1.1 1548350054 installed
<13>Jun 20 13:56:14 rpmi: less-530-alt1 sisyphus+226367.200.2.2 1554151813 installed
<13>Jun 20 13:56:14 rpmi: perl-Compress-Raw-Bzip2-2.086-alt1 sisyphus+226394.100.1.2 1554269409 installed
<13>Jun 20 13:56:14 rpmi: libdb4.7-devel-4.7.25-alt9 1490438479 installed
<13>Jun 20 13:56:14 rpmi: perl-devel-1:5.28.3-alt1 p9+261964.100.3.1 1606316313 installed
<13>Jun 20 13:56:14 rpmi: perl-Test-Fatal-0.014-alt1 1418768336 installed
<13>Jun 20 13:56:14 rpmi: perl-Specio-0.43-alt1 sisyphus.215861.100 1540964587 installed
<13>Jun 20 13:56:14 rpmi: hd2u-1.0.3-alt2 1400842666 installed
<13>Jun 20 13:56:14 rpmi: perl-Filter-1.59-alt1.1 sisyphus+219907.400.1.1 1548343389 installed
<13>Jun 20 13:56:14 rpmi: perl-Encode-3.01-alt1 sisyphus+224923.100.1.1 1552474122 installed
<13>Jun 20 13:56:14 rpmi: perl-URI-1.76-alt1 sisyphus+220243.100.1.1 1548863244 installed
<13>Jun 20 13:56:14 rpmi: perl-HTML-Parser-3.72-alt1.2 sisyphus+219907.600.1.1 1548343581 installed
<13>Jun 20 13:56:14 rpmi: perl-IO-Compress-2.086-alt1 sisyphus+226399.100.2.1 1554270186 installed
<13>Jun 20 13:56:14 rpmi: perl-Net-HTTP-6.18-alt1 1526560501 installed
<13>Jun 20 13:56:14 rpmi: perl-WWW-RobotRules-6.02-alt1 1329756211 installed
<13>Jun 20 13:56:14 rpmi: perl-Encode-Locale-1.05-alt1 1444608613 installed
<13>Jun 20 13:56:14 rpmi: perl-IO-HTML-1.001-alt1 1404821752 installed
<13>Jun 20 13:56:14 rpmi: perl-HTTP-Message-6.18-alt1 1528288416 installed
<13>Jun 20 13:56:14 rpmi: perl-HTTP-Cookies-6.04-alt1 1504116575 installed
<13>Jun 20 13:56:14 rpmi: perl-HTTP-Negotiate-6.01-alt1 1329760563 installed
<13>Jun 20 13:56:14 rpmi: perl-libwww-6.39-alt1 sisyphus+229237.100.1.1 1557650051 installed
<13>Jun 20 13:56:14 rpmi: perl-XML-Parser-2.44-alt2.2 sisyphus+219907.1300.1.1 1548343835 installed
<13>Jun 20 13:56:14 rpmi: perl-XML-DOM-1.46-alt1 1474815568 installed
<13>Jun 20 13:56:14 rpmi: perl-XML-XPath-1.44-alt1 sisyphus.215541.100 1540451758 installed
<13>Jun 20 13:56:14 rpmi: perl-HTML-Form-6.04-alt1 sisyphus+225750.100.1.1 1553678430 installed
<13>Jun 20 13:56:14 rpmi: perl-XML-Writer-0.625-alt1 1402417374 installed
<13>Jun 20 13:56:14 rpmi: hwinfo-utils-21.23-alt1.1 sisyphus+223919.100.1.1 1551893139 installed
<13>Jun 20 13:56:14 rpmi: perl-Pod-Simple-3.35-alt1 1482098090 installed
<13>Jun 20 13:56:14 rpmi: perl-Pod-Usage-1.69-alt1 1464274721 installed
<13>Jun 20 13:56:14 rpmi: perl-podlators-4.11-alt1 1525935408 installed
<13>Jun 20 13:56:14 rpmi: perl-HTML-Tree-5.07-alt1 1506480309 installed
<13>Jun 20 13:56:14 rpmi: perl-HTML-Formatter-2.16-alt1 1482105372 installed
<13>Jun 20 13:56:14 rpmi: perl-WWW-Mechanize-1.91-alt1 sisyphus+219761.100.1.2 1548132822 installed
<13>Jun 20 13:56:14 rpmi: perl-MIME-Types-2.17-alt1 1517533413 installed
<13>Jun 20 13:56:14 rpmi: perl-Text-CSV_XS-1.39-alt1 sisyphus+225184.100.1.2 1552965523 installed
<13>Jun 20 13:56:14 rpmi: perl-Spreadsheet-ParseExcel-1:0.65-alt1 1395677487 installed
<13>Jun 20 13:56:14 rpmi: perl-MIME-Charset-1.012.2-alt1 1494353584 installed
<13>Jun 20 13:56:14 rpmi: perl-YAML-Tiny-1.73-alt1 1520430664 installed
<13>Jun 20 13:56:14 rpmi: libteckit-2.5.1-alt2.1 1319227325 installed
<13>Jun 20 13:56:14 rpmi: libteckit-utils-2.5.1-alt2.1 1319227325 installed
<13>Jun 20 13:56:14 rpmi: rgb-1.0.6-alt3 p9+229442.100.1.1 1557941137 installed
<13>Jun 20 13:56:14 rpmi: libnetpbm11-10.85.04-alt1 sisyphus+225727.140.8.1 1553672199 installed
<13>Jun 20 13:56:14 rpmi: mailx-8.1.2-alt7 1366314832 installed
<13>Jun 20 13:56:14 rpmi: sharutils-4.6.3-alt1.1.qa2.1 1449219807 installed
<13>Jun 20 13:56:14 rpmi: ncompress-4.2.4.4-alt1 1366160442 installed
<13>Jun 20 13:56:14 rpmi: ed-1:0.2-alt10 1449768440 installed
<13>Jun 20 13:56:14 rpmi: libdialog-1.3.20171209-alt1 1529583087 installed
<13>Jun 20 13:56:14 rpmi: dialog-1.3.20171209-alt1 1529583087 installed
<13>Jun 20 13:56:14 rpmi: libruby-2.5.9-alt1 p9+261867.500.5.1 1606313968 installed
<13>Jun 20 13:56:14 rpmi: libyaml2-0.2.2-alt1 sisyphus+229134.100.1.1 1557342721 installed
<13>Jun 20 13:56:15 rpmi: libImageMagick6-common-6.9.11.23-alt1 p9+265603.200.9.1 1613079225 installed
<13>Jun 20 13:56:15 rpmi: libwmflite-0.2.8.4-alt13 1506519339 installed
<13>Jun 20 13:56:15 rpmi: liblqr-0.4.2-alt1 1383038438 installed
<13>Jun 20 13:56:15 rpmi: libx265-160-2.8-alt1 1529659188 installed
<13>Jun 20 13:56:15 rpmi: libde265-1.0.3-alt1 1528888221 installed
<13>Jun 20 13:56:15 rpmi: libfftw3-common-3.3.8-alt1 sisyphus+226899.100.1.1 1554782385 installed
<13>Jun 20 13:56:15 rpmi: libfftw3-3.3.8-alt1 sisyphus+226899.100.1.1 1554783258 installed
<13>Jun 20 13:56:15 rpmi: djvu-common-3.5.25.3-alt1 1365826139 installed
<13>Jun 20 13:56:15 rpmi: libdjvu-3.5.25.3-alt1 1365826139 installed
<13>Jun 20 13:56:15 rpmi: libgts-0.7.6-alt2.drc20130205.1 sisyphus+225727.500.8.1 1553672623 installed
<13>Jun 20 13:56:15 rpmi: liblz4-1:1.9.2-alt1 p9+238696.500.1.1 1570228299 installed
<13>Jun 20 13:56:15 rpmi: libgpg-error-1.36-alt1 p9+261942.140.4.1 1606237675 installed
<13>Jun 20 13:56:15 rpmi: libgcrypt20-1.8.5-alt3 p9+261942.200.4.1 1606237923 installed
<13>Jun 20 13:56:15 rpmi: libxslt-1.1.34-alt1.p9.1 p9+261811.300.3.1 1605513919 installed
<13>Jun 20 13:56:15 rpmi: xsltproc-1.1.34-alt1.p9.1 p9+261811.300.3.1 1605513919 installed
<13>Jun 20 13:56:15 rpmi: libsystemd-1:246.13-alt1 p9+265718.640.15.1 1618506331 installed
<13>Jun 20 13:56:15 rpmi: libdbus-1.12.16-alt2 p9+240607.100.1.1 1573553687 installed
<13>Jun 20 13:56:15 rpmi: libavahi-0.8-alt2 p9+270905.100.1.1 1619639865 installed
<13>Jun 20 13:56:15 rpmi: libcups-2.3.3-alt2.op2 p9+267729.100.2.1 1616001940 installed
<13>Jun 20 13:56:15 rpmi: libdbus-devel-1.12.16-alt2 p9+240607.100.1.1 1573553687 installed
<13>Jun 20 13:56:15 rpmi: icon-theme-hicolor-0.17-alt2 p9+248347.100.1.1 1584981172 installed
<13>Jun 20 13:56:15 rpmi: shared-mime-info-1.13.1-alt1 p9+238204.100.1.1 1569496447 installed
<13>Jun 20 13:56:15 rpmi: gsettings-desktop-schemas-data-3.32.0-alt1 sisyphus+225059.300.3.2 1552843929 installed
<13>Jun 20 13:56:16 rpmi: libgio-2.60.7-alt1 p9+237353.100.2.2 1568373081 installed
<13>Jun 20 13:56:16 rpmi: gsettings-desktop-schemas-3.32.0-alt1 sisyphus+225059.300.3.2 1552843980 installed
<13>Jun 20 13:56:16 rpmi: gobject-introspection-1.60.2-alt1 p9+232288.200.1.1 1560708080 installed
<13>Jun 20 13:56:16 rpmi: gobject-introspection-x11-1.60.2-alt1 p9+232288.200.1.1 1560708080 installed
<13>Jun 20 13:56:16 rpmi: libdbus-glib-1:0.106-alt1 1454672854 installed
<13>Jun 20 13:56:16 rpmi: libgdk-pixbuf-locales-2.38.2-alt1 p9+237353.1000.2.2 1568374008 installed
<13>Jun 20 13:56:16 rpmi: libgdk-pixbuf-2.38.2-alt1 p9+237353.1000.2.2 1568374336 installed
<13>Jun 20 13:56:16 rpmi: gtk-update-icon-cache-3.24.11-alt1.M90P.1 p9+270534.40.3.1 1621245189 installed
<13>Jun 20 13:56:16 rpmi: libheif-1.6.2-alt1 p9+244301.100.3.1 1582815559 installed
<13>Jun 20 13:56:16 rpmi: libgtk+2-locales-2.24.32-alt3 sisyphus+227306.100.1.3 1555646039 installed
<13>Jun 20 13:56:16 rpmi: libatk-locales-2.32.0-alt1 sisyphus+225059.600.3.2 1552845198 installed
<13>Jun 20 13:56:16 rpmi: libatk-2.32.0-alt1 sisyphus+225059.600.3.2 1552845362 installed
<13>Jun 20 13:56:16 rpmi: libdatrie-0.2.9-alt1_6 1511686676 installed
<13>Jun 20 13:56:16 rpmi: libthai-0.1.28-alt1_1 sisyphus+226107.100.1.1 1554123079 installed
<13>Jun 20 13:56:16 rpmi: libsombok-2.4.0-alt1_8 sisyphus+226104.100.1.1 1554121176 installed
<13>Jun 20 13:56:16 rpmi: perl-Unicode-LineBreak-2019.001-alt1.1 sisyphus+219907.4700.1.1 1548350207 installed
<13>Jun 20 13:56:16 rpmi: libgraphite2-1.3.13-alt2 sisyphus+226799.100.1.1 1554648241 installed
<13>Jun 20 13:56:17 rpmi: libharfbuzz-2.6.2-alt1 p9+238790.200.1.1 1570435826 installed
<13>Jun 20 13:56:17 rpmi: libfreetype-2.10.1-alt1.1.p9.1 p9+260179.200.3.1 1603971407 installed
<13>Jun 20 13:56:17 rpmi: fontconfig-2.13.1-alt1 p9+247340.200.3.1 1583400517 installed
Updating fonts cache: <29>Jun 20 13:56:18 fontconfig: Updating fonts cache: succeeded
[ DONE ]
<13>Jun 20 13:56:19 rpmi: libgs-9.27-alt1.M90P.1 p9+258832.300.4.1 1601632201 installed
<13>Jun 20 13:56:19 rpmi: fonts-type1-urw-3:1.0.7pre44-alt3 sisyphus+224082.100.2.1 1552406640 installed
<13>Jun 20 13:56:20 rpmi: ghostscript-common-9.27-alt1.M90P.1 p9+258832.300.4.1 1601632175 installed
<13>Jun 20 13:56:20 rpmi: ghostscript-classic-9.27-alt1.M90P.1 p9+258832.300.4.1 1601632201 installed
<13>Jun 20 13:56:20 rpmi: libraqm-0.5.0-alt1 1530413343 installed
<13>Jun 20 13:56:20 rpmi: ttf2pt1-3.4.4-alt1.qa1 1366267507 installed
<13>Jun 20 13:56:20 rpmi: libxshmfence-1.3-alt1 sisyphus+223149.1000.2.1 1551268571 installed
<13>Jun 20 13:56:20 rpmi: libwayland-client-1.18.0-alt1 p9+260591.100.12.1 1606212861 installed
<13>Jun 20 13:56:20 rpmi: libpciaccess-1:0.14-alt1 1528969252 installed
<13>Jun 20 13:56:20 rpmi: libdrm-1:2.4.105-alt2 p9+271012.100.1.1 1619786697 installed
<13>Jun 20 13:56:20 rpmi: libgbm-4:21.0.3-alt1 p9+271012.200.3.1 1621244977 installed
<13>Jun 20 13:56:20 rpmi: libX11-locales-3:1.7.2-alt1 p9+273972.100.2.1 1623924318 installed
<13>Jun 20 13:56:20 rpmi: libXdmcp-1.1.3-alt1 sisyphus+225206.600.1.2 1552949353 installed
<13>Jun 20 13:56:20 rpmi: libXau-1.0.9-alt1 sisyphus+223149.200.2.1 1551268152 installed
<13>Jun 20 13:56:20 rpmi: libxcb-1.13.1-alt1 sisyphus+226527.100.2.2 1554593801 installed
<13>Jun 20 13:56:20 rpmi: libX11-3:1.7.2-alt1 p9+273972.100.2.1 1623924397 installed
<13>Jun 20 13:56:20 rpmi: libXext-1.3.4-alt1 sisyphus+225206.700.1.2 1552949429 installed
<13>Jun 20 13:56:20 rpmi: libXrender-0.9.10-alt1 p9+261891.200.2.1 1606149111 installed
<13>Jun 20 13:56:20 rpmi: libXt-1.1.4-alt1 1369984722 installed
<13>Jun 20 13:56:20 rpmi: libXmu-1.1.3-alt1 sisyphus+225206.1200.1.2 1552949641 installed
<13>Jun 20 13:56:20 rpmi: libXft-2.3.3-alt1 sisyphus+225206.1000.3.2 1552987708 installed
<13>Jun 20 13:56:20 rpmi: libXfixes-5.0.3-alt1 sisyphus+226736.100.2.2 1554614841 installed
<13>Jun 20 13:56:20 rpmi: libXpm-3.5.12-alt1 sisyphus+223149.400.2.1 1551268289 installed
<13>Jun 20 13:56:20 rpmi: libgd3-2.2.5-alt3 sisyphus+226800.200.2.1 1554649317 installed
<13>Jun 20 13:56:20 rpmi: libXaw-1.0.12-alt1 1391072624 installed
<13>Jun 20 13:56:20 rpmi: libXcursor-1.2.0-alt1 sisyphus+225206.400.1.2 1552949218 installed
<13>Jun 20 13:56:20 rpmi: perl-Tk-804.034-alt1.2 sisyphus+219907.4300.1.1 1548346044 installed
<13>Jun 20 13:56:20 rpmi: libtk-8.6.9-alt1 sisyphus+227145.200.1.2 1555606681 installed
<13>Jun 20 13:56:20 rpmi: tk-8.6.9-alt1 sisyphus+227145.200.1.2 1555606681 installed
<13>Jun 20 13:56:20 rpmi: xset-1.2.4-alt1 sisyphus.213358.100 1537438594 installed
<13>Jun 20 13:56:20 rpmi: ghostscript-module-X-9.27-alt1.M90P.1 p9+258832.300.4.1 1601632201 installed
<13>Jun 20 13:56:20 rpmi: libXrandr-1.5.2-alt1 sisyphus+225206.1300.1.2 1552949710 installed
<13>Jun 20 13:56:20 rpmi: libXxf86vm-1.1.4-alt2 1527672187 installed
<13>Jun 20 13:56:20 rpmi: libGLX-mesa-4:21.0.3-alt1 p9+271012.200.3.1 1621244977 installed
<13>Jun 20 13:56:20 rpmi: libEGL-mesa-4:21.0.3-alt1 p9+271012.200.3.1 1621244977 installed
<13>Jun 20 13:56:20 rpmi: libEGL-7:1.3.2-alt0.p9 p9+265957.240.8.1 1617618230 installed
<13>Jun 20 13:56:20 rpmi: libGLX-7:1.3.2-alt0.p9 p9+265957.240.8.1 1617618230 installed
<13>Jun 20 13:56:20 rpmi: libGL-7:1.3.2-alt0.p9 p9+265957.240.8.1 1617618230 installed
<13>Jun 20 13:56:21 rpmi: libcairo-1:1.16.0-alt1 sisyphus+226534.100.2.3 1554515535 installed
<13>Jun 20 13:56:21 rpmi: libpango-1.44.6-alt1 p9+237353.700.2.2 1568374131 installed
<13>Jun 20 13:56:21 rpmi: librsvg-1:2.46.4-alt1 p9+248366.400.6.1 1587062978 installed
<13>Jun 20 13:56:21 rpmi: liblasi-1.1.2-alt1.qa1 1460141148 installed
<13>Jun 20 13:56:21 rpmi: libXi-1.7.9-alt2 sisyphus+226377.100.1.2 1554260260 installed
<13>Jun 20 13:56:21 rpmi: libXinerama-1.1.4-alt1 sisyphus+223149.300.2.1 1551268216 installed
<13>Jun 20 13:56:21 rpmi: libXcomposite-0.4.5-alt1 sisyphus+225206.300.1.2 1552949137 installed
<13>Jun 20 13:56:21 rpmi: libXdamage-1.1.5-alt1 sisyphus+225206.500.1.2 1552949286 installed
<13>Jun 20 13:56:21 rpmi: libgtk+2-2.24.32-alt3 sisyphus+227306.100.1.3 1555646092 installed
<13>Jun 20 13:56:21 rpmi: libgraphviz-2.41.2-alt4 p9+259365.100.2.1 1602278891 installed
<13>Jun 20 13:56:22 rpmi: netpbm-10.85.04-alt1 sisyphus+225727.140.8.1 1553672199 installed
<13>Jun 20 13:56:22 rpmi: xprop-1.2.4-alt1 sisyphus+225764.100.1.1 1553680703 installed
<13>Jun 20 13:56:22 rpmi: xdg-utils-1.1.3-alt7 p9+259359.100.1.1 1602061025 installed
<13>Jun 20 13:56:22 rpmi: openexr25-common-2.5.6-alt1 p9+272589.200.3.1 1622735038 installed
<13>Jun 20 13:56:22 rpmi: libilmimf25-2.5.6-alt1 p9+272589.200.3.1 1622735038 installed
<13>Jun 20 13:56:22 rpmi: libImageMagick6.6-6.9.11.23-alt1 p9+265603.200.9.1 1613079225 installed
<13>Jun 20 13:56:22 rpmi: ImageMagick-tools-6.9.11.23-alt1 p9+265603.200.9.1 1613079225 installed
<13>Jun 20 13:56:22 rpmi: python-modules-curses-2.7.16-alt1.M90P.2 p9+260393.40.3.1 1604003681 installed
<13>Jun 20 13:56:22 rpmi: libtinfo-devel-6.1.20180407-alt2 sisyphus+222164.200.1.1 1550686226 installed
<13>Jun 20 13:56:22 rpmi: libncurses-devel-6.1.20180407-alt2 sisyphus+222164.200.1.1 1550686226 installed
<13>Jun 20 13:56:22 rpmi: libverto-0.3.0-alt1_7 sisyphus+225932.100.1.1 1553994919 installed
<13>Jun 20 13:56:22 rpmi: libkeyutils-1.6-alt2 sisyphus+226520.100.2.1 1554512089 installed
<13>Jun 20 13:56:23 rpmi: rpm-macros-alternatives-0.5.1-alt1 sisyphus+226946.100.1.1 1554830426 installed
<13>Jun 20 13:56:23 rpmi: alternatives-0.5.1-alt1 sisyphus+226946.100.1.1 1554830426 installed
<13>Jun 20 13:56:23 rpmi: libnss-3.56.0-alt1 p9+254920.30.20.1 1601657872 installed
<13>Jun 20 13:56:23 rpmi: ca-certificates-2020.06.29-alt1 p9+258899.100.3.1 1601998604 installed
<13>Jun 20 13:56:23 rpmi: ca-trust-0.1.2-alt1 p9+233349.100.1.1 1561655062 installed
<13>Jun 20 13:56:23 rpmi: p11-kit-trust-0.23.15-alt2 p9+254920.2400.19.1 1601385903 installed
<13>Jun 20 13:56:23 rpmi: libcrypto1.1-1.1.1k-alt1 p9+268376.100.3.1 1616721011 installed
<13>Jun 20 13:56:23 rpmi: libssl1.1-1.1.1k-alt1 p9+268376.100.3.1 1616721011 installed
<13>Jun 20 13:56:23 rpmi: libpython3-3.7.4-alt3 p9+249932.100.2.1 1587127349 installed
<13>Jun 20 13:56:23 rpmi: python3-3.7.4-alt3 p9+249932.100.2.1 1587127349 installed
<13>Jun 20 13:56:24 rpmi: python3-base-3.7.4-alt3 p9+249932.100.2.1 1587127349 installed
<13>Jun 20 13:56:24 rpmi: python3-module-pkg_resources-1:40.8.0-alt2 sisyphus+229158.200.2.1 1557735221 installed
<13>Jun 20 13:56:24 rpmi: python3-module-six-1.12.0-alt1 sisyphus+219665.100.2.1 1548148570 installed
<13>Jun 20 13:56:25 rpmi: glib2-devel-2.60.7-alt1 p9+237353.100.2.2 1568373081 installed
<13>Jun 20 13:56:25 rpmi: libgio-devel-2.60.7-alt1 p9+237353.100.2.2 1568373081 installed
<13>Jun 20 13:56:25 rpmi: python3-module-anytree-2.6.0-alt1 sisyphus+221296.100.1.2 1549960078 installed
<13>Jun 20 13:56:25 rpmi: python3-module-ntlm-1.1.0-alt1.2 sisyphus+228512.100.1.1 1556654575 installed
<13>Jun 20 13:56:25 rpmi: python3-module-markdown-3.1.1-alt1 p9+231354.2200.4.1 1559947089 installed
<13>Jun 20 13:56:25 rpmi: python3-module-pycparser-2.19-alt1 sisyphus+228366.1000.2.3 1556706938 installed
<13>Jun 20 13:56:25 rpmi: python3-module-cffi-1.12.3-alt1 sisyphus+229040.200.3.1 1557316452 installed
<13>Jun 20 13:56:25 rpmi: python3-module-asn1crypto-0.24.0-alt1 sisyphus+227473.1300.1.2 1555756512 installed
<13>Jun 20 13:56:25 rpmi: python3-module-cryptography-2.6.1-alt1 sisyphus+225625.24400.91.1 1555298600 installed
<13>Jun 20 13:56:25 rpmi: python3-module-OpenSSL-18.0.0-alt1 1532996168 installed
<13>Jun 20 13:56:25 rpmi: python3-module-nss-1.0.1-alt3 sisyphus+225625.12420.91.1 1555289646 installed
<13>Jun 20 13:56:25 rpmi: python3-module-beaker-1.10.1-alt1 p9+229505.100.1.1 1558019142 installed
<13>Jun 20 13:56:25 rpmi: python3-module-pytz-1:2016.10-alt1 1484291011 installed
<13>Jun 20 13:56:25 rpmi: python3-module-babel-1:2.6.0-alt1 sisyphus+228351.2400.6.2 1556652168 installed
<13>Jun 20 13:56:25 rpmi: python3-module-zope.interface-4.6.0-alt1 sisyphus+227562.100.3.1 1556009950 installed
<13>Jun 20 13:56:25 rpmi: python3-module-chameleon.core-3.1-alt1.2 sisyphus+227476.1500.1.3 1555774056 installed
<13>Jun 20 13:56:25 rpmi: python3-module-polib-1.0.5-alt1.1.2 sisyphus+227468.1200.2.2 1555756059 installed
<13>Jun 20 13:56:25 rpmi: python3-module-lingua-4.13-alt1.1 sisyphus+228360.2200.5.2 1556666805 installed
<13>Jun 20 13:56:26 rpmi: python3-module-genshi-0.7-alt2 sisyphus+229363.100.1.1 1557847335 installed
<13>Jun 20 13:56:26 rpmi: python3-module-webencodings-0.5.1-alt1.1 1517943573 installed
<13>Jun 20 13:56:26 rpmi: python3-module-cssselect-0.9.1-alt1.2 sisyphus+227479.1100.1.2 1555757152 installed
<13>Jun 20 13:56:26 rpmi: python3-module-html5lib-1:0.999999999-alt4.qa1 sisyphus+227493.600.1.3 1555835341 installed
<13>Jun 20 13:56:26 rpmi: python3-module-lxml-4.4.2-alt1 p9+244111.100.1.1 1578758819 installed
<13>Jun 20 13:56:26 rpmi: python3-module-docutils-0.14-alt2 1535729778 installed
<13>Jun 20 13:56:26 rpmi: python3-module-chardet-3.0.4-alt1 sisyphus+227476.1700.1.2 1555756717 installed
<13>Jun 20 13:56:26 rpmi: python3-module-idna-2.8-alt1 sisyphus+227494.400.1.3 1555838720 installed
<13>Jun 20 13:56:26 rpmi: python3-module-ndg-0.4.2-alt1.qa1 sisyphus+227504.1300.1.2 1555853234 installed
<13>Jun 20 13:56:26 rpmi: python3-module-ndg-httpsclient-0.4.2-alt1.qa1 sisyphus+227504.1300.1.2 1555853234 installed
<13>Jun 20 13:56:26 rpmi: python3-module-urllib3-2:1.25.6-alt1 p9+250567.200.5.1 1590420860 installed
<13>Jun 20 13:56:26 rpmi: python3-module-requests-2.23.0-alt1 p9+250567.500.5.1 1590420921 installed
<13>Jun 20 13:56:26 rpmi: python3-module-imagesize-1.1.0-alt1 sisyphus+229015.100.2.1 1557233756 installed
<13>Jun 20 13:56:26 rpmi: python3-module-markupsafe-1.1.1-alt1 p9+254838.60.14.1 1602882139 installed
<13>Jun 20 13:56:26 rpmi: python3-module-jinja2-2.11.2-alt1 p9+254838.40.14.1 1602882082 installed
<13>Jun 20 13:56:26 rpmi: python3-module-pyparsing-2.2.0-alt1 1534411950 installed
<13>Jun 20 13:56:26 rpmi: python3-module-packaging-16.8-alt1.qa1 sisyphus+228363.1100.2.2 1556671459 installed
<13>Jun 20 13:56:26 rpmi: python3-module-snowballstemmer-1.2.0-alt2.1 1457859319 installed
<13>Jun 20 13:56:26 rpmi: python3-module-sphinxcontrib-applehelp-1.0.1-alt1 sisyphus+228217.100.1.1 1556282506 installed
<13>Jun 20 13:56:26 rpmi: python3-module-sphinxcontrib-devhelp-1.0.1-alt1 sisyphus+228218.100.1.1 1556283262 installed
<13>Jun 20 13:56:26 rpmi: python3-module-sphinxcontrib-htmlhelp-1.0.2-alt1 sisyphus+228401.100.1.1 1556572721 installed
<13>Jun 20 13:56:26 rpmi: python3-module-sphinxcontrib-jsmath-1.0.1-alt1 p9+247680.64.15.1 1585326575 installed
<13>Jun 20 13:56:26 rpmi: python3-module-sphinxcontrib-qthelp-1.0.2-alt1 sisyphus+228215.100.1.1 1556282300 installed
<13>Jun 20 13:56:26 rpmi: python3-module-sphinxcontrib-serializinghtml-1.1.3-alt1 sisyphus+228216.100.1.1 1556282403 installed
<13>Jun 20 13:56:26 rpmi: python3-module-alabaster-0.7.6-alt3 sisyphus+228351.700.4.1 1556637370 installed
<13>Jun 20 13:56:26 rpmi: python3-module-Pygments-2.6.1-alt2 p9+263160.600.6.1 1607946197 installed
<13>Jun 20 13:56:27 rpmi: python3-module-sphinx-1:2.2.0-alt2.1.p9 p9+247680.14.15.1 1585326533 installed
<13>Jun 20 13:56:27 rpmi: python3-module-mako-1.0.9-alt1 sisyphus+228198.40.2.1 1556265453 installed
<13>Jun 20 13:56:27 rpmi: openssl-1.1.1k-alt1 p9+268376.100.3.1 1616721011 installed
<13>Jun 20 13:56:27 rpmi: ruby-rubygems-update-3.0.4-alt1 p9+247371.35300.135.1 1590436206 installed
<13>Jun 20 13:56:27 rpmi: gem-did-you-mean-1.3.0-alt2.1 p9+247371.40400.161.1 1591376055 installed
<13>Jun 20 13:56:27 rpmi: gem-minitest-5.14.0-alt1.1 p9+247371.67710.170.1 1592235999 installed
<13>Jun 20 13:56:27 rpmi: ruby-net-telnet-0.2.0-alt1 sisyphus+219345.2700.8.1 1547631566 installed
<13>Jun 20 13:56:27 rpmi: gem-rake-13.0.1-alt1 p9+247371.77140.170.1 1592237858 installed
<13>Jun 20 13:56:27 rpmi: ruby-xmlrpc-0.3.0-alt1 sisyphus+219345.3300.8.1 1547631818 installed
<13>Jun 20 13:56:27 rpmi: gem-2.5.9-alt1 p9+261867.500.5.1 1606313941 installed
<13>Jun 20 13:56:27 rpmi: ri-6.1.1-alt3 sisyphus+220149.7500.44.1 1552167568 installed
<13>Jun 20 13:56:27 rpmi: rdoc-6.1.1-alt3 sisyphus+220149.7500.44.1 1552167568 installed
<13>Jun 20 13:56:27 rpmi: ruby-rdoc-6.1.1-alt3 sisyphus+220149.7500.44.1 1552167568 installed
<13>Jun 20 13:56:27 rpmi: rake-13.0.1-alt1 p9+247371.77140.170.1 1592237858 installed
<13>Jun 20 13:56:27 rpmi: erb-2.5.9-alt1 p9+261867.500.5.1 1606313941 installed
<13>Jun 20 13:56:27 rpmi: irb-2.5.9-alt1 p9+261867.500.5.1 1606313941 installed
<13>Jun 20 13:56:29 rpmi: gem-bundler-2.1.4-alt1 p9+247371.33100.135.1 1590435793 installed
<13>Jun 20 13:56:29 rpmi: gem-test-unit-3.3.5-alt0.1 p9+247371.60440.162.1 1591424158 installed
<13>Jun 20 13:56:29 rpmi: gem-power-assert-1.1.7-alt1 p9+247371.60200.162.1 1591424056 installed
<13>Jun 20 13:56:29 rpmi: ruby-stdlibs-2.5.9-alt1 p9+261867.500.5.1 1606313968 installed
<13>Jun 20 13:56:29 rpmi: bundle-2.1.4-alt1 p9+247371.33100.135.1 1590435793 installed
<13>Jun 20 13:56:29 rpmi: ruby-2.5.9-alt1 p9+261867.500.5.1 1606313968 installed
<13>Jun 20 13:56:29 rpmi: perl-Net-SSLeay-1.86_09-alt2 sisyphus+227568.100.1.1 1555676542 installed
<13>Jun 20 13:56:29 rpmi: perl-IO-Socket-SSL-2.066-alt1 sisyphus+223890.100.1.1 1551873760 installed
<13>Jun 20 13:56:29 rpmi: perl-Net-HTTPS-6.18-alt1 1526560501 installed
<13>Jun 20 13:56:29 rpmi: perl-LWP-Protocol-https-6.07-alt1 1494527383 installed
<13>Jun 20 13:56:29 rpmi: perl-Net-SMTP-SSL-1.04-alt1 1479470835 installed
<13>Jun 20 13:56:29 rpmi: perl-MailTools-2.20-alt1 1517533205 installed
<13>Jun 20 13:56:29 rpmi: perl-MIME-Lite-3.030-alt1 1383865152 installed
<13>Jun 20 13:56:29 rpmi: perl-Log-Dispatch-2.68-alt2 sisyphus.218872.100 1546338428 installed
<13>Jun 20 13:56:29 rpmi: perl-Log-Log4perl-1.49-alt1 1489613295 installed
<13>Jun 20 13:56:29 rpmi: gambit-4.9.3-alt1 sisyphus+220998.100.1.4 1549742946 installed
<13>Jun 20 13:56:29 rpmi: foomatic-db-engine-4.0.12-alt1 1449527983 installed
<13>Jun 20 13:56:29 rpmi: libcom_err-1.44.6-alt1 sisyphus+224154.100.1.1 1552091678 installed
<86>Jun 20 13:56:29 groupadd[2807516]: group added to /etc/group: name=_keytab, GID=499
<86>Jun 20 13:56:29 groupadd[2807516]: group added to /etc/gshadow: name=_keytab
<86>Jun 20 13:56:29 groupadd[2807516]: new group: name=_keytab, GID=499
<13>Jun 20 13:56:30 rpmi: libkrb5-1.17.2-alt1 p9+262110.100.3.1 1606242416 installed
<13>Jun 20 13:56:30 rpmi: libtirpc-1.0.3-alt1 1532008017 installed
<13>Jun 20 13:56:30 rpmi: libnsl2-1.1.0-alt1_1 1511548749 installed
<13>Jun 20 13:56:30 rpmi: python-modules-compiler-2.7.16-alt1.M90P.2 p9+260393.40.3.1 1604003681 installed
<13>Jun 20 13:56:30 rpmi: python-modules-email-2.7.16-alt1.M90P.2 p9+260393.40.3.1 1604003681 installed
<13>Jun 20 13:56:30 rpmi: python-modules-unittest-2.7.16-alt1.M90P.2 p9+260393.40.3.1 1604003681 installed
<13>Jun 20 13:56:30 rpmi: python-modules-encodings-2.7.16-alt1.M90P.2 p9+260393.40.3.1 1604003681 installed
<13>Jun 20 13:56:30 rpmi: python-modules-2.7.16-alt1.M90P.2 p9+260393.40.3.1 1604003681 installed
<13>Jun 20 13:56:30 rpmi: python-modules-nis-2.7.16-alt1.M90P.2 p9+260393.40.3.1 1604003681 installed
<13>Jun 20 13:56:30 rpmi: python-modules-xml-2.7.16-alt1.M90P.2 p9+260393.40.3.1 1604003681 installed
<13>Jun 20 13:56:30 rpmi: python-modules-ctypes-2.7.16-alt1.M90P.2 p9+260393.40.3.1 1604003681 installed
<13>Jun 20 13:56:30 rpmi: python-module-six-1.12.0-alt1 sisyphus+219665.100.2.1 1548148570 installed
<13>Jun 20 13:56:30 rpmi: python-module-pkg_resources-1:40.8.0-alt2 sisyphus+229158.200.2.1 1557735221 installed
<13>Jun 20 13:56:30 rpmi: python-modules-multiprocessing-2.7.16-alt1.M90P.2 p9+260393.40.3.1 1604003681 installed
<13>Jun 20 13:56:30 rpmi: python-modules-logging-2.7.16-alt1.M90P.2 p9+260393.40.3.1 1604003681 installed
<13>Jun 20 13:56:30 rpmi: python-modules-json-2.7.16-alt1.M90P.2 p9+260393.40.3.1 1604003681 installed
<13>Jun 20 13:56:30 rpmi: python-module-jinja2-2.11.2-alt1 p9+254838.40.14.1 1602882082 installed
<13>Jun 20 13:56:30 rpmi: python-modules-hotshot-2.7.16-alt1.M90P.2 p9+260393.40.3.1 1604003681 installed
<13>Jun 20 13:56:30 rpmi: python-module-webencodings-0.5.1-alt1.1 1517943573 installed
<13>Jun 20 13:56:30 rpmi: python-module-chardet-3.0.4-alt1 sisyphus+227476.1700.1.2 1555756717 installed
<13>Jun 20 13:56:30 rpmi: python-tools-2to3-2.7.16-alt1.M90P.2 p9+260393.40.3.1 1604003681 installed
<13>Jun 20 13:56:30 rpmi: python-module-future-0.16.0-alt2 sisyphus+228356.200.3.3 1556645013 installed
<13>Jun 20 13:56:31 rpmi: python-module-pyglet-1.3.0-alt4.a1.hg20150730.1.1.1 1460413686 installed
<13>Jun 20 13:56:31 rpmi: python-module-whoosh-2.7.4-alt1 1527697941 installed
<13>Jun 20 13:56:31 rpmi: python-modules-bsddb-2.7.16-alt1.M90P.2 p9+260393.40.3.1 1604003681 installed
<13>Jun 20 13:56:31 rpmi: python-2.7.16-alt1.M90P.2 p9+260393.40.3.1 1604003681 installed
<13>Jun 20 13:56:31 rpmi: python-strict-2.7.16-alt1.M90P.2 p9+260393.40.3.1 1604003646 installed
<13>Jun 20 13:56:31 rpmi: python-modules-distutils-2.7.16-alt1.M90P.2 p9+260393.40.3.1 1604003681 installed
<13>Jun 20 13:56:31 rpmi: python-module-4Suite-XML-1.0.2-alt4 sisyphus+224327.100.1.1 1552242121 installed
<13>Jun 20 13:56:31 rpmi: python-module-numpy-1:1.15.4-alt5 p9+255957.40.47.1 1599835883 installed
<13>Jun 20 13:56:31 rpmi: python-module-cssselect-0.9.1-alt1.2 sisyphus+227479.1100.1.2 1555757152 installed
<13>Jun 20 13:56:31 rpmi: python-module-html5lib-1:0.999999999-alt4.qa1 sisyphus+227493.600.1.3 1555835341 installed
<13>Jun 20 13:56:31 rpmi: python-module-lxml-4.4.2-alt1 p9+244111.100.1.1 1578758819 installed
<13>Jun 20 13:56:32 rpmi: python-module-docutils-0.14-alt2 1535729778 installed
<13>Jun 20 13:56:32 rpmi: python-module-idna-2.8-alt1 sisyphus+227494.400.1.3 1555838720 installed
<13>Jun 20 13:56:32 rpmi: python-module-pycparser-2.19-alt1 sisyphus+228366.1000.2.3 1556706938 installed
<13>Jun 20 13:56:32 rpmi: python-module-cffi-1.12.3-alt1 sisyphus+229040.200.3.1 1557316452 installed
<13>Jun 20 13:56:32 rpmi: python-module-asn1crypto-0.24.0-alt1 sisyphus+227473.1300.1.2 1555756512 installed
<13>Jun 20 13:56:32 rpmi: python-module-ntlm-1.1.0-alt1.2 sisyphus+228512.100.1.1 1556654575 installed
<13>Jun 20 13:56:32 rpmi: python-module-pytz-1:2016.10-alt1 1484291011 installed
<13>Jun 20 13:56:32 rpmi: python-module-babel-1:2.6.0-alt1 sisyphus+228351.2400.6.2 1556652168 installed
<13>Jun 20 13:56:32 rpmi: python-module-PyStemmer-1.0.1-alt1.2.1 1321388303 installed
<13>Jun 20 13:56:32 rpmi: python-module-snowballstemmer-1.2.0-alt2.1 1457859319 installed
<13>Jun 20 13:56:33 rpmi: gtk-doc-1.29-alt2 sisyphus+226697.100.2.2 1554603820 installed
<13>Jun 20 13:56:33 rpmi: python-module-simplejson-3.15.0-alt1.qa1 sisyphus+225625.16100.91.1 1555292381 installed
<13>Jun 20 13:56:33 rpmi: python-module-ipaddress-1.0.18-alt1.1 sisyphus+227494.1700.1.3 1555839523 installed
<13>Jun 20 13:56:33 rpmi: python-module-cryptography-2.6.1-alt1 sisyphus+225625.24400.91.1 1555298600 installed
<13>Jun 20 13:56:33 rpmi: python-module-OpenSSL-18.0.0-alt1 1532996168 installed
<13>Jun 20 13:56:33 rpmi: python-module-ndg-0.4.2-alt1.qa1 sisyphus+227504.1300.1.2 1555853234 installed
<13>Jun 20 13:56:33 rpmi: python-module-ndg-httpsclient-0.4.2-alt1.qa1 sisyphus+227504.1300.1.2 1555853234 installed
<13>Jun 20 13:56:33 rpmi: python-module-backports-3.5.0.1-alt1.1.1 1517645428 installed
<13>Jun 20 13:56:33 rpmi: python-module-backports.ssl_match_hostname-3.5.0.1-alt1.1.1 1517645428 installed
<13>Jun 20 13:56:33 rpmi: python-module-urllib3-2:1.25.6-alt1 p9+250567.200.5.1 1590420860 installed
<13>Jun 20 13:56:33 rpmi: python-module-requests-2.23.0-alt1 p9+250567.400.5.1 1590420890 installed
<13>Jun 20 13:56:33 rpmi: python-module-typing-3.6.6-alt2 sisyphus+220108.100.1.1 1548749697 installed
<13>Jun 20 13:56:33 rpmi: python-modules-sqlite3-2.7.16-alt1.M90P.2 p9+260393.40.3.1 1604003681 installed
<13>Jun 20 13:56:33 rpmi: python-module-SQLAlchemy-1.2.15-alt1 sisyphus+225625.4500.91.1 1555284142 installed
<13>Jun 20 13:56:33 rpmi: python-module-py-1.8.0-alt2 sisyphus+228349.1400.4.1 1556631070 installed
<13>Jun 20 13:56:33 rpmi: python-module-mpmath-0.19-alt1.git20150621.1.1.1.1 sisyphus+227503.2100.1.3 1555860908 installed
<13>Jun 20 13:56:33 rpmi: python-module-sympy-tests-1:1.1.1-alt1.1.1 sisyphus+228334.100.1.1 1556542452 installed
<13>Jun 20 13:56:34 rpmi: python-module-sympy-1:1.1.1-alt1.1.1 sisyphus+228334.100.1.1 1556542452 installed
<13>Jun 20 13:56:34 rpmi: python-module-xapian-1.4.15-alt1 p9+258827.200.2.1 1601308077 installed
<13>Jun 20 13:56:34 rpmi: python-module-sphinxcontrib-websupport-1.0.1-alt5 p9+247680.340.15.1 1585331199 installed
<13>Jun 20 13:56:34 rpmi: python-module-alabaster-0.7.6-alt3 sisyphus+228351.700.4.1 1556637370 installed
<13>Jun 20 13:56:34 rpmi: python-module-Pygments-2.4.2-alt3 p9+263160.400.4.1 1607939146 installed
<13>Jun 20 13:56:34 rpmi: python-module-sphinx-1:1.6.5-alt8 p9+250806.100.2.1 1588178467 installed
<13>Jun 20 13:56:34 rpmi: libnsl2-devel-1.1.0-alt1_1 1511548749 installed
<86>Jun 20 13:56:34 groupadd[2822683]: group added to /etc/group: name=sasl, GID=498
<86>Jun 20 13:56:34 groupadd[2822683]: group added to /etc/gshadow: name=sasl
<86>Jun 20 13:56:34 groupadd[2822683]: new group: name=sasl, GID=498
<13>Jun 20 13:56:34 rpmi: libsasl2-3-2.1.27-alt2.1 p9+256192.100.1.1 1597226720 installed
<13>Jun 20 13:56:35 rpmi: libldap-2.4.57-alt0.M90P.1 p9+266288.100.1.1 1613244862 installed
<13>Jun 20 13:56:35 rpmi: libcurl-7.77.0-alt1 p9+272617.100.1.1 1622106828 installed
<13>Jun 20 13:56:35 rpmi: libpoppler90-0.80.0-alt1 p9+237607.100.1.1 1568643084 installed
<13>Jun 20 13:56:35 rpmi: ghostscript-utils-9.27-alt1.M90P.1 p9+258832.300.4.1 1601632175 installed
<13>Jun 20 13:56:36 rpmi: texlive-2019-alt1_2 p9+238369.100.3.1 1569961575 installed
<13>Jun 20 13:56:49 rpmi: texlive-collection-basic-2018-alt1_5 sisyphus+226263.100.1.1 1554169804 installed
<13>Jun 20 13:56:49 rpmi: texlive-texmf-2018-alt1_5 sisyphus+226263.100.1.1 1554169804 installed
<13>Jun 20 13:57:52 rpmi: texlive-dist-2018-alt1_5 sisyphus+226263.100.1.1 1554169804 installed
<13>Jun 20 13:57:52 rpmi: dblatex-0.3.10-alt2 sisyphus.213935.100 1538494563 installed
<13>Jun 20 13:57:52 rpmi: gtk-doc-mkpdf-1.29-alt2 sisyphus+226697.100.2.2 1554603820 installed
<13>Jun 20 13:57:52 rpmi: python-dev-2.7.16-alt1.M90P.2 p9+260393.40.3.1 1604003681 installed
<13>Jun 20 13:57:52 rpmi: gobject-introspection-devel-1.60.2-alt1 p9+232288.200.1.1 1560708080 installed
<13>Jun 20 13:57:52 rpmi: python-module-pygobject3-common-devel-3.32.2-alt2 p9+270488.260.17.1 1622219001 installed
<13>Jun 20 13:57:52 rpmi: libdbus-glib-devel-1:0.106-alt1 1454672854 installed
<13>Jun 20 13:57:52 rpmi: libcheck-devel-20180202:0.12.0-alt1 1524573474 installed
<13>Jun 20 13:57:52 rpmi: libsqlite3-devel-3.33.0-alt1 p9+258834.40.2.1 1601365057 installed
<13>Jun 20 13:57:52 rpmi: libxml2-devel-1:2.9.10-alt6 p9+266566.100.3.1 1614357035 installed
Building target platforms: i586
Building for target i586
Wrote: /usr/src/in/nosrpm/libaccounts-glib-1.23-alt1_6.nosrc.rpm (w1.gzdio)
Installing libaccounts-glib-1.23-alt1_6.src.rpm
Building target platforms: i586
Building for target i586
Executing(%prep): /bin/sh -e /usr/src/tmp/rpm-tmp.47376
+ umask 022
+ /bin/mkdir -p /usr/src/RPM/BUILD
+ cd /usr/src/RPM/BUILD
+ cd /usr/src/RPM/BUILD
+ rm -rf libaccounts-glib-VERSION_1.23-8d14b10652b2fe6c25d8ad8334e2d5023d254313
+ echo 'Source #0 (libaccounts-glib-1.23.tar.gz):'
Source #0 (libaccounts-glib-1.23.tar.gz):
+ /bin/gzip -dc /usr/src/RPM/SOURCES/libaccounts-glib-1.23.tar.gz
+ /bin/tar -xf -
+ cd libaccounts-glib-VERSION_1.23-8d14b10652b2fe6c25d8ad8334e2d5023d254313
+ /bin/chmod -c -Rf u+rwX,go-w .
+ exit 0
Executing(%build): /bin/sh -e /usr/src/tmp/rpm-tmp.47376
+ umask 022
+ /bin/mkdir -p /usr/src/RPM/BUILD
+ cd /usr/src/RPM/BUILD
+ cd libaccounts-glib-VERSION_1.23-8d14b10652b2fe6c25d8ad8334e2d5023d254313
+ test -x configure
+ NOCONFIGURE=1
+ ./autogen.sh
autoreconf-default: Entering directory `.'
autoreconf-default: configure.ac: not using Gettext
autoreconf-default: running: aclocal --force --warnings=all -I m4
autoreconf-default: configure.ac: tracing
autoreconf-default: configure.ac: creating directory build-aux
autoreconf-default: running: libtoolize --copy --force --install
libtoolize-default: putting auxiliary files in AC_CONFIG_AUX_DIR, 'build-aux'.
libtoolize-default: copying file 'build-aux/config.guess'
libtoolize-default: copying file 'build-aux/config.sub'
libtoolize-default: copying file 'build-aux/install-sh'
libtoolize-default: copying file 'build-aux/ltmain.sh'
libtoolize-default: putting macros in AC_CONFIG_MACRO_DIRS, 'm4'.
libtoolize-default: copying file 'm4/libtool.m4'
libtoolize-default: copying file 'm4/ltoptions.m4'
libtoolize-default: copying file 'm4/ltsugar.m4'
libtoolize-default: copying file 'm4/ltversion.m4'
libtoolize-default: copying file 'm4/lt~obsolete.m4'
autoreconf-default: configure.ac: not using Intltool
autoreconf-default: running: gtkdocize --copy
autoreconf-default: running: /usr/bin/autoconf-2.60 --force --warnings=all
autoreconf-default: running: /usr/bin/autoheader-2.60 --force --warnings=all
autoreconf-default: running: automake --add-missing --copy --force-missing --warnings=all
configure.ac:16: installing 'build-aux/compile'
configure.ac:14: installing 'build-aux/missing'
Makefile.am: installing './INSTALL'
/usr/share/automake-1.16/am/ltlibrary.am: warning: 'libaccounts-glib.la': linking libtool libraries using a non-POSIX
/usr/share/automake-1.16/am/ltlibrary.am: archiver requires 'AM_PROG_AR' in 'configure.ac'
libaccounts-glib/Makefile.am:1: while processing Libtool library 'libaccounts-glib.la'
libaccounts-glib/Makefile.am: installing 'build-aux/depcomp'
pygobject/Makefile.am:2: installing 'build-aux/py-compile'
parallel-tests: installing 'build-aux/test-driver'
autoreconf-default: Leaving directory `.'
+ CFLAGS='-pipe -frecord-gcc-switches -Wall -g -O2 -march=i586 -mtune=generic -fPIC -DPIC'
+ export CFLAGS
+ CXXFLAGS='-pipe -frecord-gcc-switches -Wall -g -O2 -march=i586 -mtune=generic -fPIC -DPIC'
+ export CXXFLAGS
+ FFLAGS='-pipe -frecord-gcc-switches -Wall -g -O2 -march=i586 -mtune=generic -fPIC -DPIC'
+ export FFLAGS
+ FCFLAGS='-pipe -frecord-gcc-switches -Wall -g -O2 -march=i586 -mtune=generic -fPIC -DPIC'
+ export FCFLAGS
+ '[' -n '' ']'
++ printf %s '-pipe -frecord-gcc-switches -Wall -g -O2 -march=i586 -mtune=generic -fPIC -DPIC'
++ sed -r 's/(^|[[:space:]]+)-[^m][^[:space:]]*//g'
+ ASFLAGS=' -march=i586 -mtune=generic'
+ export ASFLAGS
+ export lt_cv_deplibs_check_method=pass_all
+ lt_cv_deplibs_check_method=pass_all
+ readlink -e -- ./configure
+ xargs -ri find '{}' -type f '(' -name config.sub -or -name config.guess ')' -printf '%h/\n'
+ xargs -rn1 install -pm755 -- /usr/share/gnu-config/config.sub /usr/share/gnu-config/config.guess
+ sort -u
+ xargs -ri dirname -- '{}'
+ ./configure --build=i586-alt-linux --host=i586-alt-linux --prefix=/usr --exec-prefix=/usr --bindir=/usr/bin --sbindir=/usr/sbin --sysconfdir=/etc --datadir=/usr/share --includedir=/usr/include --libdir=/usr/lib --libexecdir=/usr/lib --localstatedir=/var --sharedstatedir=/var/lib --mandir=/usr/share/man --infodir=/usr/share/info --disable-dependency-tracking --disable-silent-rules --without-included-gettext --disable-static --enable-gtk-doc
configure: WARNING: unrecognized options: --without-included-gettext
checking for a BSD-compatible install... /bin/install -c
checking whether build environment is sane... yes
checking for a thread-safe mkdir -p... /bin/mkdir -p
checking for gawk... gawk
checking whether make sets $(MAKE)... yes
checking whether make supports nested variables... yes
checking for i586-alt-linux-gcc... i586-alt-linux-gcc
checking whether the C compiler works... yes
checking for C compiler default output file name... a.out
checking for suffix of executables...
checking whether we are cross compiling... no
checking for suffix of object files... o
checking whether we are using the GNU C compiler... yes
checking whether i586-alt-linux-gcc accepts -g... yes
checking for i586-alt-linux-gcc option to accept ISO C89... none needed
checking whether i586-alt-linux-gcc understands -c and -o together... yes
checking whether make supports the include directive... yes (GNU style)
checking dependency style of i586-alt-linux-gcc... none
checking for i586-alt-linux-gcc option to accept ISO C99... none needed
checking for i586-alt-linux-gcc option to accept ISO Standard C... (cached) none needed
checking for a sed that does not truncate output... /bin/sed
checking build system type... i586-alt-linux-gnu
checking host system type... i586-alt-linux-gnu
checking how to print strings... printf
checking for a sed that does not truncate output... (cached) /bin/sed
checking for grep that handles long lines and -e... /bin/grep
checking for egrep... /bin/grep -E
checking for fgrep... /bin/grep -F
checking for ld used by i586-alt-linux-gcc... /usr/bin/ld
checking if the linker (/usr/bin/ld) is GNU ld... yes
checking for BSD- or MS-compatible name lister (nm)... /usr/bin/nm -B
checking the name lister (/usr/bin/nm -B) interface... BSD nm
checking whether ln -s works... yes
checking the maximum length of command line arguments... 1572864
checking how to convert i586-alt-linux-gnu file names to i586-alt-linux-gnu format... func_convert_file_noop
checking how to convert i586-alt-linux-gnu file names to toolchain format... func_convert_file_noop
checking for /usr/bin/ld option to reload object files... -r
checking for i586-alt-linux-objdump... no
checking for objdump... objdump
checking how to recognize dependent libraries... (cached) pass_all
checking for i586-alt-linux-dlltool... no
checking for dlltool... no
checking how to associate runtime and link libraries... printf %s\n
checking for i586-alt-linux-ar... no
checking for ar... ar
checking for archiver @FILE support... @
checking for i586-alt-linux-strip... no
checking for strip... strip
checking for i586-alt-linux-ranlib... no
checking for ranlib... ranlib
checking command to parse /usr/bin/nm -B output from i586-alt-linux-gcc object... ok
checking for sysroot... no
checking for a working dd... /bin/dd
checking how to truncate binary pipes... /bin/dd bs=4096 count=1
checking for i586-alt-linux-mt... no
checking for mt... no
checking if : is a manifest tool... no
checking how to run the C preprocessor... i586-alt-linux-gcc -E
checking for ANSI C header files... yes
checking for sys/types.h... yes
checking for sys/stat.h... yes
checking for stdlib.h... yes
checking for string.h... yes
checking for memory.h... yes
checking for strings.h... yes
checking for inttypes.h... yes
checking for stdint.h... yes
checking for unistd.h... yes
checking for dlfcn.h... yes
checking for objdir... .libs
checking if i586-alt-linux-gcc supports -fno-rtti -fno-exceptions... no
checking for i586-alt-linux-gcc option to produce PIC... -fPIC -DPIC
checking if i586-alt-linux-gcc PIC flag -fPIC -DPIC works... yes
checking if i586-alt-linux-gcc static flag -static works... no
checking if i586-alt-linux-gcc supports -c -o file.o... yes
checking if i586-alt-linux-gcc supports -c -o file.o... (cached) yes
checking whether the i586-alt-linux-gcc linker (/usr/bin/ld) supports shared libraries... yes
checking whether -lc should be explicitly linked in... no
checking dynamic linker characteristics... GNU/Linux ld.so
checking how to hardcode library paths into programs... immediate
checking whether stripping libraries is possible... yes
checking if libtool supports shared libraries... yes
checking whether to build shared libraries... yes
checking whether to build static libraries... no
checking for i586-alt-linux-pkg-config... no
checking for pkg-config... /usr/bin/pkg-config
checking pkg-config is at least version 0.9.0... yes
checking for gobject-introspection... yes
checking for glib-2.0 >= 2.26
gio-2.0 >= 2.36
gio-unix-2.0
gobject-2.0 >= 2.35.1
libxml-2.0
sqlite3 >= 3.7.0... yes
checking for library containing clock_gettime... none required
checking for check >= 0.9.4 glib-2.0 >= 2.26
gio-2.0 >= 2.36
gio-unix-2.0
gobject-2.0 >= 2.35.1
libxml-2.0
sqlite3 >= 3.7.0... yes
checking where to install tests... ${pkglibdir}
checking where to install test data... ${pkgdatadir}/testdata
checking for gtk-doc... yes
checking for gtkdoc-check... gtkdoc-check.test
checking for gtkdoc-check... /usr/bin/gtkdoc-check
checking for gtkdoc-rebase... /usr/bin/gtkdoc-rebase
checking for gtkdoc-mkpdf... /usr/bin/gtkdoc-mkpdf
checking whether to build gtk-doc documentation... yes
checking for glib-2.0 >= 2.10.0 gobject-2.0 >= 2.10.0... yes
checking for python... /usr/bin/python
checking for python version... 2.7
checking for python platform... linux2
checking for python script directory... ${prefix}/lib/python2.7/site-packages
checking for python extension module directory... ${exec_prefix}/lib/python2.7/site-packages
checking for xmllint... /usr/bin/xmllint
checking for XML catalog (/etc/xml/catalog)... found
checking for xmlcatalog... /usr/bin/xmlcatalog
checking for xsltproc... yes
checking for DocBook XML DTD V4.3 in XML catalog... found
checking for DocBook XSL Stylesheets in XML catalog... found
checking that generated files are newer than configure... done
configure: creating ./config.status
config.status: creating Makefile
config.status: creating libaccounts-glib/Makefile
config.status: creating libaccounts-glib.pc
config.status: creating docs/Makefile
config.status: creating docs/reference/Makefile
config.status: creating docs/reference/version.xml
config.status: creating pygobject/Makefile
config.status: creating tests/Makefile
config.status: creating tests/data/Makefile
config.status: creating tools/Makefile
config.status: creating config.h
config.status: executing depfiles commands
config.status: executing libtool commands
configure: WARNING: unrecognized options: --without-included-gettext
+ make -j8
make all-recursive
Making all in libaccounts-glib
make[2]: Entering directory '/usr/src/RPM/BUILD/libaccounts-glib-VERSION_1.23-8d14b10652b2fe6c25d8ad8334e2d5023d254313/libaccounts-glib'
glib-genmarshal --body --prefix=ag_marshal ag-marshal.list > ag-marshal.c
INFO: Reading ag-marshal.list...
make[2]: Leaving directory '/usr/src/RPM/BUILD/libaccounts-glib-VERSION_1.23-8d14b10652b2fe6c25d8ad8334e2d5023d254313/libaccounts-glib'
make[2]: Entering directory '/usr/src/RPM/BUILD/libaccounts-glib-VERSION_1.23-8d14b10652b2fe6c25d8ad8334e2d5023d254313/libaccounts-glib'
glib-genmarshal --header --prefix=ag_marshal ag-marshal.list > ag-marshal.h
INFO: Reading ag-marshal.list...
make[2]: Leaving directory '/usr/src/RPM/BUILD/libaccounts-glib-VERSION_1.23-8d14b10652b2fe6c25d8ad8334e2d5023d254313/libaccounts-glib'
make all-am
make[3]: Entering directory '/usr/src/RPM/BUILD/libaccounts-glib-VERSION_1.23-8d14b10652b2fe6c25d8ad8334e2d5023d254313/libaccounts-glib'
/bin/sh ../libtool --tag=CC --mode=compile i586-alt-linux-gcc -DHAVE_CONFIG_H -I.. -I.. -I. -DG_LOG_DOMAIN=\"accounts-glib\" -pthread -I/usr/include/gio-unix-2.0 -I/usr/include/glib-2.0 -I/usr/lib/glib-2.0/include -I/usr/include/libxml2 -Wall -Werror -Wno-error=deprecated-declarations -pipe -frecord-gcc-switches -Wall -g -O2 -march=i586 -mtune=generic -fPIC -DPIC -c -o libaccounts_glib_la-ag-debug.lo `test -f 'ag-debug.c' || echo './'`ag-debug.c
libtool: compile: i586-alt-linux-gcc -DHAVE_CONFIG_H -I.. -I.. -I. -DG_LOG_DOMAIN=\"accounts-glib\" -pthread -I/usr/include/gio-unix-2.0 -I/usr/include/glib-2.0 -I/usr/lib/glib-2.0/include -I/usr/include/libxml2 -Wall -Werror -Wno-error=deprecated-declarations -pipe -frecord-gcc-switches -Wall -g -O2 -march=i586 -mtune=generic -fPIC -DPIC -c ag-debug.c -fPIC -DPIC -o .libs/libaccounts_glib_la-ag-debug.o
make[3]: Leaving directory '/usr/src/RPM/BUILD/libaccounts-glib-VERSION_1.23-8d14b10652b2fe6c25d8ad8334e2d5023d254313/libaccounts-glib'
make[3]: Entering directory '/usr/src/RPM/BUILD/libaccounts-glib-VERSION_1.23-8d14b10652b2fe6c25d8ad8334e2d5023d254313/libaccounts-glib'
/bin/sh ../libtool --tag=CC --mode=compile i586-alt-linux-gcc -DHAVE_CONFIG_H -I.. -I.. -I. -DG_LOG_DOMAIN=\"accounts-glib\" -pthread -I/usr/include/gio-unix-2.0 -I/usr/include/glib-2.0 -I/usr/lib/glib-2.0/include -I/usr/include/libxml2 -Wall -Werror -Wno-error=deprecated-declarations -pipe -frecord-gcc-switches -Wall -g -O2 -march=i586 -mtune=generic -fPIC -DPIC -c -o libaccounts_glib_la-ag-auth-data.lo `test -f 'ag-auth-data.c' || echo './'`ag-auth-data.c
libtool: compile: i586-alt-linux-gcc -DHAVE_CONFIG_H -I.. -I.. -I. -DG_LOG_DOMAIN=\"accounts-glib\" -pthread -I/usr/include/gio-unix-2.0 -I/usr/include/glib-2.0 -I/usr/lib/glib-2.0/include -I/usr/include/libxml2 -Wall -Werror -Wno-error=deprecated-declarations -pipe -frecord-gcc-switches -Wall -g -O2 -march=i586 -mtune=generic -fPIC -DPIC -c ag-auth-data.c -fPIC -DPIC -o .libs/libaccounts_glib_la-ag-auth-data.o
make[3]: Leaving directory '/usr/src/RPM/BUILD/libaccounts-glib-VERSION_1.23-8d14b10652b2fe6c25d8ad8334e2d5023d254313/libaccounts-glib'
make[3]: Entering directory '/usr/src/RPM/BUILD/libaccounts-glib-VERSION_1.23-8d14b10652b2fe6c25d8ad8334e2d5023d254313/libaccounts-glib'
/bin/sh ../libtool --tag=CC --mode=compile i586-alt-linux-gcc -DHAVE_CONFIG_H -I.. -I.. -I. -DG_LOG_DOMAIN=\"accounts-glib\" -pthread -I/usr/include/gio-unix-2.0 -I/usr/include/glib-2.0 -I/usr/lib/glib-2.0/include -I/usr/include/libxml2 -Wall -Werror -Wno-error=deprecated-declarations -pipe -frecord-gcc-switches -Wall -g -O2 -march=i586 -mtune=generic -fPIC -DPIC -c -o libaccounts_glib_la-ag-account-service.lo `test -f 'ag-account-service.c' || echo './'`ag-account-service.c
libtool: compile: i586-alt-linux-gcc -DHAVE_CONFIG_H -I.. -I.. -I. -DG_LOG_DOMAIN=\"accounts-glib\" -pthread -I/usr/include/gio-unix-2.0 -I/usr/include/glib-2.0 -I/usr/lib/glib-2.0/include -I/usr/include/libxml2 -Wall -Werror -Wno-error=deprecated-declarations -pipe -frecord-gcc-switches -Wall -g -O2 -march=i586 -mtune=generic -fPIC -DPIC -c ag-account-service.c -fPIC -DPIC -o .libs/libaccounts_glib_la-ag-account-service.o
ag-account-service.c: In function 'ag_account_service_class_init':
ag-account-service.c:301:5: warning: 'g_type_class_add_private' is deprecated [-Wdeprecated-declarations]
g_type_class_add_private (object_class, sizeof (AgAccountServicePrivate));
^~~~~~~~~~~~~~~~~~~~~~~~
In file included from /usr/include/glib-2.0/gobject/gobject.h:24,
from /usr/include/glib-2.0/gobject/gbinding.h:29,
from /usr/include/glib-2.0/glib-object.h:23,
from ag-account-service.h:29,
from ag-account-service.c:114:
/usr/include/glib-2.0/gobject/gtype.h:1303:10: note: declared here
void g_type_class_add_private (gpointer g_class,
^~~~~~~~~~~~~~~~~~~~~~~~
make[3]: Leaving directory '/usr/src/RPM/BUILD/libaccounts-glib-VERSION_1.23-8d14b10652b2fe6c25d8ad8334e2d5023d254313/libaccounts-glib'
make[3]: Entering directory '/usr/src/RPM/BUILD/libaccounts-glib-VERSION_1.23-8d14b10652b2fe6c25d8ad8334e2d5023d254313/libaccounts-glib'
/bin/sh ../libtool --tag=CC --mode=compile i586-alt-linux-gcc -DHAVE_CONFIG_H -I.. -I.. -I. -DG_LOG_DOMAIN=\"accounts-glib\" -pthread -I/usr/include/gio-unix-2.0 -I/usr/include/glib-2.0 -I/usr/lib/glib-2.0/include -I/usr/include/libxml2 -Wall -Werror -Wno-error=deprecated-declarations -pipe -frecord-gcc-switches -Wall -g -O2 -march=i586 -mtune=generic -fPIC -DPIC -c -o libaccounts_glib_la-ag-provider.lo `test -f 'ag-provider.c' || echo './'`ag-provider.c
libtool: compile: i586-alt-linux-gcc -DHAVE_CONFIG_H -I.. -I.. -I. -DG_LOG_DOMAIN=\"accounts-glib\" -pthread -I/usr/include/gio-unix-2.0 -I/usr/include/glib-2.0 -I/usr/lib/glib-2.0/include -I/usr/include/libxml2 -Wall -Werror -Wno-error=deprecated-declarations -pipe -frecord-gcc-switches -Wall -g -O2 -march=i586 -mtune=generic -fPIC -DPIC -c ag-provider.c -fPIC -DPIC -o .libs/libaccounts_glib_la-ag-provider.o
make[3]: Leaving directory '/usr/src/RPM/BUILD/libaccounts-glib-VERSION_1.23-8d14b10652b2fe6c25d8ad8334e2d5023d254313/libaccounts-glib'
make[3]: Entering directory '/usr/src/RPM/BUILD/libaccounts-glib-VERSION_1.23-8d14b10652b2fe6c25d8ad8334e2d5023d254313/libaccounts-glib'
/bin/sh ../libtool --tag=CC --mode=compile i586-alt-linux-gcc -DHAVE_CONFIG_H -I.. -I.. -I. -DG_LOG_DOMAIN=\"accounts-glib\" -pthread -I/usr/include/gio-unix-2.0 -I/usr/include/glib-2.0 -I/usr/lib/glib-2.0/include -I/usr/include/libxml2 -Wall -Werror -Wno-error=deprecated-declarations -pipe -frecord-gcc-switches -Wall -g -O2 -march=i586 -mtune=generic -fPIC -DPIC -c -o libaccounts_glib_la-ag-service-type.lo `test -f 'ag-service-type.c' || echo './'`ag-service-type.c
libtool: compile: i586-alt-linux-gcc -DHAVE_CONFIG_H -I.. -I.. -I. -DG_LOG_DOMAIN=\"accounts-glib\" -pthread -I/usr/include/gio-unix-2.0 -I/usr/include/glib-2.0 -I/usr/lib/glib-2.0/include -I/usr/include/libxml2 -Wall -Werror -Wno-error=deprecated-declarations -pipe -frecord-gcc-switches -Wall -g -O2 -march=i586 -mtune=generic -fPIC -DPIC -c ag-service-type.c -fPIC -DPIC -o .libs/libaccounts_glib_la-ag-service-type.o
make[3]: Leaving directory '/usr/src/RPM/BUILD/libaccounts-glib-VERSION_1.23-8d14b10652b2fe6c25d8ad8334e2d5023d254313/libaccounts-glib'
make[3]: Entering directory '/usr/src/RPM/BUILD/libaccounts-glib-VERSION_1.23-8d14b10652b2fe6c25d8ad8334e2d5023d254313/libaccounts-glib'
/bin/sh ../libtool --tag=CC --mode=compile i586-alt-linux-gcc -DHAVE_CONFIG_H -I.. -I.. -I. -DG_LOG_DOMAIN=\"accounts-glib\" -pthread -I/usr/include/gio-unix-2.0 -I/usr/include/glib-2.0 -I/usr/lib/glib-2.0/include -I/usr/include/libxml2 -Wall -Werror -Wno-error=deprecated-declarations -pipe -frecord-gcc-switches -Wall -g -O2 -march=i586 -mtune=generic -fPIC -DPIC -c -o libaccounts_glib_la-ag-application.lo `test -f 'ag-application.c' || echo './'`ag-application.c
libtool: compile: i586-alt-linux-gcc -DHAVE_CONFIG_H -I.. -I.. -I. -DG_LOG_DOMAIN=\"accounts-glib\" -pthread -I/usr/include/gio-unix-2.0 -I/usr/include/glib-2.0 -I/usr/lib/glib-2.0/include -I/usr/include/libxml2 -Wall -Werror -Wno-error=deprecated-declarations -pipe -frecord-gcc-switches -Wall -g -O2 -march=i586 -mtune=generic -fPIC -DPIC -c ag-application.c -fPIC -DPIC -o .libs/libaccounts_glib_la-ag-application.o
make[3]: Leaving directory '/usr/src/RPM/BUILD/libaccounts-glib-VERSION_1.23-8d14b10652b2fe6c25d8ad8334e2d5023d254313/libaccounts-glib'
make[3]: Entering directory '/usr/src/RPM/BUILD/libaccounts-glib-VERSION_1.23-8d14b10652b2fe6c25d8ad8334e2d5023d254313/libaccounts-glib'
/bin/sh ../libtool --tag=CC --mode=compile i586-alt-linux-gcc -DHAVE_CONFIG_H -I.. -I.. -I. -DG_LOG_DOMAIN=\"accounts-glib\" -pthread -I/usr/include/gio-unix-2.0 -I/usr/include/glib-2.0 -I/usr/lib/glib-2.0/include -I/usr/include/libxml2 -Wall -Werror -Wno-error=deprecated-declarations -pipe -frecord-gcc-switches -Wall -g -O2 -march=i586 -mtune=generic -fPIC -DPIC -c -o libaccounts_glib_la-ag-service.lo `test -f 'ag-service.c' || echo './'`ag-service.c
libtool: compile: i586-alt-linux-gcc -DHAVE_CONFIG_H -I.. -I.. -I. -DG_LOG_DOMAIN=\"accounts-glib\" -pthread -I/usr/include/gio-unix-2.0 -I/usr/include/glib-2.0 -I/usr/lib/glib-2.0/include -I/usr/include/libxml2 -Wall -Werror -Wno-error=deprecated-declarations -pipe -frecord-gcc-switches -Wall -g -O2 -march=i586 -mtune=generic -fPIC -DPIC -c ag-service.c -fPIC -DPIC -o .libs/libaccounts_glib_la-ag-service.o
make[3]: Leaving directory '/usr/src/RPM/BUILD/libaccounts-glib-VERSION_1.23-8d14b10652b2fe6c25d8ad8334e2d5023d254313/libaccounts-glib'
make[3]: Entering directory '/usr/src/RPM/BUILD/libaccounts-glib-VERSION_1.23-8d14b10652b2fe6c25d8ad8334e2d5023d254313/libaccounts-glib'
/bin/sh ../libtool --tag=CC --mode=compile i586-alt-linux-gcc -DHAVE_CONFIG_H -I.. -I.. -I. -DG_LOG_DOMAIN=\"accounts-glib\" -pthread -I/usr/include/gio-unix-2.0 -I/usr/include/glib-2.0 -I/usr/lib/glib-2.0/include -I/usr/include/libxml2 -Wall -Werror -Wno-error=deprecated-declarations -pipe -frecord-gcc-switches -Wall -g -O2 -march=i586 -mtune=generic -fPIC -DPIC -c -o libaccounts_glib_la-ag-marshal.lo `test -f 'ag-marshal.c' || echo './'`ag-marshal.c
libtool: compile: i586-alt-linux-gcc -DHAVE_CONFIG_H -I.. -I.. -I. -DG_LOG_DOMAIN=\"accounts-glib\" -pthread -I/usr/include/gio-unix-2.0 -I/usr/include/glib-2.0 -I/usr/lib/glib-2.0/include -I/usr/include/libxml2 -Wall -Werror -Wno-error=deprecated-declarations -pipe -frecord-gcc-switches -Wall -g -O2 -march=i586 -mtune=generic -fPIC -DPIC -c ag-marshal.c -fPIC -DPIC -o .libs/libaccounts_glib_la-ag-marshal.o
make[3]: Leaving directory '/usr/src/RPM/BUILD/libaccounts-glib-VERSION_1.23-8d14b10652b2fe6c25d8ad8334e2d5023d254313/libaccounts-glib'
make[3]: Entering directory '/usr/src/RPM/BUILD/libaccounts-glib-VERSION_1.23-8d14b10652b2fe6c25d8ad8334e2d5023d254313/libaccounts-glib'
/bin/sh ../libtool --tag=CC --mode=compile i586-alt-linux-gcc -DHAVE_CONFIG_H -I.. -I.. -I. -DG_LOG_DOMAIN=\"accounts-glib\" -pthread -I/usr/include/gio-unix-2.0 -I/usr/include/glib-2.0 -I/usr/lib/glib-2.0/include -I/usr/include/libxml2 -Wall -Werror -Wno-error=deprecated-declarations -pipe -frecord-gcc-switches -Wall -g -O2 -march=i586 -mtune=generic -fPIC -DPIC -c -o libaccounts_glib_la-ag-account.lo `test -f 'ag-account.c' || echo './'`ag-account.c
libtool: compile: i586-alt-linux-gcc -DHAVE_CONFIG_H -I.. -I.. -I. -DG_LOG_DOMAIN=\"accounts-glib\" -pthread -I/usr/include/gio-unix-2.0 -I/usr/include/glib-2.0 -I/usr/lib/glib-2.0/include -I/usr/include/libxml2 -Wall -Werror -Wno-error=deprecated-declarations -pipe -frecord-gcc-switches -Wall -g -O2 -march=i586 -mtune=generic -fPIC -DPIC -c ag-account.c -fPIC -DPIC -o .libs/libaccounts_glib_la-ag-account.o
ag-account.c: In function 'ag_account_class_init':
ag-account.c:1021:5: warning: 'g_type_class_add_private' is deprecated [-Wdeprecated-declarations]
g_type_class_add_private (object_class, sizeof (AgAccountPrivate));
^~~~~~~~~~~~~~~~~~~~~~~~
In file included from /usr/include/glib-2.0/gobject/gobject.h:24,
from /usr/include/glib-2.0/gobject/gbinding.h:29,
from /usr/include/glib-2.0/glib-object.h:23,
from ag-manager.h:31,
from ag-account.c:103:
/usr/include/glib-2.0/gobject/gtype.h:1303:10: note: declared here
void g_type_class_add_private (gpointer g_class,
^~~~~~~~~~~~~~~~~~~~~~~~
make[3]: Leaving directory '/usr/src/RPM/BUILD/libaccounts-glib-VERSION_1.23-8d14b10652b2fe6c25d8ad8334e2d5023d254313/libaccounts-glib'
make[3]: Entering directory '/usr/src/RPM/BUILD/libaccounts-glib-VERSION_1.23-8d14b10652b2fe6c25d8ad8334e2d5023d254313/libaccounts-glib'
/bin/sh ../libtool --tag=CC --mode=compile i586-alt-linux-gcc -DHAVE_CONFIG_H -I.. -I.. -I. -DG_LOG_DOMAIN=\"accounts-glib\" -pthread -I/usr/include/gio-unix-2.0 -I/usr/include/glib-2.0 -I/usr/lib/glib-2.0/include -I/usr/include/libxml2 -Wall -Werror -Wno-error=deprecated-declarations -pipe -frecord-gcc-switches -Wall -g -O2 -march=i586 -mtune=generic -fPIC -DPIC -c -o libaccounts_glib_la-ag-util.lo `test -f 'ag-util.c' || echo './'`ag-util.c
libtool: compile: i586-alt-linux-gcc -DHAVE_CONFIG_H -I.. -I.. -I. -DG_LOG_DOMAIN=\"accounts-glib\" -pthread -I/usr/include/gio-unix-2.0 -I/usr/include/glib-2.0 -I/usr/lib/glib-2.0/include -I/usr/include/libxml2 -Wall -Werror -Wno-error=deprecated-declarations -pipe -frecord-gcc-switches -Wall -g -O2 -march=i586 -mtune=generic -fPIC -DPIC -c ag-util.c -fPIC -DPIC -o .libs/libaccounts_glib_la-ag-util.o
make[3]: Leaving directory '/usr/src/RPM/BUILD/libaccounts-glib-VERSION_1.23-8d14b10652b2fe6c25d8ad8334e2d5023d254313/libaccounts-glib'
make[3]: Entering directory '/usr/src/RPM/BUILD/libaccounts-glib-VERSION_1.23-8d14b10652b2fe6c25d8ad8334e2d5023d254313/libaccounts-glib'
/bin/sh ../libtool --tag=CC --mode=compile i586-alt-linux-gcc -DHAVE_CONFIG_H -I.. -I.. -I. -DG_LOG_DOMAIN=\"accounts-glib\" -pthread -I/usr/include/gio-unix-2.0 -I/usr/include/glib-2.0 -I/usr/lib/glib-2.0/include -I/usr/include/libxml2 -Wall -Werror -Wno-error=deprecated-declarations -pipe -frecord-gcc-switches -Wall -g -O2 -march=i586 -mtune=generic -fPIC -DPIC -c -o libaccounts_glib_la-ag-manager.lo `test -f 'ag-manager.c' || echo './'`ag-manager.c
libtool: compile: i586-alt-linux-gcc -DHAVE_CONFIG_H -I.. -I.. -I. -DG_LOG_DOMAIN=\"accounts-glib\" -pthread -I/usr/include/gio-unix-2.0 -I/usr/include/glib-2.0 -I/usr/lib/glib-2.0/include -I/usr/include/libxml2 -Wall -Werror -Wno-error=deprecated-declarations -pipe -frecord-gcc-switches -Wall -g -O2 -march=i586 -mtune=generic -fPIC -DPIC -c ag-manager.c -fPIC -DPIC -o .libs/libaccounts_glib_la-ag-manager.o
ag-manager.c: In function 'ag_manager_class_init':
ag-manager.c:1708:5: warning: 'g_type_class_add_private' is deprecated [-Wdeprecated-declarations]
g_type_class_add_private (object_class, sizeof (AgManagerPrivate));
^~~~~~~~~~~~~~~~~~~~~~~~
In file included from /usr/include/glib-2.0/gobject/gobject.h:24,
from /usr/include/glib-2.0/gobject/gbinding.h:29,
from /usr/include/glib-2.0/glib-object.h:23,
from ag-manager.h:31,
from ag-manager.c:49:
/usr/include/glib-2.0/gobject/gtype.h:1303:10: note: declared here
void g_type_class_add_private (gpointer g_class,
^~~~~~~~~~~~~~~~~~~~~~~~
make[3]: Leaving directory '/usr/src/RPM/BUILD/libaccounts-glib-VERSION_1.23-8d14b10652b2fe6c25d8ad8334e2d5023d254313/libaccounts-glib'
make[3]: Entering directory '/usr/src/RPM/BUILD/libaccounts-glib-VERSION_1.23-8d14b10652b2fe6c25d8ad8334e2d5023d254313/libaccounts-glib'
/bin/sh ../libtool --tag=CC --mode=link i586-alt-linux-gcc -pthread -I/usr/include/gio-unix-2.0 -I/usr/include/glib-2.0 -I/usr/lib/glib-2.0/include -I/usr/include/libxml2 -Wall -Werror -Wno-error=deprecated-declarations -pipe -frecord-gcc-switches -Wall -g -O2 -march=i586 -mtune=generic -fPIC -DPIC -version-info 2:0:2 --no-allow-shlib-undefined -export-symbols-regex '^ag_' -o libaccounts-glib.la -rpath /usr/lib libaccounts_glib_la-ag-account.lo libaccounts_glib_la-ag-account-service.lo libaccounts_glib_la-ag-application.lo libaccounts_glib_la-ag-auth-data.lo libaccounts_glib_la-ag-debug.lo libaccounts_glib_la-ag-manager.lo libaccounts_glib_la-ag-provider.lo libaccounts_glib_la-ag-service.lo libaccounts_glib_la-ag-service-type.lo libaccounts_glib_la-ag-util.lo libaccounts_glib_la-ag-marshal.lo -lgio-2.0 -lgobject-2.0 -lglib-2.0 -lxml2 -lsqlite3
libtool: link: /usr/bin/nm -B .libs/libaccounts_glib_la-ag-account.o .libs/libaccounts_glib_la-ag-account-service.o .libs/libaccounts_glib_la-ag-application.o .libs/libaccounts_glib_la-ag-auth-data.o .libs/libaccounts_glib_la-ag-debug.o .libs/libaccounts_glib_la-ag-manager.o .libs/libaccounts_glib_la-ag-provider.o .libs/libaccounts_glib_la-ag-service.o .libs/libaccounts_glib_la-ag-service-type.o .libs/libaccounts_glib_la-ag-util.o .libs/libaccounts_glib_la-ag-marshal.o | sed -n -e 's/^.*[ ]\([ABCDGIRSTW][ABCDGIRSTW]*\)[ ][ ]*\([_A-Za-z][_A-Za-z0-9]*\)$/\1 \2 \2/p' | sed '/ __gnu_lto/d' | /bin/sed 's/.* //' | sort | uniq > .libs/libaccounts-glib.exp
libtool: link: /bin/grep -E -e "^ag_" ".libs/libaccounts-glib.exp" > ".libs/libaccounts-glib.expT"
libtool: link: mv -f ".libs/libaccounts-glib.expT" ".libs/libaccounts-glib.exp"
libtool: link: echo "{ global:" > .libs/libaccounts-glib.ver
libtool: link: cat .libs/libaccounts-glib.exp | sed -e "s/\(.*\)/\1;/" >> .libs/libaccounts-glib.ver
libtool: link: echo "local: *; };" >> .libs/libaccounts-glib.ver
libtool: link: if test -r libaccounts-glib-altlinux.ver; then cp libaccounts-glib-altlinux.ver .libs/libaccounts-glib.ver; fi
libtool: link: i586-alt-linux-gcc -shared -fPIC -DPIC .libs/libaccounts_glib_la-ag-account.o .libs/libaccounts_glib_la-ag-account-service.o .libs/libaccounts_glib_la-ag-application.o .libs/libaccounts_glib_la-ag-auth-data.o .libs/libaccounts_glib_la-ag-debug.o .libs/libaccounts_glib_la-ag-manager.o .libs/libaccounts_glib_la-ag-provider.o .libs/libaccounts_glib_la-ag-service.o .libs/libaccounts_glib_la-ag-service-type.o .libs/libaccounts_glib_la-ag-util.o .libs/libaccounts_glib_la-ag-marshal.o -lgio-2.0 -lgobject-2.0 -lglib-2.0 -lxml2 -lsqlite3 -pthread -g -O2 -march=i586 -mtune=generic -pthread -Wl,-soname -Wl,libaccounts-glib.so.0 -Wl,-version-script -Wl,.libs/libaccounts-glib.ver -o .libs/libaccounts-glib.so.0.2.0
libtool: link: (cd ".libs" && rm -f "libaccounts-glib.so.0" && ln -s "libaccounts-glib.so.0.2.0" "libaccounts-glib.so.0")
libtool: link: (cd ".libs" && rm -f "libaccounts-glib.so" && ln -s "libaccounts-glib.so.0.2.0" "libaccounts-glib.so")
libtool: link: ( cd ".libs" && rm -f "libaccounts-glib.la" && ln -s "../libaccounts-glib.la" "libaccounts-glib.la" )
make[3]: Leaving directory '/usr/src/RPM/BUILD/libaccounts-glib-VERSION_1.23-8d14b10652b2fe6c25d8ad8334e2d5023d254313/libaccounts-glib'
make[3]: Entering directory '/usr/src/RPM/BUILD/libaccounts-glib-VERSION_1.23-8d14b10652b2fe6c25d8ad8334e2d5023d254313/libaccounts-glib'
CPPFLAGS="" CFLAGS="-pipe -frecord-gcc-switches -Wall -g -O2 -march=i586 -mtune=generic -fPIC -DPIC" LDFLAGS="" CC="i586-alt-linux-gcc" PKG_CONFIG="/usr/bin/pkg-config" GI_HOST_OS="" DLLTOOL="false" /usr/bin/g-ir-scanner --add-include-path=. --namespace=Accounts --nsversion=1.0 --libtool="/bin/sh ../libtool" --include=GObject-2.0 --include=Gio-2.0 --library=libaccounts-glib.la --identifier-prefix=Ag --symbol-prefix=ag --c-include="libaccounts-glib/accounts-glib.h" --warn-all --cflags-begin -pthread -I/usr/include/gio-unix-2.0 -I/usr/include/glib-2.0 -I/usr/lib/glib-2.0/include -I/usr/include/libxml2 -I.. --cflags-end ag-account.c ag-account.h ag-account-service.c ag-account-service.h ag-application.c ag-application.h ag-auth-data.c ag-auth-data.h ag-errors.h ag-manager.c ag-manager.h ag-provider.c ag-provider.h ag-service.c ag-service.h ag-service-type.c ag-service-type.h ag-types.h libaccounts-glib.la --output Accounts-1.0.gir
g-ir-scanner: link: /bin/sh ../libtool --mode=link --tag=CC i586-alt-linux-gcc -o /usr/src/RPM/BUILD/libaccounts-glib-VERSION_1.23-8d14b10652b2fe6c25d8ad8334e2d5023d254313/libaccounts-glib/tmp-introspectfjiwmg52/Accounts-1.0 -export-dynamic -pipe -frecord-gcc-switches -Wall -g -O2 -march=i586 -mtune=generic -fPIC -DPIC /usr/src/RPM/BUILD/libaccounts-glib-VERSION_1.23-8d14b10652b2fe6c25d8ad8334e2d5023d254313/libaccounts-glib/tmp-introspectfjiwmg52/Accounts-1.0.o -L. libaccounts-glib.la -lgio-2.0 -lgobject-2.0 -Wl,--export-dynamic -pthread -lgmodule-2.0 -lglib-2.0
libtool: link: i586-alt-linux-gcc -o /usr/src/RPM/BUILD/libaccounts-glib-VERSION_1.23-8d14b10652b2fe6c25d8ad8334e2d5023d254313/libaccounts-glib/tmp-introspectfjiwmg52/.libs/Accounts-1.0 -pipe -frecord-gcc-switches -Wall -g -O2 -march=i586 -mtune=generic -fPIC -DPIC /usr/src/RPM/BUILD/libaccounts-glib-VERSION_1.23-8d14b10652b2fe6c25d8ad8334e2d5023d254313/libaccounts-glib/tmp-introspectfjiwmg52/Accounts-1.0.o -Wl,--export-dynamic -pthread -Wl,--export-dynamic -L. ./.libs/libaccounts-glib.so -lgio-2.0 -lgobject-2.0 -lgmodule-2.0 -lglib-2.0 -pthread
/usr/lib/gcc/i586-alt-linux/8/include/stddef.h:435: syntax error, unexpected identifier in ' __float128 __max_align_f128 __attribute__((__aligned__(__alignof(__float128))));' at '__float128'
make[3]: Leaving directory '/usr/src/RPM/BUILD/libaccounts-glib-VERSION_1.23-8d14b10652b2fe6c25d8ad8334e2d5023d254313/libaccounts-glib'
make[3]: Entering directory '/usr/src/RPM/BUILD/libaccounts-glib-VERSION_1.23-8d14b10652b2fe6c25d8ad8334e2d5023d254313/libaccounts-glib'
/usr/bin/g-ir-compiler --includedir=. --includedir=. Accounts-1.0.gir -o Accounts-1.0.typelib
make[3]: Leaving directory '/usr/src/RPM/BUILD/libaccounts-glib-VERSION_1.23-8d14b10652b2fe6c25d8ad8334e2d5023d254313/libaccounts-glib'
Making all in docs
Making all in reference
make[3]: Entering directory '/usr/src/RPM/BUILD/libaccounts-glib-VERSION_1.23-8d14b10652b2fe6c25d8ad8334e2d5023d254313/docs/reference'
if test "/usr/src/RPM/BUILD/libaccounts-glib-VERSION_1.23-8d14b10652b2fe6c25d8ad8334e2d5023d254313/docs/reference" != "/usr/src/RPM/BUILD/libaccounts-glib-VERSION_1.23-8d14b10652b2fe6c25d8ad8334e2d5023d254313/docs/reference" ; then \
files=`echo ag-backup.xml ag-tool.xml application-file-format.xml gettext-xml-files.xml libaccounts-compiling.xml libaccounts-glossary.xml libaccounts-overview.xml libaccounts-running.xml provider-file-format.xml service-file-format.xml service-type-file-format.xml validating-xml-files.xml libaccounts-glib-docs.xml libaccounts-glib-sections.txt libaccounts-glib-overrides.txt libaccounts-glib.types`; \
if test "x$files" != "x" ; then \
for file in $files ; do \
destdir=`dirname /usr/src/RPM/BUILD/libaccounts-glib-VERSION_1.23-8d14b10652b2fe6c25d8ad8334e2d5023d254313/docs/reference/$file`; \
test -d "$destdir" || mkdir -p "$destdir"; \
test -f /usr/src/RPM/BUILD/libaccounts-glib-VERSION_1.23-8d14b10652b2fe6c25d8ad8334e2d5023d254313/docs/reference/$file && \
cp -pf /usr/src/RPM/BUILD/libaccounts-glib-VERSION_1.23-8d14b10652b2fe6c25d8ad8334e2d5023d254313/docs/reference/$file /usr/src/RPM/BUILD/libaccounts-glib-VERSION_1.23-8d14b10652b2fe6c25d8ad8334e2d5023d254313/docs/reference/$file || true; \
done; \
fi; \
fi
touch setup-build.stamp
make[3]: Leaving directory '/usr/src/RPM/BUILD/libaccounts-glib-VERSION_1.23-8d14b10652b2fe6c25d8ad8334e2d5023d254313/docs/reference'
make[3]: Entering directory '/usr/src/RPM/BUILD/libaccounts-glib-VERSION_1.23-8d14b10652b2fe6c25d8ad8334e2d5023d254313/docs/reference'
/bin/mkdir -p xml && ( \
echo ""; \
echo ""; \
echo ""; \
echo ""; \
echo ""; \
echo ""; \
echo ""; \
) > xml/gtkdocentities.ent
make[3]: Leaving directory '/usr/src/RPM/BUILD/libaccounts-glib-VERSION_1.23-8d14b10652b2fe6c25d8ad8334e2d5023d254313/docs/reference'
make[3]: Entering directory '/usr/src/RPM/BUILD/libaccounts-glib-VERSION_1.23-8d14b10652b2fe6c25d8ad8334e2d5023d254313/docs/reference'
xsltproc -nonet --path . http://docbook.sourceforge.net/release/xsl/current/manpages/docbook.xsl ag-backup.xml
Note: Writing ag-backup.1
make[3]: Leaving directory '/usr/src/RPM/BUILD/libaccounts-glib-VERSION_1.23-8d14b10652b2fe6c25d8ad8334e2d5023d254313/docs/reference'
make[3]: Entering directory '/usr/src/RPM/BUILD/libaccounts-glib-VERSION_1.23-8d14b10652b2fe6c25d8ad8334e2d5023d254313/docs/reference'
xsltproc -nonet --path . http://docbook.sourceforge.net/release/xsl/current/manpages/docbook.xsl ag-tool.xml
Note: Writing ag-tool.1
make[3]: Leaving directory '/usr/src/RPM/BUILD/libaccounts-glib-VERSION_1.23-8d14b10652b2fe6c25d8ad8334e2d5023d254313/docs/reference'
make[3]: Entering directory '/usr/src/RPM/BUILD/libaccounts-glib-VERSION_1.23-8d14b10652b2fe6c25d8ad8334e2d5023d254313/docs/reference'
_source_dir='' ; \
for i in ../../libaccounts-glib ; do \
_source_dir="${_source_dir} --source-dir=$i" ; \
done ; \
gtkdoc-scan --module=libaccounts-glib --ignore-headers="ag-marshal.h ag-debug.h ag-internals.h ag-util.h" ${_source_dir} --rebuild-types --deprecated-guards="AG_DISABLE_DEPRECATED"
if grep -l '^..*$' libaccounts-glib.types > /dev/null 2>&1 ; then \
scanobj_options=""; \
gtkdoc-scangobj 2>&1 --help | grep >/dev/null "\-\-verbose"; \
if test "$?" = "0"; then \
if test "x" = "x1"; then \
scanobj_options="--verbose"; \
fi; \
fi; \
CC="/bin/sh ../../libtool --tag=CC --mode=compile i586-alt-linux-gcc -I/usr/include/glib-2.0 -I/usr/lib/glib-2.0/include -I../.. -pthread -I/usr/include/gio-unix-2.0 -I/usr/include/glib-2.0 -I/usr/lib/glib-2.0/include -I/usr/include/libxml2 -pipe -frecord-gcc-switches -Wall -g -O2 -march=i586 -mtune=generic -fPIC -DPIC" LD="/bin/sh ../../libtool --tag=CC --mode=link i586-alt-linux-gcc -lgobject-2.0 -lglib-2.0 -pipe -frecord-gcc-switches -Wall -g -O2 -march=i586 -mtune=generic -fPIC -DPIC " RUN="/bin/sh ../../libtool --mode=execute" CFLAGS=" -pipe -frecord-gcc-switches -Wall -g -O2 -march=i586 -mtune=generic -fPIC -DPIC" LDFLAGS="../../libaccounts-glib/libaccounts-glib.la -lgio-2.0 -lgobject-2.0 -lglib-2.0 -lxml2 -lsqlite3 " \
gtkdoc-scangobj $scanobj_options --module=libaccounts-glib; \
else \
for i in libaccounts-glib.args libaccounts-glib.hierarchy libaccounts-glib.interfaces libaccounts-glib.prerequisites libaccounts-glib.signals ; do \
test -f $i || touch $i ; \
done \
fi
touch scan-build.stamp
make[3]: Leaving directory '/usr/src/RPM/BUILD/libaccounts-glib-VERSION_1.23-8d14b10652b2fe6c25d8ad8334e2d5023d254313/docs/reference'
make[3]: Entering directory '/usr/src/RPM/BUILD/libaccounts-glib-VERSION_1.23-8d14b10652b2fe6c25d8ad8334e2d5023d254313/docs/reference'
_source_dir='' ; \
for i in ../../libaccounts-glib ; do \
_source_dir="${_source_dir} --source-dir=$i" ; \
done ; \
gtkdoc-mkdb --module=libaccounts-glib --output-format=xml --expand-content-files="" --main-sgml-file=libaccounts-glib-docs.xml ${_source_dir} --source-dir=../../libaccounts-glib --sgml-mode --output-format=xml --name-space=ag
./libaccounts-glib-unused.txt:1: warning: 5 unused declarations. They should be added to libaccounts-glib-sections.txt in the appropriate place.
touch sgml-build.stamp
make[3]: Leaving directory '/usr/src/RPM/BUILD/libaccounts-glib-VERSION_1.23-8d14b10652b2fe6c25d8ad8334e2d5023d254313/docs/reference'
make[3]: Entering directory '/usr/src/RPM/BUILD/libaccounts-glib-VERSION_1.23-8d14b10652b2fe6c25d8ad8334e2d5023d254313/docs/reference'
rm -rf html && mkdir html && \
mkhtml_options=""; \
gtkdoc-mkhtml 2>&1 --help | grep >/dev/null "\-\-verbose"; \
if test "$?" = "0"; then \
if test "x" = "x1"; then \
mkhtml_options="$mkhtml_options --verbose"; \
fi; \
fi; \
gtkdoc-mkhtml 2>&1 --help | grep >/dev/null "\-\-path"; \
if test "$?" = "0"; then \
mkhtml_options="$mkhtml_options --path=\"/usr/src/RPM/BUILD/libaccounts-glib-VERSION_1.23-8d14b10652b2fe6c25d8ad8334e2d5023d254313/docs/reference\""; \
fi; \
cd html && gtkdoc-mkhtml $mkhtml_options libaccounts-glib ../libaccounts-glib-docs.xml
gtkdoc-fixxref --module=libaccounts-glib --module-dir=html --html-dir=/usr/share/gtk-doc/html
html/AgAccount.html:376: warning: no link for: "G-SIGNAL-RUN-LAST:CAPS" -> (Run Last).
html/AgAccount.html:626: warning: no link for: "GError" -> (GError).
html/AgAccount.html:631: warning: no link for: "NULL:CAPS" -> (NULL
).
html/AgAccount.html:735: warning: no link for: "TRUE:CAPS" -> (TRUE
).
html/AgAccount.html:736: warning: no link for: "FALSE:CAPS" -> (FALSE
).
html/AgAccount.html:865: warning: no link for: "GValue" -> (GValue).
html/AgAccount.html:933: warning: no link for: "GList" -> (GList).
html/AgAccount.html:1228: warning: no link for: "GVariant" -> (GVariant).
html/AgAccount.html:1231: warning: no link for: "g-variant-ref" -> (g_variant_ref()
).
html/AgAccount.html:1534: warning: no link for: "GCancellable" -> (GCancellable).
html/AgAccount.html:1535: warning: no link for: "GAsyncReadyCallback" -> (GAsyncReadyCallback).
html/AgAccount.html:1581: warning: no link for: "GAsyncResult" -> (GAsyncResult).
html/AgAccountService.html:377: warning: no link for: "g-object-ref" -> (g_object_ref()
).
html/AgAccountService.html:408: warning: no link for: "g-strfreev" -> (g_strfreev()
).
html/AgApplication.html:209: warning: no link for: "GDesktopAppInfo" -> (GDesktopAppInfo).
html/AgAuthData.html:253: warning: no link for: "G-VARIANT-TYPE-VARDICT:CAPS" -> (G_VARIANT_TYPE_VARDICT
).
html/AgAuthData.html:285: warning: no link for: "GHashTable" -> (GHashTable).
html/AgManager.html:510: warning: no link for: "g-list-free" -> (g_list_free()
).
html/AgProvider.html:478: warning: no link for: "api-index-1.14" -> (1.14).
touch html-build.stamp
make[3]: Leaving directory '/usr/src/RPM/BUILD/libaccounts-glib-VERSION_1.23-8d14b10652b2fe6c25d8ad8334e2d5023d254313/docs/reference'
make[3]: Nothing to be done for 'all-am'.
Making all in tools
make[2]: Entering directory '/usr/src/RPM/BUILD/libaccounts-glib-VERSION_1.23-8d14b10652b2fe6c25d8ad8334e2d5023d254313/tools'
i586-alt-linux-gcc -DHAVE_CONFIG_H -I.. -I.. -pthread -I/usr/include/gio-unix-2.0 -I/usr/include/glib-2.0 -I/usr/lib/glib-2.0/include -I/usr/include/libxml2 -pipe -frecord-gcc-switches -Wall -g -O2 -march=i586 -mtune=generic -fPIC -DPIC -c -o ag_backup-backup.o `test -f 'backup.c' || echo './'`backup.c
make[2]: Leaving directory '/usr/src/RPM/BUILD/libaccounts-glib-VERSION_1.23-8d14b10652b2fe6c25d8ad8334e2d5023d254313/tools'
make[2]: Entering directory '/usr/src/RPM/BUILD/libaccounts-glib-VERSION_1.23-8d14b10652b2fe6c25d8ad8334e2d5023d254313/tools'
i586-alt-linux-gcc -DHAVE_CONFIG_H -I.. -pthread -I/usr/include/gio-unix-2.0 -I/usr/include/glib-2.0 -I/usr/lib/glib-2.0/include -I/usr/include/libxml2 -pipe -frecord-gcc-switches -Wall -g -O2 -march=i586 -mtune=generic -fPIC -DPIC -c -o ag_tool-main.o `test -f 'main.c' || echo './'`main.c
main.c: In function 'parse':
main.c:1187:9: warning: unused variable 'i' [-Wunused-variable]
int i = 0;
^
make[2]: Leaving directory '/usr/src/RPM/BUILD/libaccounts-glib-VERSION_1.23-8d14b10652b2fe6c25d8ad8334e2d5023d254313/tools'
make[2]: Entering directory '/usr/src/RPM/BUILD/libaccounts-glib-VERSION_1.23-8d14b10652b2fe6c25d8ad8334e2d5023d254313/tools'
/bin/sh ../libtool --tag=CC --mode=link i586-alt-linux-gcc -pipe -frecord-gcc-switches -Wall -g -O2 -march=i586 -mtune=generic -fPIC -DPIC -o ag-backup ag_backup-backup.o -lgio-2.0 -lgobject-2.0 -lglib-2.0 -lxml2 -lsqlite3
libtool: link: i586-alt-linux-gcc -pipe -frecord-gcc-switches -Wall -g -O2 -march=i586 -mtune=generic -fPIC -DPIC -o ag-backup ag_backup-backup.o -lgio-2.0 -lgobject-2.0 -lglib-2.0 -lxml2 -lsqlite3
make[2]: Leaving directory '/usr/src/RPM/BUILD/libaccounts-glib-VERSION_1.23-8d14b10652b2fe6c25d8ad8334e2d5023d254313/tools'
make[2]: Entering directory '/usr/src/RPM/BUILD/libaccounts-glib-VERSION_1.23-8d14b10652b2fe6c25d8ad8334e2d5023d254313/tools'
/bin/sh ../libtool --tag=CC --mode=link i586-alt-linux-gcc -pipe -frecord-gcc-switches -Wall -g -O2 -march=i586 -mtune=generic -fPIC -DPIC -o ag-tool ag_tool-main.o -lgio-2.0 -lgobject-2.0 -lglib-2.0 -lxml2 -lsqlite3 ../libaccounts-glib/libaccounts-glib.la
libtool: link: i586-alt-linux-gcc -pipe -frecord-gcc-switches -Wall -g -O2 -march=i586 -mtune=generic -fPIC -DPIC -o .libs/ag-tool ag_tool-main.o -lgio-2.0 -lgobject-2.0 -lglib-2.0 -lxml2 -lsqlite3 ../libaccounts-glib/.libs/libaccounts-glib.so -pthread
make[2]: Leaving directory '/usr/src/RPM/BUILD/libaccounts-glib-VERSION_1.23-8d14b10652b2fe6c25d8ad8334e2d5023d254313/tools'
Making all in pygobject
make[2]: Nothing to be done for 'all'.
Making all in tests
make[2]: Entering directory '/usr/src/RPM/BUILD/libaccounts-glib-VERSION_1.23-8d14b10652b2fe6c25d8ad8334e2d5023d254313/tests'
gdbus-codegen \
--generate-c-code test-manager \
--c-generate-object-manager \
--c-namespace Test \
--annotate "com.google.code.AccountsSSO.Accounts.Manager" org.gtk.GDBus.C.Name Manager \
../libaccounts-glib/com.google.code.AccountsSSO.Accounts.Manager.xml
make[2]: Leaving directory '/usr/src/RPM/BUILD/libaccounts-glib-VERSION_1.23-8d14b10652b2fe6c25d8ad8334e2d5023d254313/tests'
make[2]: Entering directory '/usr/src/RPM/BUILD/libaccounts-glib-VERSION_1.23-8d14b10652b2fe6c25d8ad8334e2d5023d254313/tests'
gdbus-codegen \
--generate-c-code test-manager \
--c-generate-object-manager \
--c-namespace Test \
--annotate "com.google.code.AccountsSSO.Accounts.Manager" org.gtk.GDBus.C.Name Manager \
../libaccounts-glib/com.google.code.AccountsSSO.Accounts.Manager.xml
make[2]: Leaving directory '/usr/src/RPM/BUILD/libaccounts-glib-VERSION_1.23-8d14b10652b2fe6c25d8ad8334e2d5023d254313/tests'
make all-recursive
Making all in data
make[4]: Nothing to be done for 'all'.
make[4]: Entering directory '/usr/src/RPM/BUILD/libaccounts-glib-VERSION_1.23-8d14b10652b2fe6c25d8ad8334e2d5023d254313/tests'
/bin/sed -e 's|@''TESTDIR''@|/usr/lib/libaccounts-glib|' \
-e 's|@''TESTDATADIR''@|/usr/share/libaccounts-glib/testdata|' tests.xml.in > tests.xml
make[4]: Leaving directory '/usr/src/RPM/BUILD/libaccounts-glib-VERSION_1.23-8d14b10652b2fe6c25d8ad8334e2d5023d254313/tests'
make[4]: Entering directory '/usr/src/RPM/BUILD/libaccounts-glib-VERSION_1.23-8d14b10652b2fe6c25d8ad8334e2d5023d254313/tests'
i586-alt-linux-gcc -DHAVE_CONFIG_H -pthread -I/usr/include/gio-unix-2.0 -I/usr/include/glib-2.0 -I/usr/lib/glib-2.0/include -I/usr/include/libxml2 -I.. -pipe -frecord-gcc-switches -Wall -g -O2 -march=i586 -mtune=generic -fPIC -DPIC -c -o test_process-test-process.o `test -f 'test-process.c' || echo './'`test-process.c
make[4]: Leaving directory '/usr/src/RPM/BUILD/libaccounts-glib-VERSION_1.23-8d14b10652b2fe6c25d8ad8334e2d5023d254313/tests'
make[4]: Entering directory '/usr/src/RPM/BUILD/libaccounts-glib-VERSION_1.23-8d14b10652b2fe6c25d8ad8334e2d5023d254313/tests'
i586-alt-linux-gcc -DHAVE_CONFIG_H -pthread -I/usr/include/gio-unix-2.0 -I/usr/include/glib-2.0 -I/usr/lib/glib-2.0/include -I/usr/include/libxml2 -I.. -I../tests -I.. -pipe -frecord-gcc-switches -Wall -g -O2 -march=i586 -mtune=generic -fPIC -DPIC -c -o accounts_glib_testsuite-test-manager.o `test -f 'test-manager.c' || echo './'`test-manager.c
make[4]: Leaving directory '/usr/src/RPM/BUILD/libaccounts-glib-VERSION_1.23-8d14b10652b2fe6c25d8ad8334e2d5023d254313/tests'
make[4]: Entering directory '/usr/src/RPM/BUILD/libaccounts-glib-VERSION_1.23-8d14b10652b2fe6c25d8ad8334e2d5023d254313/tests'
/bin/sh ../libtool --tag=CC --mode=link i586-alt-linux-gcc -pipe -frecord-gcc-switches -Wall -g -O2 -march=i586 -mtune=generic -fPIC -DPIC -o test-process test_process-test-process.o -lgio-2.0 -lgobject-2.0 -lglib-2.0 -lxml2 -lsqlite3 ../libaccounts-glib/libaccounts-glib.la
libtool: link: i586-alt-linux-gcc -pipe -frecord-gcc-switches -Wall -g -O2 -march=i586 -mtune=generic -fPIC -DPIC -o .libs/test-process test_process-test-process.o -lgio-2.0 -lgobject-2.0 -lglib-2.0 -lxml2 -lsqlite3 ../libaccounts-glib/.libs/libaccounts-glib.so -pthread
make[4]: Leaving directory '/usr/src/RPM/BUILD/libaccounts-glib-VERSION_1.23-8d14b10652b2fe6c25d8ad8334e2d5023d254313/tests'
make[4]: Entering directory '/usr/src/RPM/BUILD/libaccounts-glib-VERSION_1.23-8d14b10652b2fe6c25d8ad8334e2d5023d254313/tests'
i586-alt-linux-gcc -DHAVE_CONFIG_H -pthread -I/usr/include/gio-unix-2.0 -I/usr/include/glib-2.0 -I/usr/lib/glib-2.0/include -I/usr/include/libxml2 -I.. -I../tests -I.. -pipe -frecord-gcc-switches -Wall -g -O2 -march=i586 -mtune=generic -fPIC -DPIC -c -o accounts_glib_testsuite-check_ag.o `test -f 'check_ag.c' || echo './'`check_ag.c
check_ag.c: In function 'store_cb_data_unset':
check_ag.c:96:29: warning: argument to 'sizeof' in 'memset' call is the same expression as the destination; did you mean to dereference it? [-Wsizeof-pointer-memaccess]
memset (data, 0, sizeof (data));
^
check_ag.c: In function 'test_provider':
check_ag.c:311:15: warning: unused variable 'variant' [-Wunused-variable]
GVariant *variant;
^~~~~~~
check_ag.c:309:21: warning: unused variable 'source' [-Wunused-variable]
AgSettingSource source;
^~~~~~
check_ag.c: In function 'test_provider_settings':
check_ag.c:392:17: warning: unused variable 'provider' [-Wunused-variable]
AgProvider *provider;
^~~~~~~~
check_ag.c: In function 'test_provider_directories':
check_ag.c:423:32: warning: unused variable 'xdg_data_dirs_env' [-Wunused-variable]
gchar *xdg_data_home_env, *xdg_data_dirs_env;
^~~~~~~~~~~~~~~~~
check_ag.c: In function 'check_variant_in_dict':
check_ag.c:1441:14: warning: unused variable 'equal' [-Wunused-variable]
gboolean equal;
^~~~~
check_ag.c: In function 'test_auth_data_get_login_parameters':
check_ag.c:1466:16: warning: unused variable 'my_service' [-Wunused-variable]
AgService *my_service;
^~~~~~~~~~
check_ag.c: In function 'test_auth_data_insert_parameters':
check_ag.c:1545:16: warning: unused variable 'my_service' [-Wunused-variable]
AgService *my_service;
^~~~~~~~~~
check_ag.c: In function 'test_application':
check_ag.c:1602:10: warning: unused variable 'i' [-Wunused-variable]
gint i;
^
check_ag.c: In function 'test_application_supported_services':
check_ag.c:1672:10: warning: unused variable 'i' [-Wunused-variable]
gint i;
^
check_ag.c:1669:32: warning: unused variable 'sharing_service' [-Wunused-variable]
AgService *email_service, *sharing_service;
^~~~~~~~~~~~~~~
check_ag.c: In function 'test_account_services':
check_ag.c:1994:16: warning: unused variable 'service' [-Wunused-variable]
AgService *service;
^~~~~~~
check_ag.c: In function 'test_signals_other_manager':
check_ag.c:2084:14: warning: unused variable 'service_enabled' [-Wunused-variable]
gboolean service_enabled = FALSE;
^~~~~~~~~~~~~~~
check_ag.c: In function 'test_list':
check_ag.c:2155:21: warning: unused variable 'source' [-Wunused-variable]
AgSettingSource source;
^~~~~~
check_ag.c:2154:12: warning: unused variable 'value' [-Wunused-variable]
GValue value = { 0 };
^~~~~
check_ag.c: In function 'test_watches':
check_ag.c:2733:38: warning: variable 'w_dir' set but not used [-Wunused-but-set-variable]
AgAccountWatch w_server, w_port, w_dir;
^~~~~
check_ag.c: In function 'test_cache_regression':
check_ag.c:3287:30: warning: variable 'account_id2' set but not used [-Wunused-but-set-variable]
AgAccountId account_id1, account_id2;
^~~~~~~~~~~
check_ag.c: In function 'test_delete_regression':
check_ag.c:3449:17: warning: variable 'id' set but not used [-Wunused-but-set-variable]
AgAccountId id;
^~
make[4]: Leaving directory '/usr/src/RPM/BUILD/libaccounts-glib-VERSION_1.23-8d14b10652b2fe6c25d8ad8334e2d5023d254313/tests'
make[4]: Entering directory '/usr/src/RPM/BUILD/libaccounts-glib-VERSION_1.23-8d14b10652b2fe6c25d8ad8334e2d5023d254313/tests'
/bin/sh ../libtool --tag=CC --mode=link i586-alt-linux-gcc -pipe -frecord-gcc-switches -Wall -g -O2 -march=i586 -mtune=generic -fPIC -DPIC -o accounts-glib-testsuite accounts_glib_testsuite-check_ag.o accounts_glib_testsuite-test-manager.o -lcheck -lgio-2.0 -lgobject-2.0 -lglib-2.0 -lxml2 -lsqlite3 ../libaccounts-glib/libaccounts-glib.la
libtool: link: i586-alt-linux-gcc -pipe -frecord-gcc-switches -Wall -g -O2 -march=i586 -mtune=generic -fPIC -DPIC -o .libs/accounts-glib-testsuite accounts_glib_testsuite-check_ag.o accounts_glib_testsuite-test-manager.o -lcheck -lgio-2.0 -lgobject-2.0 -lglib-2.0 -lxml2 -lsqlite3 ../libaccounts-glib/.libs/libaccounts-glib.so -pthread
make[4]: Leaving directory '/usr/src/RPM/BUILD/libaccounts-glib-VERSION_1.23-8d14b10652b2fe6c25d8ad8334e2d5023d254313/tests'
make[2]: Entering directory '/usr/src/RPM/BUILD/libaccounts-glib-VERSION_1.23-8d14b10652b2fe6c25d8ad8334e2d5023d254313'
/bin/sed -e "s|\@DATABASE_DIR\@|libaccounts-glib|" accounts.conf.in > accounts.conf
make[2]: Leaving directory '/usr/src/RPM/BUILD/libaccounts-glib-VERSION_1.23-8d14b10652b2fe6c25d8ad8334e2d5023d254313'
+ exit 0
Executing(%install): /bin/sh -e /usr/src/tmp/rpm-tmp.22034
+ umask 022
+ /bin/mkdir -p /usr/src/RPM/BUILD
+ cd /usr/src/RPM/BUILD
+ /bin/chmod -Rf u+rwX -- /usr/src/tmp/libaccounts-glib-buildroot
+ :
+ /bin/rm -rf -- /usr/src/tmp/libaccounts-glib-buildroot
+ PATH=/usr/libexec/rpm-build:/usr/src/bin:/bin:/usr/bin:/usr/X11R6/bin:/usr/games
+ cd libaccounts-glib-VERSION_1.23-8d14b10652b2fe6c25d8ad8334e2d5023d254313
+ make install DESTDIR=/usr/src/tmp/libaccounts-glib-buildroot
make: Entering directory '/usr/src/RPM/BUILD/libaccounts-glib-VERSION_1.23-8d14b10652b2fe6c25d8ad8334e2d5023d254313'
Making install in libaccounts-glib
make[1]: Entering directory '/usr/src/RPM/BUILD/libaccounts-glib-VERSION_1.23-8d14b10652b2fe6c25d8ad8334e2d5023d254313/libaccounts-glib'
make install-am
make[2]: Entering directory '/usr/src/RPM/BUILD/libaccounts-glib-VERSION_1.23-8d14b10652b2fe6c25d8ad8334e2d5023d254313/libaccounts-glib'
make[3]: Entering directory '/usr/src/RPM/BUILD/libaccounts-glib-VERSION_1.23-8d14b10652b2fe6c25d8ad8334e2d5023d254313/libaccounts-glib'
/bin/mkdir -p '/usr/src/tmp/libaccounts-glib-buildroot/usr/lib'
/bin/sh ../libtool --mode=install /bin/install -c libaccounts-glib.la '/usr/src/tmp/libaccounts-glib-buildroot/usr/lib'
libtool: install: /bin/install -c .libs/libaccounts-glib.so.0.2.0 /usr/src/tmp/libaccounts-glib-buildroot/usr/lib/libaccounts-glib.so.0.2.0
libtool: install: (cd /usr/src/tmp/libaccounts-glib-buildroot/usr/lib && { ln -s -f libaccounts-glib.so.0.2.0 libaccounts-glib.so.0 || { rm -f libaccounts-glib.so.0 && ln -s libaccounts-glib.so.0.2.0 libaccounts-glib.so.0; }; })
libtool: install: (cd /usr/src/tmp/libaccounts-glib-buildroot/usr/lib && { ln -s -f libaccounts-glib.so.0.2.0 libaccounts-glib.so || { rm -f libaccounts-glib.so && ln -s libaccounts-glib.so.0.2.0 libaccounts-glib.so; }; })
libtool: install: /bin/install -c .libs/libaccounts-glib.lai /usr/src/tmp/libaccounts-glib-buildroot/usr/lib/libaccounts-glib.la
libtool: warning: remember to run 'libtool --finish /usr/lib'
/bin/mkdir -p '/usr/src/tmp/libaccounts-glib-buildroot/usr/share/dbus-1/interfaces'
/bin/install -c -m 644 com.google.code.AccountsSSO.Accounts.Manager.xml '/usr/src/tmp/libaccounts-glib-buildroot/usr/share/dbus-1/interfaces'
/bin/mkdir -p '/usr/src/tmp/libaccounts-glib-buildroot/usr/share/xml/accounts/schema/dtd'
/bin/install -c -m 644 accounts-application.dtd accounts-provider.dtd accounts-service.dtd accounts-service-type.dtd '/usr/src/tmp/libaccounts-glib-buildroot/usr/share/xml/accounts/schema/dtd'
/bin/mkdir -p '/usr/src/tmp/libaccounts-glib-buildroot/usr/share/vala/vapi'
/bin/install -c -m 644 libaccounts-glib.deps libaccounts-glib.vapi '/usr/src/tmp/libaccounts-glib-buildroot/usr/share/vala/vapi'
/bin/mkdir -p '/usr/src/tmp/libaccounts-glib-buildroot/usr/share/gir-1.0'
/bin/install -c -m 644 Accounts-1.0.gir '/usr/src/tmp/libaccounts-glib-buildroot/usr/share/gir-1.0'
/bin/mkdir -p '/usr/src/tmp/libaccounts-glib-buildroot/usr/include/libaccounts-glib'
/bin/install -c -m 644 accounts-glib.h ag-account.h ag-account-service.h ag-application.h ag-auth-data.h ag-errors.h ag-manager.h ag-provider.h ag-service.h ag-service-type.h ag-types.h '/usr/src/tmp/libaccounts-glib-buildroot/usr/include/libaccounts-glib'
/bin/mkdir -p '/usr/src/tmp/libaccounts-glib-buildroot/usr/lib/girepository-1.0'
/bin/install -c -m 644 Accounts-1.0.typelib '/usr/src/tmp/libaccounts-glib-buildroot/usr/lib/girepository-1.0'
make[3]: Leaving directory '/usr/src/RPM/BUILD/libaccounts-glib-VERSION_1.23-8d14b10652b2fe6c25d8ad8334e2d5023d254313/libaccounts-glib'
make[2]: Leaving directory '/usr/src/RPM/BUILD/libaccounts-glib-VERSION_1.23-8d14b10652b2fe6c25d8ad8334e2d5023d254313/libaccounts-glib'
make[1]: Leaving directory '/usr/src/RPM/BUILD/libaccounts-glib-VERSION_1.23-8d14b10652b2fe6c25d8ad8334e2d5023d254313/libaccounts-glib'
Making install in docs
make[1]: Entering directory '/usr/src/RPM/BUILD/libaccounts-glib-VERSION_1.23-8d14b10652b2fe6c25d8ad8334e2d5023d254313/docs'
Making install in reference
make[2]: Entering directory '/usr/src/RPM/BUILD/libaccounts-glib-VERSION_1.23-8d14b10652b2fe6c25d8ad8334e2d5023d254313/docs/reference'
make[3]: Entering directory '/usr/src/RPM/BUILD/libaccounts-glib-VERSION_1.23-8d14b10652b2fe6c25d8ad8334e2d5023d254313/docs/reference'
make[3]: Nothing to be done for 'install-exec-am'.
/bin/install -c -m 644 ./html/AgAccount.html
/bin/install -c -m 644 ./html/AgAccountService.html
/bin/install -c -m 644 ./html/AgApplication.html
/bin/install -c -m 644 ./html/AgAuthData.html
/bin/install -c -m 644 ./html/AgManager.html
/bin/install -c -m 644 ./html/AgProvider.html
/bin/install -c -m 644 ./html/AgService.html
/bin/install -c -m 644 ./html/AgServiceType.html
/bin/install -c -m 644 ./html/account-management.html
/bin/install -c -m 644 ./html/ag-backup.html
/bin/install -c -m 644 ./html/ag-tool.html
/bin/install -c -m 644 ./html/annotation-glossary.html
/bin/install -c -m 644 ./html/api-index-1-1.html
/bin/install -c -m 644 ./html/api-index-1-2.html
/bin/install -c -m 644 ./html/api-index-1-4.html
/bin/install -c -m 644 ./html/api-index-1-5.html
/bin/install -c -m 644 ./html/api-index-deprecated.html
/bin/install -c -m 644 ./html/api-index-full.html
/bin/install -c -m 644 ./html/appendices.html
/bin/install -c -m 644 ./html/gettext-xml-files.html
/bin/install -c -m 644 ./html/glossary.html
/bin/install -c -m 644 ./html/home.png
/bin/install -c -m 644 ./html/index.html
/bin/install -c -m 644 ./html/left-insensitive.png
/bin/install -c -m 644 ./html/left.png
/bin/install -c -m 644 ./html/libaccounts-compiling.html
/bin/install -c -m 644 ./html/libaccounts-glib-objects.html
/bin/install -c -m 644 ./html/libaccounts-glib-overview.html
/bin/install -c -m 644 ./html/libaccounts-glib-tools.html
/bin/install -c -m 644 ./html/libaccounts-glib.devhelp2
/bin/install -c -m 644 ./html/libaccounts-overview.html
/bin/install -c -m 644 ./html/libaccounts-running.html
/bin/install -c -m 644 ./html/object-tree.html
/bin/install -c -m 644 ./html/provider-file-format.html
/bin/install -c -m 644 ./html/right-insensitive.png
/bin/install -c -m 644 ./html/right.png
/bin/install -c -m 644 ./html/service-file-format.html
/bin/install -c -m 644 ./html/service-type-file-format.html
/bin/install -c -m 644 ./html/style.css
/bin/install -c -m 644 ./html/up-insensitive.png
/bin/install -c -m 644 ./html/up.png
/bin/install -c -m 644 ./html/validating-xml-files.html
/bin/install -c -m 644 ./html/xml-file-formats.html
/bin/install -c -m 644 ./html/xml-files.html
/bin/mkdir -p '/usr/src/tmp/libaccounts-glib-buildroot/usr/share/man/man1'
/bin/install -c -m 644 ag-backup.1 ag-tool.1 '/usr/src/tmp/libaccounts-glib-buildroot/usr/share/man/man1'
make[3]: Leaving directory '/usr/src/RPM/BUILD/libaccounts-glib-VERSION_1.23-8d14b10652b2fe6c25d8ad8334e2d5023d254313/docs/reference'
make[2]: Leaving directory '/usr/src/RPM/BUILD/libaccounts-glib-VERSION_1.23-8d14b10652b2fe6c25d8ad8334e2d5023d254313/docs/reference'
make[2]: Entering directory '/usr/src/RPM/BUILD/libaccounts-glib-VERSION_1.23-8d14b10652b2fe6c25d8ad8334e2d5023d254313/docs'
make[3]: Entering directory '/usr/src/RPM/BUILD/libaccounts-glib-VERSION_1.23-8d14b10652b2fe6c25d8ad8334e2d5023d254313/docs'
make[3]: Nothing to be done for 'install-exec-am'.
make[3]: Nothing to be done for 'install-data-am'.
make[3]: Leaving directory '/usr/src/RPM/BUILD/libaccounts-glib-VERSION_1.23-8d14b10652b2fe6c25d8ad8334e2d5023d254313/docs'
make[2]: Leaving directory '/usr/src/RPM/BUILD/libaccounts-glib-VERSION_1.23-8d14b10652b2fe6c25d8ad8334e2d5023d254313/docs'
make[1]: Leaving directory '/usr/src/RPM/BUILD/libaccounts-glib-VERSION_1.23-8d14b10652b2fe6c25d8ad8334e2d5023d254313/docs'
Making install in tools
make[1]: Entering directory '/usr/src/RPM/BUILD/libaccounts-glib-VERSION_1.23-8d14b10652b2fe6c25d8ad8334e2d5023d254313/tools'
make[2]: Entering directory '/usr/src/RPM/BUILD/libaccounts-glib-VERSION_1.23-8d14b10652b2fe6c25d8ad8334e2d5023d254313/tools'
/bin/mkdir -p '/usr/src/tmp/libaccounts-glib-buildroot/usr/bin'
/bin/sh ../libtool --mode=install /bin/install -c ag-backup ag-tool '/usr/src/tmp/libaccounts-glib-buildroot/usr/bin'
libtool: install: /bin/install -c ag-backup /usr/src/tmp/libaccounts-glib-buildroot/usr/bin/ag-backup
libtool: warning: '../libaccounts-glib/libaccounts-glib.la' has not been installed in '/usr/lib'
libtool: install: /bin/install -c .libs/ag-tool /usr/src/tmp/libaccounts-glib-buildroot/usr/bin/ag-tool
make[2]: Nothing to be done for 'install-data-am'.
make[2]: Leaving directory '/usr/src/RPM/BUILD/libaccounts-glib-VERSION_1.23-8d14b10652b2fe6c25d8ad8334e2d5023d254313/tools'
make[1]: Leaving directory '/usr/src/RPM/BUILD/libaccounts-glib-VERSION_1.23-8d14b10652b2fe6c25d8ad8334e2d5023d254313/tools'
Making install in pygobject
make[1]: Entering directory '/usr/src/RPM/BUILD/libaccounts-glib-VERSION_1.23-8d14b10652b2fe6c25d8ad8334e2d5023d254313/pygobject'
make[2]: Entering directory '/usr/src/RPM/BUILD/libaccounts-glib-VERSION_1.23-8d14b10652b2fe6c25d8ad8334e2d5023d254313/pygobject'
make[2]: Nothing to be done for 'install-exec-am'.
make[2]: Leaving directory '/usr/src/RPM/BUILD/libaccounts-glib-VERSION_1.23-8d14b10652b2fe6c25d8ad8334e2d5023d254313/pygobject'
make[1]: Leaving directory '/usr/src/RPM/BUILD/libaccounts-glib-VERSION_1.23-8d14b10652b2fe6c25d8ad8334e2d5023d254313/pygobject'
Making install in tests
make[1]: Entering directory '/usr/src/RPM/BUILD/libaccounts-glib-VERSION_1.23-8d14b10652b2fe6c25d8ad8334e2d5023d254313/tests'
make install-recursive
make[2]: Entering directory '/usr/src/RPM/BUILD/libaccounts-glib-VERSION_1.23-8d14b10652b2fe6c25d8ad8334e2d5023d254313/tests'
Making install in data
make[3]: Entering directory '/usr/src/RPM/BUILD/libaccounts-glib-VERSION_1.23-8d14b10652b2fe6c25d8ad8334e2d5023d254313/tests/data'
make[4]: Entering directory '/usr/src/RPM/BUILD/libaccounts-glib-VERSION_1.23-8d14b10652b2fe6c25d8ad8334e2d5023d254313/tests/data'
make[4]: Nothing to be done for 'install-exec-am'.
/bin/mkdir -p '/usr/src/tmp/libaccounts-glib-buildroot/usr/share/libaccounts-glib/testdata'
/bin/mkdir -p '/usr/src/tmp/libaccounts-glib-buildroot/usr/share/libaccounts-glib/testdata/accounts/providers'
/bin/install -c -m 644 accounts/providers/MyProvider.provider accounts/providers/maemo.provider '/usr/src/tmp/libaccounts-glib-buildroot/usr/share/libaccounts-glib/testdata/accounts/providers'
/bin/mkdir -p '/usr/src/tmp/libaccounts-glib-buildroot/usr/share/libaccounts-glib/testdata/applications'
/bin/install -c -m 644 applications/Mailer.desktop '/usr/src/tmp/libaccounts-glib-buildroot/usr/share/libaccounts-glib/testdata/applications'
/bin/mkdir -p '/usr/src/tmp/libaccounts-glib-buildroot/usr/share/libaccounts-glib/testdata/accounts/services'
/bin/install -c -m 644 accounts/services/MyService.service accounts/services/MyService2.service accounts/services/OtherService.service '/usr/src/tmp/libaccounts-glib-buildroot/usr/share/libaccounts-glib/testdata/accounts/services'
/bin/mkdir -p '/usr/src/tmp/libaccounts-glib-buildroot/usr/share/libaccounts-glib/testdata/accounts/applications'
/bin/install -c -m 644 accounts/applications/Gallery.application accounts/applications/Mailer.application '/usr/src/tmp/libaccounts-glib-buildroot/usr/share/libaccounts-glib/testdata/accounts/applications'
/bin/mkdir -p '/usr/src/tmp/libaccounts-glib-buildroot/usr/share/libaccounts-glib/testdata/accounts/providers/fake-os'
/bin/install -c -m 644 accounts/providers/fake-os/MyProvider.provider '/usr/src/tmp/libaccounts-glib-buildroot/usr/share/libaccounts-glib/testdata/accounts/providers/fake-os'
/bin/mkdir -p '/usr/src/tmp/libaccounts-glib-buildroot/usr/share/libaccounts-glib/testdata/accounts/service-types'
/bin/install -c -m 644 accounts/service-types/e-mail.service-type '/usr/src/tmp/libaccounts-glib-buildroot/usr/share/libaccounts-glib/testdata/accounts/service-types'
make[4]: Leaving directory '/usr/src/RPM/BUILD/libaccounts-glib-VERSION_1.23-8d14b10652b2fe6c25d8ad8334e2d5023d254313/tests/data'
make[3]: Leaving directory '/usr/src/RPM/BUILD/libaccounts-glib-VERSION_1.23-8d14b10652b2fe6c25d8ad8334e2d5023d254313/tests/data'
make[3]: Entering directory '/usr/src/RPM/BUILD/libaccounts-glib-VERSION_1.23-8d14b10652b2fe6c25d8ad8334e2d5023d254313/tests'
make[4]: Entering directory '/usr/src/RPM/BUILD/libaccounts-glib-VERSION_1.23-8d14b10652b2fe6c25d8ad8334e2d5023d254313/tests'
make[4]: Nothing to be done for 'install-exec-am'.
/bin/mkdir -p '/usr/src/tmp/libaccounts-glib-buildroot/usr/lib/libaccounts-glib'
/bin/install -c accounts-glib-test-wrapper.sh '/usr/src/tmp/libaccounts-glib-buildroot/usr/lib/libaccounts-glib'
/bin/mkdir -p '/usr/src/tmp/libaccounts-glib-buildroot/usr/lib/libaccounts-glib'
/bin/install -c -m 644 tests.xml '/usr/src/tmp/libaccounts-glib-buildroot/usr/lib/libaccounts-glib'
/bin/mkdir -p '/usr/src/tmp/libaccounts-glib-buildroot/usr/lib/libaccounts-glib'
/bin/sh ../libtool --mode=install /bin/install -c accounts-glib-testsuite test-process '/usr/src/tmp/libaccounts-glib-buildroot/usr/lib/libaccounts-glib'
libtool: warning: '../libaccounts-glib/libaccounts-glib.la' has not been installed in '/usr/lib'
libtool: install: /bin/install -c .libs/accounts-glib-testsuite /usr/src/tmp/libaccounts-glib-buildroot/usr/lib/libaccounts-glib/accounts-glib-testsuite
libtool: warning: '../libaccounts-glib/libaccounts-glib.la' has not been installed in '/usr/lib'
libtool: install: /bin/install -c .libs/test-process /usr/src/tmp/libaccounts-glib-buildroot/usr/lib/libaccounts-glib/test-process
/bin/mkdir -p '/usr/src/tmp/libaccounts-glib-buildroot/usr/lib/libaccounts-glib'
/bin/install -c accounts-glib-test.sh '/usr/src/tmp/libaccounts-glib-buildroot/usr/lib/libaccounts-glib'
make[4]: Leaving directory '/usr/src/RPM/BUILD/libaccounts-glib-VERSION_1.23-8d14b10652b2fe6c25d8ad8334e2d5023d254313/tests'
make[3]: Leaving directory '/usr/src/RPM/BUILD/libaccounts-glib-VERSION_1.23-8d14b10652b2fe6c25d8ad8334e2d5023d254313/tests'
make[2]: Leaving directory '/usr/src/RPM/BUILD/libaccounts-glib-VERSION_1.23-8d14b10652b2fe6c25d8ad8334e2d5023d254313/tests'
make[1]: Leaving directory '/usr/src/RPM/BUILD/libaccounts-glib-VERSION_1.23-8d14b10652b2fe6c25d8ad8334e2d5023d254313/tests'
make[1]: Entering directory '/usr/src/RPM/BUILD/libaccounts-glib-VERSION_1.23-8d14b10652b2fe6c25d8ad8334e2d5023d254313'
make[2]: Entering directory '/usr/src/RPM/BUILD/libaccounts-glib-VERSION_1.23-8d14b10652b2fe6c25d8ad8334e2d5023d254313'
make[2]: Nothing to be done for 'install-exec-am'.
/bin/mkdir -p '/usr/src/tmp/libaccounts-glib-buildroot/usr/share/backup-framework/applications'
/bin/install -c -m 644 accounts.conf '/usr/src/tmp/libaccounts-glib-buildroot/usr/share/backup-framework/applications'
/bin/mkdir -p '/usr/src/tmp/libaccounts-glib-buildroot/usr/lib/pkgconfig'
/bin/install -c -m 644 libaccounts-glib.pc '/usr/src/tmp/libaccounts-glib-buildroot/usr/lib/pkgconfig'
make[2]: Leaving directory '/usr/src/RPM/BUILD/libaccounts-glib-VERSION_1.23-8d14b10652b2fe6c25d8ad8334e2d5023d254313'
make[1]: Leaving directory '/usr/src/RPM/BUILD/libaccounts-glib-VERSION_1.23-8d14b10652b2fe6c25d8ad8334e2d5023d254313'
make: Leaving directory '/usr/src/RPM/BUILD/libaccounts-glib-VERSION_1.23-8d14b10652b2fe6c25d8ad8334e2d5023d254313'
+ rm -fv /usr/src/tmp/libaccounts-glib-buildroot/usr/lib/libaccounts-glib.la
removed '/usr/src/tmp/libaccounts-glib-buildroot/usr/lib/libaccounts-glib.la'
+ mkdir -p /usr/src/tmp/libaccounts-glib-buildroot/usr/share/accounts/applications /usr/src/tmp/libaccounts-glib-buildroot/usr/share/accounts/providers /usr/src/tmp/libaccounts-glib-buildroot/usr/share/accounts/services /usr/src/tmp/libaccounts-glib-buildroot/usr/share/accounts/service_types
+ rm -rfv /usr/src/tmp/libaccounts-glib-buildroot/usr/doc/reference
+ /usr/lib/rpm/brp-alt
Cleaning files in /usr/src/tmp/libaccounts-glib-buildroot (auto)
mode of './usr/lib/libaccounts-glib.so.0.2.0' changed from 0755 (rwxr-xr-x) to 0644 (rw-r--r--)
Verifying and fixing files in /usr/src/tmp/libaccounts-glib-buildroot (binconfig,pkgconfig,libtool,desktop,gnuconfig)
/usr/lib/pkgconfig/libaccounts-glib.pc: Cflags: '-I${includedir}' --> ''
/usr/lib/pkgconfig/libaccounts-glib.pc: Libs: '-L${libdir} -laccounts-glib' --> '-laccounts-glib'
Checking contents of files in /usr/src/tmp/libaccounts-glib-buildroot/ (default)
Compressing files in /usr/src/tmp/libaccounts-glib-buildroot (auto)
Adjusting library links in /usr/src/tmp/libaccounts-glib-buildroot
./usr/lib:
libaccounts-glib.so.0 -> libaccounts-glib.so.0.2.0
Verifying ELF objects in /usr/src/tmp/libaccounts-glib-buildroot (arch=normal,fhs=normal,lfs=relaxed,lint=relaxed,rpath=normal,stack=normal,textrel=normal,unresolved=normal)
verify-elf: WARNING: ./usr/lib/libaccounts-glib/test-process: uses non-LFS functions: lockf open
verify-elf: WARNING: ./usr/lib/libaccounts-glib/accounts-glib-testsuite: uses non-LFS functions: lockf open
verify-elf: WARNING: ./usr/lib/libaccounts-glib.so.0.2.0: uses non-LFS functions: open
Hardlinking identical .pyc and .pyo files
Executing(%check): /bin/sh -e /usr/src/tmp/rpm-tmp.28631
+ umask 022
+ /bin/mkdir -p /usr/src/RPM/BUILD
+ cd /usr/src/RPM/BUILD
+ cd libaccounts-glib-VERSION_1.23-8d14b10652b2fe6c25d8ad8334e2d5023d254313
+ make check
make: Entering directory '/usr/src/RPM/BUILD/libaccounts-glib-VERSION_1.23-8d14b10652b2fe6c25d8ad8334e2d5023d254313'
Making check in libaccounts-glib
make[1]: Entering directory '/usr/src/RPM/BUILD/libaccounts-glib-VERSION_1.23-8d14b10652b2fe6c25d8ad8334e2d5023d254313/libaccounts-glib'
make check-am
make[2]: Entering directory '/usr/src/RPM/BUILD/libaccounts-glib-VERSION_1.23-8d14b10652b2fe6c25d8ad8334e2d5023d254313/libaccounts-glib'
make[2]: Nothing to be done for 'check-am'.
make[2]: Leaving directory '/usr/src/RPM/BUILD/libaccounts-glib-VERSION_1.23-8d14b10652b2fe6c25d8ad8334e2d5023d254313/libaccounts-glib'
make[1]: Leaving directory '/usr/src/RPM/BUILD/libaccounts-glib-VERSION_1.23-8d14b10652b2fe6c25d8ad8334e2d5023d254313/libaccounts-glib'
Making check in docs
make[1]: Entering directory '/usr/src/RPM/BUILD/libaccounts-glib-VERSION_1.23-8d14b10652b2fe6c25d8ad8334e2d5023d254313/docs'
Making check in reference
make[2]: Entering directory '/usr/src/RPM/BUILD/libaccounts-glib-VERSION_1.23-8d14b10652b2fe6c25d8ad8334e2d5023d254313/docs/reference'
make[2]: Leaving directory '/usr/src/RPM/BUILD/libaccounts-glib-VERSION_1.23-8d14b10652b2fe6c25d8ad8334e2d5023d254313/docs/reference'
make[2]: Entering directory '/usr/src/RPM/BUILD/libaccounts-glib-VERSION_1.23-8d14b10652b2fe6c25d8ad8334e2d5023d254313/docs'
make[2]: Nothing to be done for 'check-am'.
make[2]: Leaving directory '/usr/src/RPM/BUILD/libaccounts-glib-VERSION_1.23-8d14b10652b2fe6c25d8ad8334e2d5023d254313/docs'
make[1]: Leaving directory '/usr/src/RPM/BUILD/libaccounts-glib-VERSION_1.23-8d14b10652b2fe6c25d8ad8334e2d5023d254313/docs'
Making check in tools
make[1]: Entering directory '/usr/src/RPM/BUILD/libaccounts-glib-VERSION_1.23-8d14b10652b2fe6c25d8ad8334e2d5023d254313/tools'
make[1]: Nothing to be done for 'check'.
make[1]: Leaving directory '/usr/src/RPM/BUILD/libaccounts-glib-VERSION_1.23-8d14b10652b2fe6c25d8ad8334e2d5023d254313/tools'
Making check in pygobject
make[1]: Entering directory '/usr/src/RPM/BUILD/libaccounts-glib-VERSION_1.23-8d14b10652b2fe6c25d8ad8334e2d5023d254313/pygobject'
make[1]: Nothing to be done for 'check'.
make[1]: Leaving directory '/usr/src/RPM/BUILD/libaccounts-glib-VERSION_1.23-8d14b10652b2fe6c25d8ad8334e2d5023d254313/pygobject'
Making check in tests
make[1]: Entering directory '/usr/src/RPM/BUILD/libaccounts-glib-VERSION_1.23-8d14b10652b2fe6c25d8ad8334e2d5023d254313/tests'
make check-recursive
make[2]: Entering directory '/usr/src/RPM/BUILD/libaccounts-glib-VERSION_1.23-8d14b10652b2fe6c25d8ad8334e2d5023d254313/tests'
Making check in data
make[3]: Entering directory '/usr/src/RPM/BUILD/libaccounts-glib-VERSION_1.23-8d14b10652b2fe6c25d8ad8334e2d5023d254313/tests/data'
make[3]: Nothing to be done for 'check'.
make[3]: Leaving directory '/usr/src/RPM/BUILD/libaccounts-glib-VERSION_1.23-8d14b10652b2fe6c25d8ad8334e2d5023d254313/tests/data'
make[3]: Entering directory '/usr/src/RPM/BUILD/libaccounts-glib-VERSION_1.23-8d14b10652b2fe6c25d8ad8334e2d5023d254313/tests'
make accounts-glib-testsuite test-process \
accounts-glib-test.sh xml-dtd-validate.sh
make[4]: Entering directory '/usr/src/RPM/BUILD/libaccounts-glib-VERSION_1.23-8d14b10652b2fe6c25d8ad8334e2d5023d254313/tests'
make[4]: 'accounts-glib-testsuite' is up to date.
make[4]: 'test-process' is up to date.
make[4]: Nothing to be done for 'accounts-glib-test.sh'.
make[4]: Nothing to be done for 'xml-dtd-validate.sh'.
make[4]: Leaving directory '/usr/src/RPM/BUILD/libaccounts-glib-VERSION_1.23-8d14b10652b2fe6c25d8ad8334e2d5023d254313/tests'
make check-TESTS
make[4]: Entering directory '/usr/src/RPM/BUILD/libaccounts-glib-VERSION_1.23-8d14b10652b2fe6c25d8ad8334e2d5023d254313/tests'
make[5]: Entering directory '/usr/src/RPM/BUILD/libaccounts-glib-VERSION_1.23-8d14b10652b2fe6c25d8ad8334e2d5023d254313/tests'
FAIL: accounts-glib-test.sh
PASS: xml-dtd-validate.sh
============================================================================
Testsuite summary for libaccounts-glib 1.23
============================================================================
# TOTAL: 2
# PASS: 1
# SKIP: 0
# XFAIL: 0
# FAIL: 1
# XPASS: 0
# ERROR: 0
============================================================================
See tests/test-suite.log
Please report to https://gitlab.com/accounts-sso/libaccounts-glib/issues
============================================================================
make[5]: *** [Makefile:1073: test-suite.log] Error 1
make[5]: Leaving directory '/usr/src/RPM/BUILD/libaccounts-glib-VERSION_1.23-8d14b10652b2fe6c25d8ad8334e2d5023d254313/tests'
make[4]: *** [Makefile:1181: check-TESTS] Error 2
make[4]: Leaving directory '/usr/src/RPM/BUILD/libaccounts-glib-VERSION_1.23-8d14b10652b2fe6c25d8ad8334e2d5023d254313/tests'
make[3]: *** [Makefile:1287: check-am] Error 2
make[3]: Leaving directory '/usr/src/RPM/BUILD/libaccounts-glib-VERSION_1.23-8d14b10652b2fe6c25d8ad8334e2d5023d254313/tests'
make[2]: *** [Makefile:965: check-recursive] Error 1
make[2]: Leaving directory '/usr/src/RPM/BUILD/libaccounts-glib-VERSION_1.23-8d14b10652b2fe6c25d8ad8334e2d5023d254313/tests'
make[1]: *** [Makefile:1290: check] Error 2
make[1]: Leaving directory '/usr/src/RPM/BUILD/libaccounts-glib-VERSION_1.23-8d14b10652b2fe6c25d8ad8334e2d5023d254313/tests'
make: *** [Makefile:556: check-recursive] Error 1
make: Leaving directory '/usr/src/RPM/BUILD/libaccounts-glib-VERSION_1.23-8d14b10652b2fe6c25d8ad8334e2d5023d254313'
+ cat tests/test-suite.log
=================================================
libaccounts-glib 1.23: tests/test-suite.log
=================================================
# TOTAL: 2
# PASS: 1
# SKIP: 0
# XFAIL: 0
# FAIL: 1
# XPASS: 0
# ERROR: 0
.. contents:: :depth: 2
FAIL: accounts-glib-test.sh
===========================
Using existing D-Bus session
Running suite(s): accounts-glib
(process:3170971): accounts-glib-WARNING **: 13:59:23.401: Failed to get D-Bus connection (Cannot spawn a message bus without a machine-id: Unable to load /var/lib/dbus/machine-id or /etc/machine-id: Failed to open file ?/var/lib/dbus/machine-id?: No such file or directory)
(process:3170973): accounts-glib-WARNING **: 13:59:23.404: Failed to get D-Bus connection (Cannot spawn a message bus without a machine-id: Unable to load /var/lib/dbus/machine-id or /etc/machine-id: Failed to open file ?/var/lib/dbus/machine-id?: No such file or directory)
(process:3170976): accounts-glib-WARNING **: 13:59:23.407: Failed to get D-Bus connection (Cannot spawn a message bus without a machine-id: Unable to load /var/lib/dbus/machine-id or /etc/machine-id: Failed to open file ?/var/lib/dbus/machine-id?: No such file or directory)
(process:3170976): accounts-glib-CRITICAL **: 13:59:23.407: ag_manager_create_account: assertion 'AG_IS_MANAGER (manager)' failed
(process:3170982): accounts-glib-WARNING **: 13:59:23.409: Failed to get D-Bus connection (Cannot spawn a message bus without a machine-id: Unable to load /var/lib/dbus/machine-id or /etc/machine-id: Failed to open file ?/var/lib/dbus/machine-id?: No such file or directory)
(process:3170982): GLib-GObject-CRITICAL **: 13:59:23.409: g_object_unref: assertion 'G_IS_OBJECT (object)' failed
(process:3170988): accounts-glib-WARNING **: 13:59:23.412: Failed to get D-Bus connection (Cannot spawn a message bus without a machine-id: Unable to load /var/lib/dbus/machine-id or /etc/machine-id: Failed to open file ?/var/lib/dbus/machine-id?: No such file or directory)
(process:3170988): accounts-glib-CRITICAL **: 13:59:23.412: ag_manager_create_account: assertion 'AG_IS_MANAGER (manager)' failed
(process:3170994): accounts-glib-WARNING **: 13:59:23.414: Failed to get D-Bus connection (Cannot spawn a message bus without a machine-id: Unable to load /var/lib/dbus/machine-id or /etc/machine-id: Failed to open file ?/var/lib/dbus/machine-id?: No such file or directory)
(process:3170994): accounts-glib-CRITICAL **: 13:59:23.414: ag_manager_create_account: assertion 'AG_IS_MANAGER (manager)' failed
(process:3170999): accounts-glib-WARNING **: 13:59:23.416: Failed to get D-Bus connection (Cannot spawn a message bus without a machine-id: Unable to load /var/lib/dbus/machine-id or /etc/machine-id: Failed to open file ?/var/lib/dbus/machine-id?: No such file or directory)
(process:3170999): accounts-glib-CRITICAL **: 13:59:23.416: ag_manager_get_provider: assertion 'AG_IS_MANAGER (manager)' failed
(process:3171004): accounts-glib-WARNING **: 13:59:23.419: Failed to get D-Bus connection (Cannot spawn a message bus without a machine-id: Unable to load /var/lib/dbus/machine-id or /etc/machine-id: Failed to open file ?/var/lib/dbus/machine-id?: No such file or directory)
(process:3171004): accounts-glib-CRITICAL **: 13:59:23.420: ag_manager_create_account: assertion 'AG_IS_MANAGER (manager)' failed
(process:3171009): accounts-glib-WARNING **: 13:59:23.422: Failed to get D-Bus connection (Cannot spawn a message bus without a machine-id: Unable to load /var/lib/dbus/machine-id or /etc/machine-id: Failed to open file ?/var/lib/dbus/machine-id?: No such file or directory)
(process:3171009): accounts-glib-CRITICAL **: 13:59:23.423: ag_manager_create_account: assertion 'AG_IS_MANAGER (manager)' failed
(process:3171017): accounts-glib-WARNING **: 13:59:23.425: Failed to get D-Bus connection (Cannot spawn a message bus without a machine-id: Unable to load /var/lib/dbus/machine-id or /etc/machine-id: Failed to open file ?/var/lib/dbus/machine-id?: No such file or directory)
(process:3171017): accounts-glib-CRITICAL **: 13:59:23.425: ag_manager_create_account: assertion 'AG_IS_MANAGER (manager)' failed
(process:3171021): accounts-glib-WARNING **: 13:59:23.427: Failed to get D-Bus connection (Cannot spawn a message bus without a machine-id: Unable to load /var/lib/dbus/machine-id or /etc/machine-id: Failed to open file ?/var/lib/dbus/machine-id?: No such file or directory)
(process:3171021): GLib-GObject-CRITICAL **: 13:59:23.428: g_object_unref: assertion 'G_IS_OBJECT (object)' failed
(process:3171027): accounts-glib-WARNING **: 13:59:23.430: Failed to get D-Bus connection (Cannot spawn a message bus without a machine-id: Unable to load /var/lib/dbus/machine-id or /etc/machine-id: Failed to open file ?/var/lib/dbus/machine-id?: No such file or directory)
(process:3171027): accounts-glib-CRITICAL **: 13:59:23.430: ag_manager_create_account: assertion 'AG_IS_MANAGER (manager)' failed
(process:3171031): accounts-glib-WARNING **: 13:59:23.432: Failed to get D-Bus connection (Cannot spawn a message bus without a machine-id: Unable to load /var/lib/dbus/machine-id or /etc/machine-id: Failed to open file ?/var/lib/dbus/machine-id?: No such file or directory)
(process:3171031): accounts-glib-CRITICAL **: 13:59:23.432: ag_manager_create_account: assertion 'AG_IS_MANAGER (manager)' failed
(process:3171035): accounts-glib-WARNING **: 13:59:23.434: Failed to get D-Bus connection (Cannot spawn a message bus without a machine-id: Unable to load /var/lib/dbus/machine-id or /etc/machine-id: Failed to open file ?/var/lib/dbus/machine-id?: No such file or directory)
(process:3171035): accounts-glib-CRITICAL **: 13:59:23.434: ag_manager_create_account: assertion 'AG_IS_MANAGER (manager)' failed
(process:3171039): accounts-glib-WARNING **: 13:59:23.436: Failed to get D-Bus connection (Cannot spawn a message bus without a machine-id: Unable to load /var/lib/dbus/machine-id or /etc/machine-id: Failed to open file ?/var/lib/dbus/machine-id?: No such file or directory)
(process:3171039): accounts-glib-CRITICAL **: 13:59:23.436: ag_manager_create_account: assertion 'AG_IS_MANAGER (manager)' failed
(process:3171043): accounts-glib-WARNING **: 13:59:23.438: Failed to get D-Bus connection (Cannot spawn a message bus without a machine-id: Unable to load /var/lib/dbus/machine-id or /etc/machine-id: Failed to open file ?/var/lib/dbus/machine-id?: No such file or directory)
(process:3171043): accounts-glib-CRITICAL **: 13:59:23.438: ag_manager_load_service_type: assertion 'AG_IS_MANAGER (manager)' failed
(process:3171047): accounts-glib-WARNING **: 13:59:23.440: Failed to get D-Bus connection (Cannot spawn a message bus without a machine-id: Unable to load /var/lib/dbus/machine-id or /etc/machine-id: Failed to open file ?/var/lib/dbus/machine-id?: No such file or directory)
(process:3171047): accounts-glib-CRITICAL **: 13:59:23.440: ag_manager_create_account: assertion 'AG_IS_MANAGER (manager)' failed
(process:3171050): accounts-glib-WARNING **: 13:59:23.442: Failed to get D-Bus connection (Cannot spawn a message bus without a machine-id: Unable to load /var/lib/dbus/machine-id or /etc/machine-id: Failed to open file ?/var/lib/dbus/machine-id?: No such file or directory)
(process:3171050): accounts-glib-CRITICAL **: 13:59:23.442: ag_manager_create_account: assertion 'AG_IS_MANAGER (manager)' failed
(process:3171054): accounts-glib-WARNING **: 13:59:23.444: Failed to get D-Bus connection (Cannot spawn a message bus without a machine-id: Unable to load /var/lib/dbus/machine-id or /etc/machine-id: Failed to open file ?/var/lib/dbus/machine-id?: No such file or directory)
(process:3171054): accounts-glib-CRITICAL **: 13:59:23.444: ag_manager_create_account: assertion 'AG_IS_MANAGER (manager)' failed
(process:3171058): accounts-glib-WARNING **: 13:59:23.448: Failed to get D-Bus connection (Cannot spawn a message bus without a machine-id: Unable to load /var/lib/dbus/machine-id or /etc/machine-id: Failed to open file ?/var/lib/dbus/machine-id?: No such file or directory)
(process:3171058): accounts-glib-CRITICAL **: 13:59:23.448: ag_manager_create_account: assertion 'AG_IS_MANAGER (manager)' failed
(process:3171065): accounts-glib-WARNING **: 13:59:23.452: Failed to get D-Bus connection (Cannot spawn a message bus without a machine-id: Unable to load /var/lib/dbus/machine-id or /etc/machine-id: Failed to open file ?/var/lib/dbus/machine-id?: No such file or directory)
(process:3171065): accounts-glib-CRITICAL **: 13:59:23.452: ag_manager_create_account: assertion 'AG_IS_MANAGER (manager)' failed
(process:3171071): accounts-glib-WARNING **: 13:59:23.454: Failed to get D-Bus connection (Cannot spawn a message bus without a machine-id: Unable to load /var/lib/dbus/machine-id or /etc/machine-id: Failed to open file ?/var/lib/dbus/machine-id?: No such file or directory)
(process:3171071): accounts-glib-CRITICAL **: 13:59:23.454: ag_manager_create_account: assertion 'AG_IS_MANAGER (manager)' failed
(process:3171074): accounts-glib-WARNING **: 13:59:23.456: Failed to get D-Bus connection (Cannot spawn a message bus without a machine-id: Unable to load /var/lib/dbus/machine-id or /etc/machine-id: Failed to open file ?/var/lib/dbus/machine-id?: No such file or directory)
(process:3171074): accounts-glib-CRITICAL **: 13:59:23.456: ag_manager_get_account_services: assertion 'AG_IS_MANAGER (manager)' failed
(process:3171081): accounts-glib-WARNING **: 13:59:23.459: Failed to get D-Bus connection (Cannot spawn a message bus without a machine-id: Unable to load /var/lib/dbus/machine-id or /etc/machine-id: Failed to open file ?/var/lib/dbus/machine-id?: No such file or directory)
(process:3171081): accounts-glib-CRITICAL **: 13:59:23.459: ag_manager_get_application: assertion 'AG_IS_MANAGER (self)' failed
(process:3171089): accounts-glib-WARNING **: 13:59:23.461: Failed to get D-Bus connection (Cannot spawn a message bus without a machine-id: Unable to load /var/lib/dbus/machine-id or /etc/machine-id: Failed to open file ?/var/lib/dbus/machine-id?: No such file or directory)
(process:3171089): accounts-glib-CRITICAL **: 13:59:23.461: ag_manager_get_application: assertion 'AG_IS_MANAGER (self)' failed
(process:3171095): accounts-glib-WARNING **: 13:59:23.463: Failed to get D-Bus connection (Cannot spawn a message bus without a machine-id: Unable to load /var/lib/dbus/machine-id or /etc/machine-id: Failed to open file ?/var/lib/dbus/machine-id?: No such file or directory)
(process:3171095): accounts-glib-CRITICAL **: 13:59:23.463: ag_manager_create_account: assertion 'AG_IS_MANAGER (manager)' failed
(process:3171102): accounts-glib-WARNING **: 13:59:23.465: Failed to get D-Bus connection (Cannot spawn a message bus without a machine-id: Unable to load /var/lib/dbus/machine-id or /etc/machine-id: Failed to open file ?/var/lib/dbus/machine-id?: No such file or directory)
(process:3171108): accounts-glib-WARNING **: 13:59:23.467: Failed to get D-Bus connection (Cannot spawn a message bus without a machine-id: Unable to load /var/lib/dbus/machine-id or /etc/machine-id: Failed to open file ?/var/lib/dbus/machine-id?: No such file or directory)
(process:3171108): accounts-glib-CRITICAL **: 13:59:23.468: ag_manager_list_services: assertion 'AG_IS_MANAGER (manager)' failed
(process:3171114): accounts-glib-WARNING **: 13:59:23.471: Failed to get D-Bus connection (Cannot spawn a message bus without a machine-id: Unable to load /var/lib/dbus/machine-id or /etc/machine-id: Failed to open file ?/var/lib/dbus/machine-id?: No such file or directory)
(process:3171119): accounts-glib-WARNING **: 13:59:23.473: Failed to get D-Bus connection (Cannot spawn a message bus without a machine-id: Unable to load /var/lib/dbus/machine-id or /etc/machine-id: Failed to open file ?/var/lib/dbus/machine-id?: No such file or directory)
(process:3171119): accounts-glib-CRITICAL **: 13:59:23.474: ag_manager_list_service_types: assertion 'AG_IS_MANAGER (manager)' failed
(process:3171126): accounts-glib-WARNING **: 13:59:23.479: Failed to get D-Bus connection (Cannot spawn a message bus without a machine-id: Unable to load /var/lib/dbus/machine-id or /etc/machine-id: Failed to open file ?/var/lib/dbus/machine-id?: No such file or directory)
(process:3171126): accounts-glib-CRITICAL **: 13:59:23.479: ag_manager_create_account: assertion 'AG_IS_MANAGER (manager)' failed
(process:3171130): accounts-glib-WARNING **: 13:59:23.481: Failed to get D-Bus connection (Cannot spawn a message bus without a machine-id: Unable to load /var/lib/dbus/machine-id or /etc/machine-id: Failed to open file ?/var/lib/dbus/machine-id?: No such file or directory)
(process:3171130): accounts-glib-CRITICAL **: 13:59:23.481: ag_manager_create_account: assertion 'AG_IS_MANAGER (manager)' failed
(process:3171134): accounts-glib-WARNING **: 13:59:23.483: Failed to get D-Bus connection (Cannot spawn a message bus without a machine-id: Unable to load /var/lib/dbus/machine-id or /etc/machine-id: Failed to open file ?/var/lib/dbus/machine-id?: No such file or directory)
(process:3171134): accounts-glib-CRITICAL **: 13:59:23.484: ag_manager_create_account: assertion 'AG_IS_MANAGER (manager)' failed
(process:3171142): accounts-glib-WARNING **: 13:59:23.488: Failed to get D-Bus connection (Cannot spawn a message bus without a machine-id: Unable to load /var/lib/dbus/machine-id or /etc/machine-id: Failed to open file ?/var/lib/dbus/machine-id?: No such file or directory)
(process:3171142): accounts-glib-CRITICAL **: 13:59:23.488: ag_manager_create_account: assertion 'AG_IS_MANAGER (manager)' failed
(process:3171147): GLib-CRITICAL **: 13:59:23.591: g_setenv: assertion 'value != NULL' failed
(process:3171315): accounts-glib-WARNING **: 13:59:23.594: Failed to get D-Bus connection (Cannot spawn a message bus without a machine-id: Unable to load /var/lib/dbus/machine-id or /etc/machine-id: Failed to open file ?/var/lib/dbus/machine-id?: No such file or directory)
(process:3171315): GLib-GObject-WARNING **: 13:59:23.595: invalid (NULL) pointer instance
(process:3171315): GLib-GObject-CRITICAL **: 13:59:23.595: g_signal_connect_data: assertion 'G_TYPE_CHECK_INSTANCE (instance)' failed
(process:3171326): accounts-glib-WARNING **: 13:59:23.597: Failed to get D-Bus connection (Cannot spawn a message bus without a machine-id: Unable to load /var/lib/dbus/machine-id or /etc/machine-id: Failed to open file ?/var/lib/dbus/machine-id?: No such file or directory)
(process:3171326): accounts-glib-CRITICAL **: 13:59:23.598: ag_manager_create_account: assertion 'AG_IS_MANAGER (manager)' failed
(process:3171333): accounts-glib-WARNING **: 13:59:23.603: Failed to get D-Bus connection (Cannot spawn a message bus without a machine-id: Unable to load /var/lib/dbus/machine-id or /etc/machine-id: Failed to open file ?/var/lib/dbus/machine-id?: No such file or directory)
(process:3171333): accounts-glib-CRITICAL **: 13:59:23.603: ag_manager_get_service_type: assertion 'AG_IS_MANAGER (manager)' failed
(process:3171347): accounts-glib-WARNING **: 13:59:25.604: Failed to get D-Bus connection (Cannot spawn a message bus without a machine-id: Unable to load /var/lib/dbus/machine-id or /etc/machine-id: Failed to open file ?/var/lib/dbus/machine-id?: No such file or directory)
(process:3175686): accounts-glib-WARNING **: 13:59:25.615: Failed to get D-Bus connection (Cannot spawn a message bus without a machine-id: Unable to load /var/lib/dbus/machine-id or /etc/machine-id: Failed to open file ?/var/lib/dbus/machine-id?: No such file or directory)
(process:3175686): accounts-glib-CRITICAL **: 13:59:25.615: ag_manager_create_account: assertion 'AG_IS_MANAGER (manager)' failed
(process:3175700): accounts-glib-WARNING **: 13:59:25.625: Failed to get D-Bus connection (Cannot spawn a message bus without a machine-id: Unable to load /var/lib/dbus/machine-id or /etc/machine-id: Failed to open file ?/var/lib/dbus/machine-id?: No such file or directory)
(process:3175700): accounts-glib-CRITICAL **: 13:59:25.626: ag_manager_create_account: assertion 'AG_IS_MANAGER (manager)' failed
(process:3175713): accounts-glib-WARNING **: 13:59:25.635: Failed to get D-Bus connection (Cannot spawn a message bus without a machine-id: Unable to load /var/lib/dbus/machine-id or /etc/machine-id: Failed to open file ?/var/lib/dbus/machine-id?: No such file or directory)
(process:3175713): accounts-glib-WARNING **: 13:59:25.636: Failed to get D-Bus connection (Cannot spawn a message bus without a machine-id: Unable to load /var/lib/dbus/machine-id or /etc/machine-id: Failed to open file ?/var/lib/dbus/machine-id?: No such file or directory)
(process:3175713): accounts-glib-CRITICAL **: 13:59:25.637: ag_manager_create_account: assertion 'AG_IS_MANAGER (manager)' failed
(process:3175726): accounts-glib-WARNING **: 13:59:25.642: Failed to get D-Bus connection (Cannot spawn a message bus without a machine-id: Unable to load /var/lib/dbus/machine-id or /etc/machine-id: Failed to open file ?/var/lib/dbus/machine-id?: No such file or directory)
(process:3175726): accounts-glib-CRITICAL **: 13:59:25.642: ag_manager_create_account: assertion 'AG_IS_MANAGER (manager)' failed
(process:3175739): accounts-glib-WARNING **: 13:59:25.648: Failed to get D-Bus connection (Cannot spawn a message bus without a machine-id: Unable to load /var/lib/dbus/machine-id or /etc/machine-id: Failed to open file ?/var/lib/dbus/machine-id?: No such file or directory)
(process:3175739): accounts-glib-CRITICAL **: 13:59:25.648: ag_manager_create_account: assertion 'AG_IS_MANAGER (manager)' failed
(process:3175749): accounts-glib-WARNING **: 13:59:25.653: Failed to get D-Bus connection (Cannot spawn a message bus without a machine-id: Unable to load /var/lib/dbus/machine-id or /etc/machine-id: Failed to open file ?/var/lib/dbus/machine-id?: No such file or directory)
(process:3175749): GLib-GObject-WARNING **: 13:59:25.653: invalid (NULL) pointer instance
(process:3175749): GLib-GObject-CRITICAL **: 13:59:25.653: g_signal_connect_data: assertion 'G_TYPE_CHECK_INSTANCE (instance)' failed
(process:3175762): accounts-glib-WARNING **: 13:59:25.659: Failed to get D-Bus connection (Cannot spawn a message bus without a machine-id: Unable to load /var/lib/dbus/machine-id or /etc/machine-id: Failed to open file ?/var/lib/dbus/machine-id?: No such file or directory)
(process:3175762): accounts-glib-CRITICAL **: 13:59:25.659: ag_manager_set_db_timeout: assertion 'AG_IS_MANAGER (manager)' failed
0%: Checks: 46, Failures: 5, Errors: 41
check_ag.c:221:F:Core:test_init:0: Failed to initialize the AgManager.
check_ag.c:234:F:Core:test_timeout_properties:0: Assertion '(((__extension__ ({ GTypeInstance *__inst = (GTypeInstance*) ((manager)); GType __t = ((ag_manager_get_type ())); gboolean __r; if (!__inst) __r = (0); else if (__inst->g_class && __inst->g_class->g_type == __t) __r = (!(0)); else __r = g_type_check_instance_is_a (__inst, __t); __r; }))))' failed
check_ag.c:256:E:Create:test_object:0: (after this point) Received signal 5 (Trace/breakpoint trap)
check_ag.c:268:E:Create:test_read_only:0: (after this point) Received signal 5 (Trace/breakpoint trap)
check_ag.c:303:E:Provider:test_provider:0: (after this point) Received signal 5 (Trace/breakpoint trap)
check_ag.c:389:E:Provider:test_provider_settings:0: (after this point) Received signal 5 (Trace/breakpoint trap)
check_ag.c:419:E:Provider:test_provider_directories:0: (after this point) Received signal 5 (Trace/breakpoint trap)
check_ag.c:482:E:Store:test_store:0: (after this point) Received signal 5 (Trace/breakpoint trap)
check_ag.c:525:E:Store:test_store_locked:0: (after this point) Received signal 5 (Trace/breakpoint trap)
check_ag.c:585:E:Store:test_store_locked_cancel:0: (after this point) Received signal 5 (Trace/breakpoint trap)
check_ag.c:650:E:Store:test_store_read_only:0: (after this point) Received signal 5 (Trace/breakpoint trap)
check_ag.c:1707:E:Service:test_service:0: (after this point) Received signal 5 (Trace/breakpoint trap)
check_ag.c:1991:E:Service:test_account_services:0: (after this point) Received signal 5 (Trace/breakpoint trap)
check_ag.c:2223:E:Service:test_settings_iter_gvalue:0: (after this point) Received signal 5 (Trace/breakpoint trap)
check_ag.c:2393:E:Service:test_settings_iter:0: (after this point) Received signal 5 (Trace/breakpoint trap)
check_ag.c:3893:E:Service:test_service_type:0: (after this point) Received signal 5 (Trace/breakpoint trap)
check_ag.c:751:E:AccountService:test_account_service:0: (after this point) Received signal 5 (Trace/breakpoint trap)
check_ag.c:839:E:AccountService:test_account_service_enabledness:0: (after this point) Received signal 5 (Trace/breakpoint trap)
check_ag.c:971:E:AccountService:test_account_service_settings:0: (after this point) Received signal 5 (Trace/breakpoint trap)
check_ag.c:1153:E:AccountService:test_account_service_list:0: (after this point) Received signal 5 (Trace/breakpoint trap)
check_ag.c:1343:E:AuthData:test_auth_data:0: (after this point) Received signal 5 (Trace/breakpoint trap)
check_ag.c:1462:E:AuthData:test_auth_data_get_login_parameters:0: (after this point) Received signal 5 (Trace/breakpoint trap)
check_ag.c:1541:E:AuthData:test_auth_data_insert_parameters:0: (after this point) Received signal 5 (Trace/breakpoint trap)
check_ag.c:1596:E:Application:test_application:0: (after this point) Received signal 5 (Trace/breakpoint trap)
check_ag.c:1667:E:Application:test_application_supported_services:0: (after this point) Received signal 5 (Trace/breakpoint trap)
check_ag.c:2147:E:List:test_list:0: (after this point) Received signal 5 (Trace/breakpoint trap)
check_ag.c:3718:F:List:test_list_enabled_account:0: Manager should not be NULL
check_ag.c:2558:E:List:test_list_services:0: (after this point) Received signal 5 (Trace/breakpoint trap)
check_ag.c:3798:F:List:test_account_list_enabled_services:0: Assertion 'manager != NULL' failed
check_ag.c:2603:E:List:test_list_service_types:0: (after this point) Received signal 5 (Trace/breakpoint trap)
check_ag.c:2036:E:Signalling:test_signals:0: (after this point) Received signal 5 (Trace/breakpoint trap)
check_ag.c:2081:E:Signalling:test_signals_other_manager:0: (after this point) Received signal 5 (Trace/breakpoint trap)
check_ag.c:2648:E:Signalling:test_delete:0: (after this point) Received signal 5 (Trace/breakpoint trap)
check_ag.c:2728:E:Signalling:test_watches:0: (after this point) Received signal 5 (Trace/breakpoint trap)
check_ag.c:2843:E:Concurrency:test_no_dbus:0: (after this point) Received signal 5 (Trace/breakpoint trap)
check_ag.c:2896:E:Concurrency:test_concurrency:0: (after this point) Received signal 5 (Trace/breakpoint trap)
check_ag.c:3209:E:Concurrency:test_blocking:0: (after this point) Received signal 5 (Trace/breakpoint trap)
check_ag.c:3556:E:Concurrency:test_manager_new_for_service_type:0: (after this point) Received signal 5 (Trace/breakpoint trap)
check_ag.c:3662:F:Concurrency:test_manager_enabled_event:0: Assertion 'manager != NULL' failed
check_ag.c:3101:E:Regression:test_service_regression:0: (after this point) Received signal 5 (Trace/breakpoint trap)
check_ag.c:3285:E:Regression:test_cache_regression:0: (after this point) Received signal 5 (Trace/breakpoint trap)
check_ag.c:3355:E:Regression:test_serviceid_regression:0: (after this point) Received signal 5 (Trace/breakpoint trap)
check_ag.c:3414:E:Regression:test_enabled_regression:0: (after this point) Received signal 5 (Trace/breakpoint trap)
check_ag.c:3447:E:Regression:test_delete_regression:0: (after this point) Received signal 5 (Trace/breakpoint trap)
check_ag.c:3516:E:Regression:test_duplicate_create_regression:0: (after this point) Received signal 5 (Trace/breakpoint trap)
check_ag.c:3961:E:Caching:test_db_access:0: (after this point) Received signal 5 (Trace/breakpoint trap)
FAIL accounts-glib-test.sh (exit status: 1)
+ exit 0
Processing files: libaccounts-glib-1.23-alt1_6
Executing(%doc): /bin/sh -e /usr/src/tmp/rpm-tmp.70502
+ umask 022
+ /bin/mkdir -p /usr/src/RPM/BUILD
+ cd /usr/src/RPM/BUILD
+ cd libaccounts-glib-VERSION_1.23-8d14b10652b2fe6c25d8ad8334e2d5023d254313
+ DOCDIR=/usr/src/tmp/libaccounts-glib-buildroot/usr/share/doc/libaccounts-glib-1.23
+ export DOCDIR
+ rm -rf /usr/src/tmp/libaccounts-glib-buildroot/usr/share/doc/libaccounts-glib-1.23
+ /bin/mkdir -p /usr/src/tmp/libaccounts-glib-buildroot/usr/share/doc/libaccounts-glib-1.23
+ cp -prL --no-dereference COPYING /usr/src/tmp/libaccounts-glib-buildroot/usr/share/doc/libaccounts-glib-1.23
+ chmod -R go-w /usr/src/tmp/libaccounts-glib-buildroot/usr/share/doc/libaccounts-glib-1.23
+ chmod -R a+rX /usr/src/tmp/libaccounts-glib-buildroot/usr/share/doc/libaccounts-glib-1.23
+ cp -prL AUTHORS ChangeLog README NEWS /usr/src/tmp/libaccounts-glib-buildroot/usr/share/doc/libaccounts-glib-1.23
+ chmod -R go-w /usr/src/tmp/libaccounts-glib-buildroot/usr/share/doc/libaccounts-glib-1.23
+ chmod -R a+rX /usr/src/tmp/libaccounts-glib-buildroot/usr/share/doc/libaccounts-glib-1.23
+ exit 0
Finding Provides (using /usr/lib/rpm/find-provides)
Executing: /bin/sh -e /usr/src/tmp/rpm-tmp.6jPHwB
find-provides: running scripts (alternatives,debuginfo,gir,lib,pam,perl,pkgconfig,python,shell,typelib)
lib.prov: /usr/src/tmp/libaccounts-glib-buildroot/usr/lib/libaccounts-glib.so.0: 137 symbols, 18 bpp
Finding Requires (using /usr/lib/rpm/find-requires)
Executing: /bin/sh -e /usr/src/tmp/rpm-tmp.pbrZZt
find-requires: running scripts (cpp,debuginfo,files,gir-js,gir-python,gir,lib,pam,perl,pkgconfig,pkgconfiglib,python,rpmlib,shebang,shell,static,symlinks,systemd-services,typelib)
++ /bin/sed -e /dbus-test-runner/d
Provides: libaccounts-glib.so.0 = set:ldFuni2M24hmodaUsKdjpvziA9VX91yvglFWMndvE5nkALxL4Z3OLAH0DanjQM02qdMNxwEG9U3V7fcbTkOytsKq0b5MozUYZEv0mYsaGGgfu5x0FimTGZw7YacHjTJpaDH3xoOF6CIww4JIl0Gfgu8nB9IwMaUQIDG8f4MYaf30yR0LYCYioltvSWnd7HXis0SqlUUHwpN1eN6o0z3HEn1ocNFsS7neUiBFxjdATRpMWXjPZk6herlEcDzw7709ifEhSbvec12VyvZvroya0Gvdfjez2s30, typelib(Accounts) = 1.0
Requires: /lib/ld-linux.so.2, libc.so.6(GLIBC_2.0), libc.so.6(GLIBC_2.1.3), libc.so.6(GLIBC_2.17), libc.so.6(GLIBC_2.3.4), libc.so.6(GLIBC_2.4), libgio-2.0.so.0 >= set:ojBnMyW2i5EcZ8bgK6TFcPVVxCFXbZl7NpyZtuy936quLHqwE2mRfZBWk3rrpbXtagDZ8mVDEe4tfEhDe, libglib-2.0.so.0 >= set:oh60V4sSvgjaaQQxByjhwovkZFLC825Z4uRZJ6Jo4918OsSakEiGzaenCdZ2slc93NNhAIXP1qDvuJyTiubDhUJyd66QZblIIlBE1xeeJdrb32I3wS0FZflAEoWgPqZLvO6Uio3Vg1r4i1TTHho3Yzx7S7ZcgqzM7GUW4K4R08tVw7Nb40ZvcRcWIyLcv85KJAltt9vKyNBHg52TwpcEBsSH2m4Fmq40hYRBL2z42VZqxYZfYIZ0d8aHeKHWni1LjNX2Qe3NQSbSNXzUZttoQAK2alhpSeU5q5Tz5tzsHvWHreRpNxmqj8F1, libgobject-2.0.so.0 >= set:mgX8Uezd1IJqHL9jk1UoahtyosbcZHhvGxEszCJj59KYcVaXPPoOyNE51Z2lXV1cpq1ZL9NZdZhbRy6O39XMR4juuOXNrZaWlzMtqr4ELTlgZbF7R4s5Ay96IGLwRqBh0OIgZgdu5PY0, libpthread.so.0(GLIBC_2.0), libsqlite3.so.0 >= set:ojXRANFiVOYpenaiO3hTTBEexSk699YgADXTTNAZ5Zni4KviPVkp8i8e2nK8tqUJTOSmy8UjhLI0s1qo3V3, libxml2.so.2 >= set:okfKcWfWR7oZjZhZlR1F3yBSm8wQdL2eHPa4MEtLZjZB1, libxml2.so.2(LIBXML2_2.4.30), libxml2.so.2(LIBXML2_2.5.0), libxml2.so.2(LIBXML2_2.5.7), libxml2.so.2(LIBXML2_2.6.0), libxml2.so.2(LIBXML2_2.6.18), rtld(GNU_HASH), typelib(GObject) = 2.0, typelib(Gio) = 2.0
Requires(rpmlib): rpmlib(SetVersions)
Finding debuginfo files (using /usr/lib/rpm/find-debuginfo-files)
Executing: /bin/sh -e /usr/src/tmp/rpm-tmp.7hVBJE
Creating libaccounts-glib-debuginfo package
Processing files: libaccounts-glib-devel-1.23-alt1_6
Finding Provides (using /usr/lib/rpm/find-provides)
Executing: /bin/sh -e /usr/src/tmp/rpm-tmp.Wn5kDs
find-provides: running scripts (alternatives,debuginfo,gir,lib,pam,perl,pkgconfig,python,shell,typelib)
Finding Requires (using /usr/lib/rpm/find-requires)
Executing: /bin/sh -e /usr/src/tmp/rpm-tmp.RFTjCN
find-requires: running scripts (cpp,debuginfo,files,gir-js,gir-python,gir,lib,pam,perl,pkgconfig,pkgconfiglib,python,rpmlib,shebang,shell,static,symlinks,systemd-services,typelib)
shell.req: /usr/src/tmp/libaccounts-glib-buildroot/usr/lib/libaccounts-glib/accounts-glib-test.sh: invalid command: -v
shell.req: /usr/src/tmp/libaccounts-glib-buildroot/usr/lib/libaccounts-glib/accounts-glib-test.sh: dbus-test-runner not found (skip)
++ /bin/sed -e /dbus-test-runner/d
find-requires: FINDPACKAGE-COMMANDS: dbus-test-runner
Provides: gir(Accounts) = 1.0, pkgconfig(libaccounts-glib) = 1.23
Requires: libaccounts-glib = 1.23-alt1_6, /bin/sh, /lib/ld-linux.so.2, /usr/lib/libaccounts-glib.so.0.2.0, /usr/lib/pkgconfig, gir(GObject) = 2.0, gir(Gio) = 2.0, glib2-devel, libaccounts-glib.so.0 >= set:leFunO2M24zIo5n6AZdkye9ZKh2AvMGyG3vlV3JUW1UbhZwVnOlgvD6m4QQ0deEyAfk1cBrapytsKQ0IkMoHTKv0bZukw8Tl41OBIpjeUGMIetTejVsVg8CYkz9b2iROU3BoCcx5kHwD6X9l4f4cL2AixnKCIBwlBXzJKHCzRXyU0ub5HksM9S0b67mh9yRFQInsN1nGY37VttCmvZA33al8peGuw4F7QhCgLpKUn1PG0lZCPzq8Tw, libc.so.6(GLIBC_2.0), libc.so.6(GLIBC_2.17), libc.so.6(GLIBC_2.3.4), libc.so.6(GLIBC_2.4), libcheck.so.0 >= set:jfwd9RTDAsih5O0Ui4e9QDwolzQOcaCa, libgio-2.0.so.0 >= set:oiFVNLZILDa6bATJeyxHxWbkbhmn49Dq356re3qZKZubpmZ2dqixnEL0UNXUZG3gIdegbB7XoIZ61WLlG0R6835rBycogQDQIjUrZ2mORjsNfRZ4PpxGmwb0VLw9sBGtcmAb, libgio-devel, libglib-2.0.so.0 >= set:oh1i8PibeLdBdFgX5QVEPnbYONIzEdlY4HiLNugZ3RYMYkZAKZjR0NKkDgFVvCGdwyH6On3XRQCmVzMZjdHBLqdYGgekM6xk0cspTsuPiD6VfqmMBlCloNM7U3bRcWIyEHN4StgZ1yfS4nI08yLKYloiUHXLZyR0i8Z4Ih0mssnRL4K9Mp8WMqq5ZjoAnmfz2rhCqn08TDeRpNxmq3, libgobject-2.0.so.0 >= set:mgmapw7auXvfIZvnmloZiDUCoZ5qQItGgwHPPMomt9gAaWHzQnQZw5YXcPWhwBPCYcWZIK6eSd4EoWNuh1nNT7IATh3coSKU2SuvfWZrZuNnnqqWYZ8COT5Ld0, libpthread.so.0(GLIBC_2.0), libsqlite3.so.0 >= set:oltbVZ5MCz9bKGcUj5fJr81, pkgconfig(gio-unix-2.0), pkgconfig(glib-2.0), pkgconfig(gobject-2.0), rtld(GNU_HASH)
Requires(rpmlib): rpmlib(SetVersions)
Finding debuginfo files (using /usr/lib/rpm/find-debuginfo-files)
Executing: /bin/sh -e /usr/src/tmp/rpm-tmp.c9htkE
Creating libaccounts-glib-devel-debuginfo package
Processing files: libaccounts-glib-docs-1.23-alt1_6
Finding Provides (using /usr/lib/rpm/find-provides)
Executing: /bin/sh -e /usr/src/tmp/rpm-tmp.Vhnx4m
find-provides: running scripts (alternatives,debuginfo,gir,lib,pam,perl,pkgconfig,python,shell,typelib)
Finding Requires (using /usr/lib/rpm/find-requires)
Executing: /bin/sh -e /usr/src/tmp/rpm-tmp.yaLL1y
find-requires: running scripts (cpp,debuginfo,files,gir-js,gir-python,gir,lib,pam,perl,pkgconfig,pkgconfiglib,python,rpmlib,shebang,shell,static,symlinks,systemd-services,typelib)
Processing files: libaccounts-glib-debuginfo-1.23-alt1_6
Finding Provides (using /usr/lib/rpm/find-provides)
Executing: /bin/sh -e /usr/src/tmp/rpm-tmp.2nxM8k
find-provides: running scripts (debuginfo)
Finding Requires (using /usr/lib/rpm/find-requires)
Executing: /bin/sh -e /usr/src/tmp/rpm-tmp.sCIUOq
find-requires: running scripts (debuginfo)
++ /bin/sed -e /dbus-test-runner/d
Provides: debug(libaccounts-glib.so.0)
Requires: libaccounts-glib = 1.23-alt1_6, /usr/lib/debug/lib/ld-linux.so.2.debug, debug(libc.so.6), debug(libgio-2.0.so.0), debug(libglib-2.0.so.0), debug(libgobject-2.0.so.0), debug(libpthread.so.0), debug(libsqlite3.so.0), debug(libxml2.so.2)
Processing files: libaccounts-glib-devel-debuginfo-1.23-alt1_6
Finding Provides (using /usr/lib/rpm/find-provides)
Executing: /bin/sh -e /usr/src/tmp/rpm-tmp.AmE880
find-provides: running scripts (debuginfo)
Finding Requires (using /usr/lib/rpm/find-requires)
Executing: /bin/sh -e /usr/src/tmp/rpm-tmp.MHd7lq
find-requires: running scripts (debuginfo)
++ /bin/sed -e /dbus-test-runner/d
Requires: libaccounts-glib-devel = 1.23-alt1_6, /usr/lib/debug/lib/ld-linux.so.2.debug, debug(libaccounts-glib.so.0), debug(libc.so.6), debug(libcheck.so.0), debug(libgio-2.0.so.0), debug(libglib-2.0.so.0), debug(libgobject-2.0.so.0), debug(libpthread.so.0), debug(libsqlite3.so.0)
Adding to libaccounts-glib-devel a strict dependency on libaccounts-glib
Adding to libaccounts-glib-debuginfo a strict dependency on libaccounts-glib
Adding to libaccounts-glib-devel-debuginfo a strict dependency on libaccounts-glib-devel
Adding to libaccounts-glib-devel-debuginfo a strict dependency on libaccounts-glib-debuginfo
Removing from libaccounts-glib-devel-debuginfo 10 sources provided by libaccounts-glib-debuginfo
Removing 2 extra deps from libaccounts-glib-devel due to dependency on libaccounts-glib
Removing 1 extra deps from libaccounts-glib-devel-debuginfo due to dependency on libaccounts-glib-debuginfo
Removing 9 extra deps from libaccounts-glib-devel due to repentancy on libaccounts-glib
Removing 7 extra deps from libaccounts-glib-devel-debuginfo due to repentancy on libaccounts-glib-debuginfo
Wrote: /usr/src/RPM/RPMS/i586/libaccounts-glib-1.23-alt1_6.i586.rpm (w2.lzdio)
Wrote: /usr/src/RPM/RPMS/i586/libaccounts-glib-devel-1.23-alt1_6.i586.rpm (w2.lzdio)
Wrote: /usr/src/RPM/RPMS/noarch/libaccounts-glib-docs-1.23-alt1_6.noarch.rpm (w2.lzdio)
Wrote: /usr/src/RPM/RPMS/i586/libaccounts-glib-debuginfo-1.23-alt1_6.i586.rpm (w2.lzdio)
Wrote: /usr/src/RPM/RPMS/i586/libaccounts-glib-devel-debuginfo-1.23-alt1_6.i586.rpm (w2.lzdio)
44.22user 7.36system 1:06.02elapsed 78%CPU (0avgtext+0avgdata 64524maxresident)k
0inputs+0outputs (0major+1909662minor)pagefaults 0swaps
184.86user 22.26system 3:55.27elapsed 88%CPU (0avgtext+0avgdata 195504maxresident)k
0inputs+0outputs (0major+3089854minor)pagefaults 0swaps