86>Nov 22 09:41:47 userdel[926167]: delete user 'rooter'
<86>Nov 22 09:41:47 userdel[926167]: removed group 'rooter' owned by 'rooter'
<86>Nov 22 09:41:47 userdel[926167]: removed shadow group 'rooter' owned by 'rooter'
<86>Nov 22 09:41:47 groupadd[926189]: group added to /etc/group: name=rooter, GID=591
<86>Nov 22 09:41:47 groupadd[926189]: group added to /etc/gshadow: name=rooter
<86>Nov 22 09:41:47 groupadd[926189]: new group: name=rooter, GID=591
<86>Nov 22 09:41:47 useradd[926207]: new user: name=rooter, UID=591, GID=591, home=/root, shell=/bin/bash
<86>Nov 22 09:41:47 userdel[926240]: delete user 'builder'
<86>Nov 22 09:41:47 userdel[926240]: removed group 'builder' owned by 'builder'
<86>Nov 22 09:41:47 userdel[926240]: removed shadow group 'builder' owned by 'builder'
<86>Nov 22 09:41:47 groupadd[926262]: group added to /etc/group: name=builder, GID=592
<86>Nov 22 09:41:47 groupadd[926262]: group added to /etc/gshadow: name=builder
<86>Nov 22 09:41:47 groupadd[926262]: new group: name=builder, GID=592
<86>Nov 22 09:41:47 useradd[926276]: new user: name=builder, UID=592, GID=592, home=/usr/src, shell=/bin/bash
warning: user igor does not exist - using root
warning: group igor does not exist - using root
warning: user igor does not exist - using root
warning: group igor does not exist - using root
warning: user igor does not exist - using root
warning: group igor does not exist - using root
warning: Macro %pom_remove_plugin not found
warning: Macro %pom_remove_plugin not found
warning: Macro %pom_xpath_inject not found
warning: Macro %pom_xpath_inject not found
warning: Macro %_javadocdir not found
warning: Macro %pom_remove_dep not found
warning: Macro %pom_remove_dep not found
warning: Macro %mvn_build not found
warning: Macro %mvn_install not found
<13>Nov 22 09:41:58 rpmi: javapackages-tools-1:5.0.0-alt1_12jpp8 sisyphus+228348.2100.3.3 1556657006 installed
<13>Nov 22 09:41:58 rpmi: plexus-utils-0:3.0.24-alt1_5jpp8 1524376364 installed
<13>Nov 22 09:41:58 rpmi: apache-commons-io-1:2.6-alt1_3jpp8 1526474591 installed
<13>Nov 22 09:41:58 rpmi: maven-shared-utils-3.2.1-alt1_0.1jpp8 1527848452 installed
<13>Nov 22 09:41:58 rpmi: apache-commons-logging-0:1.2-alt1_14jpp8 sisyphus+220622.100.1.1 1549363457 installed
<13>Nov 22 09:41:58 rpmi: plexus-containers-component-annotations-0:1.7.1-alt1_6jpp8 1527990031 installed
<13>Nov 22 09:41:58 rpmi: slf4j-0:1.7.25-alt1_4jpp8 1525924634 installed
<13>Nov 22 09:41:58 rpmi: maven-wagon-provider-api-0:3.0.0-alt1_1jpp8 1511394275 installed
<13>Nov 22 09:41:58 rpmi: xml-commons-apis-1.4.01-alt3_26jpp8 sisyphus+220521.100.1.1 1549294732 installed
<13>Nov 22 09:41:58 rpmi: plexus-interpolation-0:1.22-alt1_9jpp8 1524313082 installed
<13>Nov 22 09:41:58 rpmi: apache-commons-codec-0:1.11-alt1_4jpp8 sisyphus+220604.100.1.1 1549341232 installed
<13>Nov 22 09:41:58 rpmi: apache-commons-lang3-3.7-alt1_4jpp8 sisyphus+220620.100.1.1 1549356987 installed
<13>Nov 22 09:41:58 rpmi: httpcomponents-core-4.4.9-alt1_4jpp8 1525820092 installed
<13>Nov 22 09:41:58 rpmi: plexus-classworlds-0:2.5.2-alt2_9jpp8 1524311141 installed
<13>Nov 22 09:41:58 rpmi: atinject-0:1-alt7_29.20100611svn86jpp8 sisyphus+220650.100.1.1 1549392067 installed
<13>Nov 22 09:41:59 rpmi: guava20-20.0-alt1_5jpp8 1526562255 installed
<13>Nov 22 09:41:59 rpmi: hawtjni-runtime-0:1.16-alt1_1jpp8 1527820189 installed
<13>Nov 22 09:41:59 rpmi: xmvn-api-3.0.0-alt1_18jpp8 1527991448 installed
<13>Nov 22 09:41:59 rpmi: xmvn-core-3.0.0-alt1_18jpp8 1527991448 installed
<13>Nov 22 09:41:59 rpmi: maven-resolver-api-1:1.1.1-alt1_2jpp8 1527821514 installed
<13>Nov 22 09:41:59 rpmi: maven-resolver-util-1:1.1.1-alt1_2jpp8 1527821514 installed
<13>Nov 22 09:41:59 rpmi: maven-resolver-spi-1:1.1.1-alt1_2jpp8 1527821514 installed
<13>Nov 22 09:41:59 rpmi: jansi-native-0:1.7-alt1_5jpp8 1523818758 installed
<13>Nov 22 09:41:59 rpmi: jcl-over-slf4j-0:1.7.25-alt1_4jpp8 1525924634 installed
<13>Nov 22 09:41:59 rpmi: aopalliance-0:1.0-alt6_17jpp8 1526473615 installed
<13>Nov 22 09:41:59 rpmi: apache-commons-cli-0:1.4-alt1_5jpp8 sisyphus+220603.100.1.1 1549340562 installed
<13>Nov 22 09:41:59 rpmi: apache-commons-collections-0:3.2.2-alt1_8jpp8 1527882341 installed
<13>Nov 22 09:41:59 rpmi: plexus-cipher-1.7-alt3_14jpp8 1524310885 installed
<13>Nov 22 09:41:59 rpmi: xorg-proto-devel-2018.4-alt3 1527685079 installed
<13>Nov 22 09:41:59 rpmi: libjpeg-2:2.0.2-alt1 sisyphus+226996.100.1.1 1554902907 installed
<13>Nov 22 09:41:59 rpmi: libpng16-1.6.36-alt1 sisyphus+219478.100.1.1 1547633314 installed
<13>Nov 22 09:41:59 rpmi: libexpat-2.2.10-alt1 p9+261554.100.1.1 1605103337 installed
<13>Nov 22 09:41:59 rpmi: plexus-sec-dispatcher-1.4-alt4_24jpp8 1524313702 installed
<13>Nov 22 09:41:59 rpmi: google-guice-0:4.1-alt1_12jpp8 sisyphus+221708.100.1.1 1550375735 installed
<13>Nov 22 09:41:59 rpmi: maven-resolver-connector-basic-1:1.1.1-alt1_2jpp8 1527821514 installed
<13>Nov 22 09:41:59 rpmi: maven-resolver-impl-1:1.1.1-alt1_2jpp8 1527821514 installed
<13>Nov 22 09:41:59 rpmi: maven-resolver-transport-wagon-1:1.1.1-alt1_2jpp8 1527821514 installed
<13>Nov 22 09:41:59 rpmi: maven-wagon-file-0:3.0.0-alt1_1jpp8 1511394275 installed
<13>Nov 22 09:41:59 rpmi: apache-commons-lang-0:2.6-alt5_22jpp8 sisyphus+220619.100.1.1 1549325921 installed
<13>Nov 22 09:42:00 rpmi: beust-jcommander-1.71-alt1_3jpp8 1523858260 installed
<13>Nov 22 09:42:00 rpmi: geronimo-annotation-1.0-alt4_24jpp8 sisyphus+221131.100.1.2 1549788027 installed
<13>Nov 22 09:42:00 rpmi: xml-utils-1:2.9.10-alt4 p9+261133.100.1.1 1604676314 installed
<13>Nov 22 09:42:00 rpmi: libICE-1.0.9-alt1 1409902721 installed
<13>Nov 22 09:42:00 rpmi: libSM-1.2.3-alt1 sisyphus+226734.100.2.1 1554586158 installed
<13>Nov 22 09:42:00 rpmi: velocity-1:1.7-alt3_22jpp8 1525930039 installed
<13>Nov 22 09:42:00 rpmi: xmvn-connector-aether-3.0.0-alt1_18jpp8 1527991448 installed
<13>Nov 22 09:42:00 rpmi: xmlgraphics-commons-0:2.2-alt1_2jpp8 sisyphus+220498.100.1.1 1549281765 installed
<13>Nov 22 09:42:00 rpmi: qdox-1:2.0-alt1_0.12.M7jpp8 1525919952 installed
<13>Nov 22 09:42:00 rpmi: sgml-common-0.6.3-alt15 1423664786 installed
<13>Nov 22 09:42:00 rpmi: log4j12-1.2.17-alt1_23jpp8 sisyphus+220162.100.2.1 1549021303 installed
<13>Nov 22 09:42:00 rpmi: liblksctp-1.0.17-alt2 1523113261 installed
<13>Nov 22 09:42:00 rpmi: libglvnd-7:1.3.1-alt0.p9 p9+251991.160.19.1 1590834872 installed
<13>Nov 22 09:42:00 rpmi: libwayland-server-1.17.0-alt1 sisyphus+225894.100.1.1 1553872805 installed
<13>Nov 22 09:42:00 rpmi: lksctp-tools-1.0.17-alt2 1523113261 installed
<13>Nov 22 09:42:00 rpmi: docbook-dtds-4.5-alt1 1223476557 installed
<13>Nov 22 09:42:01 rpmi: docbook-style-xsl-1.79.1-alt2 sisyphus.213665.100 1537949315 installed
<13>Nov 22 09:42:01 rpmi: libICE-devel-1.0.9-alt1 1409902721 installed
<13>Nov 22 09:42:01 rpmi: libSM-devel-1.2.3-alt1 sisyphus+226734.100.2.1 1554586158 installed
<13>Nov 22 09:42:01 rpmi: apache-commons-configuration-0:1.10-alt1_12jpp8 sisyphus+220606.100.1.1 1549344005 installed
<13>Nov 22 09:42:01 rpmi: libjasper-2.0.22-alt1 p9+259398.100.5.1 1602695044 installed
<13>Nov 22 09:42:01 rpmi: xmvn-mojo-3.0.0-alt1_18jpp8 1527991448 installed
<13>Nov 22 09:42:01 rpmi: plexus-component-api-1.0-alt4_0.24.alpha15jpp8 1524311381 installed
<13>Nov 22 09:42:01 rpmi: plexus-interactivity-api-0:1.0-alt6_0.25.alpha6jpp8 1525919089 installed
<13>Nov 22 09:42:01 rpmi: apache-commons-httpclient-1:3.1-alt6_27jpp8 1510082305 installed
<13>Nov 22 09:42:01 rpmi: maven-invoker-2.2-alt1_6jpp8 1510802103 installed
<13>Nov 22 09:42:01 rpmi: fontbox-0:1.8.13-alt2_4jpp8 1525914053 installed
<13>Nov 22 09:42:01 rpmi: plexus-io-0:3.0.0-alt1_2jpp8 1527187473 installed
<13>Nov 22 09:42:01 rpmi: maven-artifact-1:2.2.1-alt6_56jpp8 1510505131 installed
<13>Nov 22 09:42:01 rpmi: plexus-compiler-0:2.8.2-alt1_2jpp8 1525918408 installed
<13>Nov 22 09:42:01 rpmi: maven-model-1:2.2.1-alt6_56jpp8 1510505131 installed
<13>Nov 22 09:42:01 rpmi: plexus-build-api-0:0.0.7-alt3_20jpp8 1525915372 installed
<13>Nov 22 09:42:02 rpmi: ant-lib-0:1.10.3-alt1_2jpp8 1528243545 installed
<13>Nov 22 09:42:02 rpmi: objenesis-0:2.6-alt1_1jpp8 1511395274 installed
<13>Nov 22 09:42:02 rpmi: apache-commons-compress-0:1.16.1-alt1_1jpp8 1526491832 installed
<13>Nov 22 09:42:02 rpmi: apache-ivy-0:2.4.0-alt1_12jpp8 1527882603 installed
<13>Nov 22 09:42:02 rpmi: avalon-logkit-0:2.1-alt2_29jpp8 1525884624 installed
<13>Nov 22 09:42:02 rpmi: avalon-framework-0:4.3-alt4_19jpp8 1525884383 installed
<13>Nov 22 09:42:02 rpmi: jai-imageio-core-1.2-alt1_0.24.20100217cvsjpp8 sisyphus+221788.100.1.1 1550423410 installed
<13>Nov 22 09:42:02 rpmi: glassfish-el-api-3.0.1-alt1_0.9.b08jpp8 sisyphus+221160.100.1.1 1549796961 installed
<13>Nov 22 09:42:02 rpmi: jboss-interceptors-1.2-api-1.0.0-alt1_9jpp8 sisyphus+221843.100.1.1 1550450624 installed
<13>Nov 22 09:42:02 rpmi: cdi-api-1.2-alt1_9jpp8 sisyphus+220672.100.1.1 1549401296 installed
<13>Nov 22 09:42:02 rpmi: sisu-inject-2:0.3.3-alt1_3jpp8 1525924258 installed
<13>Nov 22 09:42:02 rpmi: sisu-plexus-2:0.3.3-alt1_3jpp8 1525924258 installed
<13>Nov 22 09:42:02 rpmi: dain-snappy-0.4-alt1_6jpp8 sisyphus+220815.100.1.1 1549458793 installed
<13>Nov 22 09:42:02 rpmi: extra166y-1.7.0-alt1_10jpp8 sisyphus+220916.100.1.3 1549643912 installed
<13>Nov 22 09:42:02 rpmi: java-common-1.6.0-alt1 p9+234085.100.1.1 1562573623 installed
<13>Nov 22 09:42:02 rpmi: fusesource-pom-0:1.11-alt1_4jpp8 sisyphus+221128.100.1.1 1549752021 installed
<13>Nov 22 09:42:02 rpmi: jansi-0:1.17-alt1_1jpp8 1527875993 installed
<13>Nov 22 09:42:02 rpmi: xpp3-1:1.1.4-alt1_19.cjpp8 sisyphus+220580.100.1.1 1549324731 installed
<13>Nov 22 09:42:02 rpmi: xpp3-minimal-1:1.1.4-alt1_19.cjpp8 sisyphus+220580.100.1.1 1549324731 installed
<13>Nov 22 09:42:02 rpmi: xstream-0:1.4.9-alt1_7jpp8 1524214178 installed
<13>Nov 22 09:42:02 rpmi: osgi-core-6.0.0-alt1_6jpp8 1524308153 installed
<13>Nov 22 09:42:03 rpmi: jcsp-1.1-alt1_0.10.rc5jpp8 sisyphus+221980.100.1.1 1550546630 installed
<13>Nov 22 09:42:03 rpmi: jzlib-0:1.1.3-alt1_8jpp8 1525901378 installed
<13>Nov 22 09:42:03 rpmi: netty3-3.10.6-alt2_5jpp8 sisyphus+220441.100.1.1 1549124381 installed
<13>Nov 22 09:42:03 rpmi: multiverse-0.7.0-alt1_8jpp8 1527807673 installed
<13>Nov 22 09:42:03 rpmi: hamcrest-core-0:1.3-alt3_23jpp8 1525893879 installed
<13>Nov 22 09:42:03 rpmi: junit-1:4.12-alt1_8jpp8 1525900612 installed
<13>Nov 22 09:42:03 rpmi: maven-verifier-1.6-alt1_5jpp8 1510518576 installed
<13>Nov 22 09:42:10 rpmi: java-1.8.0-openjdk-javadoc-zip-0:1.8.0.212.b04-alt2_0jpp8 p9+234508.100.3.1 1563175554 installed
<13>Nov 22 09:42:10 rpmi: jsoup-1.11.3-alt1_1jpp8 1527820709 installed
<13>Nov 22 09:42:10 rpmi: maven-filesystem-0.01-alt2.1 1460115697 installed
<13>Nov 22 09:42:10 rpmi: xz-java-1.8-alt1_2jpp8 1525824473 installed
<13>Nov 22 09:42:10 rpmi: plexus-archiver-0:3.6.0-alt1_1jpp8 1527822734 installed
<13>Nov 22 09:42:10 rpmi: zip-30000000:3.0-alt1 1332241772 installed
<13>Nov 22 09:42:10 rpmi: rpm-macros-java-1:5.0.0-alt1_12jpp8 sisyphus+228348.2100.3.3 1556657006 installed
<13>Nov 22 09:42:10 rpmi: libnatspec-0.3.1-alt2 1445691580 installed
<13>Nov 22 09:42:10 rpmi: unzip-6.0-alt4 p9+261695.100.1.1 1605219254 installed
<13>Nov 22 09:42:10 rpmi: publicsuffix-list-20200909-alt1 p9+257853.100.1.1 1599769437 installed
<13>Nov 22 09:42:10 rpmi: httpcomponents-client-4.5.5-alt1_5jpp8 sisyphus+221731.100.1.1 1550391382 installed
<13>Nov 22 09:42:10 rpmi: maven-wagon-http-shared-0:3.0.0-alt1_1jpp8 1511394275 installed
<13>Nov 22 09:42:10 rpmi: maven-wagon-http-0:3.0.0-alt1_1jpp8 1511394275 installed
<13>Nov 22 09:42:10 rpmi: maven-1:3.5.3-alt1_1jpp8 1528125011 installed
<13>Nov 22 09:42:10 rpmi: maven-lib-1:3.5.3-alt1_1jpp8 1528125011 installed
<13>Nov 22 09:42:10 rpmi: maven-common-artifact-filters-3.0.1-alt1_3jpp8 1510506852 installed
<13>Nov 22 09:42:10 rpmi: maven-archiver-0:3.2.0-alt1_1jpp8 1511392070 installed
<13>Nov 22 09:42:10 rpmi: maven-jar-plugin-3.1.0-alt1_1jpp8 1527821052 installed
<13>Nov 22 09:42:11 rpmi: maven-artifact-transfer-1:0.9.0-alt1_3jpp8 1511478032 installed
<13>Nov 22 09:42:11 rpmi: maven-shared-incremental-1.1-alt1_13jpp8 1510516163 installed
<13>Nov 22 09:42:11 rpmi: maven-filtering-3.1.1-alt1_4jpp8 1510509696 installed
<13>Nov 22 09:42:11 rpmi: maven-resources-plugin-3.1.0-alt1_1jpp8 1527822052 installed
<13>Nov 22 09:42:11 rpmi: xmvn-minimal-3.0.0-alt1_18jpp8 1527991448 installed
<13>Nov 22 09:42:11 rpmi: libpcsclite-1.9.0-alt1 p9+260393.100.3.1 1604003804 installed
<13>Nov 22 09:42:11 rpmi: libsqlite3-3.33.0-alt1 p9+258834.40.2.1 1601365057 installed
<13>Nov 22 09:42:11 rpmi: libnspr-1:4.28-alt1 p9+254920.20.18.1 1601209854 installed
<13>Nov 22 09:42:11 rpmi: javazi-2019c-alt1 p9+242136.100.1.1 1575295029 installed
<13>Nov 22 09:42:11 rpmi: libgif-4.1.6-alt3 1299634261 installed
<13>Nov 22 09:42:11 rpmi: libalsa-1:1.1.9-alt2 sisyphus+229323.100.1.1 1557826759 installed
<13>Nov 22 09:42:11 rpmi: liblz4-1:1.9.2-alt1 p9+238696.500.1.1 1570228299 installed
<13>Nov 22 09:42:11 rpmi: libgpg-error-1.36-alt1 sisyphus+225621.300.1.1 1553521082 installed
<13>Nov 22 09:42:11 rpmi: libgcrypt20-1.8.5-alt3 p9+239665.100.7.1 1586364779 installed
<13>Nov 22 09:42:11 rpmi: libsystemd-1:243.9-alt1 p9+258476.300.4.1 1601997172 installed
<13>Nov 22 09:42:11 rpmi: libdbus-1.12.16-alt2 p9+240607.100.1.1 1573553687 installed
<13>Nov 22 09:42:11 rpmi: libavahi-0.8-alt1 p9+258828.100.4.1 1601912063 installed
<13>Nov 22 09:42:11 rpmi: libcups-2.3.1-alt1 p9+247593.200.5.1 1585155229 installed
<13>Nov 22 09:42:11 rpmi: libxslt-1.1.34-alt1.p9.1 p9+261811.300.3.1 1605513919 installed
<13>Nov 22 09:42:11 rpmi: icon-theme-hicolor-0.17-alt2 p9+248347.100.1.1 1584981172 installed
<13>Nov 22 09:42:12 rpmi: libwebp7-1.0.3-alt1 p9+234901.200.1.1 1563552457 installed
<13>Nov 22 09:42:12 rpmi: libjbig-2.1-alt1 1401380926 installed
<13>Nov 22 09:42:12 rpmi: libtiff5-4.0.10.0.57.f9fc01c3-alt1 sisyphus+226958.100.1.1 1554850940 installed
<13>Nov 22 09:42:12 rpmi: shared-mime-info-1.13.1-alt1 p9+238204.100.1.1 1569496447 installed
<13>Nov 22 09:42:12 rpmi: gsettings-desktop-schemas-data-3.32.0-alt1 sisyphus+225059.300.3.2 1552843929 installed
<13>Nov 22 09:42:12 rpmi: libgio-2.60.7-alt1 p9+237353.100.2.2 1568373081 installed
<13>Nov 22 09:42:12 rpmi: gsettings-desktop-schemas-3.32.0-alt1 sisyphus+225059.300.3.2 1552843980 installed
<13>Nov 22 09:42:12 rpmi: libgdk-pixbuf-locales-2.38.2-alt1 p9+237353.1000.2.2 1568374008 installed
<13>Nov 22 09:42:12 rpmi: libgdk-pixbuf-2.38.2-alt1 p9+237353.1000.2.2 1568374336 installed
<13>Nov 22 09:42:12 rpmi: gtk-update-icon-cache-3.24.11-alt1 p9+237353.1200.2.2 1568374786 installed
<13>Nov 22 09:42:13 rpmi: libgtk+2-locales-2.24.32-alt3 sisyphus+227306.100.1.3 1555646039 installed
<13>Nov 22 09:42:13 rpmi: libdatrie-0.2.9-alt1_6 1511686676 installed
<13>Nov 22 09:42:13 rpmi: libthai-0.1.28-alt1_1 sisyphus+226107.100.1.1 1554123079 installed
<13>Nov 22 09:42:13 rpmi: libfribidi-1.0.7-alt1 p9+238309.200.1.1 1569787058 installed
<13>Nov 22 09:42:13 rpmi: libpixman-3:0.38.4-alt1 sisyphus+228006.100.1.1 1556013870 installed
<13>Nov 22 09:42:13 rpmi: libxshmfence-1.3-alt1 sisyphus+223149.1000.2.1 1551268571 installed
<13>Nov 22 09:42:13 rpmi: libwayland-client-1.17.0-alt1 sisyphus+225894.100.1.1 1553872805 installed
<13>Nov 22 09:42:13 rpmi: libpciaccess-1:0.14-alt1 1528969252 installed
<13>Nov 22 09:42:13 rpmi: libdrm-1:2.4.102-alt1 p9+252863.100.1.1 1591372623 installed
<13>Nov 22 09:42:13 rpmi: libgbm-4:20.1.8-alt1 p9+258208.300.1.1 1600333790 installed
<13>Nov 22 09:42:13 rpmi: libatk-locales-2.32.0-alt1 sisyphus+225059.600.3.2 1552845198 installed
<13>Nov 22 09:42:13 rpmi: libatk-2.32.0-alt1 sisyphus+225059.600.3.2 1552845362 installed
<13>Nov 22 09:42:13 rpmi: libX11-locales-3:1.6.7-alt2 p9+258208.100.1.1 1600333167 installed
<13>Nov 22 09:42:13 rpmi: libXdmcp-1.1.3-alt1 sisyphus+225206.600.1.2 1552949353 installed
<13>Nov 22 09:42:13 rpmi: libXau-1.0.9-alt1 sisyphus+223149.200.2.1 1551268152 installed
<13>Nov 22 09:42:13 rpmi: libxcb-1.13.1-alt1 sisyphus+226527.100.2.2 1554593801 installed
<13>Nov 22 09:42:13 rpmi: libX11-3:1.6.7-alt2 p9+258208.100.1.1 1600333162 installed
<13>Nov 22 09:42:13 rpmi: libXext-1.3.4-alt1 sisyphus+225206.700.1.2 1552949429 installed
<13>Nov 22 09:42:13 rpmi: libXrender-0.9.8-alt1 1371312112 installed
<13>Nov 22 09:42:13 rpmi: libXfixes-5.0.3-alt1 sisyphus+226736.100.2.2 1554614841 installed
<13>Nov 22 09:42:13 rpmi: libXi-1.7.9-alt2 sisyphus+226377.100.1.2 1554260260 installed
<13>Nov 22 09:42:13 rpmi: libXcomposite-0.4.5-alt1 sisyphus+225206.300.1.2 1552949137 installed
<13>Nov 22 09:42:13 rpmi: libXdamage-1.1.5-alt1 sisyphus+225206.500.1.2 1552949286 installed
<13>Nov 22 09:42:13 rpmi: libXcursor-1.2.0-alt1 sisyphus+225206.400.1.2 1552949218 installed
<13>Nov 22 09:42:13 rpmi: libXrandr-1.5.2-alt1 sisyphus+225206.1300.1.2 1552949710 installed
<13>Nov 22 09:42:13 rpmi: libXxf86vm-1.1.4-alt2 1527672187 installed
<13>Nov 22 09:42:13 rpmi: libGLX-mesa-4:20.1.8-alt1 p9+258208.300.1.1 1600333790 installed
<13>Nov 22 09:42:13 rpmi: libEGL-mesa-4:20.1.8-alt1 p9+258208.300.1.1 1600333790 installed
<13>Nov 22 09:42:13 rpmi: libEGL-7:1.3.1-alt0.p9 p9+251991.160.19.1 1590834872 installed
<13>Nov 22 09:42:13 rpmi: libGLX-7:1.3.1-alt0.p9 p9+251991.160.19.1 1590834872 installed
<13>Nov 22 09:42:13 rpmi: libGL-7:1.3.1-alt0.p9 p9+251991.160.19.1 1590834872 installed
<13>Nov 22 09:42:13 rpmi: libXinerama-1.1.4-alt1 sisyphus+223149.300.2.1 1551268216 installed
<13>Nov 22 09:42:13 rpmi: libXtst-1.2.2-alt1 1369984893 installed
<13>Nov 22 09:42:13 rpmi: libXt-1.1.4-alt1 1369984722 installed
<13>Nov 22 09:42:16 rpmi: libxcb-devel-1.13.1-alt1 sisyphus+226527.100.2.2 1554593801 installed
<13>Nov 22 09:42:16 rpmi: libX11-devel-3:1.6.7-alt2 p9+258208.100.1.1 1600333162 installed
<13>Nov 22 09:42:16 rpmi: libXt-devel-1.1.4-alt1 1369984722 installed
<13>Nov 22 09:42:16 rpmi: libgraphite2-1.3.13-alt2 sisyphus+226799.100.1.1 1554648241 installed
<13>Nov 22 09:42:17 rpmi: libharfbuzz-2.6.2-alt1 p9+238790.200.1.1 1570435826 installed
<13>Nov 22 09:42:17 rpmi: libfreetype-2.10.1-alt1.1.p9.1 p9+260179.200.3.1 1603971407 installed
<13>Nov 22 09:42:17 rpmi: fontconfig-2.13.1-alt1 p9+247340.200.3.1 1583400517 installed
Updating fonts cache: <29>Nov 22 09:42:18 fontconfig: Updating fonts cache: succeeded
[ DONE ]
<13>Nov 22 09:42:18 rpmi: libcairo-1:1.16.0-alt1 sisyphus+226534.100.2.3 1554515535 installed
<13>Nov 22 09:42:18 rpmi: fonts-type1-xorg-7.0.0-alt4 1188553211 installed
<13>Nov 22 09:42:18 rpmi: libXft-2.3.3-alt1 sisyphus+225206.1000.3.2 1552987708 installed
<13>Nov 22 09:42:18 rpmi: libpango-1.44.6-alt1 p9+237353.700.2.2 1568374131 installed
<13>Nov 22 09:42:19 rpmi: libgtk+2-2.24.32-alt3 sisyphus+227306.100.1.3 1555646092 installed
<13>Nov 22 09:42:19 rpmi: libgail-2.24.32-alt3 sisyphus+227306.100.1.3 1555646092 installed
<13>Nov 22 09:42:19 rpmi: libgdbm-1.8.3-alt10 1454943334 installed
<13>Nov 22 09:42:19 rpmi: libp11-kit-0.23.15-alt2 p9+254920.2400.19.1 1601385903 installed
<13>Nov 22 09:42:19 rpmi: libtasn1-4.14-alt1 p9+235792.100.2.1 1565425233 installed
<13>Nov 22 09:42:19 rpmi: rpm-macros-alternatives-0.5.1-alt1 sisyphus+226946.100.1.1 1554830426 installed
<13>Nov 22 09:42:19 rpmi: alternatives-0.5.1-alt1 sisyphus+226946.100.1.1 1554830426 installed
<13>Nov 22 09:42:19 rpmi: ca-certificates-2020.06.29-alt1 p9+258899.100.3.1 1601998604 installed
<13>Nov 22 09:42:19 rpmi: ca-trust-0.1.2-alt1 p9+233349.100.1.1 1561655062 installed
<13>Nov 22 09:42:19 rpmi: p11-kit-trust-0.23.15-alt2 p9+254920.2400.19.1 1601385903 installed
<13>Nov 22 09:42:20 rpmi: libcrypto1.1-1.1.1g-alt1 p9+250580.100.5.1 1588175266 installed
<13>Nov 22 09:42:20 rpmi: libssl1.1-1.1.1g-alt1 p9+250580.100.5.1 1588175266 installed
<13>Nov 22 09:42:20 rpmi: libpython3-3.7.4-alt3 p9+249932.100.2.1 1587127349 installed
<13>Nov 22 09:42:20 rpmi: python3-3.7.4-alt3 p9+249932.100.2.1 1587127349 installed
<13>Nov 22 09:42:23 rpmi: python3-base-3.7.4-alt3 p9+249932.100.2.1 1587127349 installed
<13>Nov 22 09:42:23 rpmi: python3-module-sugarbowl-0.52.1-alt1.git20141130.1.1 sisyphus+227470.1100.1.1 1555687657 installed
<13>Nov 22 09:42:23 rpmi: python3-module-six-1.12.0-alt1 sisyphus+219665.100.2.1 1548148570 installed
<13>Nov 22 09:42:23 rpmi: python3-module-markupsafe-1.1.1-alt1 p9+254838.60.14.1 1602882139 installed
<13>Nov 22 09:42:23 rpmi: python3-module-jinja2-2.11.2-alt1 p9+254838.40.14.1 1602882082 installed
<13>Nov 22 09:42:23 rpmi: python3-module-clyde-0.8.0-alt1.git20141130.2.1 sisyphus+227465.1600.1.2 1555756906 installed
<13>Nov 22 09:42:23 rpmi: python3-module-pkg_resources-1:40.8.0-alt2 sisyphus+229158.200.2.1 1557735221 installed
<13>Nov 22 09:42:23 rpmi: python3-module-runfile-0.46.1-alt1.git20141130.2.1 sisyphus+227469.1300.2.3 1555706376 installed
<13>Nov 22 09:42:23 rpmi: objectweb-asm-0:6.1.1-alt1_1jpp8 1528136365 installed
<13>Nov 22 09:42:23 rpmi: plexus-languages-0.9.3-alt2_4jpp8 1528196710 installed
<13>Nov 22 09:42:23 rpmi: maven-compiler-plugin-3.7.0-alt1_1jpp8 1527175304 installed
<13>Nov 22 09:42:23 rpmi: xmvn-install-3.0.0-alt1_18jpp8 1527991448 installed
<13>Nov 22 09:42:23 rpmi: parboiled-1.1.6-alt1_13jpp8 1524290710 installed
<13>Nov 22 09:42:23 rpmi: pegdown-1.4.2-alt1_12jpp8 1524309539 installed
<13>Nov 22 09:42:23 rpmi: antlr-tool-0:2.7.7-alt12_53jpp8 1525882426 installed
<13>Nov 22 09:42:23 rpmi: gpars-1.2.1-alt1_12jpp8 sisyphus+221710.100.1.1 1550377267 installed
<13>Nov 22 09:42:24 rpmi: groovy-lib-0:2.4.8-alt1_5jpp8 1524261040 installed
<13>Nov 22 09:42:24 rpmi: xbean-0:4.8-alt1_1jpp8 1527831195 installed
<13>Nov 22 09:42:25 rpmi: plexus-containers-container-default-0:1.7.1-alt1_6jpp8 1527990031 installed
<13>Nov 22 09:42:25 rpmi: maven-doxia-logging-api-0:1.7-alt1_9jpp8 sisyphus+220185.100.1.1 1548779496 installed
<13>Nov 22 09:42:25 rpmi: maven-doxia-sink-api-0:1.7-alt1_9jpp8 sisyphus+220185.100.1.1 1548779496 installed
<13>Nov 22 09:42:25 rpmi: maven-reporting-api-1:3.0-alt3_13jpp8 1510514759 installed
<13>Nov 22 09:42:25 rpmi: plexus-i18n-0:1.0-alt7_0.11.b10.4jpp8 1524312824 installed
<13>Nov 22 09:42:25 rpmi: plexus-velocity-0:1.2-alt1_4jpp8 1524376629 installed
<13>Nov 22 09:42:25 rpmi: maven-plugin-registry-1:2.2.1-alt6_56jpp8 1510505131 installed
<13>Nov 22 09:42:25 rpmi: maven-plugin-annotations-0:3.5.1-alt1_1jpp8 1525824925 installed
<13>Nov 22 09:42:25 rpmi: maven-surefire-0:2.21.0-alt1_1jpp8 1527848673 installed
<13>Nov 22 09:42:25 rpmi: maven-surefire-plugin-0:2.21.0-alt1_1jpp8 1527848673 installed
<13>Nov 22 09:42:25 rpmi: maven-surefire-provider-junit-0:2.21.0-alt1_1jpp8 1527848673 installed
<13>Nov 22 09:42:25 rpmi: maven-surefire-provider-testng-0:2.21.0-alt1_1jpp8 1527848673 installed
<13>Nov 22 09:42:25 rpmi: xml-commons-resolver-0:1.2-alt1_24jpp8 1525932051 installed
<13>Nov 22 09:42:25 rpmi: xalan-j2-0:2.7.1-alt4_34jpp8 1525931290 installed
<13>Nov 22 09:42:25 rpmi: xerces-j2-0:2.11.0-alt3_31jpp8 1524211519 installed
<13>Nov 22 09:42:25 rpmi: batik-css-0:1.10-alt1_2jpp8 sisyphus+220497.100.1.2 1549284940 installed
<13>Nov 22 09:42:27 rpmi: batik-0:1.10-alt1_2jpp8 sisyphus+220497.100.1.2 1549284940 installed
<13>Nov 22 09:42:27 rpmi: xmlunit-0:1.6-alt1_7jpp8 1525933352 installed
<13>Nov 22 09:42:27 rpmi: maven-doxia-core-0:1.7-alt1_9jpp8 sisyphus+220185.100.1.1 1548779496 installed
<13>Nov 22 09:42:27 rpmi: maven-doxia-module-xhtml-0:1.7-alt1_9jpp8 sisyphus+220185.100.1.1 1548779496 installed
<13>Nov 22 09:42:27 rpmi: maven-doxia-module-markdown-0:1.7-alt1_9jpp8 sisyphus+220185.100.1.1 1548779496 installed
<13>Nov 22 09:42:27 rpmi: maven-doxia-module-apt-0:1.7-alt1_9jpp8 sisyphus+220185.100.1.1 1548779496 installed
<13>Nov 22 09:42:27 rpmi: maven-doxia-module-fml-0:1.7-alt1_9jpp8 sisyphus+220185.100.1.1 1548779496 installed
<13>Nov 22 09:42:27 rpmi: maven-doxia-module-xdoc-0:1.7-alt1_9jpp8 sisyphus+220185.100.1.1 1548779496 installed
<13>Nov 22 09:42:27 rpmi: xmvn-subst-3.0.0-alt1_18jpp8 1527991448 installed
<13>Nov 22 09:42:27 rpmi: xmvn-resolve-3.0.0-alt1_18jpp8 1527991448 installed
<13>Nov 22 09:42:27 rpmi: python3-module-genshi-0.7-alt2 sisyphus+229363.100.1.1 1557847335 installed
<13>Nov 22 09:42:27 rpmi: python3-module-webencodings-0.5.1-alt1.1 1517943573 installed
<13>Nov 22 09:42:27 rpmi: python3-module-cssselect-0.9.1-alt1.2 sisyphus+227479.1100.1.2 1555757152 installed
<13>Nov 22 09:42:27 rpmi: python3-module-html5lib-1:0.999999999-alt4.qa1 sisyphus+227493.600.1.3 1555835341 installed
<13>Nov 22 09:42:27 rpmi: python3-module-lxml-4.4.2-alt1 p9+244111.100.1.1 1578758819 installed
<13>Nov 22 09:42:27 rpmi: python3-module-javapackages-1:5.0.0-alt1_12jpp8 sisyphus+228348.2100.3.3 1556657006 installed
<13>Nov 22 09:42:28 rpmi: javapackages-local-1:5.0.0-alt1_12jpp8 sisyphus+228348.2100.3.3 1556657006 installed
<13>Nov 22 09:42:28 rpmi: rpm-build-java-1:5.0.0-alt1_12jpp8 sisyphus+228348.2100.3.3 1556657006 installed
<13>Nov 22 09:42:28 rpmi: ca-trust-java-0.1.2-alt1 p9+233349.100.1.1 1561655062 installed
<13>Nov 22 09:42:28 rpmi: libnss-3.56.0-alt1 p9+254920.30.20.1 1601657872 installed
<13>Nov 22 09:42:37 rpmi: java-1.8.0-openjdk-headless-0:1.8.0.212.b04-alt2_0jpp8 p9+234508.100.3.1 1563175746 installed
<13>Nov 22 09:42:40 rpmi: java-1.8.0-openjdk-0:1.8.0.212.b04-alt2_0jpp8 p9+234508.100.3.1 1563175746 installed
<13>Nov 22 09:42:41 rpmi: fop-0:2.0-alt1_9jpp8 1524189893 installed
<13>Nov 22 09:42:41 rpmi: maven-doxia-module-fo-0:1.7-alt1_9jpp8 sisyphus+220185.100.1.1 1548779496 installed
<13>Nov 22 09:42:41 rpmi: maven-doxia-sitetools-0:1.7.5-alt1_1jpp8 1511392380 installed
<13>Nov 22 09:42:41 rpmi: maven-javadoc-plugin-3.0.0-alt1_4jpp8 1527985821 installed
<13>Nov 22 09:42:44 rpmi: java-1.8.0-openjdk-devel-0:1.8.0.212.b04-alt2_0jpp8 p9+234508.100.3.1 1563175746 installed
<13>Nov 22 09:42:44 rpmi: jpackage-generic-compat-0.29-alt1 1523537205 installed
<13>Nov 22 09:42:44 rpmi: maven-local-1:5.0.0-alt1_12jpp8 sisyphus+228348.2100.3.3 1556657006 installed
<13>Nov 22 09:42:44 rpmi: java-stub-javadoc-0.1-alt1 1229813340 installed
<13>Nov 22 09:42:44 rpmi: javamail-1.5.2-alt1_8jpp8 sisyphus+221812.100.1.1 1550428192 installed
<13>Nov 22 09:42:44 rpmi: jsr-305-1:0-alt4_0.22.20130910svnjpp8 1524302716 installed
Building target platforms: i586
Building for target i586
Wrote: /usr/src/in/nosrpm/subethasmtp-3.1.7-alt1_12jpp8.nosrc.rpm
Installing subethasmtp-3.1.7-alt1_12jpp8.src.rpm
Building target platforms: i586
Building for target i586
Executing(%prep): /bin/sh -e /usr/src/tmp/rpm-tmp.20162
+ umask 022
+ /bin/mkdir -p /usr/src/RPM/BUILD
+ cd /usr/src/RPM/BUILD
+ cd /usr/src/RPM/BUILD
+ rm -rf subethasmtp-db8a995386c9808c893384023eee78e087ad9ad7
+ echo 'Source #0 (subethasmtp-db8a995386c9808c893384023eee78e087ad9ad7.tar.gz):'
Source #0 (subethasmtp-db8a995386c9808c893384023eee78e087ad9ad7.tar.gz):
+ /bin/tar -xf -
+ /bin/gzip -dc /usr/src/RPM/SOURCES/subethasmtp-db8a995386c9808c893384023eee78e087ad9ad7.tar.gz
+ cd subethasmtp-db8a995386c9808c893384023eee78e087ad9ad7
+ /bin/chmod -c -Rf u+rwX,go-w .
+ find -name '*.class' -print -delete
+ find -name '*.jar' -print -delete
./lib/slf4j-api-1.6.1.jar
./lib/mail.jar
./lib/buildonly/svntask.jar
./lib/buildonly/svnkit.jar
./lib/buildonly/slf4j-simple-1.6.1.jar
./lib/buildonly/junit-4.5.jar
./lib/buildonly/jsr305.jar
./lib/buildonly/jmockit/jmockit.jar
./lib/buildonly/ant-ikvmc.0.5.jar
./lib/buildonly/ant-contrib-1.0b3.jar
./lib/activation.jar
+ /usr/bin/python3 /usr/share/java-utils/pom_editor.py pom_remove_plugin :maven-dependency-plugin
/usr/share/java-utils/pom_editor.py:203: DeprecationWarning: inspect.getargspec() is deprecated since Python 3.0, use inspect.signature() or inspect.getfullargspec()
(arglist, _, _, defaults) = inspect.getargspec(function)
+ /usr/bin/python3 /usr/share/java-utils/pom_editor.py pom_remove_plugin :maven-gpg-plugin
/usr/share/java-utils/pom_editor.py:203: DeprecationWarning: inspect.getargspec() is deprecated since Python 3.0, use inspect.signature() or inspect.getfullargspec()
(arglist, _, _, defaults) = inspect.getargspec(function)
+ /usr/bin/python3 /usr/share/java-utils/pom_editor.py pom_xpath_inject 'pom:plugin[pom:artifactId='\''maven-jar-plugin'\'']/pom:configuration' '
org/subethamail/smtp/test/**
'
/usr/share/java-utils/pom_editor.py:203: DeprecationWarning: inspect.getargspec() is deprecated since Python 3.0, use inspect.signature() or inspect.getfullargspec()
(arglist, _, _, defaults) = inspect.getargspec(function)
+ /usr/bin/python3 /usr/share/java-utils/pom_editor.py pom_xpath_inject 'pom:plugin[pom:artifactId='\''maven-javadoc-plugin'\'']' '
false
true
true
false
http://download.oracle.com/javase/6/docs/api/
/usr/share/javadoc/java
org.subethamail.smtp.test.*:**Test**
'
/usr/share/java-utils/pom_editor.py:203: DeprecationWarning: inspect.getargspec() is deprecated since Python 3.0, use inspect.signature() or inspect.getfullargspec()
(arglist, _, _, defaults) = inspect.getargspec(function)
+ /usr/bin/python3 /usr/share/java-utils/pom_editor.py pom_remove_dep javax.activation:activation
/usr/share/java-utils/pom_editor.py:203: DeprecationWarning: inspect.getargspec() is deprecated since Python 3.0, use inspect.signature() or inspect.getfullargspec()
(arglist, _, _, defaults) = inspect.getargspec(function)
+ /usr/bin/python3 /usr/share/java-utils/pom_editor.py pom_remove_dep :jmockit
/usr/share/java-utils/pom_editor.py:203: DeprecationWarning: inspect.getargspec() is deprecated since Python 3.0, use inspect.signature() or inspect.getfullargspec()
(arglist, _, _, defaults) = inspect.getargspec(function)
+ rm -r src/test/java/org/subethamail/smtp/MessageHandlerTest.java
+ rm -r src/test/java/org/subethamail/smtp/TimeoutTest.java src/test/java/org/subethamail/smtp/WiserFailuresTest.java src/test/java/org/subethamail/smtp/ReceivedHeaderStreamTest.java
+ sed -i.java8 's|MDC.setContextMap(parentLoggingMdcContext);|MDC.setContextMap((Map)parentLoggingMdcContext);|' src/main/java/org/subethamail/smtp/server/Session.java
+ exit 0
Executing(%build): /bin/sh -e /usr/src/tmp/rpm-tmp.94470
+ umask 022
+ /bin/mkdir -p /usr/src/RPM/BUILD
+ cd /usr/src/RPM/BUILD
+ cd subethasmtp-db8a995386c9808c893384023eee78e087ad9ad7
+ /usr/bin/python3 /usr/share/java-utils/mvn_build.py
Executing: xmvn --batch-mode --offline verify org.fedoraproject.xmvn:xmvn-mojo:install org.apache.maven.plugins:maven-javadoc-plugin:aggregate org.fedoraproject.xmvn:xmvn-mojo:builddep
['xmvn', '--batch-mode', '--offline', 'verify', 'org.fedoraproject.xmvn:xmvn-mojo:install', 'org.apache.maven.plugins:maven-javadoc-plugin:aggregate', 'org.fedoraproject.xmvn:xmvn-mojo:builddep']
[INFO] Scanning for projects...
[INFO]
[INFO] --------------------< org.subethamail:subethasmtp >---------------------
[INFO] Building SubEtha SMTP 3.1.7
[INFO] --------------------------------[ jar ]---------------------------------
[INFO]
[INFO] --- maven-resources-plugin:3.1.0:resources (default-resources) @ subethasmtp ---
[INFO] Using 'UTF-8' encoding to copy filtered resources.
[INFO] skip non existing resourceDirectory /usr/src/RPM/BUILD/subethasmtp-db8a995386c9808c893384023eee78e087ad9ad7/src/main/resources
[INFO]
[INFO] --- maven-compiler-plugin:3.7.0:compile (default-compile) @ subethasmtp ---
[INFO] Changes detected - recompiling the module!
[INFO] Compiling 63 source files to /usr/src/RPM/BUILD/subethasmtp-db8a995386c9808c893384023eee78e087ad9ad7/target/classes
[INFO] /usr/src/RPM/BUILD/subethasmtp-db8a995386c9808c893384023eee78e087ad9ad7/src/main/java/org/subethamail/smtp/server/Session.java: /usr/src/RPM/BUILD/subethasmtp-db8a995386c9808c893384023eee78e087ad9ad7/src/main/java/org/subethamail/smtp/server/Session.java uses unchecked or unsafe operations.
[INFO] /usr/src/RPM/BUILD/subethasmtp-db8a995386c9808c893384023eee78e087ad9ad7/src/main/java/org/subethamail/smtp/server/Session.java: Recompile with -Xlint:unchecked for details.
[INFO]
[INFO] --- maven-resources-plugin:3.1.0:testResources (default-testResources) @ subethasmtp ---
[INFO] Using 'UTF-8' encoding to copy filtered resources.
[INFO] skip non existing resourceDirectory /usr/src/RPM/BUILD/subethasmtp-db8a995386c9808c893384023eee78e087ad9ad7/src/test/resources
[INFO]
[INFO] --- maven-compiler-plugin:3.7.0:testCompile (default-testCompile) @ subethasmtp ---
[INFO] Changes detected - recompiling the module!
[INFO] Compiling 18 source files to /usr/src/RPM/BUILD/subethasmtp-db8a995386c9808c893384023eee78e087ad9ad7/target/test-classes
[INFO]
[INFO] --- maven-surefire-plugin:2.21.0:test (default-test) @ subethasmtp ---
[INFO]
[INFO] -------------------------------------------------------
[INFO] T E S T S
[INFO] -------------------------------------------------------
[INFO] Running org.subethamail.smtp.DotTerminatedInputStreamTest
[INFO] Tests run: 4, Failures: 0, Errors: 0, Skipped: 0, Time elapsed: 0.129 s - in org.subethamail.smtp.DotTerminatedInputStreamTest
[INFO] Running org.subethamail.smtp.command.MailTest
[main] INFO org.subethamail.smtp.server.SMTPServer - SMTP server *:2566 starting
[org.subethamail.smtp.server.ServerThread *:2566] INFO org.subethamail.smtp.server.ServerThread - SMTP server *:2566 started
[main] INFO org.subethamail.smtp.server.SMTPServer - SMTP server *:2566 stopping
[org.subethamail.smtp.server.ServerThread *:2566] INFO org.subethamail.smtp.server.ServerThread - SMTP server *:2566 stopped
[main] INFO org.subethamail.smtp.server.SMTPServer - SMTP server *:2566 starting
[org.subethamail.smtp.server.ServerThread *:2566] INFO org.subethamail.smtp.server.ServerThread - SMTP server *:2566 started
[main] INFO org.subethamail.smtp.server.SMTPServer - SMTP server *:2566 stopping
[org.subethamail.smtp.server.ServerThread *:2566] INFO org.subethamail.smtp.server.ServerThread - SMTP server *:2566 stopped
[main] INFO org.subethamail.smtp.server.SMTPServer - SMTP server *:2566 starting
[org.subethamail.smtp.server.ServerThread *:2566] INFO org.subethamail.smtp.server.ServerThread - SMTP server *:2566 started
[main] INFO org.subethamail.smtp.server.SMTPServer - SMTP server *:2566 stopping
[org.subethamail.smtp.server.ServerThread *:2566] INFO org.subethamail.smtp.server.ServerThread - SMTP server *:2566 stopped
[main] INFO org.subethamail.smtp.server.SMTPServer - SMTP server *:2566 starting
[org.subethamail.smtp.server.ServerThread *:2566] INFO org.subethamail.smtp.server.ServerThread - SMTP server *:2566 started
[main] INFO org.subethamail.smtp.server.SMTPServer - SMTP server *:2566 stopping
[org.subethamail.smtp.server.ServerThread *:2566] INFO org.subethamail.smtp.server.ServerThread - SMTP server *:2566 stopped
[main] INFO org.subethamail.smtp.server.SMTPServer - SMTP server *:2566 starting
[org.subethamail.smtp.server.ServerThread *:2566] INFO org.subethamail.smtp.server.ServerThread - SMTP server *:2566 started
[main] INFO org.subethamail.smtp.server.SMTPServer - SMTP server *:2566 stopping
[org.subethamail.smtp.server.ServerThread *:2566] INFO org.subethamail.smtp.server.ServerThread - SMTP server *:2566 stopped
[main] INFO org.subethamail.smtp.server.SMTPServer - SMTP server *:2566 starting
[org.subethamail.smtp.server.ServerThread *:2566] INFO org.subethamail.smtp.server.ServerThread - SMTP server *:2566 started
[main] INFO org.subethamail.smtp.server.SMTPServer - SMTP server *:2566 stopping
[org.subethamail.smtp.server.ServerThread *:2566] INFO org.subethamail.smtp.server.ServerThread - SMTP server *:2566 stopped
[main] INFO org.subethamail.smtp.server.SMTPServer - SMTP server *:2566 starting
[org.subethamail.smtp.server.ServerThread *:2566] INFO org.subethamail.smtp.server.ServerThread - SMTP server *:2566 started
[main] INFO org.subethamail.smtp.server.SMTPServer - SMTP server *:2566 stopping
[org.subethamail.smtp.server.ServerThread *:2566] INFO org.subethamail.smtp.server.ServerThread - SMTP server *:2566 stopped
[main] INFO org.subethamail.smtp.server.SMTPServer - SMTP server *:2566 starting
[org.subethamail.smtp.server.ServerThread *:2566] INFO org.subethamail.smtp.server.ServerThread - SMTP server *:2566 started
[main] INFO org.subethamail.smtp.server.SMTPServer - SMTP server *:2566 stopping
[org.subethamail.smtp.server.ServerThread *:2566] INFO org.subethamail.smtp.server.ServerThread - SMTP server *:2566 stopped
[main] INFO org.subethamail.smtp.server.SMTPServer - SMTP server *:2566 starting
[org.subethamail.smtp.server.ServerThread *:2566] INFO org.subethamail.smtp.server.ServerThread - SMTP server *:2566 started
[main] INFO org.subethamail.smtp.server.SMTPServer - SMTP server *:2566 stopping
[org.subethamail.smtp.server.ServerThread *:2566] INFO org.subethamail.smtp.server.ServerThread - SMTP server *:2566 stopped
[main] INFO org.subethamail.smtp.server.SMTPServer - SMTP server *:2566 starting
[org.subethamail.smtp.server.ServerThread *:2566] INFO org.subethamail.smtp.server.ServerThread - SMTP server *:2566 started
[main] INFO org.subethamail.smtp.server.SMTPServer - SMTP server *:2566 stopping
[org.subethamail.smtp.server.ServerThread *:2566] INFO org.subethamail.smtp.server.ServerThread - SMTP server *:2566 stopped
[INFO] Tests run: 10, Failures: 0, Errors: 0, Skipped: 0, Time elapsed: 0.576 s - in org.subethamail.smtp.command.MailTest
[INFO] Running org.subethamail.smtp.command.QuitTest
[main] INFO org.subethamail.smtp.server.SMTPServer - SMTP server *:2566 starting
[org.subethamail.smtp.server.ServerThread *:2566] INFO org.subethamail.smtp.server.ServerThread - SMTP server *:2566 started
[main] INFO org.subethamail.smtp.server.SMTPServer - SMTP server *:2566 stopping
[org.subethamail.smtp.server.ServerThread *:2566] INFO org.subethamail.smtp.server.ServerThread - SMTP server *:2566 stopped
[INFO] Tests run: 1, Failures: 0, Errors: 0, Skipped: 0, Time elapsed: 0.034 s - in org.subethamail.smtp.command.QuitTest
[INFO] Running org.subethamail.smtp.command.DataTest
[main] INFO org.subethamail.smtp.server.SMTPServer - SMTP server *:2566 starting
[org.subethamail.smtp.server.ServerThread *:2566] INFO org.subethamail.smtp.server.ServerThread - SMTP server *:2566 started
[main] INFO org.subethamail.smtp.server.SMTPServer - SMTP server *:2566 stopping
[org.subethamail.smtp.server.ServerThread *:2566] INFO org.subethamail.smtp.server.ServerThread - SMTP server *:2566 stopped
[main] INFO org.subethamail.smtp.server.SMTPServer - SMTP server *:2566 starting
[org.subethamail.smtp.server.ServerThread *:2566] INFO org.subethamail.smtp.server.ServerThread - SMTP server *:2566 started
[main] INFO org.subethamail.smtp.server.SMTPServer - SMTP server *:2566 stopping
[org.subethamail.smtp.server.ServerThread *:2566] INFO org.subethamail.smtp.server.ServerThread - SMTP server *:2566 stopped
[main] INFO org.subethamail.smtp.server.SMTPServer - SMTP server *:2566 starting
[org.subethamail.smtp.server.ServerThread *:2566] INFO org.subethamail.smtp.server.ServerThread - SMTP server *:2566 started
[main] INFO org.subethamail.smtp.server.SMTPServer - SMTP server *:2566 stopping
[org.subethamail.smtp.server.ServerThread *:2566] INFO org.subethamail.smtp.server.ServerThread - SMTP server *:2566 stopped
[main] INFO org.subethamail.smtp.server.SMTPServer - SMTP server *:2566 starting
[org.subethamail.smtp.server.ServerThread *:2566] INFO org.subethamail.smtp.server.ServerThread - SMTP server *:2566 started
[main] INFO org.subethamail.smtp.server.SMTPServer - SMTP server *:2566 stopping
[org.subethamail.smtp.server.ServerThread *:2566] INFO org.subethamail.smtp.server.ServerThread - SMTP server *:2566 stopped
[INFO] Tests run: 4, Failures: 0, Errors: 0, Skipped: 0, Time elapsed: 0.101 s - in org.subethamail.smtp.command.DataTest
[INFO] Running org.subethamail.smtp.command.AuthTest
[main] INFO org.subethamail.smtp.server.SMTPServer - SMTP server *:2566 starting
[org.subethamail.smtp.server.ServerThread *:2566] INFO org.subethamail.smtp.server.ServerThread - SMTP server *:2566 started
[main] INFO org.subethamail.smtp.server.SMTPServer - SMTP server *:2566 stopping
[org.subethamail.smtp.server.ServerThread *:2566] INFO org.subethamail.smtp.server.ServerThread - SMTP server *:2566 stopped
[main] INFO org.subethamail.smtp.server.SMTPServer - SMTP server *:2566 starting
[org.subethamail.smtp.server.ServerThread *:2566] INFO org.subethamail.smtp.server.ServerThread - SMTP server *:2566 started
[main] INFO org.subethamail.smtp.server.SMTPServer - SMTP server *:2566 stopping
[org.subethamail.smtp.server.ServerThread *:2566] INFO org.subethamail.smtp.server.ServerThread - SMTP server *:2566 stopped
[main] INFO org.subethamail.smtp.server.SMTPServer - SMTP server *:2566 starting
[org.subethamail.smtp.server.ServerThread *:2566] INFO org.subethamail.smtp.server.ServerThread - SMTP server *:2566 started
[main] INFO org.subethamail.smtp.server.SMTPServer - SMTP server *:2566 stopping
[org.subethamail.smtp.server.ServerThread *:2566] INFO org.subethamail.smtp.server.ServerThread - SMTP server *:2566 stopped
[INFO] Tests run: 3, Failures: 0, Errors: 0, Skipped: 0, Time elapsed: 0.078 s - in org.subethamail.smtp.command.AuthTest
[INFO] Running org.subethamail.smtp.command.CommandTest
[main] INFO org.subethamail.smtp.server.SMTPServer - SMTP server *:2566 starting
[ERROR] Tests run: 1, Failures: 0, Errors: 1, Skipped: 0, Time elapsed: 0.008 s <<< FAILURE! - in org.subethamail.smtp.command.CommandTest
[ERROR] testCommandHandling(org.subethamail.smtp.command.CommandTest) Time elapsed: 0.005 s <<< ERROR!
java.lang.RuntimeException: java.net.BindException: Address already in use (Bind failed)
Caused by: java.net.BindException: Address already in use (Bind failed)
[INFO] Running org.subethamail.smtp.command.HelloTest
[main] INFO org.subethamail.smtp.server.SMTPServer - SMTP server *:2566 starting
[main] INFO org.subethamail.smtp.server.SMTPServer - SMTP server *:2566 starting
[main] INFO org.subethamail.smtp.server.SMTPServer - SMTP server *:2566 starting
[org.subethamail.smtp.server.ServerThread *:2566] INFO org.subethamail.smtp.server.ServerThread - SMTP server *:2566 started
[main] INFO org.subethamail.smtp.server.SMTPServer - SMTP server *:2566 stopping
[org.subethamail.smtp.server.ServerThread *:2566] INFO org.subethamail.smtp.server.ServerThread - SMTP server *:2566 stopped
[ERROR] Tests run: 3, Failures: 0, Errors: 2, Skipped: 0, Time elapsed: 0.041 s <<< FAILURE! - in org.subethamail.smtp.command.HelloTest
[ERROR] testHelloCommand(org.subethamail.smtp.command.HelloTest) Time elapsed: 0.005 s <<< ERROR!
java.lang.RuntimeException: java.net.BindException: Address already in use (Bind failed)
Caused by: java.net.BindException: Address already in use (Bind failed)
[ERROR] testEhloSize(org.subethamail.smtp.command.HelloTest) Time elapsed: 0.004 s <<< ERROR!
java.lang.RuntimeException: java.net.BindException: Address already in use (Bind failed)
Caused by: java.net.BindException: Address already in use (Bind failed)
[INFO] Running org.subethamail.smtp.command.ReceiptTest
[main] INFO org.subethamail.smtp.server.SMTPServer - SMTP server *:2566 starting
[org.subethamail.smtp.server.ServerThread *:2566] INFO org.subethamail.smtp.server.ServerThread - SMTP server *:2566 started
[main] INFO org.subethamail.smtp.server.SMTPServer - SMTP server *:2566 stopping
[org.subethamail.smtp.server.ServerThread *:2566] INFO org.subethamail.smtp.server.ServerThread - SMTP server *:2566 stopped
[main] INFO org.subethamail.smtp.server.SMTPServer - SMTP server *:2566 starting
[org.subethamail.smtp.server.ServerThread *:2566] INFO org.subethamail.smtp.server.ServerThread - SMTP server *:2566 started
[main] INFO org.subethamail.smtp.server.SMTPServer - SMTP server *:2566 stopping
[org.subethamail.smtp.server.ServerThread *:2566] INFO org.subethamail.smtp.server.ServerThread - SMTP server *:2566 stopped
[main] INFO org.subethamail.smtp.server.SMTPServer - SMTP server *:2566 starting
[org.subethamail.smtp.server.ServerThread *:2566] INFO org.subethamail.smtp.server.ServerThread - SMTP server *:2566 started
[main] INFO org.subethamail.smtp.server.SMTPServer - SMTP server *:2566 stopping
[org.subethamail.smtp.server.ServerThread *:2566] INFO org.subethamail.smtp.server.ServerThread - SMTP server *:2566 stopped
[main] INFO org.subethamail.smtp.server.SMTPServer - SMTP server *:2566 starting
[org.subethamail.smtp.server.ServerThread *:2566] INFO org.subethamail.smtp.server.ServerThread - SMTP server *:2566 started
[main] INFO org.subethamail.smtp.server.SMTPServer - SMTP server *:2566 stopping
[org.subethamail.smtp.server.ServerThread *:2566] INFO org.subethamail.smtp.server.ServerThread - SMTP server *:2566 stopped
[INFO] Tests run: 4, Failures: 0, Errors: 0, Skipped: 0, Time elapsed: 0.1 s - in org.subethamail.smtp.command.ReceiptTest
[INFO] Running org.subethamail.smtp.command.StartTLSTest
[main] INFO org.subethamail.smtp.server.SMTPServer - SMTP server *:2566 starting
[org.subethamail.smtp.server.ServerThread *:2566] INFO org.subethamail.smtp.server.ServerThread - SMTP server *:2566 started
[main] INFO org.subethamail.smtp.server.SMTPServer - SMTP server *:2566 stopping
[org.subethamail.smtp.server.ServerThread *:2566] INFO org.subethamail.smtp.server.ServerThread - SMTP server *:2566 stopped
[INFO] Tests run: 1, Failures: 0, Errors: 0, Skipped: 0, Time elapsed: 0.038 s - in org.subethamail.smtp.command.StartTLSTest
[INFO] Running org.subethamail.smtp.StartStopTest
[main] INFO org.subethamail.smtp.server.SMTPServer - SMTP server *:2566 starting
[main] INFO org.subethamail.smtp.server.SMTPServer - SMTP server *:2566 stopping
[org.subethamail.smtp.server.ServerThread *:2566] INFO org.subethamail.smtp.server.ServerThread - SMTP server *:2566 started
[org.subethamail.smtp.server.ServerThread *:2566] INFO org.subethamail.smtp.server.ServerThread - SMTP server *:2566 stopped
[main] INFO org.subethamail.smtp.server.SMTPServer - SMTP server *:2566 starting
[main] INFO org.subethamail.smtp.server.SMTPServer - SMTP server *:2566 stopping
[org.subethamail.smtp.server.ServerThread *:2566] INFO org.subethamail.smtp.server.ServerThread - SMTP server *:2566 started
[org.subethamail.smtp.server.ServerThread *:2566] INFO org.subethamail.smtp.server.ServerThread - SMTP server *:2566 stopped
[main] INFO org.subethamail.smtp.server.SMTPServer - SMTP server *:2566 starting
[main] INFO org.subethamail.smtp.server.SMTPServer - SMTP server *:2566 stopping
[org.subethamail.smtp.server.ServerThread *:2566] INFO org.subethamail.smtp.server.ServerThread - SMTP server *:2566 started
[org.subethamail.smtp.server.ServerThread *:2566] INFO org.subethamail.smtp.server.ServerThread - SMTP server *:2566 stopped
[main] INFO org.subethamail.smtp.server.SMTPServer - SMTP server *:2566 starting
[main] INFO org.subethamail.smtp.server.SMTPServer - SMTP server *:2566 stopping
[org.subethamail.smtp.server.ServerThread *:2566] INFO org.subethamail.smtp.server.ServerThread - SMTP server *:2566 started
[org.subethamail.smtp.server.ServerThread *:2566] INFO org.subethamail.smtp.server.ServerThread - SMTP server *:2566 stopped
[main] INFO org.subethamail.smtp.server.SMTPServer - SMTP server *:2566 starting
[main] INFO org.subethamail.smtp.server.SMTPServer - SMTP server *:2566 stopping
[org.subethamail.smtp.server.ServerThread *:2566] INFO org.subethamail.smtp.server.ServerThread - SMTP server *:2566 started
[org.subethamail.smtp.server.ServerThread *:2566] INFO org.subethamail.smtp.server.ServerThread - SMTP server *:2566 stopped
[main] INFO org.subethamail.smtp.server.SMTPServer - SMTP server *:2566 starting
[main] INFO org.subethamail.smtp.server.SMTPServer - SMTP server *:2566 stopping
[org.subethamail.smtp.server.ServerThread *:2566] INFO org.subethamail.smtp.server.ServerThread - SMTP server *:2566 started
[org.subethamail.smtp.server.ServerThread *:2566] INFO org.subethamail.smtp.server.ServerThread - SMTP server *:2566 stopped
[main] INFO org.subethamail.smtp.server.SMTPServer - SMTP server *:2566 starting
[org.subethamail.smtp.server.ServerThread *:2566] INFO org.subethamail.smtp.server.ServerThread - SMTP server *:2566 started
[main] INFO org.subethamail.smtp.server.SMTPServer - SMTP server *:2566 stopping
[org.subethamail.smtp.server.ServerThread *:2566] INFO org.subethamail.smtp.server.ServerThread - SMTP server *:2566 stopped
[main] INFO org.subethamail.smtp.server.SMTPServer - SMTP server *:2566 starting
[org.subethamail.smtp.server.ServerThread *:2566] INFO org.subethamail.smtp.server.ServerThread - SMTP server *:2566 started
[main] INFO org.subethamail.smtp.server.SMTPServer - SMTP server *:2566 stopping
[org.subethamail.smtp.server.ServerThread *:2566] INFO org.subethamail.smtp.server.ServerThread - SMTP server *:2566 stopped
[main] INFO org.subethamail.smtp.server.SMTPServer - SMTP server *:2566 starting
[org.subethamail.smtp.server.ServerThread *:2566] INFO org.subethamail.smtp.server.ServerThread - SMTP server *:2566 started
[main] INFO org.subethamail.smtp.server.SMTPServer - SMTP server *:2566 stopping
[org.subethamail.smtp.server.ServerThread *:2566] INFO org.subethamail.smtp.server.ServerThread - SMTP server *:2566 stopped
[main] INFO org.subethamail.smtp.server.SMTPServer - SMTP server *:2566 starting
[org.subethamail.smtp.server.ServerThread *:2566] INFO org.subethamail.smtp.server.ServerThread - SMTP server *:2566 started
[main] INFO org.subethamail.smtp.server.SMTPServer - SMTP server *:2566 stopping
[org.subethamail.smtp.server.ServerThread *:2566] INFO org.subethamail.smtp.server.ServerThread - SMTP server *:2566 stopped
[INFO] Tests run: 1, Failures: 0, Errors: 0, Skipped: 0, Time elapsed: 3.828 s - in org.subethamail.smtp.StartStopTest
[INFO] Running org.subethamail.smtp.MessageContentTest
[main] INFO org.subethamail.smtp.server.SMTPServer - SMTP server *:2566 starting
[org.subethamail.smtp.server.ServerThread *:2566] INFO org.subethamail.smtp.server.ServerThread - SMTP server *:2566 started
[main] INFO org.subethamail.smtp.server.SMTPServer - SMTP server *:2566 stopping
[org.subethamail.smtp.server.ServerThread *:2566] INFO org.subethamail.smtp.server.ServerThread - SMTP server *:2566 stopped
[main] INFO org.subethamail.smtp.server.SMTPServer - SMTP server *:2566 starting
[org.subethamail.smtp.server.ServerThread *:2566] INFO org.subethamail.smtp.server.ServerThread - SMTP server *:2566 started
[main] INFO org.subethamail.smtp.server.SMTPServer - SMTP server *:2566 stopping
[org.subethamail.smtp.server.ServerThread *:2566] INFO org.subethamail.smtp.server.ServerThread - SMTP server *:2566 stopped
[main] INFO org.subethamail.smtp.server.SMTPServer - SMTP server *:2566 starting
[org.subethamail.smtp.server.ServerThread *:2566] INFO org.subethamail.smtp.server.ServerThread - SMTP server *:2566 started
[main] INFO org.subethamail.smtp.server.SMTPServer - SMTP server *:2566 stopping
[org.subethamail.smtp.server.ServerThread *:2566] INFO org.subethamail.smtp.server.ServerThread - SMTP server *:2566 stopped
[main] INFO org.subethamail.smtp.server.SMTPServer - SMTP server *:2566 starting
[org.subethamail.smtp.server.ServerThread *:2566] INFO org.subethamail.smtp.server.ServerThread - SMTP server *:2566 started
[main] INFO org.subethamail.smtp.server.SMTPServer - SMTP server *:2566 stopping
[org.subethamail.smtp.server.ServerThread *:2566] INFO org.subethamail.smtp.server.ServerThread - SMTP server *:2566 stopped
[main] INFO org.subethamail.smtp.server.SMTPServer - SMTP server *:2566 starting
[org.subethamail.smtp.server.ServerThread *:2566] INFO org.subethamail.smtp.server.ServerThread - SMTP server *:2566 started
[main] INFO org.subethamail.smtp.server.SMTPServer - SMTP server *:2566 stopping
[org.subethamail.smtp.server.ServerThread *:2566] INFO org.subethamail.smtp.server.ServerThread - SMTP server *:2566 stopped
[main] INFO org.subethamail.smtp.server.SMTPServer - SMTP server *:2566 starting
[org.subethamail.smtp.server.ServerThread *:2566] INFO org.subethamail.smtp.server.ServerThread - SMTP server *:2566 started
[main] INFO org.subethamail.smtp.server.SMTPServer - SMTP server *:2566 stopping
[org.subethamail.smtp.server.ServerThread *:2566] INFO org.subethamail.smtp.server.ServerThread - SMTP server *:2566 stopped
[main] INFO org.subethamail.smtp.server.SMTPServer - SMTP server *:2566 starting
[org.subethamail.smtp.server.ServerThread *:2566] INFO org.subethamail.smtp.server.ServerThread - SMTP server *:2566 started
[main] INFO org.subethamail.smtp.server.SMTPServer - SMTP server *:2566 stopping
[org.subethamail.smtp.server.ServerThread *:2566] INFO org.subethamail.smtp.server.ServerThread - SMTP server *:2566 stopped
[main] INFO org.subethamail.smtp.server.SMTPServer - SMTP server *:2566 starting
[org.subethamail.smtp.server.ServerThread *:2566] INFO org.subethamail.smtp.server.ServerThread - SMTP server *:2566 started
[main] INFO org.subethamail.smtp.server.SMTPServer - SMTP server *:2566 stopping
[org.subethamail.smtp.server.ServerThread *:2566] INFO org.subethamail.smtp.server.ServerThread - SMTP server *:2566 stopped
[INFO] Tests run: 8, Failures: 0, Errors: 0, Skipped: 0, Time elapsed: 0.485 s - in org.subethamail.smtp.MessageContentTest
[INFO] Running org.subethamail.smtp.ThreadDeathLoggingTest
[WARNING] Tests run: 1, Failures: 0, Errors: 0, Skipped: 1, Time elapsed: 0.003 s - in org.subethamail.smtp.ThreadDeathLoggingTest
[INFO] Running org.subethamail.smtp.DotTerminatedOutputStreamTest
[INFO] Tests run: 5, Failures: 0, Errors: 0, Skipped: 0, Time elapsed: 0.005 s - in org.subethamail.smtp.DotTerminatedOutputStreamTest
[INFO] Running org.subethamail.smtp.server.RequireTlsTest
[main] INFO org.subethamail.smtp.server.SMTPServer - SMTP server *:2566 starting
[org.subethamail.smtp.server.ServerThread *:2566] INFO org.subethamail.smtp.server.ServerThread - SMTP server *:2566 started
[main] INFO org.subethamail.smtp.server.SMTPServer - SMTP server *:2566 stopping
[org.subethamail.smtp.server.ServerThread *:2566] INFO org.subethamail.smtp.server.ServerThread - SMTP server *:2566 stopped
[INFO] Tests run: 1, Failures: 0, Errors: 0, Skipped: 0, Time elapsed: 0.023 s - in org.subethamail.smtp.server.RequireTlsTest
[INFO]
[INFO] Results:
[INFO]
[ERROR] Errors:
[ERROR] CommandTest>ServerTestCase.setUp:67 » Runtime java.net.BindException: Address ...
[ERROR] HelloTest>ServerTestCase.setUp:67 » Runtime java.net.BindException: Address al...
[ERROR] HelloTest>ServerTestCase.setUp:67 » Runtime java.net.BindException: Address al...
[INFO]
[ERROR] Tests run: 47, Failures: 0, Errors: 3, Skipped: 1
[INFO]
[INFO]
[INFO] ------------------------------------------------------------------------
[INFO] Skipping SubEtha SMTP
[INFO] This project has been banned from the build due to previous failures.
[INFO] ------------------------------------------------------------------------
[INFO] ------------------------------------------------------------------------
[INFO] BUILD FAILURE
[INFO] ------------------------------------------------------------------------
[INFO] Total time: 22.897 s
[INFO] Finished at: 2020-11-22T09:43:38Z
[INFO] ------------------------------------------------------------------------
[ERROR] Failed to execute goal org.apache.maven.plugins:maven-surefire-plugin:2.21.0:test (default-test) on project subethasmtp: There are test failures.
[ERROR]
[ERROR] Please refer to /usr/src/RPM/BUILD/subethasmtp-db8a995386c9808c893384023eee78e087ad9ad7/target/surefire-reports for the individual test results.
[ERROR] Please refer to dump files (if any exist) [date]-jvmRun[N].dump, [date].dumpstream and [date]-jvmRun[N].dumpstream.
[ERROR] -> [Help 1]
[ERROR]
[ERROR] To see the full stack trace of the errors, re-run Maven with the -e switch.
[ERROR] Re-run Maven using the -X switch to enable full debug logging.
[ERROR]
[ERROR] For more information about the errors and possible solutions, please read the following articles:
[ERROR] [Help 1] http://cwiki.apache.org/confluence/display/MAVEN/MojoFailureException
error: Bad exit status from /usr/src/tmp/rpm-tmp.94470 (%build)
RPM build errors:
Bad exit status from /usr/src/tmp/rpm-tmp.94470 (%build)
Command exited with non-zero status 1
28.06user 1.15system 0:34.13elapsed 85%CPU (0avgtext+0avgdata 227300maxresident)k
0inputs+0outputs (0major+77145minor)pagefaults 0swaps
hsh-rebuild: rebuild of `subethasmtp-3.1.7-alt1_12jpp8.src.rpm' failed.
Command exited with non-zero status 1
70.04user 10.00system 1:54.83elapsed 69%CPU (0avgtext+0avgdata 227300maxresident)k
0inputs+0outputs (0major+614244minor)pagefaults 0swaps