<86>Apr 26 13:30:23 userdel[2864065]: delete user 'rooter'
<86>Apr 26 13:30:23 userdel[2864065]: removed group 'rooter' owned by 'rooter'
<86>Apr 26 13:30:23 groupadd[2864083]: group added to /etc/group: name=rooter, GID=603
<86>Apr 26 13:30:23 groupadd[2864083]: group added to /etc/gshadow: name=rooter
<86>Apr 26 13:30:23 groupadd[2864083]: new group: name=rooter, GID=603
<86>Apr 26 13:30:23 useradd[2864097]: new user: name=rooter, UID=603, GID=603, home=/root, shell=/bin/bash
<86>Apr 26 13:30:24 userdel[2864120]: delete user 'builder'
<86>Apr 26 13:30:24 userdel[2864120]: removed group 'builder' owned by 'builder'
<86>Apr 26 13:30:24 userdel[2864120]: removed shadow group 'builder' owned by 'builder'
<86>Apr 26 13:30:24 groupadd[2864138]: group added to /etc/group: name=builder, GID=604
<86>Apr 26 13:30:24 groupadd[2864138]: group added to /etc/gshadow: name=builder
<86>Apr 26 13:30:24 groupadd[2864138]: new group: name=builder, GID=604
<86>Apr 26 13:30:24 useradd[2864152]: new user: name=builder, UID=604, GID=604, home=/usr/src, shell=/bin/bash
<13>Apr 26 13:30:26 rpmi: rpm-macros-kde-common-devel-14.12.1-alt1 1422279175 installed
<13>Apr 26 13:30:26 rpmi: strace-5.6-alt1 p9+249553.100.1.1 1586293051 installed
<13>Apr 26 13:30:26 rpmi: ed-1:0.2-alt10 1449768440 installed
<13>Apr 26 13:30:26 rpmi: rpm-utils-0.10.3-alt1 p9+238192.400.1.1 1569486860 installed
<13>Apr 26 13:30:26 rpmi: kde-common-devel-14.12.1-alt1 1422279175 installed
<13>Apr 26 13:30:34 rpmi: xorg-proto-devel-2018.4-alt3 1527685079 installed
<13>Apr 26 13:30:34 rpmi: libjpeg-2:2.0.2-alt1 sisyphus+226996.100.1.1 1554902907 installed
<13>Apr 26 13:30:34 rpmi: libgpg-error-1.36-alt1 sisyphus+225621.300.1.1 1553521082 installed
<13>Apr 26 13:30:34 rpmi: libexpat-2.2.4-alt1 1503305345 installed
<13>Apr 26 13:30:34 rpmi: libboost_system1.67.0-1:1.67.0-alt6 sisyphus+227124.100.3.3 1555633205 installed
<13>Apr 26 13:30:34 rpmi: libICE-1.0.9-alt1 1409902721 installed
<13>Apr 26 13:30:34 rpmi: libpng16-1.6.36-alt1 sisyphus+219478.100.1.1 1547633314 installed
<13>Apr 26 13:30:37 rpmi: libicu64-1:6.4.2-alt1 sisyphus+227580.100.1.2 1555784329 installed
<13>Apr 26 13:30:37 rpmi: libSM-1.2.3-alt1 sisyphus+226734.100.2.1 1554586158 installed
<13>Apr 26 13:30:37 rpmi: libglvnd-7:1.1.1-alt1 sisyphus+224993.100.4.1 1552634542 installed
<13>Apr 26 13:30:37 rpmi: xml-utils-1:2.9.10-alt2 p9+240157.100.1.1 1572735327 installed
<13>Apr 26 13:30:37 rpmi: libgcrypt20-1.8.5-alt3 p9+239665.100.7.1 1586364779 installed
<13>Apr 26 13:30:37 rpmi: libxslt-1.1.33-alt1 sisyphus+226936.100.1.1 1554820937 installed
<13>Apr 26 13:30:37 rpmi: libassuan-2.5.3-alt1 sisyphus+225621.400.1.1 1553521210 installed
<13>Apr 26 13:30:37 rpmi: libgpg-error-devel-1.36-alt1 sisyphus+225621.300.1.1 1553521082 installed
<13>Apr 26 13:30:37 rpmi: shared-mime-info-1.13.1-alt1 p9+238204.100.1.1 1569496447 installed
<13>Apr 26 13:30:37 rpmi: libogg-1.3.4-alt1 p9+249556.100.1.1 1586300646 installed
<13>Apr 26 13:30:38 rpmi: kde-common-15.12.1-alt1 1453450783 installed
<13>Apr 26 13:30:38 rpmi: kde4pimlibs-common-4.14.11-alt9.S1 1524201573 installed
<13>Apr 26 13:30:38 rpmi: libsqlite3-3.29.0-alt1 p9+237498.100.1.1 1568303696 installed
<13>Apr 26 13:30:38 rpmi: libidn2-2.2.0-alt1 p9+229971.100.2.1 1558696281 installed
<13>Apr 26 13:30:38 rpmi: libnettle6-3.4.1-alt1 sisyphus+226533.100.2.1 1554512222 installed
<13>Apr 26 13:30:39 rpmi: libopenblas-0.2.20-alt2 p9+229427.100.2.1 1558020066 installed
<13>Apr 26 13:30:39 rpmi: libcom_err-1.44.6-alt1 sisyphus+224154.100.1.1 1552091678 installed
<13>Apr 26 13:30:39 rpmi: libical-3.0.6-alt1 p9+238203.100.1.1 1569495575 installed
<13>Apr 26 13:30:39 rpmi: libICE-devel-1.0.9-alt1 1409902721 installed
<13>Apr 26 13:30:39 rpmi: libSM-devel-1.2.3-alt1 sisyphus+226734.100.2.1 1554586158 installed
<86>Apr 26 13:30:39 groupadd[2888413]: group added to /etc/group: name=utempter, GID=499
<86>Apr 26 13:30:39 groupadd[2888413]: group added to /etc/gshadow: name=utempter
<86>Apr 26 13:30:39 groupadd[2888413]: new group: name=utempter, GID=499
<13>Apr 26 13:30:39 rpmi: libutempter-1.1.6-alt2 1299636220 installed
<13>Apr 26 13:30:39 rpmi: libgif-4.1.6-alt3 1299634261 installed
<13>Apr 26 13:30:39 rpmi: libwebp7-1.0.3-alt1 p9+234901.200.1.1 1563552457 installed
<13>Apr 26 13:30:39 rpmi: libXdmcp-1.1.3-alt1 sisyphus+225206.600.1.2 1552949353 installed
<13>Apr 26 13:30:39 rpmi: libXau-1.0.9-alt1 sisyphus+223149.200.2.1 1551268152 installed
<13>Apr 26 13:30:39 rpmi: libxcb-1.13.1-alt1 sisyphus+226527.100.2.2 1554593801 installed
<13>Apr 26 13:30:39 rpmi: libwayland-server-1.17.0-alt1 sisyphus+225894.100.1.1 1553872805 installed
<13>Apr 26 13:30:39 rpmi: zlib-devel-1.2.11-alt1 sisyphus+221902.6000.4.1 1550601058 installed
<13>Apr 26 13:30:39 rpmi: ilmbase12-common-2.2.0-alt2 p9+237895.200.1.1 1568985164 installed
<13>Apr 26 13:30:39 rpmi: libiex12-2.2.0-alt2 p9+237895.200.1.1 1568985164 installed
<13>Apr 26 13:30:39 rpmi: libhalf12-2.2.0-alt2 p9+237895.200.1.1 1568985164 installed
<13>Apr 26 13:30:39 rpmi: su-0.60-alt35 1484567251 installed
<13>Apr 26 13:30:39 rpmi: libgraphite2-1.3.13-alt2 sisyphus+226799.100.1.1 1554648241 installed
<13>Apr 26 13:30:39 rpmi: libharfbuzz-2.6.2-alt1 p9+238790.200.1.1 1570435826 installed
<13>Apr 26 13:30:39 rpmi: libfreetype-2.10.1-alt1 p9+247340.100.1.1 1583394177 installed
<13>Apr 26 13:30:39 rpmi: fontconfig-2.13.1-alt1 p9+247340.200.3.1 1583400517 installed
Updating fonts cache: <29>Apr 26 13:30:40 fontconfig: Updating fonts cache: succeeded
[ DONE ]
<13>Apr 26 13:30:40 rpmi: libgdbm-1.8.3-alt10 1454943334 installed
<13>Apr 26 13:30:41 rpmi: libp11-kit-0.23.15-alt1 sisyphus+226408.100.2.1 1554288204 installed
<13>Apr 26 13:30:41 rpmi: libtasn1-4.14-alt1 p9+235792.100.2.1 1565425233 installed
<13>Apr 26 13:30:41 rpmi: qt4-common-4.8.7-alt20 p9+240783.100.2.1 1574328612 installed
<13>Apr 26 13:30:41 rpmi: libqt4-core-4.8.7-alt20 p9+240783.100.2.1 1574328612 installed
<13>Apr 26 13:30:41 rpmi: libqt4-xml-4.8.7-alt20 p9+240783.100.2.1 1574328612 installed
<13>Apr 26 13:30:41 rpmi: libqt4-sql-4.8.7-alt20 p9+240783.100.2.1 1574328612 installed
<13>Apr 26 13:30:41 rpmi: libqjson-0.8.1-alt2 1446565447 installed
<13>Apr 26 13:30:41 rpmi: icon-theme-hicolor-0.17-alt2 p9+248347.100.1.1 1584981172 installed
<13>Apr 26 13:30:42 rpmi: menu-icons-default-0.2.0.20-alt1 1479213521 installed
<13>Apr 26 13:30:43 rpmi: altlinux-freedesktop-menu-icon-theme-default-0.0.26-alt1 1366231495 installed
<13>Apr 26 13:30:43 rpmi: libqt4-sql-sqlite-4.8.7-alt20 p9+240783.100.2.1 1574328612 installed
<13>Apr 26 13:30:43 rpmi: automoc-0.9.88-alt1.qa1 1366273811 installed
<13>Apr 26 13:30:43 rpmi: libqt4-test-4.8.7-alt20 p9+240783.100.2.1 1574328612 installed
<13>Apr 26 13:30:43 rpmi: libqt4-clucene-4.8.7-alt20 p9+240783.100.2.1 1574328612 installed
<13>Apr 26 13:30:43 rpmi: rpm-macros-qt4-4.8.7-alt20 p9+240783.100.2.1 1574328371 installed
<13>Apr 26 13:30:43 rpmi: libharfbuzz-icu-2.6.2-alt1 p9+238790.200.1.1 1570435826 installed
<13>Apr 26 13:30:43 rpmi: libgraphite2-devel-1.3.13-alt2 sisyphus+226799.100.1.1 1554648241 installed
<13>Apr 26 13:30:43 rpmi: libilmthread12-2.2.0-alt2 p9+237895.200.1.1 1568985164 installed
<13>Apr 26 13:30:43 rpmi: libpng-devel-1.6.36-alt1 sisyphus+219478.100.1.1 1547633314 installed
<13>Apr 26 13:30:46 rpmi: libxcb-devel-1.13.1-alt1 sisyphus+226527.100.2.2 1554593801 installed
<13>Apr 26 13:30:46 rpmi: libXau-devel-1.0.9-alt1 sisyphus+223149.200.2.1 1551268152 installed
<13>Apr 26 13:30:46 rpmi: libXdmcp-devel-1.1.3-alt1 sisyphus+225206.600.1.2 1552949353 installed
<13>Apr 26 13:30:46 rpmi: libgif-devel-4.1.6-alt3 1299634261 installed
<13>Apr 26 13:30:46 rpmi: libutempter-devel-1.1.6-alt2 1299636220 installed
<13>Apr 26 13:30:46 rpmi: libe2fs-1.44.6-alt1 sisyphus+224154.100.1.1 1552091678 installed
<13>Apr 26 13:30:46 rpmi: libarchive13-3.4.0-alt1 p9+240559.100.1.1 1573466474 installed
<13>Apr 26 13:30:46 rpmi: libhogweed4-3.4.1-alt1 sisyphus+226533.100.2.1 1554512222 installed
<13>Apr 26 13:30:46 rpmi: libgnutls30-3.6.13-alt1 p9+249005.100.1.1 1585668021 installed
<13>Apr 26 13:30:46 rpmi: libakonadi4-kabc-4.14.11-alt9.S1 1524201573 installed
<13>Apr 26 13:30:46 rpmi: libflac8-1.3.3-alt1 p9+249557.100.1.1 1586302007 installed
<13>Apr 26 13:30:46 rpmi: libvorbis-1.3.6-alt2 sisyphus+220072.200.2.2 1548744475 installed
<13>Apr 26 13:30:46 rpmi: libassuan-devel-2.5.3-alt1 sisyphus+225621.400.1.1 1553521210 installed
<13>Apr 26 13:30:46 rpmi: rpm-build-gir-0.7.3-alt2 p9+234356.40.2.1 1562933848 installed
<13>Apr 26 13:30:46 rpmi: libOpenGL-7:1.1.1-alt1 sisyphus+224993.100.4.1 1552634542 installed
<13>Apr 26 13:30:46 rpmi: libGLES-7:1.1.1-alt1 sisyphus+224993.100.4.1 1552634542 installed
<13>Apr 26 13:30:46 rpmi: libboost_regex1.67.0-1:1.67.0-alt6 sisyphus+227124.100.3.3 1555633205 installed
<13>Apr 26 13:30:46 rpmi: libboost_graph1.67.0-1:1.67.0-alt6 sisyphus+227124.100.3.3 1555633205 installed
<13>Apr 26 13:30:46 rpmi: icu-utils-1:6.4.2-alt1 sisyphus+227580.100.1.2 1555784329 installed
<13>Apr 26 13:30:46 rpmi: libicu-devel-1:6.4.2-alt1 sisyphus+227580.100.1.2 1555784329 installed
<13>Apr 26 13:30:46 rpmi: libboost_atomic1.67.0-1:1.67.0-alt6 sisyphus+227124.100.3.3 1555633205 installed
<13>Apr 26 13:30:46 rpmi: libboost_contract1.67.0-1:1.67.0-alt6 sisyphus+227124.100.3.3 1555633205 installed
<13>Apr 26 13:30:46 rpmi: libboost_random1.67.0-1:1.67.0-alt6 sisyphus+227124.100.3.3 1555633205 installed
<13>Apr 26 13:30:46 rpmi: libboost_chrono1.67.0-1:1.67.0-alt6 sisyphus+227124.100.3.3 1555633205 installed
<13>Apr 26 13:30:46 rpmi: libboost_timer1.67.0-1:1.67.0-alt6 sisyphus+227124.100.3.3 1555633205 installed
<13>Apr 26 13:30:46 rpmi: libboost_filesystem1.67.0-1:1.67.0-alt6 sisyphus+227124.100.3.3 1555633205 installed
<13>Apr 26 13:30:46 rpmi: libboost_thread1.67.0-1:1.67.0-alt6 sisyphus+227124.100.3.3 1555633205 installed
<13>Apr 26 13:30:46 rpmi: libboost_type_erasure1.67.0-1:1.67.0-alt6 sisyphus+227124.100.3.3 1555633205 installed
<13>Apr 26 13:30:46 rpmi: libksba-1.3.6-alt13 p9+239665.200.7.1 1586364839 installed
<13>Apr 26 13:30:46 rpmi: libjasper-2.0.14-alt1 1530105217 installed
<13>Apr 26 13:30:46 rpmi: xorg-xf86miscproto-devel-0.9.3-alt1 1303464883 installed
<13>Apr 26 13:30:46 rpmi: qt5-base-common-5.12.8-alt1 p9+249835.100.3.1 1587401725 installed
<13>Apr 26 13:30:46 rpmi: libpcre2-10.33-alt1.1 sisyphus+227856.100.1.2 1555786378 installed
<13>Apr 26 13:30:46 rpmi: libqt5-core-5.12.8-alt1 p9+249835.100.3.1 1587401725 installed
<13>Apr 26 13:30:46 rpmi: libqrencode4-4.0.2-alt1 sisyphus.213106.400 1537186499 installed
<13>Apr 26 13:30:46 rpmi: libdmtx-0.7.2-alt8 sisyphus+225269.5200.12.1 1553611822 installed
<13>Apr 26 13:30:46 rpmi: libhunspell-1.7.0-alt1 sisyphus+226731.100.2.1 1554585904 installed
<13>Apr 26 13:30:46 rpmi: libenchant-1.6.0-alt3.qa1 1460409853 installed
<13>Apr 26 13:30:46 rpmi: openexr22-common-2.2.0-alt5 p9+238340.100.1.1 1569838858 installed
<13>Apr 26 13:30:47 rpmi: libilmimf22-2.2.0-alt5 p9+238340.100.1.1 1569838858 installed
<13>Apr 26 13:30:47 rpmi: url_handler-0.3.1-alt1 1290564262 installed
<13>Apr 26 13:30:47 rpmi: desktop-file-utils-0.23-alt2 sisyphus+226879.100.1.1 1554744356 installed
<13>Apr 26 13:30:47 rpmi: sgml-common-0.6.3-alt15 1423664786 installed
<13>Apr 26 13:30:47 rpmi: docbook-dtds-4.5-alt1 1223476557 installed
<13>Apr 26 13:30:47 rpmi: docbook-style-xsl-1.79.1-alt2 sisyphus.213665.100 1537949315 installed
<13>Apr 26 13:30:47 rpmi: shared-desktop-ontologies-1:0.11.0-alt1 1378390330 installed
<13>Apr 26 13:30:47 rpmi: shared-desktop-ontologies-devel-1:0.11.0-alt1 1378390330 installed
<13>Apr 26 13:30:47 rpmi: libpcre16-8.44-alt1 p9+249555.100.1.1 1586300290 installed
<13>Apr 26 13:30:47 rpmi: pcretest-8.44-alt1 p9+249555.100.1.1 1586300290 installed
<13>Apr 26 13:30:47 rpmi: libpcre-devel-8.44-alt1 p9+249555.100.1.1 1586300290 installed
<13>Apr 26 13:30:47 rpmi: libalsa-1:1.1.9-alt2 sisyphus+229323.100.1.1 1557826759 installed
<13>Apr 26 13:30:47 rpmi: libltdl7-2.4.6-alt1 sisyphus+226971.100.2.1 1554906368 installed
<13>Apr 26 13:30:47 rpmi: libunixODBC2-2.3.7-alt1 sisyphus+228027.100.1.1 1556027338 installed
<13>Apr 26 13:30:47 rpmi: libunixODBC-devel-compat-2.3.7-alt1 sisyphus+228027.100.1.1 1556027338 installed
<13>Apr 26 13:30:47 rpmi: libunixODBC-devel-2.3.7-alt1 sisyphus+228027.100.1.1 1556027338 installed
<13>Apr 26 13:30:47 rpmi: libgsm-1.0.17-alt1 1523356165 installed
<13>Apr 26 13:30:47 rpmi: libsndfile-1.0.28-alt2 sisyphus.212728.100 1536333068 installed
<13>Apr 26 13:30:47 rpmi: libasyncns-0.8-alt2.qa1 1365949820 installed
<13>Apr 26 13:30:47 rpmi: libjbig-2.1-alt1 1401380926 installed
<13>Apr 26 13:30:47 rpmi: libtiff5-4.0.10.0.57.f9fc01c3-alt1 sisyphus+226958.100.1.1 1554850940 installed
<13>Apr 26 13:30:47 rpmi: liblcms2-2.9-alt1 1516411892 installed
<13>Apr 26 13:30:47 rpmi: libmng-2.0.3-alt2 sisyphus+222619.100.1.1 1550943853 installed
<13>Apr 26 13:30:47 rpmi: liblz4-1:1.9.2-alt1 p9+238696.500.1.1 1570228299 installed
<13>Apr 26 13:30:47 rpmi: libsystemd-1:243.8-alt2 p9+249709.100.3.1 1586972032 installed
<13>Apr 26 13:30:47 rpmi: libdbus-1.12.16-alt2 p9+240607.100.1.1 1573553687 installed
<13>Apr 26 13:30:47 rpmi: libqt4-dbus-4.8.7-alt20 p9+240783.100.2.1 1574328612 installed
<13>Apr 26 13:30:47 rpmi: libqt4-script-4.8.7-alt20 p9+240783.100.2.1 1574328612 installed
<13>Apr 26 13:30:47 rpmi: libstrigi-0.7.8-alt8 p9+236761.2300.3.1 1567133808 installed
<13>Apr 26 13:30:47 rpmi: libstrigi-devel-0.7.8-alt8 p9+236761.2300.3.1 1567133808 installed
<13>Apr 26 13:30:48 rpmi: libdbus-devel-1.12.16-alt2 p9+240607.100.1.1 1573553687 installed
<13>Apr 26 13:30:48 rpmi: libpulseaudio-12.2-alt3 p9+233336.100.1.1 1561644521 installed
<13>Apr 26 13:30:48 rpmi: libxshmfence-1.3-alt1 sisyphus+223149.1000.2.1 1551268571 installed
<13>Apr 26 13:30:48 rpmi: libX11-locales-3:1.6.7-alt1 sisyphus+226735.100.2.2 1554615009 installed
<13>Apr 26 13:30:48 rpmi: libX11-3:1.6.7-alt1 sisyphus+226735.100.2.2 1554615005 installed
<13>Apr 26 13:30:48 rpmi: libXext-1.3.4-alt1 sisyphus+225206.700.1.2 1552949429 installed
<13>Apr 26 13:30:48 rpmi: libX11-devel-3:1.6.7-alt1 sisyphus+226735.100.2.2 1554615005 installed
<13>Apr 26 13:30:48 rpmi: libXrender-0.9.8-alt1 1371312112 installed
<13>Apr 26 13:30:48 rpmi: libXfixes-5.0.3-alt1 sisyphus+226736.100.2.2 1554614841 installed
<13>Apr 26 13:30:48 rpmi: libXfixes-devel-5.0.3-alt1 sisyphus+226736.100.2.2 1554614841 installed
<13>Apr 26 13:30:48 rpmi: libXrender-devel-0.9.8-alt1 1371312112 installed
<13>Apr 26 13:30:48 rpmi: libXext-devel-1.3.4-alt1 sisyphus+225206.700.1.2 1552949429 installed
<13>Apr 26 13:30:48 rpmi: libXcursor-1.2.0-alt1 sisyphus+225206.400.1.2 1552949218 installed
<13>Apr 26 13:30:48 rpmi: libXt-1.1.4-alt1 1369984722 installed
<13>Apr 26 13:30:48 rpmi: libXrandr-1.5.2-alt1 sisyphus+225206.1300.1.2 1552949710 installed
<13>Apr 26 13:30:48 rpmi: libXxf86vm-1.1.4-alt2 1527672187 installed
<13>Apr 26 13:30:48 rpmi: libXi-1.7.9-alt2 sisyphus+226377.100.1.2 1554260260 installed
<13>Apr 26 13:30:48 rpmi: libXi-devel-1.7.9-alt2 sisyphus+226377.100.1.2 1554260260 installed
<13>Apr 26 13:30:48 rpmi: libXinerama-1.1.4-alt1 sisyphus+223149.300.2.1 1551268216 installed
<13>Apr 26 13:30:48 rpmi: libqt4-gui-4.8.7-alt20 p9+240783.100.2.1 1574328612 installed
<13>Apr 26 13:30:48 rpmi: libphonon-4.8.3-alt1 1418134069 installed
<13>Apr 26 13:30:49 rpmi: libqt4-designer-4.8.7-alt20 p9+240783.100.2.1 1574328612 installed
<13>Apr 26 13:30:49 rpmi: libqt4-uitools-4.8.7-alt20 p9+240783.100.2.1 1574328612 installed
<13>Apr 26 13:30:49 rpmi: libqt4-svg-4.8.7-alt20 p9+240783.100.2.1 1574328612 installed
<13>Apr 26 13:30:49 rpmi: libXtst-1.2.2-alt1 1369984893 installed
<13>Apr 26 13:30:49 rpmi: libXtst-devel-1.2.2-alt1 1369984893 installed
<13>Apr 26 13:30:49 rpmi: libXScrnSaver-1.2.3-alt1 sisyphus+223149.500.2.1 1551268358 installed
<13>Apr 26 13:30:49 rpmi: libXdamage-1.1.5-alt1 sisyphus+225206.500.1.2 1552949286 installed
<13>Apr 26 13:30:49 rpmi: libXdamage-devel-1.1.5-alt1 sisyphus+225206.500.1.2 1552949286 installed
<13>Apr 26 13:30:49 rpmi: libXScrnSaver-devel-1.2.3-alt1 sisyphus+223149.500.2.1 1551268358 installed
<13>Apr 26 13:30:49 rpmi: libphononexperimental-4.8.3-alt1 1418134069 installed
<13>Apr 26 13:30:49 rpmi: libqt4-scripttools-4.8.7-alt20 p9+240783.100.2.1 1574328612 installed
<13>Apr 26 13:30:49 rpmi: libqt4-multimedia-4.8.7-alt20 p9+240783.100.2.1 1574328612 installed
<13>Apr 26 13:30:49 rpmi: libdbusmenu-qt2-0.9.3-alt0.2 1463760662 installed
<13>Apr 26 13:30:49 rpmi: libprison0-1.1.1-alt1 sisyphus+223025.400.3.1 1551263266 installed
<13>Apr 26 13:30:49 rpmi: libXinerama-devel-1.1.4-alt1 sisyphus+223149.300.2.1 1551268216 installed
<13>Apr 26 13:30:49 rpmi: libXxf86vm-devel-1.1.4-alt2 1527672187 installed
<13>Apr 26 13:30:49 rpmi: libXrandr-devel-1.5.2-alt1 sisyphus+225206.1300.1.2 1552949710 installed
<13>Apr 26 13:30:49 rpmi: libXpm-3.5.12-alt1 sisyphus+223149.400.2.1 1551268289 installed
<13>Apr 26 13:30:49 rpmi: libXpm-devel-3.5.12-alt1 sisyphus+223149.400.2.1 1551268289 installed
<13>Apr 26 13:30:49 rpmi: libXt-devel-1.1.4-alt1 1369984722 installed
<13>Apr 26 13:30:49 rpmi: libXmu-1.1.3-alt1 sisyphus+225206.1200.1.2 1552949641 installed
<13>Apr 26 13:30:49 rpmi: xset-1.2.4-alt1 sisyphus.213358.100 1537438594 installed
<13>Apr 26 13:30:49 rpmi: libXcursor-devel-1.2.0-alt1 sisyphus+225206.400.1.2 1552949218 installed
<13>Apr 26 13:30:49 rpmi: libXft-2.3.3-alt1 sisyphus+225206.1000.3.2 1552987708 installed
<13>Apr 26 13:30:49 rpmi: libXv-1.0.11-alt1 1527685499 installed
<13>Apr 26 13:30:49 rpmi: libXv-devel-1.0.11-alt1 1527685499 installed
<13>Apr 26 13:30:49 rpmi: libXxf86misc-1.0.4-alt1 sisyphus+223149.600.2.1 1551268423 installed
<13>Apr 26 13:30:49 rpmi: libXcomposite-0.4.5-alt1 sisyphus+225206.300.1.2 1552949137 installed
<13>Apr 26 13:30:49 rpmi: libXcomposite-devel-0.4.5-alt1 sisyphus+225206.300.1.2 1552949137 installed
<13>Apr 26 13:30:49 rpmi: libxkbfile-1.1.0-alt1 sisyphus+225206.1100.1.2 1552949569 installed
<13>Apr 26 13:30:49 rpmi: libxkbfile-devel-1.1.0-alt1 sisyphus+225206.1100.1.2 1552949569 installed
<13>Apr 26 13:30:49 rpmi: xprop-1.2.4-alt1 sisyphus+225764.100.1.1 1553680703 installed
<13>Apr 26 13:30:49 rpmi: xdg-utils-1.1.3-alt5 sisyphus.216143.100 1541504685 installed
<13>Apr 26 13:30:49 rpmi: libwayland-client-1.17.0-alt1 sisyphus+225894.100.1.1 1553872805 installed
<13>Apr 26 13:30:49 rpmi: libpciaccess-1:0.14-alt1 1528969252 installed
<13>Apr 26 13:30:49 rpmi: libdrm-1:2.4.99-alt1 p9+236610.100.1.1 1566818128 installed
<13>Apr 26 13:30:49 rpmi: libGLX-mesa-4:19.1.8-alt1.p9 p9+248560.100.2.1 1585561025 installed
<13>Apr 26 13:30:49 rpmi: libGLX-7:1.1.1-alt1 sisyphus+224993.100.4.1 1552634542 installed
<13>Apr 26 13:30:49 rpmi: libGL-7:1.1.1-alt1 sisyphus+224993.100.4.1 1552634542 installed
<13>Apr 26 13:30:49 rpmi: libqt4-opengl-4.8.7-alt20 p9+240783.100.2.1 1574328612 installed
<13>Apr 26 13:30:49 rpmi: libGLU-4:9.0.0-alt1 1347643784 installed
<13>Apr 26 13:30:49 rpmi: libgbm-4:19.1.8-alt1.p9 p9+248560.100.2.1 1585561025 installed
<13>Apr 26 13:30:49 rpmi: libEGL-mesa-4:19.1.8-alt1.p9 p9+248560.100.2.1 1585561025 installed
<13>Apr 26 13:30:49 rpmi: libEGL-7:1.1.1-alt1 sisyphus+224993.100.4.1 1552634542 installed
<13>Apr 26 13:30:49 rpmi: libglvnd-devel-7:1.1.1-alt1 sisyphus+224993.100.4.1 1552634542 installed
<13>Apr 26 13:30:49 rpmi: libEGL-devel-4:19.1.8-alt1.p9 p9+248560.100.2.1 1585561025 installed
<13>Apr 26 13:30:49 rpmi: libGL-devel-4:19.1.8-alt1.p9 p9+248560.100.2.1 1585561025 installed
<13>Apr 26 13:30:49 rpmi: libGLU-devel-4:9.0.0-alt1 1347643784 installed
<13>Apr 26 13:30:49 rpmi: gsettings-desktop-schemas-data-3.32.0-alt1 sisyphus+225059.300.3.2 1552843929 installed
<13>Apr 26 13:30:49 rpmi: libgio-2.60.7-alt1 p9+237353.100.2.2 1568373081 installed
<13>Apr 26 13:30:49 rpmi: gsettings-desktop-schemas-3.32.0-alt1 sisyphus+225059.300.3.2 1552843980 installed
<13>Apr 26 13:30:49 rpmi: libpolkit-0.116-alt1 sisyphus+228976.400.4.1 1557128967 installed
<13>Apr 26 13:30:49 rpmi: libpolkit-qt-core-1-0.112.0-alt1 1407931994 installed
<13>Apr 26 13:30:49 rpmi: gpgme-common-1.13.1-alt1 p9+246074.100.3.1 1586363832 installed
<13>Apr 26 13:30:49 rpmi: libusb-1.0.22-alt1 1525452055 installed
<13>Apr 26 13:30:49 rpmi: libnpth-1.6-alt1_1 sisyphus+226100.100.1.1 1554119252 installed
<13>Apr 26 13:30:49 rpmi: gcc-c++-common-1.4.23-alt1 sisyphus+221902.2500.4.1 1550596716 installed
<13>Apr 26 13:30:50 rpmi: libstdc++8-devel-8.4.1-alt0.p9.1 p9+247559.100.2.1 1585587912 installed
<13>Apr 26 13:30:51 rpmi: gcc8-c++-8.4.1-alt0.p9.1 p9+247559.100.2.1 1585587912 installed
<13>Apr 26 13:30:51 rpmi: rpm-macros-cmake-3.16.3-alt1 p9+245760.100.3.1 1582902678 installed
<13>Apr 26 13:30:51 rpmi: rmt-0.4b44-alt1.1 sisyphus+226687.100.1.1 1554516078 installed
<13>Apr 26 13:30:51 rpmi: dump-0.4b44-alt1.1 sisyphus+226687.100.1.1 1554516078 installed
<13>Apr 26 13:30:51 rpmi: cmake-modules-3.16.3-alt1 p9+245760.100.3.1 1582902649 installed
<13>Apr 26 13:30:51 rpmi: libuv-1.35.0-alt1 p9+249995.340.2.1 1587141242 installed
<13>Apr 26 13:30:51 rpmi: librhash-1.3.5-alt2 1505156279 installed
<13>Apr 26 13:30:51 rpmi: libjsoncpp19-1.8.4-alt2.S1 1518769525 installed
<13>Apr 26 13:30:51 rpmi: publicsuffix-list-dafsa-20200401-alt1 p9+249162.100.3.1 1586187723 installed
<13>Apr 26 13:30:51 rpmi: libpsl-0.21.0-alt1 sisyphus+227314.100.1.2 1555618423 installed
<13>Apr 26 13:30:51 rpmi: libnghttp2-1.34.0-alt1 sisyphus+222625.100.1.1 1550947259 installed
<13>Apr 26 13:30:51 rpmi: libbrotlicommon-1.0.7-alt1 sisyphus+226738.100.2.1 1554554568 installed
<13>Apr 26 13:30:51 rpmi: libbrotlidec-1.0.7-alt1 sisyphus+226738.100.2.1 1554554568 installed
<13>Apr 26 13:30:51 rpmi: bzlib-devel-1:1.0.6-alt6 sisyphus+224341.100.1.1 1552254552 installed
<13>Apr 26 13:30:51 rpmi: libboost_context1.67.0-1:1.67.0-alt6 sisyphus+227124.100.3.3 1555633205 installed
<13>Apr 26 13:30:51 rpmi: libboost_fiber1.67.0-1:1.67.0-alt6 sisyphus+227124.100.3.3 1555633205 installed
<13>Apr 26 13:30:51 rpmi: libboost_stacktrace1.67.0-1:1.67.0-alt6 sisyphus+227124.100.3.3 1555633205 installed
<13>Apr 26 13:30:51 rpmi: libnumpy-py3-1:1.15.4-alt1 sisyphus+225625.25600.91.1 1555302306 installed
<13>Apr 26 13:30:51 rpmi: libboost_python1.67.0-1:1.67.0-alt6 sisyphus+227124.100.3.3 1555633205 installed
<13>Apr 26 13:30:51 rpmi: libnumpy-1:1.15.4-alt1 sisyphus+225625.25600.91.1 1555302306 installed
<13>Apr 26 13:30:51 rpmi: python-module-iniconfig-1.0.0-alt1 sisyphus+227494.1100.1.3 1555839106 installed
<13>Apr 26 13:30:51 rpmi: python-module-apipkg-1.5-alt1 1531926894 installed
<13>Apr 26 13:30:51 rpmi: libxblas-1.0.248-alt1.3 sisyphus+229150.100.1.1 1557388786 installed
<13>Apr 26 13:30:51 rpmi: libquadmath0-8.4.1-alt0.p9.1 p9+247559.100.2.1 1585587912 installed
<13>Apr 26 13:30:52 rpmi: libgfortran5-8.4.1-alt0.p9.1 p9+247559.100.2.1 1585587912 installed
<13>Apr 26 13:30:52 rpmi: liblapack-1:3.8.0-alt3 sisyphus+221521.100.1.1 1550134903 installed
<13>Apr 26 13:30:52 rpmi: python-modules-curses-2.7.16-alt1.M90P.1 p9+244933.100.1.1 1579867218 installed
<13>Apr 26 13:30:52 rpmi: libverto-0.3.0-alt1_7 sisyphus+225932.100.1.1 1553994919 installed
<13>Apr 26 13:30:52 rpmi: libkeyutils-1.6-alt2 sisyphus+226520.100.2.1 1554512089 installed
<13>Apr 26 13:30:52 rpmi: libboost_test1.67.0-1:1.67.0-alt6 sisyphus+227124.100.3.3 1555633205 installed
<13>Apr 26 13:30:52 rpmi: libboost_serialization1.67.0-1:1.67.0-alt6 sisyphus+227124.100.3.3 1555633205 installed
<13>Apr 26 13:30:52 rpmi: libboost_iostreams1.67.0-1:1.67.0-alt6 sisyphus+227124.100.3.3 1555633205 installed
<13>Apr 26 13:30:52 rpmi: libboost_date_time1.67.0-1:1.67.0-alt6 sisyphus+227124.100.3.3 1555633205 installed
<13>Apr 26 13:30:52 rpmi: libboost_container1.67.0-1:1.67.0-alt6 sisyphus+227124.100.3.3 1555633205 installed
<13>Apr 26 13:30:52 rpmi: bash-builtin-lockf-0.3.1-alt1.qa1 1366318152 installed
<13>Apr 26 13:30:52 rpmi: altlinux-mime-defaults-0.435-alt1 p9+233226.100.2.1 1561697917 installed
<13>Apr 26 13:30:52 rpmi: wm-common-freedesktop-1.3-alt1 1303402115 installed
<13>Apr 26 13:30:52 rpmi: altlinux-freedesktop-menu-common-0.67-alt1 p9+233140.100.2.1 1561935835 installed
<13>Apr 26 13:30:52 rpmi: rpm-macros-alternatives-0.5.1-alt1 sisyphus+226946.100.1.1 1554830426 installed
<13>Apr 26 13:30:52 rpmi: alternatives-0.5.1-alt1 sisyphus+226946.100.1.1 1554830426 installed
<13>Apr 26 13:30:52 rpmi: ca-certificates-2020.01.23-alt1 p9+245253.100.3.1 1580749631 installed
<13>Apr 26 13:30:52 rpmi: ca-trust-0.1.2-alt1 p9+233349.100.1.1 1561655062 installed
<13>Apr 26 13:30:52 rpmi: p11-kit-trust-0.23.15-alt1 sisyphus+226408.100.2.1 1554288204 installed
<13>Apr 26 13:30:53 rpmi: libcrypto1.1-1.1.1d-alt1.1 p9+237853.200.3.1 1569251834 installed
<13>Apr 26 13:30:53 rpmi: libssl1.1-1.1.1d-alt1.1 p9+237853.200.3.1 1569251834 installed
<13>Apr 26 13:30:53 rpmi: libpython3-3.7.4-alt3 p9+249932.100.2.1 1587127349 installed
<13>Apr 26 13:30:53 rpmi: python3-3.7.4-alt3 p9+249932.100.2.1 1587127349 installed
<13>Apr 26 13:30:56 rpmi: python3-base-3.7.4-alt3 p9+249932.100.2.1 1587127349 installed
<13>Apr 26 13:30:56 rpmi: libqt4-network-4.8.7-alt20 p9+240783.100.2.1 1574328612 installed
<86>Apr 26 13:30:56 groupadd[2901737]: group added to /etc/group: name=_keytab, GID=498
<86>Apr 26 13:30:56 groupadd[2901737]: group added to /etc/gshadow: name=_keytab
<86>Apr 26 13:30:56 groupadd[2901737]: new group: name=_keytab, GID=498
<13>Apr 26 13:30:56 rpmi: libkrb5-1.17.1-alt1 p9+242852.100.2.1 1576572639 installed
<86>Apr 26 13:30:56 groupadd[2901924]: group added to /etc/group: name=sasl, GID=497
<86>Apr 26 13:30:56 groupadd[2901924]: group added to /etc/gshadow: name=sasl
<86>Apr 26 13:30:56 groupadd[2901924]: new group: name=sasl, GID=497
<13>Apr 26 13:30:56 rpmi: libsasl2-3-2.1.27-alt2 sisyphus+228101.100.1.1 1556139863 installed
<13>Apr 26 13:30:56 rpmi: libldap-2.4.48-alt3 p9+238817.100.1.1 1570449122 installed
<13>Apr 26 13:30:56 rpmi: libqt4-qt3support-4.8.7-alt20 p9+240783.100.2.1 1574328612 installed
<13>Apr 26 13:30:57 rpmi: python3-module-pkg_resources-1:40.8.0-alt2 sisyphus+229158.200.2.1 1557735221 installed
<13>Apr 26 13:30:57 rpmi: glib2-devel-2.60.7-alt1 p9+237353.100.2.2 1568373081 installed
<13>Apr 26 13:30:57 rpmi: libharfbuzz-devel-2.6.2-alt1 p9+238790.200.1.1 1570435826 installed
<13>Apr 26 13:30:57 rpmi: libfreetype-devel-2.10.1-alt1 p9+247340.100.1.1 1583394177 installed
<13>Apr 26 13:30:57 rpmi: fontconfig-devel-2.13.1-alt1 p9+247340.200.3.1 1583400517 installed
<13>Apr 26 13:30:57 rpmi: libXft-devel-2.3.3-alt1 sisyphus+225206.1000.3.2 1552987708 installed
<13>Apr 26 13:30:57 rpmi: python3-module-nose-1:1.3.7-alt4.git20160316 sisyphus+229068.100.1.1 1557255939 installed
<13>Apr 26 13:30:57 rpmi: libcurl-7.65.0-alt1 p9+229801.100.1.1 1558513358 installed
<13>Apr 26 13:30:58 rpmi: cmake-3.16.3-alt1 p9+245760.100.3.1 1582902678 installed
<13>Apr 26 13:30:58 rpmi: gnupg2-2.2.17-alt8 p9+239665.1000.7.1 1586365078 installed
<13>Apr 26 13:30:58 rpmi: libgpgme11-1.13.1-alt1 p9+246074.100.3.1 1586363832 installed
<13>Apr 26 13:30:58 rpmi: libgpgmexx4-4.14.11-alt9.S1 1524201573 installed
<13>Apr 26 13:30:58 rpmi: libgpgmexx4-pthread-4.14.11-alt9.S1 1524201573 installed
<13>Apr 26 13:30:58 rpmi: libqgpgme4-4.14.11-alt9.S1 1524201573 installed
<13>Apr 26 13:30:58 rpmi: libgpgmepp6-1.13.1-alt1 p9+246074.100.3.1 1586363832 installed
<13>Apr 26 13:30:58 rpmi: libqgpgme7-1.13.1-alt1 p9+246074.100.3.1 1586363832 installed
<13>Apr 26 13:30:58 rpmi: libgpgme-devel-1.13.1-alt1 p9+246074.100.3.1 1586363832 installed
<13>Apr 26 13:30:58 rpmi: libtirpc-1.0.3-alt1 1532008017 installed
<13>Apr 26 13:30:58 rpmi: libnsl2-1.1.0-alt1_1 1511548749 installed
<13>Apr 26 13:30:58 rpmi: python-modules-compiler-2.7.16-alt1.M90P.1 p9+244933.100.1.1 1579867218 installed
<13>Apr 26 13:30:58 rpmi: python-modules-email-2.7.16-alt1.M90P.1 p9+244933.100.1.1 1579867218 installed
<13>Apr 26 13:30:58 rpmi: python-modules-unittest-2.7.16-alt1.M90P.1 p9+244933.100.1.1 1579867218 installed
<13>Apr 26 13:30:58 rpmi: python-modules-nis-2.7.16-alt1.M90P.1 p9+244933.100.1.1 1579867218 installed
<13>Apr 26 13:30:58 rpmi: python-modules-encodings-2.7.16-alt1.M90P.1 p9+244933.100.1.1 1579867218 installed
<13>Apr 26 13:30:59 rpmi: python-modules-2.7.16-alt1.M90P.1 p9+244933.100.1.1 1579867218 installed
<13>Apr 26 13:30:59 rpmi: python-module-six-1.12.0-alt1 sisyphus+219665.100.2.1 1548148570 installed
<13>Apr 26 13:30:59 rpmi: python-modules-ctypes-2.7.16-alt1.M90P.1 p9+244933.100.1.1 1579867218 installed
<13>Apr 26 13:30:59 rpmi: python-modules-multiprocessing-2.7.16-alt1.M90P.1 p9+244933.100.1.1 1579867218 installed
<13>Apr 26 13:30:59 rpmi: python-modules-logging-2.7.16-alt1.M90P.1 p9+244933.100.1.1 1579867218 installed
<13>Apr 26 13:30:59 rpmi: python-module-more-itertools-1:5.0.0-alt2 sisyphus+226536.200.1.1 1554329977 installed
<13>Apr 26 13:30:59 rpmi: python-modules-xml-2.7.16-alt1.M90P.1 p9+244933.100.1.1 1579867218 installed
<13>Apr 26 13:30:59 rpmi: python-modules-hotshot-2.7.16-alt1.M90P.1 p9+244933.100.1.1 1579867218 installed
<13>Apr 26 13:30:59 rpmi: python-modules-bsddb-2.7.16-alt1.M90P.1 p9+244933.100.1.1 1579867218 installed
<13>Apr 26 13:30:59 rpmi: python-2.7.16-alt1.M90P.1 p9+244933.100.1.1 1579867218 installed
<13>Apr 26 13:30:59 rpmi: python-strict-2.7.16-alt1.M90P.1 p9+244933.100.1.1 1579867164 installed
<13>Apr 26 13:30:59 rpmi: python-module-attrs-19.1.0-alt1 sisyphus+227473.2100.1.2 1555756986 installed
<13>Apr 26 13:30:59 rpmi: python-modules-distutils-2.7.16-alt1.M90P.1 p9+244933.100.1.1 1579867218 installed
<13>Apr 26 13:30:59 rpmi: python-module-py-1.8.0-alt2 sisyphus+228349.1400.4.1 1556631070 installed
<13>Apr 26 13:30:59 rpmi: python-module-funcsigs-1.0.2-alt2 sisyphus+228355.2600.2.1 1556560236 installed
<13>Apr 26 13:30:59 rpmi: python-module-scandir-1.10.0-alt1 sisyphus+225192.100.1.2 1552968870 installed
<13>Apr 26 13:30:59 rpmi: python-module-pathlib2-2.3.3-alt1 sisyphus+228364.300.4.1 1556886257 installed
<13>Apr 26 13:30:59 rpmi: python-module-atomicwrites-1.3.0-alt1 sisyphus+227473.2000.1.3 1555763467 installed
<13>Apr 26 13:30:59 rpmi: python-modules-json-2.7.16-alt1.M90P.1 p9+244933.100.1.1 1579867218 installed
<13>Apr 26 13:30:59 rpmi: python-module-pkg_resources-1:40.8.0-alt2 sisyphus+229158.200.2.1 1557735221 installed
<13>Apr 26 13:30:59 rpmi: python-module-pluggy-0.11.0-alt1 sisyphus+229116.100.1.1 1557316655 installed
<13>Apr 26 13:30:59 rpmi: python-module-pytest-3.10.1-alt5 sisyphus+228366.2000.2.3 1556707871 installed
<13>Apr 26 13:31:00 rpmi: python-module-numpy-1:1.15.4-alt1 sisyphus+225625.25600.91.1 1555302306 installed
<13>Apr 26 13:31:00 rpmi: python-module-numpy-testing-1:1.15.4-alt1 sisyphus+225625.25600.91.1 1555302306 installed
<13>Apr 26 13:31:00 rpmi: libboost_numpy1.67.0-1:1.67.0-alt6 sisyphus+227124.100.3.3 1555633205 installed
<13>Apr 26 13:31:00 rpmi: libqt4-xmlpatterns-4.8.7-alt20 p9+240783.100.2.1 1574328612 installed
<13>Apr 26 13:31:00 rpmi: libqt4-declarative-4.8.7-alt20 p9+240783.100.2.1 1574328612 installed
<13>Apr 26 13:31:01 rpmi: libqt4-webkit-1:2.3.4-alt7 p9+233171.100.2.1 1561543146 installed
<13>Apr 26 13:31:01 rpmi: libqt4-help-4.8.7-alt20 p9+240783.100.2.1 1574328612 installed
<13>Apr 26 13:31:02 rpmi: libattica0.4-0.4.2-alt1 1375339023 installed
<13>Apr 26 13:31:02 rpmi: python3-module-atomicwrites-1.3.0-alt1 sisyphus+227473.2000.1.3 1555763467 installed
<13>Apr 26 13:31:02 rpmi: python3-module-attrs-19.1.0-alt1 sisyphus+227473.2100.1.2 1555756986 installed
<13>Apr 26 13:31:02 rpmi: python3-module-more-itertools-7.0.0-alt3 sisyphus+226536.100.1.1 1554329928 installed
<13>Apr 26 13:31:02 rpmi: python3-module-pluggy-0.11.0-alt1 sisyphus+229116.100.1.1 1557316655 installed
<13>Apr 26 13:31:02 rpmi: python3-module-apipkg-1.5-alt1 sisyphus+227465.1100.1.2 1555756555 installed
<13>Apr 26 13:31:02 rpmi: python3-module-iniconfig-1.0.0-alt1 sisyphus+227494.1100.1.3 1555839106 installed
<13>Apr 26 13:31:02 rpmi: python3-module-py-1.8.0-alt2 sisyphus+228349.1400.4.1 1556631070 installed
<13>Apr 26 13:31:02 rpmi: python3-module-six-1.12.0-alt1 sisyphus+219665.100.2.1 1548148570 installed
<13>Apr 26 13:31:02 rpmi: python3-module-pytest-3.10.1-alt5 sisyphus+228366.2000.2.3 1556707871 installed
<13>Apr 26 13:31:02 rpmi: python3-module-numpy-testing-1:1.15.4-alt1 sisyphus+225625.25600.91.1 1555302306 installed
<13>Apr 26 13:31:02 rpmi: python3-module-numpy-1:1.15.4-alt1 sisyphus+225625.25600.91.1 1555302306 installed
<13>Apr 26 13:31:02 rpmi: libboost_python3-1.67.0-1:1.67.0-alt6 sisyphus+227124.100.3.3 1555633205 installed
<13>Apr 26 13:31:02 rpmi: libboost_numpy3-1.67.0-1:1.67.0-alt6 sisyphus+227124.100.3.3 1555633205 installed
<13>Apr 26 13:31:04 rpmi: boost-devel-headers-1:1.67.0-alt6 sisyphus+227124.100.3.3 1555633102 installed
<13>Apr 26 13:31:04 rpmi: boost-devel-1:1.67.0-alt6 sisyphus+227124.100.3.3 1555633205 installed
<13>Apr 26 13:31:04 rpmi: libssl-devel-1.1.1d-alt1.1 p9+237853.200.3.1 1569251834 installed
<13>Apr 26 13:31:04 rpmi: phonon-devel-4.8.3-alt1 1418134069 installed
<13>Apr 26 13:31:04 rpmi: libqt4-webkit-devel-1:2.3.4-alt7 p9+233171.100.2.1 1561543146 installed
<13>Apr 26 13:31:05 rpmi: libqt4-devel-4.8.7-alt20 p9+240783.100.2.1 1574328612 installed
<13>Apr 26 13:31:05 rpmi: libqca2-2.2.0-alt0.1.S1 1535533007 installed
<13>Apr 26 13:31:05 rpmi: altlinux-freedesktop-menu-shallow-menu-0.67-alt1 p9+233140.100.2.1 1561935835 installed
<13>Apr 26 13:31:05 rpmi: altlinux-freedesktop-menu-generic-0.67-alt1 p9+233140.100.2.1 1561935835 installed
<13>Apr 26 13:31:05 rpmi: altlinux-freedesktop-menu-kde4-0.67-alt1 p9+233140.100.2.1 1561935835 installed
<13>Apr 26 13:31:07 rpmi: kde4libs-4.14.38-alt5 p9+235763.100.1.1 1565261007 installed
<13>Apr 26 13:31:07 rpmi: libkmime4-4.14.11-alt9.S1 1524201573 installed
<13>Apr 26 13:31:07 rpmi: libkpimutils4-4.14.11-alt9.S1 1524201573 installed
<13>Apr 26 13:31:07 rpmi: libkcalcore4-4.14.11-alt9.S1 1524201573 installed
<13>Apr 26 13:31:07 rpmi: libmicroblog4-4.14.11-alt9.S1 1524201573 installed
<13>Apr 26 13:31:07 rpmi: libkpimtextedit4-4.14.11-alt9.S1 1524201573 installed
<13>Apr 26 13:31:07 rpmi: libkpimidentities4-4.14.11-alt9.S1 1524201573 installed
<13>Apr 26 13:31:07 rpmi: libkcalutils4-4.14.11-alt9.S1 1524201573 installed
<13>Apr 26 13:31:07 rpmi: libakonadi4-notes-4.14.11-alt9.S1 1524201573 installed
<13>Apr 26 13:31:07 rpmi: libkimap4-4.14.11-alt9.S1 1524201573 installed
<13>Apr 26 13:31:07 rpmi: libkmbox4-4.14.11-alt9.S1 1524201573 installed
<13>Apr 26 13:31:08 rpmi: kde4libs-devel-4.14.38-alt5 p9+235763.100.1.1 1565261007 installed
<13>Apr 26 13:31:08 rpmi: libkresources4-4.14.11-alt9.S1 1524201573 installed
<13>Apr 26 13:31:08 rpmi: libkabc4-4.14.11-alt9.S1 1524201573 installed
<13>Apr 26 13:31:08 rpmi: libkcal4-4.14.11-alt9.S1 1524201573 installed
<13>Apr 26 13:31:08 rpmi: libktnef4-4.14.11-alt9.S1 1524201573 installed
<13>Apr 26 13:31:08 rpmi: libkabc4_file_core-4.14.11-alt9.S1 1524201573 installed
<13>Apr 26 13:31:08 rpmi: libkholidays4-4.14.11-alt9.S1 1524201573 installed
<13>Apr 26 13:31:08 rpmi: libkxmlrpcclient4-4.14.11-alt9.S1 1524201573 installed
<13>Apr 26 13:31:08 rpmi: libsyndication4-4.14.11-alt9.S1 1524201573 installed
<13>Apr 26 13:31:08 rpmi: libkblog4-4.14.11-alt9.S1 1524201573 installed
<13>Apr 26 13:31:08 rpmi: libkldap4-4.14.11-alt9.S1 1524201573 installed
<13>Apr 26 13:31:08 rpmi: libkontactinterface4-4.14.11-alt9.S1 1524201573 installed
<13>Apr 26 13:31:08 rpmi: akonadi-common-1.13.1-alt0.6 sisyphus+226337.100.1.1 1554108843 installed
<13>Apr 26 13:31:08 rpmi: libakonadiprotocolinternals-1.13.1-alt0.6 sisyphus+226337.100.1.1 1554108843 installed
<13>Apr 26 13:31:08 rpmi: libakonadi4-kde-4.14.11-alt9.S1 1524201573 installed
<13>Apr 26 13:31:08 rpmi: libakonadi4-xml-4.14.11-alt9.S1 1524201573 installed
<13>Apr 26 13:31:08 rpmi: libakonadi4-contact-4.14.11-alt9.S1 1524201573 installed
<13>Apr 26 13:31:08 rpmi: libakonadi4-kmime-4.14.11-alt9.S1 1524201573 installed
<13>Apr 26 13:31:08 rpmi: libmailtransport4-4.14.11-alt9.S1 1524201573 installed
<13>Apr 26 13:31:08 rpmi: libakonadi4-calendar-4.14.11-alt9.S1 1524201573 installed
<13>Apr 26 13:31:08 rpmi: libakonadi4-kcal-4.14.11-alt9.S1 1524201573 installed
<13>Apr 26 13:31:08 rpmi: libakonadi4-socialutils-4.14.11-alt9.S1 1524201573 installed
<13>Apr 26 13:31:08 rpmi: libkalarmcal4-4.14.11-alt9.S1 1524201573 installed
<13>Apr 26 13:31:08 rpmi: kde4pimlibs-4.14.11-alt9.S1 1524201573 installed
<13>Apr 26 13:31:08 rpmi: kde4pimlibs-devel-4.14.11-alt9.S1 1524201573 installed
<13>Apr 26 13:31:08 rpmi: qjson-devel-0.8.1-alt2 1446565447 installed
<13>Apr 26 13:31:08 rpmi: gcc-c++-8-alt2 p9+246536.100.3.1 1582643803 installed
<13>Apr 26 13:31:08 rpmi: libXxf86misc-devel-1.0.4-alt1 sisyphus+223149.600.2.1 1551268423 installed
<13>Apr 26 13:31:08 rpmi: xsltproc-1.1.33-alt1 sisyphus+226936.100.1.1 1554820937 installed
Building target platforms: i586
Building for target i586
Wrote: /usr/src/in/nosrpm/libkfbapi-1.0-alt2.nosrc.rpm
Installing libkfbapi-1.0-alt2.src.rpm
Building target platforms: i586
Building for target i586
Executing(%prep): /bin/sh -e /usr/src/tmp/rpm-tmp.54378
+ umask 022
+ /bin/mkdir -p /usr/src/RPM/BUILD
+ cd /usr/src/RPM/BUILD
+ cd /usr/src/RPM/BUILD
+ rm -rf libkfbapi-1.0
+ echo 'Source #0 (libkfbapi-1.0.tar):'
Source #0 (libkfbapi-1.0.tar):
+ /bin/tar -xf /usr/src/RPM/SOURCES/libkfbapi-1.0.tar
+ cd libkfbapi-1.0
+ /bin/chmod -c -Rf u+rwX,go-w .
+ echo 'Patch #1 (libkfbapi-1.0-alt-pkgconfig.patch):'
Patch #1 (libkfbapi-1.0-alt-pkgconfig.patch):
+ /usr/bin/patch -p1
patching file LibKFbAPI.pc.in
+ exit 0
Executing(%build): /bin/sh -e /usr/src/tmp/rpm-tmp.54378
+ umask 022
+ /bin/mkdir -p /usr/src/RPM/BUILD
+ cd /usr/src/RPM/BUILD
+ cd libkfbapi-1.0
+ __kde4_build
+ mkdir -p BUILD-i586-alt-linux
+ __kde4_cmake
+ export PATH=/usr/lib/kde4/bin:/usr/src/bin:/bin:/usr/bin:/usr/X11R6/bin:/usr/games
+ PATH=/usr/lib/kde4/bin:/usr/src/bin:/bin:/usr/bin:/usr/X11R6/bin:/usr/games
+ pushd BUILD-i586-alt-linux
~/RPM/BUILD/libkfbapi-1.0/BUILD-i586-alt-linux ~/RPM/BUILD/libkfbapi-1.0
+ cmake .. -DCMAKE_SKIP_RPATH:BOOL=yes -DCMAKE_BUILD_TYPE=Release '-DCMAKE_C_FLAGS:STRING=-pipe -frecord-gcc-switches -Wall -g -O2 -march=i586 -mtune=generic' '-DCMAKE_CXX_FLAGS:STRING=-pipe -frecord-gcc-switches -Wall -g -O2 -march=i586 -mtune=generic' '-DCMAKE_EXE_LINKER_FLAGS:STRING=-L/usr/lib/kde4link -L/usr/lib/kde4/devel' '-DCMAKE_MODULE_LINKER_FLAGS:STRING=-L/usr/lib/kde4link -L/usr/lib/kde4/devel' '-DCMAKE_SHARED_LINKER_FLAGS:STRING=-L/usr/lib/kde4link -L/usr/lib/kde4/devel' '-DCMAKE_LIBRARY_PATH:LIST=/usr/lib/kde4/devel;/usr/lib/kde4link;/usr/lib;/lib' -DLIB_DESTINATION=lib -DLIB_SUFFIX= -DCMAKE_INSTALL_PREFIX=/usr -DBIN_INSTALL_DIR=/usr/bin -DSBIN_INSTALL_DIR=/usr/sbin -DICON_INSTALL_DIR=/usr/share/icons -DXDG_APPS_INSTALL_DIR=/usr/share/applications/kde4 -DXDG_DIRECTORY_INSTALL_DIR=/usr/share/desktop-directories -DLIB_INSTALL_DIR=/usr/lib -DLIBEXEC_INSTALL_DIR=/usr/lib/kde4/libexec -DINCLUDE_INSTALL_DIR=/usr/include/kde4 -DKDE4_INCLUDE_INSTALL_DIR=/usr/include/kde4 -DSYSCONF_INSTALL_DIR=/etc -DDATA_INSTALL_DIR=/usr/share/kde4/apps -DCONFIG_INSTALL_DIR=/usr/share/kde4/config -DKCFG_INSTALL_DIR=/usr/share/kde4/config.kcfg -DHTML_INSTALL_DIR=/usr/share/kde4/doc/HTML -DAPPLNK_INSTALL_DIR=/usr/share/applnk -DLOCALE_INSTALL_DIR=/usr/share/kde4/locale -DSERVICES_INSTALL_DIR=/usr/share/kde4/services -DSERVICETYPES_INSTALL_DIR=/usr/share/kde4/servicetypes -DKCONF_UPDATE_INSTALL_DIR=/usr/share/kde4/apps/kconf_update -DXDG_MIME_INSTALL_DIR=/usr/share/mime/packages -DAUTOSTART_INSTALL_DIR=/usr/share/kde4/autostart -DSOUND_INSTALL_DIR=/usr/share/kde4/sounds -DTEMPLATES_INSTALL_DIR=/usr/share/kde4/templates -DWALLPAPER_INSTALL_DIR=/usr/share/wallpapers -DDBUS_INTERFACES_INSTALL_DIR=/usr/share/dbus-1/interfaces -DDBUS_SERVICES_INSTALL_DIR=/usr/share/dbus-1/services -DDBUS_SYSTEM_SERVICES_INSTALL_DIR=/usr/share/dbus-1/system-services -DMAN_INSTALL_DIR=/usr/share/man -DINFO_INSTALL_DIR=/usr/share/info -DINSTALL_PYTHON_FILES_IN_PYTHON_PREFIX:BOOL=yes
-- The C compiler identification is GNU 8.4.1
-- The CXX compiler identification is GNU 8.4.1
-- Check for working C compiler: /usr/bin/cc
-- Check for working C compiler: /usr/bin/cc -- works
-- Detecting C compiler ABI info
-- Detecting C compiler ABI info - done
-- Detecting C compile features
-- Detecting C compile features - done
-- Check for working CXX compiler: /usr/bin/c++
-- Check for working CXX compiler: /usr/bin/c++ -- works
-- Detecting CXX compiler ABI info
-- Detecting CXX compiler ABI info - done
-- Detecting CXX compile features
-- Detecting CXX compile features - done
-- Looking for Q_WS_X11
-- Looking for Q_WS_X11 - found
-- Looking for Q_WS_WIN
-- Looking for Q_WS_WIN - not found
-- Looking for Q_WS_QWS
-- Looking for Q_WS_QWS - not found
-- Looking for Q_WS_MAC
-- Looking for Q_WS_MAC - not found
-- Found Qt-Version 4.8.7 (using /usr/bin/qmake-qt4)
-- Looking for XOpenDisplay in /usr/lib/libX11.so;/usr/lib/libXext.so;/usr/lib/libXft.so;/usr/lib/libXau.so;/usr/lib/libXdmcp.so;/usr/lib/libXpm.so
-- Looking for XOpenDisplay in /usr/lib/libX11.so;/usr/lib/libXext.so;/usr/lib/libXft.so;/usr/lib/libXau.so;/usr/lib/libXdmcp.so;/usr/lib/libXpm.so - found
-- Looking for gethostbyname
-- Looking for gethostbyname - found
-- Looking for connect
-- Looking for connect - found
-- Looking for remove
-- Looking for remove - found
-- Looking for shmat
-- Looking for shmat - found
-- Looking for IceConnectionNumber in ICE
-- Looking for IceConnectionNumber in ICE - found
-- Found X11: /usr/lib/libX11.so
-- Looking for pthread.h
-- Looking for pthread.h - found
-- Performing Test CMAKE_HAVE_LIBC_PTHREAD
-- Performing Test CMAKE_HAVE_LIBC_PTHREAD - Failed
-- Looking for pthread_create in pthreads
-- Looking for pthread_create in pthreads - not found
-- Looking for pthread_create in pthread
-- Looking for pthread_create in pthread - found
-- Found Threads: TRUE  
-- Found OpenSSL: /usr/lib/libcrypto.so (found version "1.1.1d")  
-- Looking for _POSIX_TIMERS
-- Looking for _POSIX_TIMERS - found
-- Found Automoc4: /usr/bin/automoc4  
-- Found Perl: /usr/bin/perl (found version "5.28.2") 
-- Found Phonon: /usr/include/kde4 (Required is at least version "4.3.80") 
-- Performing Test _OFFT_IS_64BIT
-- Performing Test _OFFT_IS_64BIT - Failed
-- Performing Test HAVE_FPIE_SUPPORT
-- Performing Test HAVE_FPIE_SUPPORT - Success
-- Performing Test __KDE_HAVE_W_OVERLOADED_VIRTUAL
-- Performing Test __KDE_HAVE_W_OVERLOADED_VIRTUAL - Success
-- Performing Test __KDE_HAVE_GCC_VISIBILITY
-- Performing Test __KDE_HAVE_GCC_VISIBILITY - Success
-- Found KDE 4.12 include dir: /usr/include/kde4
-- Found KDE 4.12 library dir: /usr/lib/kde4/devel
-- Found the KDE4 kconfig_compiler4 preprocessor: /usr/lib/kde4/bin/kconfig_compiler4
-- Found automoc4: /usr/bin/automoc4
-- Found KdepimLibs: /usr/lib/cmake/KdepimLibs/KdepimLibsConfig.cmake (Required is at least version "4.5.63") 
CMake Deprecation Warning at /usr/share/cmake/Modules/FeatureSummary.cmake:669 (message):
  SET_PACKAGE_INFO is deprecated.  Use SET_PACKAGE_PROPERTIES instead.
Call Stack (most recent call first):
  /usr/share/kde4/apps/cmake/modules/MacroLogFeature.cmake:98 (SET_PACKAGE_INFO)
  CMakeLists.txt:19 (macro_log_feature)


CMake Deprecation Warning at /usr/share/cmake/Modules/FeatureSummary.cmake:669 (message):
  SET_PACKAGE_INFO is deprecated.  Use SET_PACKAGE_PROPERTIES instead.
Call Stack (most recent call first):
  /usr/share/kde4/apps/cmake/modules/MacroLogFeature.cmake:98 (SET_PACKAGE_INFO)
  CMakeLists.txt:23 (macro_log_feature)


CMake Warning (dev) at /usr/lib/automoc4/Automoc4Config.cmake:179 (get_directory_property):
  Policy CMP0059 is not set: Do not treat DEFINITIONS as a built-in directory
  property.  Run "cmake --help-policy CMP0059" for policy details.  Use the
  cmake_policy command to set the policy and suppress this warning.
Call Stack (most recent call first):
  /usr/lib/automoc4/Automoc4Config.cmake:243 (_add_automoc4_target)
  /usr/share/kde4/apps/cmake/modules/KDE4Macros.cmake:1081 (_automoc4_kde4_pre_target_handling)
  libkfbapi/CMakeLists.txt:67 (kde4_add_library)
This warning is for project developers.  Use -Wno-dev to suppress it.

-- Looking for dgettext
-- Looking for dgettext - found
-- Found Gettext: built in libc
CMake Warning (dev) in CMakeLists.txt:
  No cmake_minimum_required command is present.  A line of code such as

    cmake_minimum_required(VERSION 3.16)

  should be added at the top of the file.  The version specified may be lower
  if you wish to support older CMake versions for this project.  For more
  information run "cmake --help-policy CMP0000".
This warning is for project developers.  Use -Wno-dev to suppress it.

-- Configuring done
CMake Warning (dev) at /usr/share/kde4/apps/cmake/modules/KDE4Macros.cmake:1088 (add_library):
  Policy CMP0003 should be set before this line.  Add code such as

    if(COMMAND cmake_policy)
      cmake_policy(SET CMP0003 NEW)
    endif(COMMAND cmake_policy)

  as early as possible but after the most recent call to
  cmake_minimum_required or cmake_policy(VERSION).  This warning appears
  because target "kfbapi" links to some libraries for which the linker must
  search:

    -lpthread

  and other libraries with known full path:

    /usr/lib/libQtGui.so

  CMake is adding directories in the second list to the linker search path in
  case they are needed to find libraries from the first list (for backwards
  compatibility with CMake 2.4).  Set policy CMP0003 to OLD or NEW to enable
  or disable this behavior explicitly.  Run "cmake --help-policy CMP0003" for
  more information.
Call Stack (most recent call first):
  libkfbapi/CMakeLists.txt:67 (kde4_add_library)
This warning is for project developers.  Use -Wno-dev to suppress it.

CMake Warning (dev) in libkfbapi/CMakeLists.txt:
  Policy CMP0022 is not set: INTERFACE_LINK_LIBRARIES defines the link
  interface.  Run "cmake --help-policy CMP0022" for policy details.  Use the
  cmake_policy command to set the policy and suppress this warning.

  Target "kfbapi" has an INTERFACE_LINK_LIBRARIES property which differs from
  its LINK_INTERFACE_LIBRARIES properties.

  INTERFACE_LINK_LIBRARIES:

    KDE4__kdecore;KDE4__kdeui;Qt4::QtGui;Qt4::QtWebKit;KDE4__kdewebkit;KDE4__kio;qjson;KDEPIMLibs__kabc;KDEPIMLibs__kpimutils;KDEPIMLibs__kmime;KDEPIMLibs__kcalcore

  LINK_INTERFACE_LIBRARIES:

    

This warning is for project developers.  Use -Wno-dev to suppress it.

-- Generating done
CMake Warning:
  Manually-specified variables were not used by the project:

    APPLNK_INSTALL_DIR
    INSTALL_PYTHON_FILES_IN_PYTHON_PREFIX
    LIB_DESTINATION


-- Build files have been written to: /usr/src/RPM/BUILD/libkfbapi-1.0/BUILD-i586-alt-linux
+ popd
~/RPM/BUILD/libkfbapi-1.0
+ __kde4_make
+ pushd BUILD-i586-alt-linux
~/RPM/BUILD/libkfbapi-1.0/BUILD-i586-alt-linux ~/RPM/BUILD/libkfbapi-1.0
+ make -j8
make[2]: Entering directory '/usr/src/RPM/BUILD/libkfbapi-1.0/BUILD-i586-alt-linux'
Scanning dependencies of target pofiles_4
make[2]: Leaving directory '/usr/src/RPM/BUILD/libkfbapi-1.0/BUILD-i586-alt-linux'
make[2]: Entering directory '/usr/src/RPM/BUILD/libkfbapi-1.0/BUILD-i586-alt-linux'
Scanning dependencies of target kfbapi_automoc
make[2]: Leaving directory '/usr/src/RPM/BUILD/libkfbapi-1.0/BUILD-i586-alt-linux'
make[2]: Entering directory '/usr/src/RPM/BUILD/libkfbapi-1.0/BUILD-i586-alt-linux'
Scanning dependencies of target pofiles_1
make[2]: Leaving directory '/usr/src/RPM/BUILD/libkfbapi-1.0/BUILD-i586-alt-linux'
make[2]: Entering directory '/usr/src/RPM/BUILD/libkfbapi-1.0/BUILD-i586-alt-linux'
Scanning dependencies of target pofiles_2
make[2]: Leaving directory '/usr/src/RPM/BUILD/libkfbapi-1.0/BUILD-i586-alt-linux'
make[2]: Entering directory '/usr/src/RPM/BUILD/libkfbapi-1.0/BUILD-i586-alt-linux'
Scanning dependencies of target pofiles_3
make[2]: Leaving directory '/usr/src/RPM/BUILD/libkfbapi-1.0/BUILD-i586-alt-linux'
make[2]: Entering directory '/usr/src/RPM/BUILD/libkfbapi-1.0/BUILD-i586-alt-linux'
Scanning dependencies of target pofiles_7
make[2]: Leaving directory '/usr/src/RPM/BUILD/libkfbapi-1.0/BUILD-i586-alt-linux'
make[2]: Entering directory '/usr/src/RPM/BUILD/libkfbapi-1.0/BUILD-i586-alt-linux'
Scanning dependencies of target pofiles_5
make[2]: Leaving directory '/usr/src/RPM/BUILD/libkfbapi-1.0/BUILD-i586-alt-linux'
make[2]: Entering directory '/usr/src/RPM/BUILD/libkfbapi-1.0/BUILD-i586-alt-linux'
Scanning dependencies of target pofiles_6
make[2]: Leaving directory '/usr/src/RPM/BUILD/libkfbapi-1.0/BUILD-i586-alt-linux'
make[2]: Entering directory '/usr/src/RPM/BUILD/libkfbapi-1.0/BUILD-i586-alt-linux'
[  2%] Generating libkfbapi.gmo
make[2]: Leaving directory '/usr/src/RPM/BUILD/libkfbapi-1.0/BUILD-i586-alt-linux'
make[1]: Entering directory '/usr/src/RPM/BUILD/libkfbapi-1.0/BUILD-i586-alt-linux'
[  5%] Built target pofiles_1
make[1]: Leaving directory '/usr/src/RPM/BUILD/libkfbapi-1.0/BUILD-i586-alt-linux'
make[2]: Entering directory '/usr/src/RPM/BUILD/libkfbapi-1.0/BUILD-i586-alt-linux'
[  5%] Generating libkfbapi.gmo
make[2]: Leaving directory '/usr/src/RPM/BUILD/libkfbapi-1.0/BUILD-i586-alt-linux'
make[2]: Entering directory '/usr/src/RPM/BUILD/libkfbapi-1.0/BUILD-i586-alt-linux'
[  3%] Generating libkfbapi.gmo
make[2]: Leaving directory '/usr/src/RPM/BUILD/libkfbapi-1.0/BUILD-i586-alt-linux'
make[2]: Entering directory '/usr/src/RPM/BUILD/libkfbapi-1.0/BUILD-i586-alt-linux'
[  1%] Generating libkfbapi.gmo
make[2]: Leaving directory '/usr/src/RPM/BUILD/libkfbapi-1.0/BUILD-i586-alt-linux'
make[2]: Entering directory '/usr/src/RPM/BUILD/libkfbapi-1.0/BUILD-i586-alt-linux'
[  4%] Generating libkfbapi.gmo
make[2]: Leaving directory '/usr/src/RPM/BUILD/libkfbapi-1.0/BUILD-i586-alt-linux'
make[1]: Entering directory '/usr/src/RPM/BUILD/libkfbapi-1.0/BUILD-i586-alt-linux'
[  6%] Built target pofiles_3
make[1]: Leaving directory '/usr/src/RPM/BUILD/libkfbapi-1.0/BUILD-i586-alt-linux'
make[1]: Entering directory '/usr/src/RPM/BUILD/libkfbapi-1.0/BUILD-i586-alt-linux'
[  6%] Built target pofiles_4
make[1]: Leaving directory '/usr/src/RPM/BUILD/libkfbapi-1.0/BUILD-i586-alt-linux'
make[2]: Entering directory '/usr/src/RPM/BUILD/libkfbapi-1.0/BUILD-i586-alt-linux'
[  7%] Generating libkfbapi.gmo
make[2]: Leaving directory '/usr/src/RPM/BUILD/libkfbapi-1.0/BUILD-i586-alt-linux'
make[2]: Entering directory '/usr/src/RPM/BUILD/libkfbapi-1.0/BUILD-i586-alt-linux'
[  6%] Generating libkfbapi.gmo
make[2]: Leaving directory '/usr/src/RPM/BUILD/libkfbapi-1.0/BUILD-i586-alt-linux'
make[1]: Entering directory '/usr/src/RPM/BUILD/libkfbapi-1.0/BUILD-i586-alt-linux'
[  7%] Built target pofiles_2
make[1]: Leaving directory '/usr/src/RPM/BUILD/libkfbapi-1.0/BUILD-i586-alt-linux'
make[2]: Entering directory '/usr/src/RPM/BUILD/libkfbapi-1.0/BUILD-i586-alt-linux'
Scanning dependencies of target pofiles_9
make[2]: Leaving directory '/usr/src/RPM/BUILD/libkfbapi-1.0/BUILD-i586-alt-linux'
make[2]: Entering directory '/usr/src/RPM/BUILD/libkfbapi-1.0/BUILD-i586-alt-linux'
Scanning dependencies of target pofiles_10
make[2]: Leaving directory '/usr/src/RPM/BUILD/libkfbapi-1.0/BUILD-i586-alt-linux'
make[1]: Entering directory '/usr/src/RPM/BUILD/libkfbapi-1.0/BUILD-i586-alt-linux'
[  7%] Built target pofiles_6
make[1]: Leaving directory '/usr/src/RPM/BUILD/libkfbapi-1.0/BUILD-i586-alt-linux'
make[1]: Entering directory '/usr/src/RPM/BUILD/libkfbapi-1.0/BUILD-i586-alt-linux'
[  7%] Built target pofiles_5
make[1]: Leaving directory '/usr/src/RPM/BUILD/libkfbapi-1.0/BUILD-i586-alt-linux'
make[2]: Entering directory '/usr/src/RPM/BUILD/libkfbapi-1.0/BUILD-i586-alt-linux'
[  8%] Generating libkfbapi.gmo
make[2]: Leaving directory '/usr/src/RPM/BUILD/libkfbapi-1.0/BUILD-i586-alt-linux'
make[2]: Entering directory '/usr/src/RPM/BUILD/libkfbapi-1.0/BUILD-i586-alt-linux'
Scanning dependencies of target pofiles_12
make[2]: Leaving directory '/usr/src/RPM/BUILD/libkfbapi-1.0/BUILD-i586-alt-linux'
make[1]: Entering directory '/usr/src/RPM/BUILD/libkfbapi-1.0/BUILD-i586-alt-linux'
[  8%] Built target pofiles_9
make[1]: Leaving directory '/usr/src/RPM/BUILD/libkfbapi-1.0/BUILD-i586-alt-linux'
make[2]: Entering directory '/usr/src/RPM/BUILD/libkfbapi-1.0/BUILD-i586-alt-linux'
Scanning dependencies of target pofiles_11
make[2]: Leaving directory '/usr/src/RPM/BUILD/libkfbapi-1.0/BUILD-i586-alt-linux'
make[2]: Entering directory '/usr/src/RPM/BUILD/libkfbapi-1.0/BUILD-i586-alt-linux'
Scanning dependencies of target pofiles_8
make[2]: Leaving directory '/usr/src/RPM/BUILD/libkfbapi-1.0/BUILD-i586-alt-linux'
make[2]: Entering directory '/usr/src/RPM/BUILD/libkfbapi-1.0/BUILD-i586-alt-linux'
Scanning dependencies of target pofiles_14
make[2]: Leaving directory '/usr/src/RPM/BUILD/libkfbapi-1.0/BUILD-i586-alt-linux'
make[1]: Entering directory '/usr/src/RPM/BUILD/libkfbapi-1.0/BUILD-i586-alt-linux'
[  8%] Built target pofiles_7
make[1]: Leaving directory '/usr/src/RPM/BUILD/libkfbapi-1.0/BUILD-i586-alt-linux'
make[2]: Entering directory '/usr/src/RPM/BUILD/libkfbapi-1.0/BUILD-i586-alt-linux'
[  9%] Generating libkfbapi.gmo
make[2]: Leaving directory '/usr/src/RPM/BUILD/libkfbapi-1.0/BUILD-i586-alt-linux'
make[1]: Entering directory '/usr/src/RPM/BUILD/libkfbapi-1.0/BUILD-i586-alt-linux'
[ 11%] Built target pofiles_10
make[1]: Leaving directory '/usr/src/RPM/BUILD/libkfbapi-1.0/BUILD-i586-alt-linux'
make[2]: Entering directory '/usr/src/RPM/BUILD/libkfbapi-1.0/BUILD-i586-alt-linux'
[ 10%] Generating libkfbapi.gmo
make[2]: Leaving directory '/usr/src/RPM/BUILD/libkfbapi-1.0/BUILD-i586-alt-linux'
make[2]: Entering directory '/usr/src/RPM/BUILD/libkfbapi-1.0/BUILD-i586-alt-linux'
Scanning dependencies of target pofiles_13
make[2]: Leaving directory '/usr/src/RPM/BUILD/libkfbapi-1.0/BUILD-i586-alt-linux'
make[1]: Entering directory '/usr/src/RPM/BUILD/libkfbapi-1.0/BUILD-i586-alt-linux'
[ 11%] Built target pofiles_11
make[1]: Leaving directory '/usr/src/RPM/BUILD/libkfbapi-1.0/BUILD-i586-alt-linux'
make[2]: Entering directory '/usr/src/RPM/BUILD/libkfbapi-1.0/BUILD-i586-alt-linux'
[ 11%] Generating libkfbapi.gmo
make[2]: Leaving directory '/usr/src/RPM/BUILD/libkfbapi-1.0/BUILD-i586-alt-linux'
make[2]: Entering directory '/usr/src/RPM/BUILD/libkfbapi-1.0/BUILD-i586-alt-linux'
Scanning dependencies of target pofiles_17
make[2]: Leaving directory '/usr/src/RPM/BUILD/libkfbapi-1.0/BUILD-i586-alt-linux'
make[1]: Entering directory '/usr/src/RPM/BUILD/libkfbapi-1.0/BUILD-i586-alt-linux'
[ 12%] Built target pofiles_8
make[1]: Leaving directory '/usr/src/RPM/BUILD/libkfbapi-1.0/BUILD-i586-alt-linux'
make[2]: Entering directory '/usr/src/RPM/BUILD/libkfbapi-1.0/BUILD-i586-alt-linux'
[ 12%] Generating libkfbapi.gmo
make[2]: Leaving directory '/usr/src/RPM/BUILD/libkfbapi-1.0/BUILD-i586-alt-linux'
make[2]: Entering directory '/usr/src/RPM/BUILD/libkfbapi-1.0/BUILD-i586-alt-linux'
Scanning dependencies of target pofiles_15
make[2]: Leaving directory '/usr/src/RPM/BUILD/libkfbapi-1.0/BUILD-i586-alt-linux'
make[2]: Entering directory '/usr/src/RPM/BUILD/libkfbapi-1.0/BUILD-i586-alt-linux'
[ 13%] Generating libkfbapi.gmo
make[2]: Leaving directory '/usr/src/RPM/BUILD/libkfbapi-1.0/BUILD-i586-alt-linux'
make[2]: Entering directory '/usr/src/RPM/BUILD/libkfbapi-1.0/BUILD-i586-alt-linux'
Scanning dependencies of target pofiles_16
make[2]: Leaving directory '/usr/src/RPM/BUILD/libkfbapi-1.0/BUILD-i586-alt-linux'
make[2]: Entering directory '/usr/src/RPM/BUILD/libkfbapi-1.0/BUILD-i586-alt-linux'
[ 14%] Generating libkfbapi.gmo
make[2]: Leaving directory '/usr/src/RPM/BUILD/libkfbapi-1.0/BUILD-i586-alt-linux'
make[2]: Entering directory '/usr/src/RPM/BUILD/libkfbapi-1.0/BUILD-i586-alt-linux'
Scanning dependencies of target pofiles_18
make[2]: Leaving directory '/usr/src/RPM/BUILD/libkfbapi-1.0/BUILD-i586-alt-linux'
make[1]: Entering directory '/usr/src/RPM/BUILD/libkfbapi-1.0/BUILD-i586-alt-linux'
[ 15%] Built target pofiles_12
make[1]: Leaving directory '/usr/src/RPM/BUILD/libkfbapi-1.0/BUILD-i586-alt-linux'
make[2]: Entering directory '/usr/src/RPM/BUILD/libkfbapi-1.0/BUILD-i586-alt-linux'
[ 15%] Generating libkfbapi.gmo
make[2]: Leaving directory '/usr/src/RPM/BUILD/libkfbapi-1.0/BUILD-i586-alt-linux'
make[2]: Entering directory '/usr/src/RPM/BUILD/libkfbapi-1.0/BUILD-i586-alt-linux'
[ 16%] Generating libkfbapi.gmo
make[2]: Leaving directory '/usr/src/RPM/BUILD/libkfbapi-1.0/BUILD-i586-alt-linux'
make[1]: Entering directory '/usr/src/RPM/BUILD/libkfbapi-1.0/BUILD-i586-alt-linux'
[ 16%] Built target pofiles_14
make[1]: Leaving directory '/usr/src/RPM/BUILD/libkfbapi-1.0/BUILD-i586-alt-linux'
make[2]: Entering directory '/usr/src/RPM/BUILD/libkfbapi-1.0/BUILD-i586-alt-linux'
[ 17%] Generating libkfbapi.gmo
make[2]: Leaving directory '/usr/src/RPM/BUILD/libkfbapi-1.0/BUILD-i586-alt-linux'
make[1]: Entering directory '/usr/src/RPM/BUILD/libkfbapi-1.0/BUILD-i586-alt-linux'
[ 16%] Built target pofiles_17
make[1]: Leaving directory '/usr/src/RPM/BUILD/libkfbapi-1.0/BUILD-i586-alt-linux'
make[1]: Entering directory '/usr/src/RPM/BUILD/libkfbapi-1.0/BUILD-i586-alt-linux'
[ 18%] Built target pofiles_18
make[1]: Leaving directory '/usr/src/RPM/BUILD/libkfbapi-1.0/BUILD-i586-alt-linux'
make[1]: Entering directory '/usr/src/RPM/BUILD/libkfbapi-1.0/BUILD-i586-alt-linux'
[ 18%] Built target pofiles_15
make[1]: Leaving directory '/usr/src/RPM/BUILD/libkfbapi-1.0/BUILD-i586-alt-linux'
make[2]: Entering directory '/usr/src/RPM/BUILD/libkfbapi-1.0/BUILD-i586-alt-linux'
[ 18%] Generating libkfbapi.gmo
make[2]: Leaving directory '/usr/src/RPM/BUILD/libkfbapi-1.0/BUILD-i586-alt-linux'
make[2]: Entering directory '/usr/src/RPM/BUILD/libkfbapi-1.0/BUILD-i586-alt-linux'
Scanning dependencies of target pofiles_19
make[2]: Leaving directory '/usr/src/RPM/BUILD/libkfbapi-1.0/BUILD-i586-alt-linux'
make[1]: Entering directory '/usr/src/RPM/BUILD/libkfbapi-1.0/BUILD-i586-alt-linux'
[ 18%] Built target pofiles_16
make[1]: Leaving directory '/usr/src/RPM/BUILD/libkfbapi-1.0/BUILD-i586-alt-linux'
make[2]: Entering directory '/usr/src/RPM/BUILD/libkfbapi-1.0/BUILD-i586-alt-linux'
Scanning dependencies of target pofiles_22
make[2]: Leaving directory '/usr/src/RPM/BUILD/libkfbapi-1.0/BUILD-i586-alt-linux'
make[1]: Entering directory '/usr/src/RPM/BUILD/libkfbapi-1.0/BUILD-i586-alt-linux'
[ 18%] Built target pofiles_13
make[1]: Leaving directory '/usr/src/RPM/BUILD/libkfbapi-1.0/BUILD-i586-alt-linux'
make[2]: Entering directory '/usr/src/RPM/BUILD/libkfbapi-1.0/BUILD-i586-alt-linux'
Scanning dependencies of target pofiles_21
make[2]: Leaving directory '/usr/src/RPM/BUILD/libkfbapi-1.0/BUILD-i586-alt-linux'
make[2]: Entering directory '/usr/src/RPM/BUILD/libkfbapi-1.0/BUILD-i586-alt-linux'
Scanning dependencies of target pofiles_23
make[2]: Leaving directory '/usr/src/RPM/BUILD/libkfbapi-1.0/BUILD-i586-alt-linux'
make[2]: Entering directory '/usr/src/RPM/BUILD/libkfbapi-1.0/BUILD-i586-alt-linux'
Scanning dependencies of target pofiles_20
make[2]: Leaving directory '/usr/src/RPM/BUILD/libkfbapi-1.0/BUILD-i586-alt-linux'
make[2]: Entering directory '/usr/src/RPM/BUILD/libkfbapi-1.0/BUILD-i586-alt-linux'
Scanning dependencies of target pofiles_25
make[2]: Leaving directory '/usr/src/RPM/BUILD/libkfbapi-1.0/BUILD-i586-alt-linux'
make[2]: Entering directory '/usr/src/RPM/BUILD/libkfbapi-1.0/BUILD-i586-alt-linux'
Scanning dependencies of target pofiles_24
make[2]: Leaving directory '/usr/src/RPM/BUILD/libkfbapi-1.0/BUILD-i586-alt-linux'
make[2]: Entering directory '/usr/src/RPM/BUILD/libkfbapi-1.0/BUILD-i586-alt-linux'
[ 22%] Generating libkfbapi.gmo
make[2]: Leaving directory '/usr/src/RPM/BUILD/libkfbapi-1.0/BUILD-i586-alt-linux'
make[2]: Entering directory '/usr/src/RPM/BUILD/libkfbapi-1.0/BUILD-i586-alt-linux'
[ 21%] Generating libkfbapi.gmo
make[2]: Leaving directory '/usr/src/RPM/BUILD/libkfbapi-1.0/BUILD-i586-alt-linux'
make[2]: Entering directory '/usr/src/RPM/BUILD/libkfbapi-1.0/BUILD-i586-alt-linux'
[ 20%] Generating libkfbapi.gmo
make[2]: Leaving directory '/usr/src/RPM/BUILD/libkfbapi-1.0/BUILD-i586-alt-linux'
make[1]: Entering directory '/usr/src/RPM/BUILD/libkfbapi-1.0/BUILD-i586-alt-linux'
[ 25%] Built target pofiles_21
make[1]: Leaving directory '/usr/src/RPM/BUILD/libkfbapi-1.0/BUILD-i586-alt-linux'
make[2]: Entering directory '/usr/src/RPM/BUILD/libkfbapi-1.0/BUILD-i586-alt-linux'
[ 23%] Generating libkfbapi.gmo
make[2]: Leaving directory '/usr/src/RPM/BUILD/libkfbapi-1.0/BUILD-i586-alt-linux'
make[1]: Entering directory '/usr/src/RPM/BUILD/libkfbapi-1.0/BUILD-i586-alt-linux'
[ 25%] Built target pofiles_22
make[1]: Leaving directory '/usr/src/RPM/BUILD/libkfbapi-1.0/BUILD-i586-alt-linux'
make[2]: Entering directory '/usr/src/RPM/BUILD/libkfbapi-1.0/BUILD-i586-alt-linux'
[ 24%] Generating libkfbapi.gmo
make[2]: Leaving directory '/usr/src/RPM/BUILD/libkfbapi-1.0/BUILD-i586-alt-linux'
make[1]: Entering directory '/usr/src/RPM/BUILD/libkfbapi-1.0/BUILD-i586-alt-linux'
[ 25%] Built target pofiles_20
make[1]: Leaving directory '/usr/src/RPM/BUILD/libkfbapi-1.0/BUILD-i586-alt-linux'
make[2]: Entering directory '/usr/src/RPM/BUILD/libkfbapi-1.0/BUILD-i586-alt-linux'
[ 25%] Generating libkfbapi.gmo
make[2]: Leaving directory '/usr/src/RPM/BUILD/libkfbapi-1.0/BUILD-i586-alt-linux'
make[1]: Entering directory '/usr/src/RPM/BUILD/libkfbapi-1.0/BUILD-i586-alt-linux'
[ 26%] Built target pofiles_25
make[1]: Leaving directory '/usr/src/RPM/BUILD/libkfbapi-1.0/BUILD-i586-alt-linux'
make[1]: Entering directory '/usr/src/RPM/BUILD/libkfbapi-1.0/BUILD-i586-alt-linux'
[ 26%] Built target pofiles_19
make[1]: Leaving directory '/usr/src/RPM/BUILD/libkfbapi-1.0/BUILD-i586-alt-linux'
make[2]: Entering directory '/usr/src/RPM/BUILD/libkfbapi-1.0/BUILD-i586-alt-linux'
Scanning dependencies of target pofiles_26
make[2]: Leaving directory '/usr/src/RPM/BUILD/libkfbapi-1.0/BUILD-i586-alt-linux'
make[1]: Entering directory '/usr/src/RPM/BUILD/libkfbapi-1.0/BUILD-i586-alt-linux'
[ 26%] Built target pofiles_23
make[1]: Leaving directory '/usr/src/RPM/BUILD/libkfbapi-1.0/BUILD-i586-alt-linux'
make[2]: Entering directory '/usr/src/RPM/BUILD/libkfbapi-1.0/BUILD-i586-alt-linux'
Scanning dependencies of target pofiles_30
make[2]: Leaving directory '/usr/src/RPM/BUILD/libkfbapi-1.0/BUILD-i586-alt-linux'
make[2]: Entering directory '/usr/src/RPM/BUILD/libkfbapi-1.0/BUILD-i586-alt-linux'
[ 26%] Generating libkfbapi.gmo
make[2]: Leaving directory '/usr/src/RPM/BUILD/libkfbapi-1.0/BUILD-i586-alt-linux'
make[1]: Entering directory '/usr/src/RPM/BUILD/libkfbapi-1.0/BUILD-i586-alt-linux'
[ 26%] Built target pofiles_24
make[1]: Leaving directory '/usr/src/RPM/BUILD/libkfbapi-1.0/BUILD-i586-alt-linux'
make[2]: Entering directory '/usr/src/RPM/BUILD/libkfbapi-1.0/BUILD-i586-alt-linux'
Scanning dependencies of target pofiles_32
make[2]: Leaving directory '/usr/src/RPM/BUILD/libkfbapi-1.0/BUILD-i586-alt-linux'
make[2]: Entering directory '/usr/src/RPM/BUILD/libkfbapi-1.0/BUILD-i586-alt-linux'
Scanning dependencies of target pofiles_27
make[2]: Leaving directory '/usr/src/RPM/BUILD/libkfbapi-1.0/BUILD-i586-alt-linux'
make[2]: Entering directory '/usr/src/RPM/BUILD/libkfbapi-1.0/BUILD-i586-alt-linux'
Scanning dependencies of target pofiles_28
make[2]: Leaving directory '/usr/src/RPM/BUILD/libkfbapi-1.0/BUILD-i586-alt-linux'
make[2]: Entering directory '/usr/src/RPM/BUILD/libkfbapi-1.0/BUILD-i586-alt-linux'
[ 27%] Generating libkfbapi.gmo
make[2]: Leaving directory '/usr/src/RPM/BUILD/libkfbapi-1.0/BUILD-i586-alt-linux'
make[2]: Entering directory '/usr/src/RPM/BUILD/libkfbapi-1.0/BUILD-i586-alt-linux'
Scanning dependencies of target pofiles_29
make[2]: Leaving directory '/usr/src/RPM/BUILD/libkfbapi-1.0/BUILD-i586-alt-linux'
make[2]: Entering directory '/usr/src/RPM/BUILD/libkfbapi-1.0/BUILD-i586-alt-linux'
[ 29%] Generating libkfbapi.gmo
make[2]: Leaving directory '/usr/src/RPM/BUILD/libkfbapi-1.0/BUILD-i586-alt-linux'
make[2]: Entering directory '/usr/src/RPM/BUILD/libkfbapi-1.0/BUILD-i586-alt-linux'
Scanning dependencies of target pofiles_31
make[2]: Leaving directory '/usr/src/RPM/BUILD/libkfbapi-1.0/BUILD-i586-alt-linux'
make[2]: Entering directory '/usr/src/RPM/BUILD/libkfbapi-1.0/BUILD-i586-alt-linux'
[ 30%] Generating libkfbapi.gmo
make[2]: Leaving directory '/usr/src/RPM/BUILD/libkfbapi-1.0/BUILD-i586-alt-linux'
make[2]: Entering directory '/usr/src/RPM/BUILD/libkfbapi-1.0/BUILD-i586-alt-linux'
[ 28%] Generating libkfbapi.gmo
make[2]: Leaving directory '/usr/src/RPM/BUILD/libkfbapi-1.0/BUILD-i586-alt-linux'
make[1]: Entering directory '/usr/src/RPM/BUILD/libkfbapi-1.0/BUILD-i586-alt-linux'
[ 32%] Built target pofiles_29
make[1]: Leaving directory '/usr/src/RPM/BUILD/libkfbapi-1.0/BUILD-i586-alt-linux'
make[1]: Entering directory '/usr/src/RPM/BUILD/libkfbapi-1.0/BUILD-i586-alt-linux'
[ 32%] Built target pofiles_26
make[1]: Leaving directory '/usr/src/RPM/BUILD/libkfbapi-1.0/BUILD-i586-alt-linux'
make[2]: Entering directory '/usr/src/RPM/BUILD/libkfbapi-1.0/BUILD-i586-alt-linux'
[ 32%] Generating libkfbapi.gmo
make[2]: Leaving directory '/usr/src/RPM/BUILD/libkfbapi-1.0/BUILD-i586-alt-linux'
make[2]: Entering directory '/usr/src/RPM/BUILD/libkfbapi-1.0/BUILD-i586-alt-linux'
[ 31%] Generating libkfbapi.gmo
make[2]: Leaving directory '/usr/src/RPM/BUILD/libkfbapi-1.0/BUILD-i586-alt-linux'
make[1]: Entering directory '/usr/src/RPM/BUILD/libkfbapi-1.0/BUILD-i586-alt-linux'
[ 32%] Built target pofiles_27
make[1]: Leaving directory '/usr/src/RPM/BUILD/libkfbapi-1.0/BUILD-i586-alt-linux'
make[1]: Entering directory '/usr/src/RPM/BUILD/libkfbapi-1.0/BUILD-i586-alt-linux'
[ 32%] Built target pofiles_30
make[1]: Leaving directory '/usr/src/RPM/BUILD/libkfbapi-1.0/BUILD-i586-alt-linux'
make[1]: Entering directory '/usr/src/RPM/BUILD/libkfbapi-1.0/BUILD-i586-alt-linux'
[ 33%] Built target pofiles_28
make[1]: Leaving directory '/usr/src/RPM/BUILD/libkfbapi-1.0/BUILD-i586-alt-linux'
make[2]: Entering directory '/usr/src/RPM/BUILD/libkfbapi-1.0/BUILD-i586-alt-linux'
Scanning dependencies of target pofiles_34
make[2]: Leaving directory '/usr/src/RPM/BUILD/libkfbapi-1.0/BUILD-i586-alt-linux'
make[2]: Entering directory '/usr/src/RPM/BUILD/libkfbapi-1.0/BUILD-i586-alt-linux'
[ 33%] Generating libkfbapi.gmo
make[2]: Leaving directory '/usr/src/RPM/BUILD/libkfbapi-1.0/BUILD-i586-alt-linux'
make[2]: Entering directory '/usr/src/RPM/BUILD/libkfbapi-1.0/BUILD-i586-alt-linux'
Scanning dependencies of target pofiles_33
make[2]: Leaving directory '/usr/src/RPM/BUILD/libkfbapi-1.0/BUILD-i586-alt-linux'
make[2]: Entering directory '/usr/src/RPM/BUILD/libkfbapi-1.0/BUILD-i586-alt-linux'
Scanning dependencies of target pofiles_35
make[2]: Leaving directory '/usr/src/RPM/BUILD/libkfbapi-1.0/BUILD-i586-alt-linux'
make[1]: Entering directory '/usr/src/RPM/BUILD/libkfbapi-1.0/BUILD-i586-alt-linux'
[ 33%] Built target pofiles_32
make[1]: Leaving directory '/usr/src/RPM/BUILD/libkfbapi-1.0/BUILD-i586-alt-linux'
make[2]: Entering directory '/usr/src/RPM/BUILD/libkfbapi-1.0/BUILD-i586-alt-linux'
Scanning dependencies of target pofiles_37
make[2]: Leaving directory '/usr/src/RPM/BUILD/libkfbapi-1.0/BUILD-i586-alt-linux'
make[2]: Entering directory '/usr/src/RPM/BUILD/libkfbapi-1.0/BUILD-i586-alt-linux'
Scanning dependencies of target pofiles_36
make[2]: Leaving directory '/usr/src/RPM/BUILD/libkfbapi-1.0/BUILD-i586-alt-linux'
make[2]: Entering directory '/usr/src/RPM/BUILD/libkfbapi-1.0/BUILD-i586-alt-linux'
[ 34%] Generating libkfbapi.gmo
make[2]: Leaving directory '/usr/src/RPM/BUILD/libkfbapi-1.0/BUILD-i586-alt-linux'
make[1]: Entering directory '/usr/src/RPM/BUILD/libkfbapi-1.0/BUILD-i586-alt-linux'
[ 34%] Built target pofiles_34
make[1]: Leaving directory '/usr/src/RPM/BUILD/libkfbapi-1.0/BUILD-i586-alt-linux'
make[1]: Entering directory '/usr/src/RPM/BUILD/libkfbapi-1.0/BUILD-i586-alt-linux'
[ 36%] Built target pofiles_31
make[1]: Leaving directory '/usr/src/RPM/BUILD/libkfbapi-1.0/BUILD-i586-alt-linux'
make[2]: Entering directory '/usr/src/RPM/BUILD/libkfbapi-1.0/BUILD-i586-alt-linux'
Scanning dependencies of target pofiles_39
make[2]: Leaving directory '/usr/src/RPM/BUILD/libkfbapi-1.0/BUILD-i586-alt-linux'
make[2]: Entering directory '/usr/src/RPM/BUILD/libkfbapi-1.0/BUILD-i586-alt-linux'
[ 37%] Generating libkfbapi.gmo
make[2]: Leaving directory '/usr/src/RPM/BUILD/libkfbapi-1.0/BUILD-i586-alt-linux'
make[2]: Entering directory '/usr/src/RPM/BUILD/libkfbapi-1.0/BUILD-i586-alt-linux'
Scanning dependencies of target pofiles_38
make[2]: Leaving directory '/usr/src/RPM/BUILD/libkfbapi-1.0/BUILD-i586-alt-linux'
make[2]: Entering directory '/usr/src/RPM/BUILD/libkfbapi-1.0/BUILD-i586-alt-linux'
[ 35%] Generating libkfbapi.gmo
make[2]: Leaving directory '/usr/src/RPM/BUILD/libkfbapi-1.0/BUILD-i586-alt-linux'
make[2]: Entering directory '/usr/src/RPM/BUILD/libkfbapi-1.0/BUILD-i586-alt-linux'
[ 36%] Generating libkfbapi.gmo
make[2]: Leaving directory '/usr/src/RPM/BUILD/libkfbapi-1.0/BUILD-i586-alt-linux'
make[1]: Entering directory '/usr/src/RPM/BUILD/libkfbapi-1.0/BUILD-i586-alt-linux'
[ 40%] Built target pofiles_37
make[1]: Leaving directory '/usr/src/RPM/BUILD/libkfbapi-1.0/BUILD-i586-alt-linux'
make[1]: Entering directory '/usr/src/RPM/BUILD/libkfbapi-1.0/BUILD-i586-alt-linux'
[ 40%] Built target pofiles_35
make[1]: Leaving directory '/usr/src/RPM/BUILD/libkfbapi-1.0/BUILD-i586-alt-linux'
make[2]: Entering directory '/usr/src/RPM/BUILD/libkfbapi-1.0/BUILD-i586-alt-linux'
[ 40%] Generating libkfbapi.gmo
make[2]: Leaving directory '/usr/src/RPM/BUILD/libkfbapi-1.0/BUILD-i586-alt-linux'
make[2]: Entering directory '/usr/src/RPM/BUILD/libkfbapi-1.0/BUILD-i586-alt-linux'
[ 38%] Generating libkfbapi.gmo
make[2]: Leaving directory '/usr/src/RPM/BUILD/libkfbapi-1.0/BUILD-i586-alt-linux'
make[2]: Entering directory '/usr/src/RPM/BUILD/libkfbapi-1.0/BUILD-i586-alt-linux'
Scanning dependencies of target pofiles_41
make[2]: Leaving directory '/usr/src/RPM/BUILD/libkfbapi-1.0/BUILD-i586-alt-linux'
make[1]: Entering directory '/usr/src/RPM/BUILD/libkfbapi-1.0/BUILD-i586-alt-linux'
[ 40%] Built target pofiles_33
make[1]: Leaving directory '/usr/src/RPM/BUILD/libkfbapi-1.0/BUILD-i586-alt-linux'
make[1]: Entering directory '/usr/src/RPM/BUILD/libkfbapi-1.0/BUILD-i586-alt-linux'
[ 40%] Built target pofiles_36
make[1]: Leaving directory '/usr/src/RPM/BUILD/libkfbapi-1.0/BUILD-i586-alt-linux'
make[2]: Entering directory '/usr/src/RPM/BUILD/libkfbapi-1.0/BUILD-i586-alt-linux'
[ 41%] Generating libkfbapi.gmo
make[2]: Leaving directory '/usr/src/RPM/BUILD/libkfbapi-1.0/BUILD-i586-alt-linux'
make[1]: Entering directory '/usr/src/RPM/BUILD/libkfbapi-1.0/BUILD-i586-alt-linux'
[ 41%] Built target pofiles_39
make[1]: Leaving directory '/usr/src/RPM/BUILD/libkfbapi-1.0/BUILD-i586-alt-linux'
make[1]: Entering directory '/usr/src/RPM/BUILD/libkfbapi-1.0/BUILD-i586-alt-linux'
[ 41%] Built target pofiles_41
make[1]: Leaving directory '/usr/src/RPM/BUILD/libkfbapi-1.0/BUILD-i586-alt-linux'
make[2]: Entering directory '/usr/src/RPM/BUILD/libkfbapi-1.0/BUILD-i586-alt-linux'
Scanning dependencies of target pofiles_42
make[2]: Leaving directory '/usr/src/RPM/BUILD/libkfbapi-1.0/BUILD-i586-alt-linux'
make[2]: Entering directory '/usr/src/RPM/BUILD/libkfbapi-1.0/BUILD-i586-alt-linux'
Scanning dependencies of target pofiles_40
make[2]: Leaving directory '/usr/src/RPM/BUILD/libkfbapi-1.0/BUILD-i586-alt-linux'
make[2]: Entering directory '/usr/src/RPM/BUILD/libkfbapi-1.0/BUILD-i586-alt-linux'
[ 42%] Generating libkfbapi.gmo
make[2]: Leaving directory '/usr/src/RPM/BUILD/libkfbapi-1.0/BUILD-i586-alt-linux'
make[2]: Entering directory '/usr/src/RPM/BUILD/libkfbapi-1.0/BUILD-i586-alt-linux'
[ 43%] Generating libkfbapi.gmo
make[2]: Leaving directory '/usr/src/RPM/BUILD/libkfbapi-1.0/BUILD-i586-alt-linux'
make[1]: Entering directory '/usr/src/RPM/BUILD/libkfbapi-1.0/BUILD-i586-alt-linux'
[ 44%] Built target pofiles_38
make[1]: Leaving directory '/usr/src/RPM/BUILD/libkfbapi-1.0/BUILD-i586-alt-linux'
make[2]: Entering directory '/usr/src/RPM/BUILD/libkfbapi-1.0/BUILD-i586-alt-linux'
[ 44%] Generating libkfbapi.gmo
make[2]: Leaving directory '/usr/src/RPM/BUILD/libkfbapi-1.0/BUILD-i586-alt-linux'
make[1]: Entering directory '/usr/src/RPM/BUILD/libkfbapi-1.0/BUILD-i586-alt-linux'
[ 44%] Built target pofiles_42
make[1]: Leaving directory '/usr/src/RPM/BUILD/libkfbapi-1.0/BUILD-i586-alt-linux'
make[1]: Entering directory '/usr/src/RPM/BUILD/libkfbapi-1.0/BUILD-i586-alt-linux'
[ 44%] Built target pofiles_40
make[1]: Leaving directory '/usr/src/RPM/BUILD/libkfbapi-1.0/BUILD-i586-alt-linux'
make[2]: Entering directory '/usr/src/RPM/BUILD/libkfbapi-1.0/BUILD-i586-alt-linux'
Generating notejob.moc
Generating notificationsmarkreadjob.moc
Generating authenticationdialog.moc
Generating postaddjob.moc
Generating userinfojob.moc
Generating friendjob.moc
Generating photojob.moc
Generating eventjob.moc
Generating postjob.moc
Generating friendlistjob.moc
Generating facebookjobs.moc
Generating noteaddjob.moc
Generating moc_eventslistjob.cpp
Generating moc_listjobbase.cpp
Generating moc_notificationslistjob.cpp
Generating moc_allpostslistjob.cpp
Generating moc_getcommentsjob.cpp
Generating moc_noteslistjob.cpp
Generating moc_getlikesjob.cpp
Generating moc_pagedlistjob.cpp
Generating moc_alleventslistjob.cpp
Generating moc_postslistjob.cpp
Generating moc_allnoteslistjob.cpp
make[2]: Leaving directory '/usr/src/RPM/BUILD/libkfbapi-1.0/BUILD-i586-alt-linux'
make[1]: Entering directory '/usr/src/RPM/BUILD/libkfbapi-1.0/BUILD-i586-alt-linux'
[ 44%] Built target kfbapi_automoc
make[1]: Leaving directory '/usr/src/RPM/BUILD/libkfbapi-1.0/BUILD-i586-alt-linux'
make[2]: Entering directory '/usr/src/RPM/BUILD/libkfbapi-1.0/BUILD-i586-alt-linux'
[ 45%] Generating moc_appinfoparser_p.cpp
make[2]: Leaving directory '/usr/src/RPM/BUILD/libkfbapi-1.0/BUILD-i586-alt-linux'
make[2]: Entering directory '/usr/src/RPM/BUILD/libkfbapi-1.0/BUILD-i586-alt-linux'
[ 46%] Generating moc_commentinfoparser_p.cpp
make[2]: Leaving directory '/usr/src/RPM/BUILD/libkfbapi-1.0/BUILD-i586-alt-linux'
make[2]: Entering directory '/usr/src/RPM/BUILD/libkfbapi-1.0/BUILD-i586-alt-linux'
[ 48%] Generating moc_likeinfoparser_p.cpp
make[2]: Leaving directory '/usr/src/RPM/BUILD/libkfbapi-1.0/BUILD-i586-alt-linux'
make[2]: Entering directory '/usr/src/RPM/BUILD/libkfbapi-1.0/BUILD-i586-alt-linux'
[ 49%] Generating moc_userinfoparser_p.cpp
make[2]: Leaving directory '/usr/src/RPM/BUILD/libkfbapi-1.0/BUILD-i586-alt-linux'
make[2]: Entering directory '/usr/src/RPM/BUILD/libkfbapi-1.0/BUILD-i586-alt-linux'
[ 53%] Generating moc_propertyinfoparser_p.cpp
make[2]: Leaving directory '/usr/src/RPM/BUILD/libkfbapi-1.0/BUILD-i586-alt-linux'
make[2]: Entering directory '/usr/src/RPM/BUILD/libkfbapi-1.0/BUILD-i586-alt-linux'
[ 47%] Generating moc_eventinfoparser_p.cpp
make[2]: Leaving directory '/usr/src/RPM/BUILD/libkfbapi-1.0/BUILD-i586-alt-linux'
make[2]: Entering directory '/usr/src/RPM/BUILD/libkfbapi-1.0/BUILD-i586-alt-linux'
[ 50%] Generating moc_notificationinfoparser_p.cpp
make[2]: Leaving directory '/usr/src/RPM/BUILD/libkfbapi-1.0/BUILD-i586-alt-linux'
make[2]: Entering directory '/usr/src/RPM/BUILD/libkfbapi-1.0/BUILD-i586-alt-linux'
[ 52%] Generating moc_postinfoparser_p.cpp
make[2]: Leaving directory '/usr/src/RPM/BUILD/libkfbapi-1.0/BUILD-i586-alt-linux'
make[2]: Entering directory '/usr/src/RPM/BUILD/libkfbapi-1.0/BUILD-i586-alt-linux'
[ 51%] Generating moc_noteinfoparser_p.cpp
make[2]: Leaving directory '/usr/src/RPM/BUILD/libkfbapi-1.0/BUILD-i586-alt-linux'
make[2]: Entering directory '/usr/src/RPM/BUILD/libkfbapi-1.0/BUILD-i586-alt-linux'
Scanning dependencies of target kfbapi
make[2]: Leaving directory '/usr/src/RPM/BUILD/libkfbapi-1.0/BUILD-i586-alt-linux'
make[2]: Entering directory '/usr/src/RPM/BUILD/libkfbapi-1.0/BUILD-i586-alt-linux'
[ 58%] Building CXX object libkfbapi/CMakeFiles/kfbapi.dir/kfbapi_automoc.o
make[2]: Leaving directory '/usr/src/RPM/BUILD/libkfbapi-1.0/BUILD-i586-alt-linux'
make[2]: Entering directory '/usr/src/RPM/BUILD/libkfbapi-1.0/BUILD-i586-alt-linux'
[ 55%] Building CXX object libkfbapi/CMakeFiles/kfbapi.dir/userinfo.o
make[2]: Leaving directory '/usr/src/RPM/BUILD/libkfbapi-1.0/BUILD-i586-alt-linux'
make[2]: Entering directory '/usr/src/RPM/BUILD/libkfbapi-1.0/BUILD-i586-alt-linux'
[ 60%] Building CXX object libkfbapi/CMakeFiles/kfbapi.dir/friendlistjob.o
make[2]: Leaving directory '/usr/src/RPM/BUILD/libkfbapi-1.0/BUILD-i586-alt-linux'
make[2]: Entering directory '/usr/src/RPM/BUILD/libkfbapi-1.0/BUILD-i586-alt-linux'
[ 62%] Building CXX object libkfbapi/CMakeFiles/kfbapi.dir/friendjob.o
make[2]: Leaving directory '/usr/src/RPM/BUILD/libkfbapi-1.0/BUILD-i586-alt-linux'
make[2]: Entering directory '/usr/src/RPM/BUILD/libkfbapi-1.0/BUILD-i586-alt-linux'
[ 61%] Building CXX object libkfbapi/CMakeFiles/kfbapi.dir/photojob.o
make[2]: Leaving directory '/usr/src/RPM/BUILD/libkfbapi-1.0/BUILD-i586-alt-linux'
make[2]: Entering directory '/usr/src/RPM/BUILD/libkfbapi-1.0/BUILD-i586-alt-linux'
[ 57%] Building CXX object libkfbapi/CMakeFiles/kfbapi.dir/allpostslistjob.o
make[2]: Leaving directory '/usr/src/RPM/BUILD/libkfbapi-1.0/BUILD-i586-alt-linux'
make[2]: Entering directory '/usr/src/RPM/BUILD/libkfbapi-1.0/BUILD-i586-alt-linux'
[ 63%] Building CXX object libkfbapi/CMakeFiles/kfbapi.dir/eventslistjob.o
make[2]: Leaving directory '/usr/src/RPM/BUILD/libkfbapi-1.0/BUILD-i586-alt-linux'
make[2]: Entering directory '/usr/src/RPM/BUILD/libkfbapi-1.0/BUILD-i586-alt-linux'
[ 66%] Building CXX object libkfbapi/CMakeFiles/kfbapi.dir/alleventslistjob.o
make[2]: Leaving directory '/usr/src/RPM/BUILD/libkfbapi-1.0/BUILD-i586-alt-linux'
make[2]: Entering directory '/usr/src/RPM/BUILD/libkfbapi-1.0/BUILD-i586-alt-linux'
[ 56%] Building CXX object libkfbapi/CMakeFiles/kfbapi.dir/userinfojob.o
make[2]: Leaving directory '/usr/src/RPM/BUILD/libkfbapi-1.0/BUILD-i586-alt-linux'
make[2]: Entering directory '/usr/src/RPM/BUILD/libkfbapi-1.0/BUILD-i586-alt-linux'
[ 65%] Building CXX object libkfbapi/CMakeFiles/kfbapi.dir/util.o
make[2]: Leaving directory '/usr/src/RPM/BUILD/libkfbapi-1.0/BUILD-i586-alt-linux'
make[2]: Entering directory '/usr/src/RPM/BUILD/libkfbapi-1.0/BUILD-i586-alt-linux'
[ 69%] Building CXX object libkfbapi/CMakeFiles/kfbapi.dir/noteslistjob.o
make[2]: Leaving directory '/usr/src/RPM/BUILD/libkfbapi-1.0/BUILD-i586-alt-linux'
make[2]: Entering directory '/usr/src/RPM/BUILD/libkfbapi-1.0/BUILD-i586-alt-linux'
[ 67%] Building CXX object libkfbapi/CMakeFiles/kfbapi.dir/eventjob.o
make[2]: Leaving directory '/usr/src/RPM/BUILD/libkfbapi-1.0/BUILD-i586-alt-linux'
make[2]: Entering directory '/usr/src/RPM/BUILD/libkfbapi-1.0/BUILD-i586-alt-linux'
[ 54%] Building CXX object libkfbapi/CMakeFiles/kfbapi.dir/authenticationdialog.o
make[2]: Leaving directory '/usr/src/RPM/BUILD/libkfbapi-1.0/BUILD-i586-alt-linux'
make[2]: Entering directory '/usr/src/RPM/BUILD/libkfbapi-1.0/BUILD-i586-alt-linux'
[ 64%] Building CXX object libkfbapi/CMakeFiles/kfbapi.dir/eventinfo.o
/usr/src/RPM/BUILD/libkfbapi-1.0/libkfbapi/eventinfo.cpp: In member function 'KFbAPI::EventPtr KFbAPI::EventInfo::asEvent() const':
/usr/src/RPM/BUILD/libkfbapi-1.0/libkfbapi/eventinfo.cpp:134:45: warning: 'void KCalCore::Event::setHasEndDate(bool)' is deprecated [-Wdeprecated-declarations]
     event->setHasEndDate(endTime().isValid());
                                             ^
In file included from /usr/include/kde4/KDE/KCalCore/Event:1,
                 from /usr/src/RPM/BUILD/libkfbapi-1.0/libkfbapi/eventinfo.h:27,
                 from /usr/src/RPM/BUILD/libkfbapi-1.0/libkfbapi/eventinfo.cpp:20:
/usr/include/kde4/KDE/KCalCore/../../kcalcore/event.h:142:30: note: declared here
     KCALCORE_DEPRECATED void setHasEndDate(bool b);
                              ^~~~~~~~~~~~~
make[2]: Leaving directory '/usr/src/RPM/BUILD/libkfbapi-1.0/BUILD-i586-alt-linux'
make[2]: Entering directory '/usr/src/RPM/BUILD/libkfbapi-1.0/BUILD-i586-alt-linux'
[ 70%] Building CXX object libkfbapi/CMakeFiles/kfbapi.dir/allnoteslistjob.o
make[2]: Leaving directory '/usr/src/RPM/BUILD/libkfbapi-1.0/BUILD-i586-alt-linux'
make[2]: Entering directory '/usr/src/RPM/BUILD/libkfbapi-1.0/BUILD-i586-alt-linux'
[ 71%] Building CXX object libkfbapi/CMakeFiles/kfbapi.dir/notejob.o
make[2]: Leaving directory '/usr/src/RPM/BUILD/libkfbapi-1.0/BUILD-i586-alt-linux'
make[2]: Entering directory '/usr/src/RPM/BUILD/libkfbapi-1.0/BUILD-i586-alt-linux'
[ 68%] Building CXX object libkfbapi/CMakeFiles/kfbapi.dir/noteinfo.o
make[2]: Leaving directory '/usr/src/RPM/BUILD/libkfbapi-1.0/BUILD-i586-alt-linux'
make[2]: Entering directory '/usr/src/RPM/BUILD/libkfbapi-1.0/BUILD-i586-alt-linux'
[ 77%] Building CXX object libkfbapi/CMakeFiles/kfbapi.dir/postjob.o
make[2]: Leaving directory '/usr/src/RPM/BUILD/libkfbapi-1.0/BUILD-i586-alt-linux'
make[2]: Entering directory '/usr/src/RPM/BUILD/libkfbapi-1.0/BUILD-i586-alt-linux'
[ 72%] Building CXX object libkfbapi/CMakeFiles/kfbapi.dir/noteaddjob.o
make[2]: Leaving directory '/usr/src/RPM/BUILD/libkfbapi-1.0/BUILD-i586-alt-linux'
make[2]: Entering directory '/usr/src/RPM/BUILD/libkfbapi-1.0/BUILD-i586-alt-linux'
[ 81%] Building CXX object libkfbapi/CMakeFiles/kfbapi.dir/propertyinfo.o
make[2]: Leaving directory '/usr/src/RPM/BUILD/libkfbapi-1.0/BUILD-i586-alt-linux'
make[2]: Entering directory '/usr/src/RPM/BUILD/libkfbapi-1.0/BUILD-i586-alt-linux'
[ 74%] Building CXX object libkfbapi/CMakeFiles/kfbapi.dir/pagedlistjob.o
make[2]: Leaving directory '/usr/src/RPM/BUILD/libkfbapi-1.0/BUILD-i586-alt-linux'
make[2]: Entering directory '/usr/src/RPM/BUILD/libkfbapi-1.0/BUILD-i586-alt-linux'
[ 76%] Building CXX object libkfbapi/CMakeFiles/kfbapi.dir/postinfo.o
make[2]: Leaving directory '/usr/src/RPM/BUILD/libkfbapi-1.0/BUILD-i586-alt-linux'
make[2]: Entering directory '/usr/src/RPM/BUILD/libkfbapi-1.0/BUILD-i586-alt-linux'
[ 78%] Building CXX object libkfbapi/CMakeFiles/kfbapi.dir/postaddjob.o
make[2]: Leaving directory '/usr/src/RPM/BUILD/libkfbapi-1.0/BUILD-i586-alt-linux'
make[2]: Entering directory '/usr/src/RPM/BUILD/libkfbapi-1.0/BUILD-i586-alt-linux'
[ 82%] Building CXX object libkfbapi/CMakeFiles/kfbapi.dir/appinfo.o
make[2]: Leaving directory '/usr/src/RPM/BUILD/libkfbapi-1.0/BUILD-i586-alt-linux'
make[2]: Entering directory '/usr/src/RPM/BUILD/libkfbapi-1.0/BUILD-i586-alt-linux'
[ 75%] Building CXX object libkfbapi/CMakeFiles/kfbapi.dir/listjobbase.o
/usr/src/RPM/BUILD/libkfbapi-1.0/libkfbapi/listjobbase.cpp: In member function 'virtual void KFbAPI::ListJobBase::handleItems(const QVariant&)':
/usr/src/RPM/BUILD/libkfbapi-1.0/libkfbapi/listjobbase.cpp:55:47: warning: unused parameter 'root' [-Wunused-parameter]
 void ListJobBase::handleItems(const QVariant &root)
                               ~~~~~~~~~~~~~~~~^~~~
make[2]: Leaving directory '/usr/src/RPM/BUILD/libkfbapi-1.0/BUILD-i586-alt-linux'
make[2]: Entering directory '/usr/src/RPM/BUILD/libkfbapi-1.0/BUILD-i586-alt-linux'
[ 88%] Building CXX object libkfbapi/CMakeFiles/kfbapi.dir/getcommentsjob.o
make[2]: Leaving directory '/usr/src/RPM/BUILD/libkfbapi-1.0/BUILD-i586-alt-linux'
make[2]: Entering directory '/usr/src/RPM/BUILD/libkfbapi-1.0/BUILD-i586-alt-linux'
[ 86%] Building CXX object libkfbapi/CMakeFiles/kfbapi.dir/notificationslistjob.o
make[2]: Leaving directory '/usr/src/RPM/BUILD/libkfbapi-1.0/BUILD-i586-alt-linux'
make[2]: Entering directory '/usr/src/RPM/BUILD/libkfbapi-1.0/BUILD-i586-alt-linux'
[ 90%] Building CXX object libkfbapi/CMakeFiles/kfbapi.dir/moc_appinfoparser_p.o
make[2]: Leaving directory '/usr/src/RPM/BUILD/libkfbapi-1.0/BUILD-i586-alt-linux'
make[2]: Entering directory '/usr/src/RPM/BUILD/libkfbapi-1.0/BUILD-i586-alt-linux'
[ 80%] Building CXX object libkfbapi/CMakeFiles/kfbapi.dir/postslistjob.o
make[2]: Leaving directory '/usr/src/RPM/BUILD/libkfbapi-1.0/BUILD-i586-alt-linux'
make[2]: Entering directory '/usr/src/RPM/BUILD/libkfbapi-1.0/BUILD-i586-alt-linux'
[ 91%] Building CXX object libkfbapi/CMakeFiles/kfbapi.dir/moc_commentinfoparser_p.o
make[2]: Leaving directory '/usr/src/RPM/BUILD/libkfbapi-1.0/BUILD-i586-alt-linux'
make[2]: Entering directory '/usr/src/RPM/BUILD/libkfbapi-1.0/BUILD-i586-alt-linux'
[ 92%] Building CXX object libkfbapi/CMakeFiles/kfbapi.dir/moc_eventinfoparser_p.o
make[2]: Leaving directory '/usr/src/RPM/BUILD/libkfbapi-1.0/BUILD-i586-alt-linux'
make[2]: Entering directory '/usr/src/RPM/BUILD/libkfbapi-1.0/BUILD-i586-alt-linux'
[ 94%] Building CXX object libkfbapi/CMakeFiles/kfbapi.dir/moc_noteinfoparser_p.o
make[2]: Leaving directory '/usr/src/RPM/BUILD/libkfbapi-1.0/BUILD-i586-alt-linux'
make[2]: Entering directory '/usr/src/RPM/BUILD/libkfbapi-1.0/BUILD-i586-alt-linux'
[ 95%] Building CXX object libkfbapi/CMakeFiles/kfbapi.dir/moc_notificationinfoparser_p.o
make[2]: Leaving directory '/usr/src/RPM/BUILD/libkfbapi-1.0/BUILD-i586-alt-linux'
make[2]: Entering directory '/usr/src/RPM/BUILD/libkfbapi-1.0/BUILD-i586-alt-linux'
[ 89%] Building CXX object libkfbapi/CMakeFiles/kfbapi.dir/notificationsmarkreadjob.o
make[2]: Leaving directory '/usr/src/RPM/BUILD/libkfbapi-1.0/BUILD-i586-alt-linux'
make[2]: Entering directory '/usr/src/RPM/BUILD/libkfbapi-1.0/BUILD-i586-alt-linux'
[ 96%] Building CXX object libkfbapi/CMakeFiles/kfbapi.dir/moc_postinfoparser_p.o
make[2]: Leaving directory '/usr/src/RPM/BUILD/libkfbapi-1.0/BUILD-i586-alt-linux'
make[2]: Entering directory '/usr/src/RPM/BUILD/libkfbapi-1.0/BUILD-i586-alt-linux'
[ 97%] Building CXX object libkfbapi/CMakeFiles/kfbapi.dir/moc_propertyinfoparser_p.o
make[2]: Leaving directory '/usr/src/RPM/BUILD/libkfbapi-1.0/BUILD-i586-alt-linux'
make[2]: Entering directory '/usr/src/RPM/BUILD/libkfbapi-1.0/BUILD-i586-alt-linux'
[ 98%] Building CXX object libkfbapi/CMakeFiles/kfbapi.dir/moc_userinfoparser_p.o
make[2]: Leaving directory '/usr/src/RPM/BUILD/libkfbapi-1.0/BUILD-i586-alt-linux'
make[2]: Entering directory '/usr/src/RPM/BUILD/libkfbapi-1.0/BUILD-i586-alt-linux'
[ 84%] Building CXX object libkfbapi/CMakeFiles/kfbapi.dir/likeinfo.o
make[2]: Leaving directory '/usr/src/RPM/BUILD/libkfbapi-1.0/BUILD-i586-alt-linux'
make[2]: Entering directory '/usr/src/RPM/BUILD/libkfbapi-1.0/BUILD-i586-alt-linux'
[ 87%] Building CXX object libkfbapi/CMakeFiles/kfbapi.dir/getlikesjob.o
make[2]: Leaving directory '/usr/src/RPM/BUILD/libkfbapi-1.0/BUILD-i586-alt-linux'
make[2]: Entering directory '/usr/src/RPM/BUILD/libkfbapi-1.0/BUILD-i586-alt-linux'
[ 85%] Building CXX object libkfbapi/CMakeFiles/kfbapi.dir/notificationinfo.o
make[2]: Leaving directory '/usr/src/RPM/BUILD/libkfbapi-1.0/BUILD-i586-alt-linux'
make[2]: Entering directory '/usr/src/RPM/BUILD/libkfbapi-1.0/BUILD-i586-alt-linux'
[ 73%] Building CXX object libkfbapi/CMakeFiles/kfbapi.dir/facebookjobs.o
make[2]: Leaving directory '/usr/src/RPM/BUILD/libkfbapi-1.0/BUILD-i586-alt-linux'
make[2]: Entering directory '/usr/src/RPM/BUILD/libkfbapi-1.0/BUILD-i586-alt-linux'
[ 83%] Building CXX object libkfbapi/CMakeFiles/kfbapi.dir/commentinfo.o
make[2]: Leaving directory '/usr/src/RPM/BUILD/libkfbapi-1.0/BUILD-i586-alt-linux'
make[2]: Entering directory '/usr/src/RPM/BUILD/libkfbapi-1.0/BUILD-i586-alt-linux'
[ 93%] Building CXX object libkfbapi/CMakeFiles/kfbapi.dir/moc_likeinfoparser_p.o
make[2]: Leaving directory '/usr/src/RPM/BUILD/libkfbapi-1.0/BUILD-i586-alt-linux'
make[2]: Entering directory '/usr/src/RPM/BUILD/libkfbapi-1.0/BUILD-i586-alt-linux'
[100%] Linking CXX shared library ../lib/libkfbapi.so
make[2]: Leaving directory '/usr/src/RPM/BUILD/libkfbapi-1.0/BUILD-i586-alt-linux'
make[1]: Entering directory '/usr/src/RPM/BUILD/libkfbapi-1.0/BUILD-i586-alt-linux'
[100%] Built target kfbapi
make[1]: Leaving directory '/usr/src/RPM/BUILD/libkfbapi-1.0/BUILD-i586-alt-linux'
+ popd
~/RPM/BUILD/libkfbapi-1.0
+ exit 0
Executing(%install): /bin/sh -e /usr/src/tmp/rpm-tmp.20912
+ umask 022
+ /bin/mkdir -p /usr/src/RPM/BUILD
+ cd /usr/src/RPM/BUILD
+ /bin/chmod -Rf u+rwX -- /usr/src/tmp/libkfbapi-buildroot
+ :
+ /bin/rm -rf -- /usr/src/tmp/libkfbapi-buildroot
+ cd libkfbapi-1.0
+ __kde_install
+ make -C BUILD-i586-alt-linux DESTDIR=/usr/src/tmp/libkfbapi-buildroot install
make: Entering directory '/usr/src/RPM/BUILD/libkfbapi-1.0/BUILD-i586-alt-linux'
make[1]: Entering directory '/usr/src/RPM/BUILD/libkfbapi-1.0/BUILD-i586-alt-linux'
make[2]: Entering directory '/usr/src/RPM/BUILD/libkfbapi-1.0/BUILD-i586-alt-linux'
make[2]: Leaving directory '/usr/src/RPM/BUILD/libkfbapi-1.0/BUILD-i586-alt-linux'
make[2]: Entering directory '/usr/src/RPM/BUILD/libkfbapi-1.0/BUILD-i586-alt-linux'
make[2]: Leaving directory '/usr/src/RPM/BUILD/libkfbapi-1.0/BUILD-i586-alt-linux'
[  0%] Built target kfbapi_automoc
make[2]: Entering directory '/usr/src/RPM/BUILD/libkfbapi-1.0/BUILD-i586-alt-linux'
make[2]: Leaving directory '/usr/src/RPM/BUILD/libkfbapi-1.0/BUILD-i586-alt-linux'
[ 55%] Built target kfbapi
make[2]: Entering directory '/usr/src/RPM/BUILD/libkfbapi-1.0/BUILD-i586-alt-linux'
make[2]: Leaving directory '/usr/src/RPM/BUILD/libkfbapi-1.0/BUILD-i586-alt-linux'
[ 56%] Built target pofiles_1
make[2]: Entering directory '/usr/src/RPM/BUILD/libkfbapi-1.0/BUILD-i586-alt-linux'
make[2]: Leaving directory '/usr/src/RPM/BUILD/libkfbapi-1.0/BUILD-i586-alt-linux'
[ 57%] Built target pofiles_2
make[2]: Entering directory '/usr/src/RPM/BUILD/libkfbapi-1.0/BUILD-i586-alt-linux'
make[2]: Leaving directory '/usr/src/RPM/BUILD/libkfbapi-1.0/BUILD-i586-alt-linux'
[ 58%] Built target pofiles_3
make[2]: Entering directory '/usr/src/RPM/BUILD/libkfbapi-1.0/BUILD-i586-alt-linux'
make[2]: Leaving directory '/usr/src/RPM/BUILD/libkfbapi-1.0/BUILD-i586-alt-linux'
[ 60%] Built target pofiles_4
make[2]: Entering directory '/usr/src/RPM/BUILD/libkfbapi-1.0/BUILD-i586-alt-linux'
make[2]: Leaving directory '/usr/src/RPM/BUILD/libkfbapi-1.0/BUILD-i586-alt-linux'
[ 61%] Built target pofiles_5
make[2]: Entering directory '/usr/src/RPM/BUILD/libkfbapi-1.0/BUILD-i586-alt-linux'
make[2]: Leaving directory '/usr/src/RPM/BUILD/libkfbapi-1.0/BUILD-i586-alt-linux'
[ 62%] Built target pofiles_6
make[2]: Entering directory '/usr/src/RPM/BUILD/libkfbapi-1.0/BUILD-i586-alt-linux'
make[2]: Leaving directory '/usr/src/RPM/BUILD/libkfbapi-1.0/BUILD-i586-alt-linux'
[ 63%] Built target pofiles_7
make[2]: Entering directory '/usr/src/RPM/BUILD/libkfbapi-1.0/BUILD-i586-alt-linux'
make[2]: Leaving directory '/usr/src/RPM/BUILD/libkfbapi-1.0/BUILD-i586-alt-linux'
[ 64%] Built target pofiles_8
make[2]: Entering directory '/usr/src/RPM/BUILD/libkfbapi-1.0/BUILD-i586-alt-linux'
make[2]: Leaving directory '/usr/src/RPM/BUILD/libkfbapi-1.0/BUILD-i586-alt-linux'
[ 65%] Built target pofiles_9
make[2]: Entering directory '/usr/src/RPM/BUILD/libkfbapi-1.0/BUILD-i586-alt-linux'
make[2]: Leaving directory '/usr/src/RPM/BUILD/libkfbapi-1.0/BUILD-i586-alt-linux'
[ 66%] Built target pofiles_10
make[2]: Entering directory '/usr/src/RPM/BUILD/libkfbapi-1.0/BUILD-i586-alt-linux'
make[2]: Leaving directory '/usr/src/RPM/BUILD/libkfbapi-1.0/BUILD-i586-alt-linux'
[ 67%] Built target pofiles_11
make[2]: Entering directory '/usr/src/RPM/BUILD/libkfbapi-1.0/BUILD-i586-alt-linux'
make[2]: Leaving directory '/usr/src/RPM/BUILD/libkfbapi-1.0/BUILD-i586-alt-linux'
[ 68%] Built target pofiles_12
make[2]: Entering directory '/usr/src/RPM/BUILD/libkfbapi-1.0/BUILD-i586-alt-linux'
make[2]: Leaving directory '/usr/src/RPM/BUILD/libkfbapi-1.0/BUILD-i586-alt-linux'
[ 69%] Built target pofiles_13
make[2]: Entering directory '/usr/src/RPM/BUILD/libkfbapi-1.0/BUILD-i586-alt-linux'
make[2]: Leaving directory '/usr/src/RPM/BUILD/libkfbapi-1.0/BUILD-i586-alt-linux'
[ 70%] Built target pofiles_14
make[2]: Entering directory '/usr/src/RPM/BUILD/libkfbapi-1.0/BUILD-i586-alt-linux'
make[2]: Leaving directory '/usr/src/RPM/BUILD/libkfbapi-1.0/BUILD-i586-alt-linux'
[ 71%] Built target pofiles_15
make[2]: Entering directory '/usr/src/RPM/BUILD/libkfbapi-1.0/BUILD-i586-alt-linux'
make[2]: Leaving directory '/usr/src/RPM/BUILD/libkfbapi-1.0/BUILD-i586-alt-linux'
[ 72%] Built target pofiles_16
make[2]: Entering directory '/usr/src/RPM/BUILD/libkfbapi-1.0/BUILD-i586-alt-linux'
make[2]: Leaving directory '/usr/src/RPM/BUILD/libkfbapi-1.0/BUILD-i586-alt-linux'
[ 73%] Built target pofiles_17
make[2]: Entering directory '/usr/src/RPM/BUILD/libkfbapi-1.0/BUILD-i586-alt-linux'
make[2]: Leaving directory '/usr/src/RPM/BUILD/libkfbapi-1.0/BUILD-i586-alt-linux'
[ 74%] Built target pofiles_18
make[2]: Entering directory '/usr/src/RPM/BUILD/libkfbapi-1.0/BUILD-i586-alt-linux'
make[2]: Leaving directory '/usr/src/RPM/BUILD/libkfbapi-1.0/BUILD-i586-alt-linux'
[ 75%] Built target pofiles_19
make[2]: Entering directory '/usr/src/RPM/BUILD/libkfbapi-1.0/BUILD-i586-alt-linux'
make[2]: Leaving directory '/usr/src/RPM/BUILD/libkfbapi-1.0/BUILD-i586-alt-linux'
[ 76%] Built target pofiles_20
make[2]: Entering directory '/usr/src/RPM/BUILD/libkfbapi-1.0/BUILD-i586-alt-linux'
make[2]: Leaving directory '/usr/src/RPM/BUILD/libkfbapi-1.0/BUILD-i586-alt-linux'
[ 77%] Built target pofiles_21
make[2]: Entering directory '/usr/src/RPM/BUILD/libkfbapi-1.0/BUILD-i586-alt-linux'
make[2]: Leaving directory '/usr/src/RPM/BUILD/libkfbapi-1.0/BUILD-i586-alt-linux'
[ 78%] Built target pofiles_22
make[2]: Entering directory '/usr/src/RPM/BUILD/libkfbapi-1.0/BUILD-i586-alt-linux'
make[2]: Leaving directory '/usr/src/RPM/BUILD/libkfbapi-1.0/BUILD-i586-alt-linux'
[ 80%] Built target pofiles_23
make[2]: Entering directory '/usr/src/RPM/BUILD/libkfbapi-1.0/BUILD-i586-alt-linux'
make[2]: Leaving directory '/usr/src/RPM/BUILD/libkfbapi-1.0/BUILD-i586-alt-linux'
[ 81%] Built target pofiles_24
make[2]: Entering directory '/usr/src/RPM/BUILD/libkfbapi-1.0/BUILD-i586-alt-linux'
make[2]: Leaving directory '/usr/src/RPM/BUILD/libkfbapi-1.0/BUILD-i586-alt-linux'
[ 82%] Built target pofiles_25
make[2]: Entering directory '/usr/src/RPM/BUILD/libkfbapi-1.0/BUILD-i586-alt-linux'
make[2]: Leaving directory '/usr/src/RPM/BUILD/libkfbapi-1.0/BUILD-i586-alt-linux'
[ 83%] Built target pofiles_26
make[2]: Entering directory '/usr/src/RPM/BUILD/libkfbapi-1.0/BUILD-i586-alt-linux'
make[2]: Leaving directory '/usr/src/RPM/BUILD/libkfbapi-1.0/BUILD-i586-alt-linux'
[ 84%] Built target pofiles_27
make[2]: Entering directory '/usr/src/RPM/BUILD/libkfbapi-1.0/BUILD-i586-alt-linux'
make[2]: Leaving directory '/usr/src/RPM/BUILD/libkfbapi-1.0/BUILD-i586-alt-linux'
[ 85%] Built target pofiles_28
make[2]: Entering directory '/usr/src/RPM/BUILD/libkfbapi-1.0/BUILD-i586-alt-linux'
make[2]: Leaving directory '/usr/src/RPM/BUILD/libkfbapi-1.0/BUILD-i586-alt-linux'
[ 86%] Built target pofiles_29
make[2]: Entering directory '/usr/src/RPM/BUILD/libkfbapi-1.0/BUILD-i586-alt-linux'
make[2]: Leaving directory '/usr/src/RPM/BUILD/libkfbapi-1.0/BUILD-i586-alt-linux'
[ 87%] Built target pofiles_30
make[2]: Entering directory '/usr/src/RPM/BUILD/libkfbapi-1.0/BUILD-i586-alt-linux'
make[2]: Leaving directory '/usr/src/RPM/BUILD/libkfbapi-1.0/BUILD-i586-alt-linux'
[ 88%] Built target pofiles_31
make[2]: Entering directory '/usr/src/RPM/BUILD/libkfbapi-1.0/BUILD-i586-alt-linux'
make[2]: Leaving directory '/usr/src/RPM/BUILD/libkfbapi-1.0/BUILD-i586-alt-linux'
[ 89%] Built target pofiles_32
make[2]: Entering directory '/usr/src/RPM/BUILD/libkfbapi-1.0/BUILD-i586-alt-linux'
make[2]: Leaving directory '/usr/src/RPM/BUILD/libkfbapi-1.0/BUILD-i586-alt-linux'
[ 90%] Built target pofiles_33
make[2]: Entering directory '/usr/src/RPM/BUILD/libkfbapi-1.0/BUILD-i586-alt-linux'
make[2]: Leaving directory '/usr/src/RPM/BUILD/libkfbapi-1.0/BUILD-i586-alt-linux'
[ 91%] Built target pofiles_34
make[2]: Entering directory '/usr/src/RPM/BUILD/libkfbapi-1.0/BUILD-i586-alt-linux'
make[2]: Leaving directory '/usr/src/RPM/BUILD/libkfbapi-1.0/BUILD-i586-alt-linux'
[ 92%] Built target pofiles_35
make[2]: Entering directory '/usr/src/RPM/BUILD/libkfbapi-1.0/BUILD-i586-alt-linux'
make[2]: Leaving directory '/usr/src/RPM/BUILD/libkfbapi-1.0/BUILD-i586-alt-linux'
[ 93%] Built target pofiles_36
make[2]: Entering directory '/usr/src/RPM/BUILD/libkfbapi-1.0/BUILD-i586-alt-linux'
make[2]: Leaving directory '/usr/src/RPM/BUILD/libkfbapi-1.0/BUILD-i586-alt-linux'
[ 94%] Built target pofiles_37
make[2]: Entering directory '/usr/src/RPM/BUILD/libkfbapi-1.0/BUILD-i586-alt-linux'
make[2]: Leaving directory '/usr/src/RPM/BUILD/libkfbapi-1.0/BUILD-i586-alt-linux'
[ 95%] Built target pofiles_38
make[2]: Entering directory '/usr/src/RPM/BUILD/libkfbapi-1.0/BUILD-i586-alt-linux'
make[2]: Leaving directory '/usr/src/RPM/BUILD/libkfbapi-1.0/BUILD-i586-alt-linux'
[ 96%] Built target pofiles_39
make[2]: Entering directory '/usr/src/RPM/BUILD/libkfbapi-1.0/BUILD-i586-alt-linux'
make[2]: Leaving directory '/usr/src/RPM/BUILD/libkfbapi-1.0/BUILD-i586-alt-linux'
[ 97%] Built target pofiles_40
make[2]: Entering directory '/usr/src/RPM/BUILD/libkfbapi-1.0/BUILD-i586-alt-linux'
make[2]: Leaving directory '/usr/src/RPM/BUILD/libkfbapi-1.0/BUILD-i586-alt-linux'
[ 98%] Built target pofiles_41
make[2]: Entering directory '/usr/src/RPM/BUILD/libkfbapi-1.0/BUILD-i586-alt-linux'
make[2]: Leaving directory '/usr/src/RPM/BUILD/libkfbapi-1.0/BUILD-i586-alt-linux'
[100%] Built target pofiles_42
make[1]: Leaving directory '/usr/src/RPM/BUILD/libkfbapi-1.0/BUILD-i586-alt-linux'
Install the project...
-- Install configuration: "Release"
-- Installing: /usr/src/tmp/libkfbapi-buildroot/usr/lib/pkgconfig/LibKFbAPI.pc
-- Installing: /usr/src/tmp/libkfbapi-buildroot/usr/lib/cmake/LibKFbAPI/LibKFbAPIConfig.cmake
-- Installing: /usr/src/tmp/libkfbapi-buildroot/usr/lib/cmake/LibKFbAPI/LibKFbAPIConfigVersion.cmake
-- Installing: /usr/src/tmp/libkfbapi-buildroot/usr/lib/cmake/LibKFbAPI/LibKFbAPITargetsWithPrefix.cmake
-- Installing: /usr/src/tmp/libkfbapi-buildroot/usr/lib/cmake/LibKFbAPI/LibKFbAPITargetsWithPrefix-release.cmake
-- Installing: /usr/src/tmp/libkfbapi-buildroot/usr/lib/libkfbapi.so.1.0
-- Installing: /usr/src/tmp/libkfbapi-buildroot/usr/lib/libkfbapi.so.1
-- Installing: /usr/src/tmp/libkfbapi-buildroot/usr/lib/libkfbapi.so
-- Installing: /usr/src/tmp/libkfbapi-buildroot/usr/include/kde4/libkfbapi/alleventslistjob.h
-- Installing: /usr/src/tmp/libkfbapi-buildroot/usr/include/kde4/libkfbapi/allnoteslistjob.h
-- Installing: /usr/src/tmp/libkfbapi-buildroot/usr/include/kde4/libkfbapi/allpostslistjob.h
-- Installing: /usr/src/tmp/libkfbapi-buildroot/usr/include/kde4/libkfbapi/appinfo.h
-- Installing: /usr/src/tmp/libkfbapi-buildroot/usr/include/kde4/libkfbapi/authenticationdialog.h
-- Installing: /usr/src/tmp/libkfbapi-buildroot/usr/include/kde4/libkfbapi/commentinfo.h
-- Installing: /usr/src/tmp/libkfbapi-buildroot/usr/include/kde4/libkfbapi/eventjob.h
-- Installing: /usr/src/tmp/libkfbapi-buildroot/usr/include/kde4/libkfbapi/eventinfo.h
-- Installing: /usr/src/tmp/libkfbapi-buildroot/usr/include/kde4/libkfbapi/eventslistjob.h
-- Installing: /usr/src/tmp/libkfbapi-buildroot/usr/include/kde4/libkfbapi/facebookjobs.h
-- Installing: /usr/src/tmp/libkfbapi-buildroot/usr/include/kde4/libkfbapi/friendlistjob.h
-- Installing: /usr/src/tmp/libkfbapi-buildroot/usr/include/kde4/libkfbapi/friendjob.h
-- Installing: /usr/src/tmp/libkfbapi-buildroot/usr/include/kde4/libkfbapi/getcommentsjob.h
-- Installing: /usr/src/tmp/libkfbapi-buildroot/usr/include/kde4/libkfbapi/getlikesjob.h
-- Installing: /usr/src/tmp/libkfbapi-buildroot/usr/include/kde4/libkfbapi/libkfbapi_export.h
-- Installing: /usr/src/tmp/libkfbapi-buildroot/usr/include/kde4/libkfbapi/likeinfo.h
-- Installing: /usr/src/tmp/libkfbapi-buildroot/usr/include/kde4/libkfbapi/listjobbase.h
-- Installing: /usr/src/tmp/libkfbapi-buildroot/usr/include/kde4/libkfbapi/noteinfo.h
-- Installing: /usr/src/tmp/libkfbapi-buildroot/usr/include/kde4/libkfbapi/noteslistjob.h
-- Installing: /usr/src/tmp/libkfbapi-buildroot/usr/include/kde4/libkfbapi/notejob.h
-- Installing: /usr/src/tmp/libkfbapi-buildroot/usr/include/kde4/libkfbapi/noteaddjob.h
-- Installing: /usr/src/tmp/libkfbapi-buildroot/usr/include/kde4/libkfbapi/notificationinfo.h
-- Installing: /usr/src/tmp/libkfbapi-buildroot/usr/include/kde4/libkfbapi/notificationslistjob.h
-- Installing: /usr/src/tmp/libkfbapi-buildroot/usr/include/kde4/libkfbapi/notificationsmarkreadjob.h
-- Installing: /usr/src/tmp/libkfbapi-buildroot/usr/include/kde4/libkfbapi/pagedlistjob.h
-- Installing: /usr/src/tmp/libkfbapi-buildroot/usr/include/kde4/libkfbapi/photojob.h
-- Installing: /usr/src/tmp/libkfbapi-buildroot/usr/include/kde4/libkfbapi/postinfo.h
-- Installing: /usr/src/tmp/libkfbapi-buildroot/usr/include/kde4/libkfbapi/postjob.h
-- Installing: /usr/src/tmp/libkfbapi-buildroot/usr/include/kde4/libkfbapi/postaddjob.h
-- Installing: /usr/src/tmp/libkfbapi-buildroot/usr/include/kde4/libkfbapi/postslistjob.h
-- Installing: /usr/src/tmp/libkfbapi-buildroot/usr/include/kde4/libkfbapi/propertyinfo.h
-- Installing: /usr/src/tmp/libkfbapi-buildroot/usr/include/kde4/libkfbapi/userinfojob.h
-- Installing: /usr/src/tmp/libkfbapi-buildroot/usr/include/kde4/libkfbapi/userinfo.h
-- Installing: /usr/src/tmp/libkfbapi-buildroot/usr/share/kde4/locale/ar/LC_MESSAGES/libkfbapi.mo
-- Installing: /usr/src/tmp/libkfbapi-buildroot/usr/share/kde4/locale/be/LC_MESSAGES/libkfbapi.mo
-- Installing: /usr/src/tmp/libkfbapi-buildroot/usr/share/kde4/locale/bs/LC_MESSAGES/libkfbapi.mo
-- Installing: /usr/src/tmp/libkfbapi-buildroot/usr/share/kde4/locale/cs/LC_MESSAGES/libkfbapi.mo
-- Installing: /usr/src/tmp/libkfbapi-buildroot/usr/share/kde4/locale/da/LC_MESSAGES/libkfbapi.mo
-- Installing: /usr/src/tmp/libkfbapi-buildroot/usr/share/kde4/locale/de/LC_MESSAGES/libkfbapi.mo
-- Installing: /usr/src/tmp/libkfbapi-buildroot/usr/share/kde4/locale/el/LC_MESSAGES/libkfbapi.mo
-- Installing: /usr/src/tmp/libkfbapi-buildroot/usr/share/kde4/locale/en_GB/LC_MESSAGES/libkfbapi.mo
-- Installing: /usr/src/tmp/libkfbapi-buildroot/usr/share/kde4/locale/eo/LC_MESSAGES/libkfbapi.mo
-- Installing: /usr/src/tmp/libkfbapi-buildroot/usr/share/kde4/locale/es/LC_MESSAGES/libkfbapi.mo
-- Installing: /usr/src/tmp/libkfbapi-buildroot/usr/share/kde4/locale/et/LC_MESSAGES/libkfbapi.mo
-- Installing: /usr/src/tmp/libkfbapi-buildroot/usr/share/kde4/locale/fi/LC_MESSAGES/libkfbapi.mo
-- Installing: /usr/src/tmp/libkfbapi-buildroot/usr/share/kde4/locale/fr/LC_MESSAGES/libkfbapi.mo
-- Installing: /usr/src/tmp/libkfbapi-buildroot/usr/share/kde4/locale/ga/LC_MESSAGES/libkfbapi.mo
-- Installing: /usr/src/tmp/libkfbapi-buildroot/usr/share/kde4/locale/gl/LC_MESSAGES/libkfbapi.mo
-- Installing: /usr/src/tmp/libkfbapi-buildroot/usr/share/kde4/locale/hi/LC_MESSAGES/libkfbapi.mo
-- Installing: /usr/src/tmp/libkfbapi-buildroot/usr/share/kde4/locale/hu/LC_MESSAGES/libkfbapi.mo
-- Installing: /usr/src/tmp/libkfbapi-buildroot/usr/share/kde4/locale/it/LC_MESSAGES/libkfbapi.mo
-- Installing: /usr/src/tmp/libkfbapi-buildroot/usr/share/kde4/locale/ja/LC_MESSAGES/libkfbapi.mo
-- Installing: /usr/src/tmp/libkfbapi-buildroot/usr/share/kde4/locale/kk/LC_MESSAGES/libkfbapi.mo
-- Installing: /usr/src/tmp/libkfbapi-buildroot/usr/share/kde4/locale/km/LC_MESSAGES/libkfbapi.mo
-- Installing: /usr/src/tmp/libkfbapi-buildroot/usr/share/kde4/locale/lt/LC_MESSAGES/libkfbapi.mo
-- Installing: /usr/src/tmp/libkfbapi-buildroot/usr/share/kde4/locale/mai/LC_MESSAGES/libkfbapi.mo
-- Installing: /usr/src/tmp/libkfbapi-buildroot/usr/share/kde4/locale/mr/LC_MESSAGES/libkfbapi.mo
-- Installing: /usr/src/tmp/libkfbapi-buildroot/usr/share/kde4/locale/nb/LC_MESSAGES/libkfbapi.mo
-- Installing: /usr/src/tmp/libkfbapi-buildroot/usr/share/kde4/locale/nds/LC_MESSAGES/libkfbapi.mo
-- Installing: /usr/src/tmp/libkfbapi-buildroot/usr/share/kde4/locale/nl/LC_MESSAGES/libkfbapi.mo
-- Installing: /usr/src/tmp/libkfbapi-buildroot/usr/share/kde4/locale/nn/LC_MESSAGES/libkfbapi.mo
-- Installing: /usr/src/tmp/libkfbapi-buildroot/usr/share/kde4/locale/oc/LC_MESSAGES/libkfbapi.mo
-- Installing: /usr/src/tmp/libkfbapi-buildroot/usr/share/kde4/locale/pa/LC_MESSAGES/libkfbapi.mo
-- Installing: /usr/src/tmp/libkfbapi-buildroot/usr/share/kde4/locale/pl/LC_MESSAGES/libkfbapi.mo
-- Installing: /usr/src/tmp/libkfbapi-buildroot/usr/share/kde4/locale/pt/LC_MESSAGES/libkfbapi.mo
-- Installing: /usr/src/tmp/libkfbapi-buildroot/usr/share/kde4/locale/pt_BR/LC_MESSAGES/libkfbapi.mo
-- Installing: /usr/src/tmp/libkfbapi-buildroot/usr/share/kde4/locale/ro/LC_MESSAGES/libkfbapi.mo
-- Installing: /usr/src/tmp/libkfbapi-buildroot/usr/share/kde4/locale/ru/LC_MESSAGES/libkfbapi.mo
-- Installing: /usr/src/tmp/libkfbapi-buildroot/usr/share/kde4/locale/sk/LC_MESSAGES/libkfbapi.mo
-- Installing: /usr/src/tmp/libkfbapi-buildroot/usr/share/kde4/locale/sl/LC_MESSAGES/libkfbapi.mo
-- Installing: /usr/src/tmp/libkfbapi-buildroot/usr/share/kde4/locale/sv/LC_MESSAGES/libkfbapi.mo
-- Installing: /usr/src/tmp/libkfbapi-buildroot/usr/share/kde4/locale/tr/LC_MESSAGES/libkfbapi.mo
-- Installing: /usr/src/tmp/libkfbapi-buildroot/usr/share/kde4/locale/ug/LC_MESSAGES/libkfbapi.mo
-- Installing: /usr/src/tmp/libkfbapi-buildroot/usr/share/kde4/locale/uk/LC_MESSAGES/libkfbapi.mo
-- Installing: /usr/src/tmp/libkfbapi-buildroot/usr/share/kde4/locale/zh_TW/LC_MESSAGES/libkfbapi.mo
make: Leaving directory '/usr/src/RPM/BUILD/libkfbapi-1.0/BUILD-i586-alt-linux'
+ mkdir -p /usr/src/tmp/libkfbapi-buildroot//usr/lib/kde4/devel
+ pushd /usr/src/tmp/libkfbapi-buildroot//usr/lib
~/tmp/libkfbapi-buildroot/usr/lib ~/RPM/BUILD/libkfbapi-1.0
+ for l in lib*.so
+ '[' -L libkfbapi.so ']'
++ readlink libkfbapi.so
+ f=libkfbapi.so.1
++ relative /usr/src/tmp/libkfbapi-buildroot//usr/lib/libkfbapi.so.1 /usr/src/tmp/libkfbapi-buildroot//usr/lib/kde4/devel/libkfbapi.so.1
+ ln -sf ../../libkfbapi.so.1 /usr/src/tmp/libkfbapi-buildroot//usr/lib/kde4/devel/libkfbapi.so
+ rm -f libkfbapi.so
+ popd
~/RPM/BUILD/libkfbapi-1.0
+ '[' -d /usr/src/tmp/libkfbapi-buildroot//usr/lib/kconf_update_bin ']'
+ '[' -d /usr/src/tmp/libkfbapi-buildroot//usr/share/kde4/share ']'
+ '[' -d /usr/src/tmp/libkfbapi-buildroot//usr/share/kde4/bin ']'
+ '[' -d /usr/src/tmp/libkfbapi-buildroot//etc/xdg/menus ']'
+ '[' -d /usr/src/tmp/libkfbapi-buildroot//usr/share/kde4/apps/cmake/modules/ ']'
+ /usr/lib/rpm/find-lang libkfbapi
+ /usr/lib/rpm/brp-alt
Cleaning files in /usr/src/tmp/libkfbapi-buildroot (auto)
mode of './usr/lib/libkfbapi.so.1.0' changed from 0755 (rwxr-xr-x) to 0644 (rw-r--r--)
Verifying and fixing files in /usr/src/tmp/libkfbapi-buildroot (binconfig,pkgconfig,libtool,desktop)
/usr/lib/pkgconfig/LibKFbAPI.pc: Libs: '-L${libdir} -lkfbapi' --> '-lkfbapi'
Checking contents of files in /usr/src/tmp/libkfbapi-buildroot/ (default)
Compressing files in /usr/src/tmp/libkfbapi-buildroot (auto)
Adjusting library links in /usr/src/tmp/libkfbapi-buildroot
./usr/lib:
	libkfbapi.so.1 -> libkfbapi.so.1.0
Verifying ELF objects in /usr/src/tmp/libkfbapi-buildroot (arch=normal,fhs=normal,lfs=relaxed,lint=relaxed,rpath=normal,stack=normal,textrel=normal,unresolved=normal)
Hardlinking identical .pyc and .pyo files
Processing files: libkfbapi1-1.0-alt2
Finding Provides (using /usr/lib/rpm/find-provides)
Executing: /bin/sh -e /usr/src/tmp/rpm-tmp.TNpcQW
find-provides: running scripts (alternatives,debuginfo,gir,lib,pam,perl,pkgconfig,python,shell,typelib)
lib.prov: /usr/src/tmp/libkfbapi-buildroot/usr/lib/libkfbapi.so.1: 646 symbols, 20 bpp
Finding Requires (using /usr/lib/rpm/find-requires)
Executing: /bin/sh -e /usr/src/tmp/rpm-tmp.S88iDZ
find-requires: running scripts (cpp,debuginfo,files,gir-js,gir-python,gir,lib,pam,perl,pkgconfig,pkgconfiglib,python,rpmlib,shebang,shell,static,symlinks,typelib)
Provides: libkfbapi.so.1 = set:nd2koysNAqwmJuSgYObs0R1A5qmXxBiosO15pg9io5zE8c4ZxQLSWlDF4jQea69Lrmgkh6lNmyRA12KRG5q7lxwazmB96Z9OBgxCtUmwQHMQGsuwsMHVZmoFB0aaNqPnxOd1fU7EJyTULuVhR1Ua90ObZzea0Bi9bPTeq7OeGmxTPakpxElcjY3NgKZj8Ko4im2VZKpaakCwWYpma1p2gQ50upin535xM7xvieC3M14lzLooxu7mMFoLdTkZiesVQsIV3uy4VIualw9RCsqKpXq8PKZC6BCPQp9Gi2ZqNpk7PEQ57hvqINbXngkZcmkxFmZwLanWkza4JNP3gm9YMGaSJXu4pYyF6zv4K61ZnR08I5A2W0sS1lUldauIZDMoCSFMPIvncSBvqoM66F58WsD5SA7Z5BeJvzsLhgXST9UjxoRKh3t84JS6W0k9teMgVM89yafN9bGmxRrq8WML4AipXUBGqSLm2R0RQWXvh7PyZJ02k078oclyQbVUmDv9h6SVVXqc2bDL6s2ZIGnZg6khPf6l6kyIfyWwuQZCrzZ8gehAaLmGPd1i1LtSHNwowbfu2Y8htkNwvqZ5EMkgMmaB8qHuT75rzV806S41l8cTwhjINiobsep2QDhLVhggTrQJ1XFzxKlIprhFxZ8QT9oiRWYWVNYvAjHuGzU08GThy0DoL5PosdcaoIwdcnvIxYNdTT1Xf354VyfYMGPcQs3p07ecBMwzPS4tFkoSSOPnyC48yb1zWns2ZAZoKKIbI6eEZdQGxaRDRhYc8gw3sOZG5zWbqqg8L843tm67YqKQHPOVoToZ9h66MeO91hsLeO9Pj2LGy0V8ZnEZJ4Tkafe5qaPy34Z5XuVILUrweGPXpODo8Y9h2MzsboeAa0Zl3xgXFgM8vEE0EzbJS3us2502sWYrzVDgRUhHZs2MvpdFUw48ZAlnxG0dSeDnYBARszNtqMTJpUGxGFcZl4AwNXEAAwBsqGJJ0aMezZFUZsoAbFZkbCnCosofl0IuvtUQjAYWqmu9jWjZ8Ob2yM1Ion2IaMjnPMp8FlZgQRS58yglbFMoVm0h7nirtbxbv8C1AnNHN7xQdRpPnjmISSgddoxmnvwZAL8hJUnMun3UT7OikZLfxHE2Zf7ZfjMk5gbq8VVOpruyEcX3Sh1zy1yf6tSNp2lXxuGNZcKJb0XNz7S6CfQmsf4z0PkyUaVc2cUUPjhaahCmwClANiSGOwwjZjOocG7Ivz5afaBUVrWqtH4RBgKTNO0pygmadngABSDn4WaVtjhoqIKjV6K1V11z5IMs5UEtkPcPfP4RFnbjAmf
Requires: libQtCore.so.4 >= set:piFOUekvbE5M8GdZfVjEgu28YBDgB3Yk4Z2vZLQtlQBq7ePYrATFMOk2C2lbhmGPDSwRUNWkQZvIcb0fDaYcC5KTNGzp0MKZqUIn0IBLs5Y3chN7QbahrZecLBMijJnAYdCvvMlKYVvfeUwYSoeYvBsxCZ7myrYaegWhqv6b04ZmA0ZktGZgyCKZJRtJqE38nJnxG5ngcZ75yyQdmjmBe1UBOtpPTJSC0m93VR1lt2ybGM3w4HJaXOxfcQgZenV72BvMeRTZr0cu33z9, libQtGui.so.4 >= set:rlR9KZ1ZHH8ILQ4Ng9Z4OOk6nGxFopwcAb1FTPHGFJlXQ6HrNJNYAJ1tsZ2dI5fwDyZJgNOc53VZJRp3MQa3uf1UhdSbFRMbZnOLBNk9vHmIQZtTMJJl0FAZDGVGYZ51FnxQzphblYJTe5igf8B4Cg8eFEaUwGNCoXbvIZnqBbTefWiylQf3rQvPsyVXT7cuZot, libQtWebKit.so.4 >= set:oksSdBLX2sfillSBwINWHXqSScj3, libc.so.6(GLIBC_2.0), libc.so.6(GLIBC_2.1.3), libc.so.6(GLIBC_2.4), libgcc_s.so.1(GCC_3.0), libkabc.so.4 >= set:ojIyPh10FxC9umZyZbx3Wwq7ZB95rZ7qU1kZrtjhEpw8BcI47d0wG9Q29A, libkcalcore.so.4 >= set:okjHpWWjZmWt8XUbJOcBtphJbUCaryBz18Y3Rnv0, libkdecore.so.5 >= set:qkyBkk4cb7MhmfLTeRoffTtuYcYOSYrIxp7iHmnHBJ991wWw9ZDjp9O3NBgf5DiLwJjxQxCgNeCcej4SkxZIZjj7ynXNPWcT6wnYvxQyqHxlbOUIl8zhVI3RrsC2zeld9DjGMAEmMZ8tVJkca3, libkdeui.so.5 >= set:ql8vAMwIZi4Cob18ZduhZcemUtIRGwZzY07a6NgwpDj6dFoCM1gyZ5pqA48H04, libkdewebkit.so.5 >= set:lkZ5U1, libkio.so.5 >= set:pmkZ9xGpGejwKqLZAUv6, libkmime.so.4 >= set:ol419zNI2BimtxZ9hZ0vLFpb98, libkpimutils.so.4 >= set:kjtl4, libqjson.so.0 >= set:li9nAd7RBXQ2AU5pyEr, libstdc++.so.6(CXXABI_1.3), libstdc++.so.6(CXXABI_1.3.9), libstdc++.so.6(GLIBCXX_3.4), rtld(GNU_HASH)
Requires(rpmlib): rpmlib(SetVersions)
Finding debuginfo files (using /usr/lib/rpm/find-debuginfo-files)
Executing: /bin/sh -e /usr/src/tmp/rpm-tmp.lVNtBz
Creating libkfbapi1-debuginfo package
Processing files: libkfbapi-devel-1.0-alt2
Finding Provides (using /usr/lib/rpm/find-provides)
Executing: /bin/sh -e /usr/src/tmp/rpm-tmp.V225Gr
find-provides: running scripts (alternatives,debuginfo,gir,lib,pam,perl,pkgconfig,python,shell,typelib)
Finding Requires (using /usr/lib/rpm/find-requires)
Executing: /bin/sh -e /usr/src/tmp/rpm-tmp.b9bLus
find-requires: running scripts (cpp,debuginfo,files,gir-js,gir-python,gir,lib,pam,perl,pkgconfig,pkgconfiglib,python,rpmlib,shebang,shell,static,symlinks,typelib)
/usr/src/tmp/libkfbapi-buildroot/usr/include/kde4/libkfbapi/appinfo.h:25:10: fatal error: QSharedPointer: No such file or directory
 #include <QSharedPointer>
          ^~~~~~~~~~~~~~~~
compilation terminated.
cpp.req: /usr/src/tmp/libkfbapi-buildroot/usr/include/kde4/libkfbapi/appinfo.h: cpp failed, trying c++ mode
In file included from /usr/src/tmp/libkfbapi-buildroot/usr/include/kde4/libkfbapi/libkfbapi_export.h:23,
                 from /usr/src/tmp/libkfbapi-buildroot/usr/include/kde4/libkfbapi/appinfo.h:23:
/usr/include/kde4/kdemacros.h:162:11: fatal error: QtCore/qglobal.h: No such file or directory
 # include <QtCore/qglobal.h>
           ^~~~~~~~~~~~~~~~~~
compilation terminated.
cpp.req: WARNING: /usr/src/tmp/libkfbapi-buildroot/usr/include/kde4/libkfbapi/appinfo.h: cpp failed
In file included from /usr/src/tmp/libkfbapi-buildroot/usr/include/kde4/libkfbapi/notejob.h:23:
/usr/src/tmp/libkfbapi-buildroot/usr/include/kde4/libkfbapi/facebookjobs.h:27:10: fatal error: KJob: No such file or directory
 #include <KJob>
          ^~~~~~
compilation terminated.
cpp.req: /usr/src/tmp/libkfbapi-buildroot/usr/include/kde4/libkfbapi/notejob.h: cpp failed, trying c++ mode
In file included from /usr/src/tmp/libkfbapi-buildroot/usr/include/kde4/libkfbapi/libkfbapi_export.h:23,
                 from /usr/src/tmp/libkfbapi-buildroot/usr/include/kde4/libkfbapi/facebookjobs.h:25,
                 from /usr/src/tmp/libkfbapi-buildroot/usr/include/kde4/libkfbapi/notejob.h:23:
/usr/include/kde4/kdemacros.h:162:11: fatal error: QtCore/qglobal.h: No such file or directory
 # include <QtCore/qglobal.h>
           ^~~~~~~~~~~~~~~~~~
compilation terminated.
cpp.req: WARNING: /usr/src/tmp/libkfbapi-buildroot/usr/include/kde4/libkfbapi/notejob.h: cpp failed
In file included from /usr/src/tmp/libkfbapi-buildroot/usr/include/kde4/libkfbapi/postjob.h:23:
/usr/src/tmp/libkfbapi-buildroot/usr/include/kde4/libkfbapi/facebookjobs.h:27:10: fatal error: KJob: No such file or directory
 #include <KJob>
          ^~~~~~
compilation terminated.
cpp.req: /usr/src/tmp/libkfbapi-buildroot/usr/include/kde4/libkfbapi/postjob.h: cpp failed, trying c++ mode
In file included from /usr/src/tmp/libkfbapi-buildroot/usr/include/kde4/libkfbapi/libkfbapi_export.h:23,
                 from /usr/src/tmp/libkfbapi-buildroot/usr/include/kde4/libkfbapi/facebookjobs.h:25,
                 from /usr/src/tmp/libkfbapi-buildroot/usr/include/kde4/libkfbapi/postjob.h:23:
/usr/include/kde4/kdemacros.h:162:11: fatal error: QtCore/qglobal.h: No such file or directory
 # include <QtCore/qglobal.h>
           ^~~~~~~~~~~~~~~~~~
compilation terminated.
cpp.req: WARNING: /usr/src/tmp/libkfbapi-buildroot/usr/include/kde4/libkfbapi/postjob.h: cpp failed
In file included from /usr/src/tmp/libkfbapi-buildroot/usr/include/kde4/libkfbapi/eventjob.h:23:
/usr/src/tmp/libkfbapi-buildroot/usr/include/kde4/libkfbapi/facebookjobs.h:27:10: fatal error: KJob: No such file or directory
 #include <KJob>
          ^~~~~~
compilation terminated.
cpp.req: /usr/src/tmp/libkfbapi-buildroot/usr/include/kde4/libkfbapi/eventjob.h: cpp failed, trying c++ mode
In file included from /usr/src/tmp/libkfbapi-buildroot/usr/include/kde4/libkfbapi/libkfbapi_export.h:23,
                 from /usr/src/tmp/libkfbapi-buildroot/usr/include/kde4/libkfbapi/facebookjobs.h:25,
                 from /usr/src/tmp/libkfbapi-buildroot/usr/include/kde4/libkfbapi/eventjob.h:23:
/usr/include/kde4/kdemacros.h:162:11: fatal error: QtCore/qglobal.h: No such file or directory
 # include <QtCore/qglobal.h>
           ^~~~~~~~~~~~~~~~~~
compilation terminated.
cpp.req: WARNING: /usr/src/tmp/libkfbapi-buildroot/usr/include/kde4/libkfbapi/eventjob.h: cpp failed
In file included from /usr/src/tmp/libkfbapi-buildroot/usr/include/kde4/libkfbapi/likeinfo.h:24:
/usr/src/tmp/libkfbapi-buildroot/usr/include/kde4/libkfbapi/userinfo.h:25:10: fatal error: KABC/Addressee: No such file or directory
 #include <KABC/Addressee>
          ^~~~~~~~~~~~~~~~
compilation terminated.
cpp.req: /usr/src/tmp/libkfbapi-buildroot/usr/include/kde4/libkfbapi/likeinfo.h: cpp failed, trying c++ mode
In file included from /usr/src/tmp/libkfbapi-buildroot/usr/include/kde4/libkfbapi/libkfbapi_export.h:23,
                 from /usr/src/tmp/libkfbapi-buildroot/usr/include/kde4/libkfbapi/likeinfo.h:23:
/usr/include/kde4/kdemacros.h:162:11: fatal error: QtCore/qglobal.h: No such file or directory
 # include <QtCore/qglobal.h>
           ^~~~~~~~~~~~~~~~~~
compilation terminated.
cpp.req: WARNING: /usr/src/tmp/libkfbapi-buildroot/usr/include/kde4/libkfbapi/likeinfo.h: cpp failed
/usr/src/tmp/libkfbapi-buildroot/usr/include/kde4/libkfbapi/noteinfo.h:25:10: fatal error: KMime/Message: No such file or directory
 #include <KMime/Message>
          ^~~~~~~~~~~~~~~
compilation terminated.
cpp.req: /usr/src/tmp/libkfbapi-buildroot/usr/include/kde4/libkfbapi/noteinfo.h: cpp failed, trying c++ mode
In file included from /usr/src/tmp/libkfbapi-buildroot/usr/include/kde4/libkfbapi/libkfbapi_export.h:23,
                 from /usr/src/tmp/libkfbapi-buildroot/usr/include/kde4/libkfbapi/noteinfo.h:23:
/usr/include/kde4/kdemacros.h:162:11: fatal error: QtCore/qglobal.h: No such file or directory
 # include <QtCore/qglobal.h>
           ^~~~~~~~~~~~~~~~~~
compilation terminated.
cpp.req: WARNING: /usr/src/tmp/libkfbapi-buildroot/usr/include/kde4/libkfbapi/noteinfo.h: cpp failed
In file included from /usr/src/tmp/libkfbapi-buildroot/usr/include/kde4/libkfbapi/photojob.h:24:
/usr/src/tmp/libkfbapi-buildroot/usr/include/kde4/libkfbapi/facebookjobs.h:27:10: fatal error: KJob: No such file or directory
 #include <KJob>
          ^~~~~~
compilation terminated.
cpp.req: /usr/src/tmp/libkfbapi-buildroot/usr/include/kde4/libkfbapi/photojob.h: cpp failed, trying c++ mode
In file included from /usr/src/tmp/libkfbapi-buildroot/usr/include/kde4/libkfbapi/libkfbapi_export.h:23,
                 from /usr/src/tmp/libkfbapi-buildroot/usr/include/kde4/libkfbapi/photojob.h:23:
/usr/include/kde4/kdemacros.h:162:11: fatal error: QtCore/qglobal.h: No such file or directory
 # include <QtCore/qglobal.h>
           ^~~~~~~~~~~~~~~~~~
compilation terminated.
cpp.req: WARNING: /usr/src/tmp/libkfbapi-buildroot/usr/include/kde4/libkfbapi/photojob.h: cpp failed
In file included from /usr/src/tmp/libkfbapi-buildroot/usr/include/kde4/libkfbapi/postinfo.h:24:
/usr/src/tmp/libkfbapi-buildroot/usr/include/kde4/libkfbapi/userinfo.h:25:10: fatal error: KABC/Addressee: No such file or directory
 #include <KABC/Addressee>
          ^~~~~~~~~~~~~~~~
compilation terminated.
cpp.req: /usr/src/tmp/libkfbapi-buildroot/usr/include/kde4/libkfbapi/postinfo.h: cpp failed, trying c++ mode
In file included from /usr/src/tmp/libkfbapi-buildroot/usr/include/kde4/libkfbapi/libkfbapi_export.h:23,
                 from /usr/src/tmp/libkfbapi-buildroot/usr/include/kde4/libkfbapi/postinfo.h:23:
/usr/include/kde4/kdemacros.h:162:11: fatal error: QtCore/qglobal.h: No such file or directory
 # include <QtCore/qglobal.h>
           ^~~~~~~~~~~~~~~~~~
compilation terminated.
cpp.req: WARNING: /usr/src/tmp/libkfbapi-buildroot/usr/include/kde4/libkfbapi/postinfo.h: cpp failed
/usr/src/tmp/libkfbapi-buildroot/usr/include/kde4/libkfbapi/userinfo.h:25:10: fatal error: KABC/Addressee: No such file or directory
 #include <KABC/Addressee>
          ^~~~~~~~~~~~~~~~
compilation terminated.
cpp.req: /usr/src/tmp/libkfbapi-buildroot/usr/include/kde4/libkfbapi/userinfo.h: cpp failed, trying c++ mode
In file included from /usr/src/tmp/libkfbapi-buildroot/usr/include/kde4/libkfbapi/libkfbapi_export.h:23,
                 from /usr/src/tmp/libkfbapi-buildroot/usr/include/kde4/libkfbapi/userinfo.h:23:
/usr/include/kde4/kdemacros.h:162:11: fatal error: QtCore/qglobal.h: No such file or directory
 # include <QtCore/qglobal.h>
           ^~~~~~~~~~~~~~~~~~
compilation terminated.
cpp.req: WARNING: /usr/src/tmp/libkfbapi-buildroot/usr/include/kde4/libkfbapi/userinfo.h: cpp failed
/usr/src/tmp/libkfbapi-buildroot/usr/include/kde4/libkfbapi/eventinfo.h:25:10: fatal error: KDateTime: No such file or directory
 #include <KDateTime>
          ^~~~~~~~~~~
compilation terminated.
cpp.req: /usr/src/tmp/libkfbapi-buildroot/usr/include/kde4/libkfbapi/eventinfo.h: cpp failed, trying c++ mode
In file included from /usr/src/tmp/libkfbapi-buildroot/usr/include/kde4/libkfbapi/libkfbapi_export.h:23,
                 from /usr/src/tmp/libkfbapi-buildroot/usr/include/kde4/libkfbapi/eventinfo.h:23:
/usr/include/kde4/kdemacros.h:162:11: fatal error: QtCore/qglobal.h: No such file or directory
 # include <QtCore/qglobal.h>
           ^~~~~~~~~~~~~~~~~~
compilation terminated.
cpp.req: WARNING: /usr/src/tmp/libkfbapi-buildroot/usr/include/kde4/libkfbapi/eventinfo.h: cpp failed
In file included from /usr/src/tmp/libkfbapi-buildroot/usr/include/kde4/libkfbapi/friendjob.h:23:
/usr/src/tmp/libkfbapi-buildroot/usr/include/kde4/libkfbapi/facebookjobs.h:27:10: fatal error: KJob: No such file or directory
 #include <KJob>
          ^~~~~~
compilation terminated.
cpp.req: /usr/src/tmp/libkfbapi-buildroot/usr/include/kde4/libkfbapi/friendjob.h: cpp failed, trying c++ mode
In file included from /usr/src/tmp/libkfbapi-buildroot/usr/include/kde4/libkfbapi/libkfbapi_export.h:23,
                 from /usr/src/tmp/libkfbapi-buildroot/usr/include/kde4/libkfbapi/facebookjobs.h:25,
                 from /usr/src/tmp/libkfbapi-buildroot/usr/include/kde4/libkfbapi/friendjob.h:23:
/usr/include/kde4/kdemacros.h:162:11: fatal error: QtCore/qglobal.h: No such file or directory
 # include <QtCore/qglobal.h>
           ^~~~~~~~~~~~~~~~~~
compilation terminated.
cpp.req: WARNING: /usr/src/tmp/libkfbapi-buildroot/usr/include/kde4/libkfbapi/friendjob.h: cpp failed
In file included from /usr/src/tmp/libkfbapi-buildroot/usr/include/kde4/libkfbapi/noteaddjob.h:23:
/usr/src/tmp/libkfbapi-buildroot/usr/include/kde4/libkfbapi/facebookjobs.h:27:10: fatal error: KJob: No such file or directory
 #include <KJob>
          ^~~~~~
compilation terminated.
cpp.req: /usr/src/tmp/libkfbapi-buildroot/usr/include/kde4/libkfbapi/noteaddjob.h: cpp failed, trying c++ mode
In file included from /usr/src/tmp/libkfbapi-buildroot/usr/include/kde4/libkfbapi/libkfbapi_export.h:23,
                 from /usr/src/tmp/libkfbapi-buildroot/usr/include/kde4/libkfbapi/facebookjobs.h:25,
                 from /usr/src/tmp/libkfbapi-buildroot/usr/include/kde4/libkfbapi/noteaddjob.h:23:
/usr/include/kde4/kdemacros.h:162:11: fatal error: QtCore/qglobal.h: No such file or directory
 # include <QtCore/qglobal.h>
           ^~~~~~~~~~~~~~~~~~
compilation terminated.
cpp.req: WARNING: /usr/src/tmp/libkfbapi-buildroot/usr/include/kde4/libkfbapi/noteaddjob.h: cpp failed
In file included from /usr/src/tmp/libkfbapi-buildroot/usr/include/kde4/libkfbapi/postaddjob.h:23:
/usr/src/tmp/libkfbapi-buildroot/usr/include/kde4/libkfbapi/facebookjobs.h:27:10: fatal error: KJob: No such file or directory
 #include <KJob>
          ^~~~~~
compilation terminated.
cpp.req: /usr/src/tmp/libkfbapi-buildroot/usr/include/kde4/libkfbapi/postaddjob.h: cpp failed, trying c++ mode
In file included from /usr/src/tmp/libkfbapi-buildroot/usr/include/kde4/libkfbapi/libkfbapi_export.h:23,
                 from /usr/src/tmp/libkfbapi-buildroot/usr/include/kde4/libkfbapi/facebookjobs.h:25,
                 from /usr/src/tmp/libkfbapi-buildroot/usr/include/kde4/libkfbapi/postaddjob.h:23:
/usr/include/kde4/kdemacros.h:162:11: fatal error: QtCore/qglobal.h: No such file or directory
 # include <QtCore/qglobal.h>
           ^~~~~~~~~~~~~~~~~~
compilation terminated.
cpp.req: WARNING: /usr/src/tmp/libkfbapi-buildroot/usr/include/kde4/libkfbapi/postaddjob.h: cpp failed
In file included from /usr/src/tmp/libkfbapi-buildroot/usr/include/kde4/libkfbapi/commentinfo.h:24:
/usr/src/tmp/libkfbapi-buildroot/usr/include/kde4/libkfbapi/userinfo.h:25:10: fatal error: KABC/Addressee: No such file or directory
 #include <KABC/Addressee>
          ^~~~~~~~~~~~~~~~
compilation terminated.
cpp.req: /usr/src/tmp/libkfbapi-buildroot/usr/include/kde4/libkfbapi/commentinfo.h: cpp failed, trying c++ mode
In file included from /usr/src/tmp/libkfbapi-buildroot/usr/include/kde4/libkfbapi/libkfbapi_export.h:23,
                 from /usr/src/tmp/libkfbapi-buildroot/usr/include/kde4/libkfbapi/commentinfo.h:23:
/usr/include/kde4/kdemacros.h:162:11: fatal error: QtCore/qglobal.h: No such file or directory
 # include <QtCore/qglobal.h>
           ^~~~~~~~~~~~~~~~~~
compilation terminated.
cpp.req: WARNING: /usr/src/tmp/libkfbapi-buildroot/usr/include/kde4/libkfbapi/commentinfo.h: cpp failed
In file included from /usr/src/tmp/libkfbapi-buildroot/usr/include/kde4/libkfbapi/getlikesjob.h:23:
/usr/src/tmp/libkfbapi-buildroot/usr/include/kde4/libkfbapi/facebookjobs.h:27:10: fatal error: KJob: No such file or directory
 #include <KJob>
          ^~~~~~
compilation terminated.
cpp.req: /usr/src/tmp/libkfbapi-buildroot/usr/include/kde4/libkfbapi/getlikesjob.h: cpp failed, trying c++ mode
In file included from /usr/src/tmp/libkfbapi-buildroot/usr/include/kde4/libkfbapi/libkfbapi_export.h:23,
                 from /usr/src/tmp/libkfbapi-buildroot/usr/include/kde4/libkfbapi/facebookjobs.h:25,
                 from /usr/src/tmp/libkfbapi-buildroot/usr/include/kde4/libkfbapi/getlikesjob.h:23:
/usr/include/kde4/kdemacros.h:162:11: fatal error: QtCore/qglobal.h: No such file or directory
 # include <QtCore/qglobal.h>
           ^~~~~~~~~~~~~~~~~~
compilation terminated.
cpp.req: WARNING: /usr/src/tmp/libkfbapi-buildroot/usr/include/kde4/libkfbapi/getlikesjob.h: cpp failed
In file included from /usr/src/tmp/libkfbapi-buildroot/usr/include/kde4/libkfbapi/listjobbase.h:25:
/usr/src/tmp/libkfbapi-buildroot/usr/include/kde4/libkfbapi/facebookjobs.h:27:10: fatal error: KJob: No such file or directory
 #include <KJob>
          ^~~~~~
compilation terminated.
cpp.req: /usr/src/tmp/libkfbapi-buildroot/usr/include/kde4/libkfbapi/listjobbase.h: cpp failed, trying c++ mode
In file included from /usr/src/tmp/libkfbapi-buildroot/usr/include/kde4/libkfbapi/libkfbapi_export.h:23,
                 from /usr/src/tmp/libkfbapi-buildroot/usr/include/kde4/libkfbapi/listjobbase.h:23:
/usr/include/kde4/kdemacros.h:162:11: fatal error: QtCore/qglobal.h: No such file or directory
 # include <QtCore/qglobal.h>
           ^~~~~~~~~~~~~~~~~~
compilation terminated.
cpp.req: WARNING: /usr/src/tmp/libkfbapi-buildroot/usr/include/kde4/libkfbapi/listjobbase.h: cpp failed
In file included from /usr/src/tmp/libkfbapi-buildroot/usr/include/kde4/libkfbapi/userinfojob.h:23:
/usr/src/tmp/libkfbapi-buildroot/usr/include/kde4/libkfbapi/userinfo.h:25:10: fatal error: KABC/Addressee: No such file or directory
 #include <KABC/Addressee>
          ^~~~~~~~~~~~~~~~
compilation terminated.
cpp.req: /usr/src/tmp/libkfbapi-buildroot/usr/include/kde4/libkfbapi/userinfojob.h: cpp failed, trying c++ mode
In file included from /usr/src/tmp/libkfbapi-buildroot/usr/include/kde4/libkfbapi/libkfbapi_export.h:23,
                 from /usr/src/tmp/libkfbapi-buildroot/usr/include/kde4/libkfbapi/userinfo.h:23,
                 from /usr/src/tmp/libkfbapi-buildroot/usr/include/kde4/libkfbapi/userinfojob.h:23:
/usr/include/kde4/kdemacros.h:162:11: fatal error: QtCore/qglobal.h: No such file or directory
 # include <QtCore/qglobal.h>
           ^~~~~~~~~~~~~~~~~~
compilation terminated.
cpp.req: WARNING: /usr/src/tmp/libkfbapi-buildroot/usr/include/kde4/libkfbapi/userinfojob.h: cpp failed
/usr/src/tmp/libkfbapi-buildroot/usr/include/kde4/libkfbapi/facebookjobs.h:27:10: fatal error: KJob: No such file or directory
 #include <KJob>
          ^~~~~~
compilation terminated.
cpp.req: /usr/src/tmp/libkfbapi-buildroot/usr/include/kde4/libkfbapi/facebookjobs.h: cpp failed, trying c++ mode
In file included from /usr/src/tmp/libkfbapi-buildroot/usr/include/kde4/libkfbapi/libkfbapi_export.h:23,
                 from /usr/src/tmp/libkfbapi-buildroot/usr/include/kde4/libkfbapi/facebookjobs.h:25:
/usr/include/kde4/kdemacros.h:162:11: fatal error: QtCore/qglobal.h: No such file or directory
 # include <QtCore/qglobal.h>
           ^~~~~~~~~~~~~~~~~~
compilation terminated.
cpp.req: WARNING: /usr/src/tmp/libkfbapi-buildroot/usr/include/kde4/libkfbapi/facebookjobs.h: cpp failed
In file included from /usr/src/tmp/libkfbapi-buildroot/usr/include/kde4/libkfbapi/listjobbase.h:25,
                 from /usr/src/tmp/libkfbapi-buildroot/usr/include/kde4/libkfbapi/noteslistjob.h:23:
/usr/src/tmp/libkfbapi-buildroot/usr/include/kde4/libkfbapi/facebookjobs.h:27:10: fatal error: KJob: No such file or directory
 #include <KJob>
          ^~~~~~
compilation terminated.
cpp.req: /usr/src/tmp/libkfbapi-buildroot/usr/include/kde4/libkfbapi/noteslistjob.h: cpp failed, trying c++ mode
In file included from /usr/src/tmp/libkfbapi-buildroot/usr/include/kde4/libkfbapi/libkfbapi_export.h:23,
                 from /usr/src/tmp/libkfbapi-buildroot/usr/include/kde4/libkfbapi/listjobbase.h:23,
                 from /usr/src/tmp/libkfbapi-buildroot/usr/include/kde4/libkfbapi/noteslistjob.h:23:
/usr/include/kde4/kdemacros.h:162:11: fatal error: QtCore/qglobal.h: No such file or directory
 # include <QtCore/qglobal.h>
           ^~~~~~~~~~~~~~~~~~
compilation terminated.
cpp.req: WARNING: /usr/src/tmp/libkfbapi-buildroot/usr/include/kde4/libkfbapi/noteslistjob.h: cpp failed
/usr/src/tmp/libkfbapi-buildroot/usr/include/kde4/libkfbapi/pagedlistjob.h:25:10: fatal error: KJob: No such file or directory
 #include <KJob>
          ^~~~~~
compilation terminated.
cpp.req: /usr/src/tmp/libkfbapi-buildroot/usr/include/kde4/libkfbapi/pagedlistjob.h: cpp failed, trying c++ mode
In file included from /usr/src/tmp/libkfbapi-buildroot/usr/include/kde4/libkfbapi/libkfbapi_export.h:23,
                 from /usr/src/tmp/libkfbapi-buildroot/usr/include/kde4/libkfbapi/pagedlistjob.h:23:
/usr/include/kde4/kdemacros.h:162:11: fatal error: QtCore/qglobal.h: No such file or directory
 # include <QtCore/qglobal.h>
           ^~~~~~~~~~~~~~~~~~
compilation terminated.
cpp.req: WARNING: /usr/src/tmp/libkfbapi-buildroot/usr/include/kde4/libkfbapi/pagedlistjob.h: cpp failed
In file included from /usr/src/tmp/libkfbapi-buildroot/usr/include/kde4/libkfbapi/listjobbase.h:25,
                 from /usr/src/tmp/libkfbapi-buildroot/usr/include/kde4/libkfbapi/postslistjob.h:23:
/usr/src/tmp/libkfbapi-buildroot/usr/include/kde4/libkfbapi/facebookjobs.h:27:10: fatal error: KJob: No such file or directory
 #include <KJob>
          ^~~~~~
compilation terminated.
cpp.req: /usr/src/tmp/libkfbapi-buildroot/usr/include/kde4/libkfbapi/postslistjob.h: cpp failed, trying c++ mode
In file included from /usr/src/tmp/libkfbapi-buildroot/usr/include/kde4/libkfbapi/libkfbapi_export.h:23,
                 from /usr/src/tmp/libkfbapi-buildroot/usr/include/kde4/libkfbapi/listjobbase.h:23,
                 from /usr/src/tmp/libkfbapi-buildroot/usr/include/kde4/libkfbapi/postslistjob.h:23:
/usr/include/kde4/kdemacros.h:162:11: fatal error: QtCore/qglobal.h: No such file or directory
 # include <QtCore/qglobal.h>
           ^~~~~~~~~~~~~~~~~~
compilation terminated.
cpp.req: WARNING: /usr/src/tmp/libkfbapi-buildroot/usr/include/kde4/libkfbapi/postslistjob.h: cpp failed
/usr/src/tmp/libkfbapi-buildroot/usr/include/kde4/libkfbapi/propertyinfo.h:25:10: fatal error: QSharedPointer: No such file or directory
 #include <QSharedPointer>
          ^~~~~~~~~~~~~~~~
compilation terminated.
cpp.req: /usr/src/tmp/libkfbapi-buildroot/usr/include/kde4/libkfbapi/propertyinfo.h: cpp failed, trying c++ mode
In file included from /usr/src/tmp/libkfbapi-buildroot/usr/include/kde4/libkfbapi/libkfbapi_export.h:23,
                 from /usr/src/tmp/libkfbapi-buildroot/usr/include/kde4/libkfbapi/propertyinfo.h:23:
/usr/include/kde4/kdemacros.h:162:11: fatal error: QtCore/qglobal.h: No such file or directory
 # include <QtCore/qglobal.h>
           ^~~~~~~~~~~~~~~~~~
compilation terminated.
cpp.req: WARNING: /usr/src/tmp/libkfbapi-buildroot/usr/include/kde4/libkfbapi/propertyinfo.h: cpp failed
In file included from /usr/src/tmp/libkfbapi-buildroot/usr/include/kde4/libkfbapi/listjobbase.h:25,
                 from /usr/src/tmp/libkfbapi-buildroot/usr/include/kde4/libkfbapi/eventslistjob.h:23:
/usr/src/tmp/libkfbapi-buildroot/usr/include/kde4/libkfbapi/facebookjobs.h:27:10: fatal error: KJob: No such file or directory
 #include <KJob>
          ^~~~~~
compilation terminated.
cpp.req: /usr/src/tmp/libkfbapi-buildroot/usr/include/kde4/libkfbapi/eventslistjob.h: cpp failed, trying c++ mode
In file included from /usr/src/tmp/libkfbapi-buildroot/usr/include/kde4/libkfbapi/libkfbapi_export.h:23,
                 from /usr/src/tmp/libkfbapi-buildroot/usr/include/kde4/libkfbapi/listjobbase.h:23,
                 from /usr/src/tmp/libkfbapi-buildroot/usr/include/kde4/libkfbapi/eventslistjob.h:23:
/usr/include/kde4/kdemacros.h:162:11: fatal error: QtCore/qglobal.h: No such file or directory
 # include <QtCore/qglobal.h>
           ^~~~~~~~~~~~~~~~~~
compilation terminated.
cpp.req: WARNING: /usr/src/tmp/libkfbapi-buildroot/usr/include/kde4/libkfbapi/eventslistjob.h: cpp failed
In file included from /usr/src/tmp/libkfbapi-buildroot/usr/include/kde4/libkfbapi/friendlistjob.h:23:
/usr/src/tmp/libkfbapi-buildroot/usr/include/kde4/libkfbapi/userinfo.h:25:10: fatal error: KABC/Addressee: No such file or directory
 #include <KABC/Addressee>
          ^~~~~~~~~~~~~~~~
compilation terminated.
cpp.req: /usr/src/tmp/libkfbapi-buildroot/usr/include/kde4/libkfbapi/friendlistjob.h: cpp failed, trying c++ mode
In file included from /usr/src/tmp/libkfbapi-buildroot/usr/include/kde4/libkfbapi/libkfbapi_export.h:23,
                 from /usr/src/tmp/libkfbapi-buildroot/usr/include/kde4/libkfbapi/userinfo.h:23,
                 from /usr/src/tmp/libkfbapi-buildroot/usr/include/kde4/libkfbapi/friendlistjob.h:23:
/usr/include/kde4/kdemacros.h:162:11: fatal error: QtCore/qglobal.h: No such file or directory
 # include <QtCore/qglobal.h>
           ^~~~~~~~~~~~~~~~~~
compilation terminated.
cpp.req: WARNING: /usr/src/tmp/libkfbapi-buildroot/usr/include/kde4/libkfbapi/friendlistjob.h: cpp failed
In file included from /usr/src/tmp/libkfbapi-buildroot/usr/include/kde4/libkfbapi/getcommentsjob.h:23:
/usr/src/tmp/libkfbapi-buildroot/usr/include/kde4/libkfbapi/facebookjobs.h:27:10: fatal error: KJob: No such file or directory
 #include <KJob>
          ^~~~~~
compilation terminated.
cpp.req: /usr/src/tmp/libkfbapi-buildroot/usr/include/kde4/libkfbapi/getcommentsjob.h: cpp failed, trying c++ mode
In file included from /usr/src/tmp/libkfbapi-buildroot/usr/include/kde4/libkfbapi/libkfbapi_export.h:23,
                 from /usr/src/tmp/libkfbapi-buildroot/usr/include/kde4/libkfbapi/facebookjobs.h:25,
                 from /usr/src/tmp/libkfbapi-buildroot/usr/include/kde4/libkfbapi/getcommentsjob.h:23:
/usr/include/kde4/kdemacros.h:162:11: fatal error: QtCore/qglobal.h: No such file or directory
 # include <QtCore/qglobal.h>
           ^~~~~~~~~~~~~~~~~~
compilation terminated.
cpp.req: WARNING: /usr/src/tmp/libkfbapi-buildroot/usr/include/kde4/libkfbapi/getcommentsjob.h: cpp failed
In file included from /usr/src/tmp/libkfbapi-buildroot/usr/include/kde4/libkfbapi/allnoteslistjob.h:23:
/usr/src/tmp/libkfbapi-buildroot/usr/include/kde4/libkfbapi/pagedlistjob.h:25:10: fatal error: KJob: No such file or directory
 #include <KJob>
          ^~~~~~
compilation terminated.
cpp.req: /usr/src/tmp/libkfbapi-buildroot/usr/include/kde4/libkfbapi/allnoteslistjob.h: cpp failed, trying c++ mode
In file included from /usr/src/tmp/libkfbapi-buildroot/usr/include/kde4/libkfbapi/libkfbapi_export.h:23,
                 from /usr/src/tmp/libkfbapi-buildroot/usr/include/kde4/libkfbapi/pagedlistjob.h:23,
                 from /usr/src/tmp/libkfbapi-buildroot/usr/include/kde4/libkfbapi/allnoteslistjob.h:23:
/usr/include/kde4/kdemacros.h:162:11: fatal error: QtCore/qglobal.h: No such file or directory
 # include <QtCore/qglobal.h>
           ^~~~~~~~~~~~~~~~~~
compilation terminated.
cpp.req: WARNING: /usr/src/tmp/libkfbapi-buildroot/usr/include/kde4/libkfbapi/allnoteslistjob.h: cpp failed
In file included from /usr/src/tmp/libkfbapi-buildroot/usr/include/kde4/libkfbapi/allpostslistjob.h:24:
/usr/src/tmp/libkfbapi-buildroot/usr/include/kde4/libkfbapi/pagedlistjob.h:25:10: fatal error: KJob: No such file or directory
 #include <KJob>
          ^~~~~~
compilation terminated.
cpp.req: /usr/src/tmp/libkfbapi-buildroot/usr/include/kde4/libkfbapi/allpostslistjob.h: cpp failed, trying c++ mode
In file included from /usr/src/tmp/libkfbapi-buildroot/usr/include/kde4/libkfbapi/libkfbapi_export.h:23,
                 from /usr/src/tmp/libkfbapi-buildroot/usr/include/kde4/libkfbapi/pagedlistjob.h:23,
                 from /usr/src/tmp/libkfbapi-buildroot/usr/include/kde4/libkfbapi/allpostslistjob.h:24:
/usr/include/kde4/kdemacros.h:162:11: fatal error: QtCore/qglobal.h: No such file or directory
 # include <QtCore/qglobal.h>
           ^~~~~~~~~~~~~~~~~~
compilation terminated.
cpp.req: WARNING: /usr/src/tmp/libkfbapi-buildroot/usr/include/kde4/libkfbapi/allpostslistjob.h: cpp failed
In file included from /usr/src/tmp/libkfbapi-buildroot/usr/include/kde4/libkfbapi/alleventslistjob.h:23:
/usr/src/tmp/libkfbapi-buildroot/usr/include/kde4/libkfbapi/pagedlistjob.h:25:10: fatal error: KJob: No such file or directory
 #include <KJob>
          ^~~~~~
compilation terminated.
cpp.req: /usr/src/tmp/libkfbapi-buildroot/usr/include/kde4/libkfbapi/alleventslistjob.h: cpp failed, trying c++ mode
In file included from /usr/src/tmp/libkfbapi-buildroot/usr/include/kde4/libkfbapi/libkfbapi_export.h:23,
                 from /usr/src/tmp/libkfbapi-buildroot/usr/include/kde4/libkfbapi/pagedlistjob.h:23,
                 from /usr/src/tmp/libkfbapi-buildroot/usr/include/kde4/libkfbapi/alleventslistjob.h:23:
/usr/include/kde4/kdemacros.h:162:11: fatal error: QtCore/qglobal.h: No such file or directory
 # include <QtCore/qglobal.h>
           ^~~~~~~~~~~~~~~~~~
compilation terminated.
cpp.req: WARNING: /usr/src/tmp/libkfbapi-buildroot/usr/include/kde4/libkfbapi/alleventslistjob.h: cpp failed
In file included from /usr/src/tmp/libkfbapi-buildroot/usr/include/kde4/libkfbapi/notificationinfo.h:24:
/usr/src/tmp/libkfbapi-buildroot/usr/include/kde4/libkfbapi/userinfo.h:25:10: fatal error: KABC/Addressee: No such file or directory
 #include <KABC/Addressee>
          ^~~~~~~~~~~~~~~~
compilation terminated.
cpp.req: /usr/src/tmp/libkfbapi-buildroot/usr/include/kde4/libkfbapi/notificationinfo.h: cpp failed, trying c++ mode
In file included from /usr/src/tmp/libkfbapi-buildroot/usr/include/kde4/libkfbapi/libkfbapi_export.h:23,
                 from /usr/src/tmp/libkfbapi-buildroot/usr/include/kde4/libkfbapi/notificationinfo.h:23:
/usr/include/kde4/kdemacros.h:162:11: fatal error: QtCore/qglobal.h: No such file or directory
 # include <QtCore/qglobal.h>
           ^~~~~~~~~~~~~~~~~~
compilation terminated.
cpp.req: WARNING: /usr/src/tmp/libkfbapi-buildroot/usr/include/kde4/libkfbapi/notificationinfo.h: cpp failed
/usr/src/tmp/libkfbapi-buildroot/usr/include/kde4/libkfbapi/authenticationdialog.h:25:10: fatal error: KDialog: No such file or directory
 #include <KDialog>
          ^~~~~~~~~
compilation terminated.
cpp.req: /usr/src/tmp/libkfbapi-buildroot/usr/include/kde4/libkfbapi/authenticationdialog.h: cpp failed, trying c++ mode
In file included from /usr/src/tmp/libkfbapi-buildroot/usr/include/kde4/libkfbapi/libkfbapi_export.h:23,
                 from /usr/src/tmp/libkfbapi-buildroot/usr/include/kde4/libkfbapi/authenticationdialog.h:23:
/usr/include/kde4/kdemacros.h:162:11: fatal error: QtCore/qglobal.h: No such file or directory
 # include <QtCore/qglobal.h>
           ^~~~~~~~~~~~~~~~~~
compilation terminated.
cpp.req: WARNING: /usr/src/tmp/libkfbapi-buildroot/usr/include/kde4/libkfbapi/authenticationdialog.h: cpp failed
In file included from /usr/src/tmp/libkfbapi-buildroot/usr/include/kde4/libkfbapi/listjobbase.h:25,
                 from /usr/src/tmp/libkfbapi-buildroot/usr/include/kde4/libkfbapi/notificationslistjob.h:23:
/usr/src/tmp/libkfbapi-buildroot/usr/include/kde4/libkfbapi/facebookjobs.h:27:10: fatal error: KJob: No such file or directory
 #include <KJob>
          ^~~~~~
compilation terminated.
cpp.req: /usr/src/tmp/libkfbapi-buildroot/usr/include/kde4/libkfbapi/notificationslistjob.h: cpp failed, trying c++ mode
In file included from /usr/src/tmp/libkfbapi-buildroot/usr/include/kde4/libkfbapi/libkfbapi_export.h:23,
                 from /usr/src/tmp/libkfbapi-buildroot/usr/include/kde4/libkfbapi/listjobbase.h:23,
                 from /usr/src/tmp/libkfbapi-buildroot/usr/include/kde4/libkfbapi/notificationslistjob.h:23:
/usr/include/kde4/kdemacros.h:162:11: fatal error: QtCore/qglobal.h: No such file or directory
 # include <QtCore/qglobal.h>
           ^~~~~~~~~~~~~~~~~~
compilation terminated.
cpp.req: WARNING: /usr/src/tmp/libkfbapi-buildroot/usr/include/kde4/libkfbapi/notificationslistjob.h: cpp failed
In file included from /usr/src/tmp/libkfbapi-buildroot/usr/include/kde4/libkfbapi/notificationsmarkreadjob.h:23:
/usr/src/tmp/libkfbapi-buildroot/usr/include/kde4/libkfbapi/facebookjobs.h:27:10: fatal error: KJob: No such file or directory
 #include <KJob>
          ^~~~~~
compilation terminated.
cpp.req: /usr/src/tmp/libkfbapi-buildroot/usr/include/kde4/libkfbapi/notificationsmarkreadjob.h: cpp failed, trying c++ mode
In file included from /usr/src/tmp/libkfbapi-buildroot/usr/include/kde4/libkfbapi/libkfbapi_export.h:23,
                 from /usr/src/tmp/libkfbapi-buildroot/usr/include/kde4/libkfbapi/facebookjobs.h:25,
                 from /usr/src/tmp/libkfbapi-buildroot/usr/include/kde4/libkfbapi/notificationsmarkreadjob.h:23:
/usr/include/kde4/kdemacros.h:162:11: fatal error: QtCore/qglobal.h: No such file or directory
 # include <QtCore/qglobal.h>
           ^~~~~~~~~~~~~~~~~~
compilation terminated.
cpp.req: WARNING: /usr/src/tmp/libkfbapi-buildroot/usr/include/kde4/libkfbapi/notificationsmarkreadjob.h: cpp failed
pkgconfiglib.req: WARNING: /usr/src/tmp/libkfbapi-buildroot/usr/lib/pkgconfig/LibKFbAPI.pc: cannot find -lkfbapi library path (skip)
Provides: pkgconfig(LibKFbAPI) = 1.0
Requires: kde4pimlibs-devel, /usr/lib/libkfbapi.so.1, /usr/lib/pkgconfig, kde4libs-devel
Finding debuginfo files (using /usr/lib/rpm/find-debuginfo-files)
Executing: /bin/sh -e /usr/src/tmp/rpm-tmp.4kUbkN
Processing files: libkfbapi1-debuginfo-1.0-alt2
Finding Provides (using /usr/lib/rpm/find-provides)
Executing: /bin/sh -e /usr/src/tmp/rpm-tmp.iHLIaA
find-provides: running scripts (debuginfo)
Finding Requires (using /usr/lib/rpm/find-requires)
Executing: /bin/sh -e /usr/src/tmp/rpm-tmp.RTEdbG
find-requires: running scripts (debuginfo)
Provides: debug(libkfbapi.so.1)
Requires: libkfbapi1 = 1.0-alt2, debug(libQtCore.so.4), debug(libQtGui.so.4), debug(libQtWebKit.so.4), debug(libc.so.6), debug(libgcc_s.so.1), debug(libkabc.so.4), debug(libkcalcore.so.4), debug(libkdecore.so.5), debug(libkdeui.so.5), debug(libkdewebkit.so.5), debug(libkio.so.5), debug(libkmime.so.4), debug(libkpimutils.so.4), debug(libqjson.so.0), debug(libstdc++.so.6)
Adding to libkfbapi-devel a strict dependency on libkfbapi1
Removing 1 extra deps from libkfbapi-devel due to dependency on libkfbapi1
Wrote: /usr/src/RPM/RPMS/i586/libkfbapi1-1.0-alt2.i586.rpm
Wrote: /usr/src/RPM/RPMS/i586/libkfbapi-devel-1.0-alt2.i586.rpm
Wrote: /usr/src/RPM/RPMS/i586/libkfbapi1-debuginfo-1.0-alt2.i586.rpm
52.35user 8.70system 0:51.53elapsed 118%CPU (0avgtext+0avgdata 101456maxresident)k
0inputs+0outputs (0major+2119178minor)pagefaults 0swaps
90.44user 18.13system 1:51.80elapsed 97%CPU (0avgtext+0avgdata 115516maxresident)k
48inputs+0outputs (0major+3255648minor)pagefaults 0swaps
--- libkfbapi1-1.0-alt2.i586.rpm.repo	2016-03-09 08:40:07.000000000 +0000
+++ libkfbapi1-1.0-alt2.i586.rpm.hasher	2020-04-26 13:32:13.959636215 +0000
@@ -46,3 +46,3 @@
 Requires: rpmlib(SetVersions)  
-Requires: libQtGui.so.4 >= set:rlR9KZ1ZHH8ILQ4Ng9Z4OOk6nGxFopwc3ozsHPKTPHGFJlXQ6HrNJNYAJ1tsZ2dI5fwDyZJgNOc53VZJRp3MQa3uf1UhdSbFRMbZnOLBNk9vHmIQZtTMJJl0FAZDGVGYZ51FnxQzphblYJTe5igf8B4Cg8eFEaUwGNCoXbvIZnqBbTefWiylQf3rQvPsyVXT7cuZot
+Requires: libQtGui.so.4 >= set:rlR9KZ1ZHH8ILQ4Ng9Z4OOk6nGxFopwcAb1FTPHGFJlXQ6HrNJNYAJ1tsZ2dI5fwDyZJgNOc53VZJRp3MQa3uf1UhdSbFRMbZnOLBNk9vHmIQZtTMJJl0FAZDGVGYZ51FnxQzphblYJTe5igf8B4Cg8eFEaUwGNCoXbvIZnqBbTefWiylQf3rQvPsyVXT7cuZot
 Requires: libQtWebKit.so.4 >= set:oksSdBLX2sfillSBwINWHXqSScj3
@@ -50,2 +50,3 @@
 Requires: libc.so.6(GLIBC_2.1.3)  
+Requires: libc.so.6(GLIBC_2.4)  
 Requires: libgcc_s.so.1(GCC_3.0)  
@@ -61,2 +62,3 @@
 Requires: libstdc++.so.6(CXXABI_1.3)  
+Requires: libstdc++.so.6(CXXABI_1.3.9)  
 Requires: libstdc++.so.6(GLIBCXX_3.4)