<86>Mar 15 12:07:06 userdel[3135566]: delete user 'rooter' <86>Mar 15 12:07:06 userdel[3135566]: removed group 'rooter' owned by 'rooter' <86>Mar 15 12:07:06 userdel[3135566]: removed shadow group 'rooter' owned by 'rooter' <86>Mar 15 12:07:06 groupadd[3135646]: group added to /etc/group: name=rooter, GID=627 <86>Mar 15 12:07:06 groupadd[3135646]: group added to /etc/gshadow: name=rooter <86>Mar 15 12:07:06 groupadd[3135646]: new group: name=rooter, GID=627 <86>Mar 15 12:07:06 useradd[3135700]: new user: name=rooter, UID=627, GID=627, home=/root, shell=/bin/bash <86>Mar 15 12:07:06 userdel[3135781]: delete user 'builder' <86>Mar 15 12:07:06 userdel[3135781]: removed group 'builder' owned by 'builder' <86>Mar 15 12:07:06 userdel[3135781]: removed shadow group 'builder' owned by 'builder' <86>Mar 15 12:07:06 groupadd[3135872]: group added to /etc/group: name=builder, GID=628 <86>Mar 15 12:07:06 groupadd[3135872]: group added to /etc/gshadow: name=builder <86>Mar 15 12:07:06 groupadd[3135872]: new group: name=builder, GID=628 <86>Mar 15 12:07:06 useradd[3135906]: new user: name=builder, UID=628, GID=628, home=/usr/src, shell=/bin/bash <13>Mar 15 12:07:10 rpmi: libgdbm-1.8.3-alt10 1454943334 installed <13>Mar 15 12:07:10 rpmi: libexpat-2.2.4-alt1 1503305345 installed <13>Mar 15 12:07:11 rpmi: libp11-kit-0.23.15-alt1 sisyphus+226408.100.2.1 1554288204 installed <13>Mar 15 12:07:11 rpmi: libtasn1-4.14-alt1 p9+235792.100.2.1 1565425233 installed <13>Mar 15 12:07:11 rpmi: rpm-macros-alternatives-0.5.1-alt1 sisyphus+226946.100.1.1 1554830426 installed <13>Mar 15 12:07:11 rpmi: alternatives-0.5.1-alt1 sisyphus+226946.100.1.1 1554830426 installed <13>Mar 15 12:07:11 rpmi: ca-certificates-2020.01.23-alt1 p9+245253.100.3.1 1580749631 installed <13>Mar 15 12:07:11 rpmi: ca-trust-0.1.2-alt1 p9+233349.100.1.1 1561655062 installed <13>Mar 15 12:07:11 rpmi: p11-kit-trust-0.23.15-alt1 sisyphus+226408.100.2.1 1554288204 installed <13>Mar 15 12:07:11 rpmi: libcrypto1.1-1.1.1d-alt1.1 p9+237853.200.3.1 1569251834 installed <13>Mar 15 12:07:11 rpmi: libssl1.1-1.1.1d-alt1.1 p9+237853.200.3.1 1569251834 installed <13>Mar 15 12:07:11 rpmi: python3-3.7.4-alt2 p9+239459.100.1.1 1571444790 installed <13>Mar 15 12:07:12 rpmi: libpython3-3.7.4-alt2 p9+239459.100.1.1 1571444790 installed <13>Mar 15 12:07:13 rpmi: python3-base-3.7.4-alt2 p9+239459.100.1.1 1571444790 installed <13>Mar 15 12:07:13 rpmi: tests-for-installed-python3-pkgs-0.1.13.1-alt2 1535450458 installed <13>Mar 15 12:07:13 rpmi: rpm-build-python3-0.1.13.1-alt2 1535450458 installed warning: Macro %prepare_sphinx not found <13>Mar 15 12:07:19 rpmi: python3-module-pkg_resources-1:40.8.0-alt2 sisyphus+229158.200.2.1 1557735221 installed <13>Mar 15 12:07:19 rpmi: python3-module-six-1.12.0-alt1 sisyphus+219665.100.2.1 1548148570 installed <13>Mar 15 12:07:19 rpmi: python3-module-werkzeug-0.15.5-alt1 p9+236927.100.1.1 1567193021 installed <13>Mar 15 12:07:19 rpmi: python3-module-click-6.7-alt1.1.1 sisyphus+228018.100.1.1 1556023031 installed <13>Mar 15 12:07:19 rpmi: python3-module-pytz-1:2016.10-alt1 1484291011 installed <13>Mar 15 12:07:19 rpmi: python-module-sphinxcontrib-2.1.1-alt2.1.2 sisyphus+227529.1100.1.2 1555924423 installed <13>Mar 15 12:07:20 rpmi: python3-module-babel-1:2.6.0-alt1 sisyphus+228351.2400.6.2 1556652168 installed <13>Mar 15 12:07:20 rpmi: python3-module-click-tests-6.7-alt1.1.1 sisyphus+228018.100.1.1 1556023031 installed <13>Mar 15 12:07:20 rpmi: python3-module-ntlm-1.1.0-alt1.2 sisyphus+228512.100.1.1 1556654575 installed <13>Mar 15 12:07:20 rpmi: python3-module-sqlparse-0.2.2-alt1 sisyphus+228373.1300.2.3 1556721017 installed <13>Mar 15 12:07:20 rpmi: python3-module-markupsafe-0.23-alt1.2.1.1 sisyphus+225625.12200.91.1 1555289337 installed <13>Mar 15 12:07:20 rpmi: python3-module-jinja2-2.10-alt1 1521724576 installed <13>Mar 15 12:07:20 rpmi: python3-module-itsdangerous-0.24-alt1.git20140328.2 sisyphus+227495.1400.1.3 1555843258 installed <13>Mar 15 12:07:20 rpmi: python3-module-flask-1.1.1-alt1 p9+236927.200.1.1 1567193058 installed <13>Mar 15 12:07:20 rpmi: python3-module-ndg-0.4.2-alt1.qa1 sisyphus+227504.1300.1.2 1555853234 installed <13>Mar 15 12:07:20 rpmi: python3-module-asn1crypto-0.24.0-alt1 sisyphus+227473.1300.1.2 1555756512 installed <13>Mar 15 12:07:20 rpmi: python3-module-pycparser-2.19-alt1 sisyphus+228366.1000.2.3 1556706938 installed <13>Mar 15 12:07:20 rpmi: python3-module-cffi-1.12.3-alt1 sisyphus+229040.200.3.1 1557316452 installed <13>Mar 15 12:07:20 rpmi: python3-module-cryptography-2.6.1-alt1 sisyphus+225625.24400.91.1 1555298600 installed <13>Mar 15 12:07:20 rpmi: python3-module-OpenSSL-18.0.0-alt1 1532996168 installed <13>Mar 15 12:07:20 rpmi: python3-module-ndg-httpsclient-0.4.2-alt1.qa1 sisyphus+227504.1300.1.2 1555853234 installed <13>Mar 15 12:07:20 rpmi: python3-module-urllib3-2:1.24.3-alt1 sisyphus+228978.100.1.1 1557126149 installed <13>Mar 15 12:07:20 rpmi: python3-module-idna-2.8-alt1 sisyphus+227494.400.1.3 1555838720 installed <13>Mar 15 12:07:20 rpmi: python3-module-chardet-3.0.4-alt1 sisyphus+227476.1700.1.2 1555756717 installed <13>Mar 15 12:07:20 rpmi: python3-module-requests-2.21.0-alt1 sisyphus+228370.100.2.2 1556711628 installed <13>Mar 15 12:07:21 rpmi: python-module-sphinx-pickles-1:1.6.5-alt4 sisyphus+228232.100.1.1 1556298645 installed <13>Mar 15 12:07:21 rpmi: rpm-macros-sphinx-1:1.6.5-alt4 sisyphus+228232.100.1.1 1556298645 installed <13>Mar 15 12:07:21 rpmi: libyaml2-0.2.2-alt1 sisyphus+229134.100.1.1 1557342721 installed <13>Mar 15 12:07:21 rpmi: python3-module-yaml-5.1.2-alt1 p9+235990.100.1.1 1565701485 installed <13>Mar 15 12:07:21 rpmi: libmaxminddb-1.3.2-alt1 sisyphus+222615.100.1.1 1550939231 installed <13>Mar 15 12:07:21 rpmi: python3-module-MaxMindDB-1.4.1-alt1 sisyphus+225625.4200.91.1 1555283529 installed <13>Mar 15 12:07:21 rpmi: python3-module-GeoIP2-2.9.0-alt1 sisyphus+227491.100.1.3 1555830187 installed <13>Mar 15 12:07:21 rpmi: python-module-iniconfig-1.0.0-alt1 sisyphus+227494.1100.1.3 1555839106 installed <13>Mar 15 12:07:21 rpmi: python-module-apipkg-1.5-alt1 1531926894 installed <13>Mar 15 12:07:21 rpmi: python-module-imagesize-1.1.0-alt1 sisyphus+229015.100.2.1 1557233756 installed <13>Mar 15 12:07:21 rpmi: python-sphinx-objects.inv-1:2.3.8.20190514-alt1 p9+229421.100.1.1 1557927689 installed <13>Mar 15 12:07:21 rpmi: libxapian-1.4.5-alt3 sisyphus+222778.100.1.1 1551144773 installed <13>Mar 15 12:07:21 rpmi: python-module-google-0.4.2-alt2.1 sisyphus+228356.1500.3.1 1556633057 installed <13>Mar 15 12:07:21 rpmi: libsqlite3-3.29.0-alt1 p9+237498.100.1.1 1568303696 installed <13>Mar 15 12:07:21 rpmi: python-module-enum34-1.1.6-alt3 1527251693 installed <13>Mar 15 12:07:21 rpmi: libgpg-error-1.36-alt1 sisyphus+225621.300.1.1 1553521082 installed <13>Mar 15 12:07:21 rpmi: libgcrypt20-1.8.4-alt2 sisyphus+229280.100.1.1 1557742126 installed <13>Mar 15 12:07:21 rpmi: libxslt-1.1.33-alt1 sisyphus+226936.100.1.1 1554820937 installed <13>Mar 15 12:07:21 rpmi: python-modules-curses-2.7.16-alt1.M90P.1 p9+244933.100.1.1 1579867218 installed <13>Mar 15 12:07:21 rpmi: libtinfo-devel-6.1.20180407-alt2 sisyphus+222164.200.1.1 1550686226 installed <13>Mar 15 12:07:21 rpmi: libncurses-devel-6.1.20180407-alt2 sisyphus+222164.200.1.1 1550686226 installed <13>Mar 15 12:07:21 rpmi: python3-dev-3.7.4-alt2 p9+239459.100.1.1 1571444790 installed <13>Mar 15 12:07:21 rpmi: libverto-0.3.0-alt1_7 sisyphus+225932.100.1.1 1553994919 installed <13>Mar 15 12:07:21 rpmi: libkeyutils-1.6-alt2 sisyphus+226520.100.2.1 1554512089 installed <13>Mar 15 12:07:21 rpmi: libcom_err-1.44.6-alt1 sisyphus+224154.100.1.1 1552091678 installed <86>Mar 15 12:07:21 groupadd[3164586]: group added to /etc/group: name=_keytab, GID=499 <86>Mar 15 12:07:21 groupadd[3164586]: group added to /etc/gshadow: name=_keytab <86>Mar 15 12:07:21 groupadd[3164586]: new group: name=_keytab, GID=499 <13>Mar 15 12:07:21 rpmi: libkrb5-1.17.1-alt1 p9+242852.100.2.1 1576572639 installed <13>Mar 15 12:07:21 rpmi: libtirpc-1.0.3-alt1 1532008017 installed <13>Mar 15 12:07:21 rpmi: libnsl2-1.1.0-alt1_1 1511548749 installed <13>Mar 15 12:07:21 rpmi: python-modules-compiler-2.7.16-alt1.M90P.1 p9+244933.100.1.1 1579867218 installed <13>Mar 15 12:07:21 rpmi: python-modules-email-2.7.16-alt1.M90P.1 p9+244933.100.1.1 1579867218 installed <13>Mar 15 12:07:21 rpmi: python-modules-unittest-2.7.16-alt1.M90P.1 p9+244933.100.1.1 1579867218 installed <13>Mar 15 12:07:21 rpmi: python-modules-encodings-2.7.16-alt1.M90P.1 p9+244933.100.1.1 1579867218 installed <13>Mar 15 12:07:22 rpmi: python-modules-2.7.16-alt1.M90P.1 p9+244933.100.1.1 1579867218 installed <13>Mar 15 12:07:22 rpmi: python-modules-nis-2.7.16-alt1.M90P.1 p9+244933.100.1.1 1579867218 installed <13>Mar 15 12:07:22 rpmi: python-module-six-1.12.0-alt1 sisyphus+219665.100.2.1 1548148570 installed <13>Mar 15 12:07:22 rpmi: python-module-pkg_resources-1:40.8.0-alt2 sisyphus+229158.200.2.1 1557735221 installed <13>Mar 15 12:07:22 rpmi: python-modules-ctypes-2.7.16-alt1.M90P.1 p9+244933.100.1.1 1579867218 installed <13>Mar 15 12:07:22 rpmi: python-modules-xml-2.7.16-alt1.M90P.1 p9+244933.100.1.1 1579867218 installed <13>Mar 15 12:07:22 rpmi: python-modules-json-2.7.16-alt1.M90P.1 p9+244933.100.1.1 1579867218 installed <13>Mar 15 12:07:22 rpmi: python-modules-multiprocessing-2.7.16-alt1.M90P.1 p9+244933.100.1.1 1579867218 installed <13>Mar 15 12:07:22 rpmi: python-modules-logging-2.7.16-alt1.M90P.1 p9+244933.100.1.1 1579867218 installed <13>Mar 15 12:07:22 rpmi: python-module-werkzeug-0.15.5-alt1 p9+236927.100.1.1 1567193021 installed <13>Mar 15 12:07:22 rpmi: python-modules-hotshot-2.7.16-alt1.M90P.1 p9+244933.100.1.1 1579867218 installed <13>Mar 15 12:07:22 rpmi: python-module-click-6.7-alt1.1.1 sisyphus+228018.100.1.1 1556023031 installed <13>Mar 15 12:07:22 rpmi: python-module-click-tests-6.7-alt1.1.1 sisyphus+228018.100.1.1 1556023031 installed <13>Mar 15 12:07:22 rpmi: python-module-chardet-3.0.4-alt1 sisyphus+227476.1700.1.2 1555756717 installed <13>Mar 15 12:07:22 rpmi: python-tools-2to3-2.7.16-alt1.M90P.1 p9+244933.100.1.1 1579867218 installed <13>Mar 15 12:07:22 rpmi: python-module-whoosh-2.7.4-alt1 1527697941 installed <13>Mar 15 12:07:22 rpmi: python-module-webencodings-0.5.1-alt1.1 1517943573 installed <13>Mar 15 12:07:22 rpmi: python-module-more-itertools-1:5.0.0-alt2 sisyphus+226536.200.1.1 1554329977 installed <13>Mar 15 12:07:22 rpmi: python-modules-bsddb-2.7.16-alt1.M90P.1 p9+244933.100.1.1 1579867218 installed <13>Mar 15 12:07:22 rpmi: python-2.7.16-alt1.M90P.1 p9+244933.100.1.1 1579867218 installed <13>Mar 15 12:07:22 rpmi: python-strict-2.7.16-alt1.M90P.1 p9+244933.100.1.1 1579867164 installed <13>Mar 15 12:07:22 rpmi: python-modules-distutils-2.7.16-alt1.M90P.1 p9+244933.100.1.1 1579867218 installed <13>Mar 15 12:07:22 rpmi: python-module-cssselect-0.9.1-alt1.2 sisyphus+227479.1100.1.2 1555757152 installed <13>Mar 15 12:07:22 rpmi: python-module-html5lib-1:0.999999999-alt4.qa1 sisyphus+227493.600.1.3 1555835341 installed <13>Mar 15 12:07:22 rpmi: python-module-lxml-4.4.2-alt1 p9+244111.100.1.1 1578758819 installed <13>Mar 15 12:07:23 rpmi: python-module-docutils-0.14-alt2 1535729778 installed <13>Mar 15 12:07:23 rpmi: python-module-idna-2.8-alt1 sisyphus+227494.400.1.3 1555838720 installed <13>Mar 15 12:07:23 rpmi: python-module-pycparser-2.19-alt1 sisyphus+228366.1000.2.3 1556706938 installed <13>Mar 15 12:07:23 rpmi: python-module-cffi-1.12.3-alt1 sisyphus+229040.200.3.1 1557316452 installed <13>Mar 15 12:07:23 rpmi: python-module-asn1crypto-0.24.0-alt1 sisyphus+227473.1300.1.2 1555756512 installed <13>Mar 15 12:07:23 rpmi: python-module-ntlm-1.1.0-alt1.2 sisyphus+228512.100.1.1 1556654575 installed <13>Mar 15 12:07:23 rpmi: python-module-pytz-1:2016.10-alt1 1484291011 installed <13>Mar 15 12:07:24 rpmi: python-module-babel-1:2.6.0-alt1 sisyphus+228351.2400.6.2 1556652168 installed <13>Mar 15 12:07:24 rpmi: python-module-attrs-19.1.0-alt1 sisyphus+227473.2100.1.2 1555756986 installed <13>Mar 15 12:07:24 rpmi: python-module-PyStemmer-1.0.1-alt1.2.1 1321388303 installed <13>Mar 15 12:07:24 rpmi: python-module-snowballstemmer-1.2.0-alt2.1 1457859319 installed <13>Mar 15 12:07:24 rpmi: python-module-simplejson-3.15.0-alt1.qa1 sisyphus+225625.16100.91.1 1555292381 installed <13>Mar 15 12:07:24 rpmi: python-module-ipaddress-1.0.18-alt1.1 sisyphus+227494.1700.1.3 1555839523 installed <13>Mar 15 12:07:24 rpmi: python-module-cryptography-2.6.1-alt1 sisyphus+225625.24400.91.1 1555298600 installed <13>Mar 15 12:07:24 rpmi: python-module-OpenSSL-18.0.0-alt1 1532996168 installed <13>Mar 15 12:07:24 rpmi: python-module-ndg-0.4.2-alt1.qa1 sisyphus+227504.1300.1.2 1555853234 installed <13>Mar 15 12:07:24 rpmi: python-module-ndg-httpsclient-0.4.2-alt1.qa1 sisyphus+227504.1300.1.2 1555853234 installed <13>Mar 15 12:07:24 rpmi: python-module-backports-3.5.0.1-alt1.1.1 1517645428 installed <13>Mar 15 12:07:24 rpmi: python-module-backports.ssl_match_hostname-3.5.0.1-alt1.1.1 1517645428 installed <13>Mar 15 12:07:24 rpmi: python-module-urllib3-2:1.24.3-alt1 sisyphus+228978.100.1.1 1557126149 installed <13>Mar 15 12:07:24 rpmi: python-module-requests-2.21.0-alt1 sisyphus+228370.100.2.2 1556711628 installed <13>Mar 15 12:07:24 rpmi: python-module-typing-3.6.6-alt2 sisyphus+220108.100.1.1 1548749697 installed <13>Mar 15 12:07:24 rpmi: python-module-markupsafe-0.23-alt1.2.1.1 sisyphus+225625.12200.91.1 1555289337 installed <13>Mar 15 12:07:24 rpmi: python-module-jinja2-2.10-alt1 1521724576 installed <13>Mar 15 12:07:24 rpmi: python-modules-sqlite3-2.7.16-alt1.M90P.1 p9+244933.100.1.1 1579867218 installed <13>Mar 15 12:07:24 rpmi: python-module-SQLAlchemy-1.2.15-alt1 sisyphus+225625.4500.91.1 1555284142 installed <13>Mar 15 12:07:24 rpmi: python-module-py-1.8.0-alt2 sisyphus+228349.1400.4.1 1556631070 installed <13>Mar 15 12:07:24 rpmi: python-module-funcsigs-1.0.2-alt2 sisyphus+228355.2600.2.1 1556560236 installed <13>Mar 15 12:07:24 rpmi: python-module-scandir-1.10.0-alt1 sisyphus+225192.100.1.2 1552968870 installed <13>Mar 15 12:07:24 rpmi: python-module-pathlib2-2.3.3-alt1 sisyphus+228364.300.4.1 1556886257 installed <13>Mar 15 12:07:24 rpmi: python-module-atomicwrites-1.3.0-alt1 sisyphus+227473.2000.1.3 1555763467 installed <13>Mar 15 12:07:24 rpmi: python-module-itsdangerous-0.24-alt1.git20140328.2 sisyphus+227495.1400.1.3 1555843258 installed <13>Mar 15 12:07:24 rpmi: python-module-flask-1.1.1-alt1 p9+236927.200.1.1 1567193058 installed <13>Mar 15 12:07:24 rpmi: python-module-xapian-1.4.5-alt3 sisyphus+225625.23000.91.1 1555296582 installed <13>Mar 15 12:07:24 rpmi: python-module-pluggy-0.11.0-alt1 sisyphus+229116.100.1.1 1557316655 installed <13>Mar 15 12:07:25 rpmi: python-module-pytest-3.10.1-alt5 sisyphus+228366.2000.2.3 1556707871 installed <13>Mar 15 12:07:25 rpmi: python-module-sphinxcontrib-websupport-1.0.1-alt3.qa1 sisyphus+227529.1200.1.2 1555924506 installed <13>Mar 15 12:07:25 rpmi: python-module-alabaster-0.7.6-alt3 sisyphus+228351.700.4.1 1556637370 installed <13>Mar 15 12:07:25 rpmi: python-module-Pygments-2.2.0-alt2 1526455576 installed <13>Mar 15 12:07:25 rpmi: python-module-sphinx-1:1.6.5-alt4 sisyphus+228232.100.1.1 1556298645 installed <13>Mar 15 12:07:25 rpmi: libnsl2-devel-1.1.0-alt1_1 1511548749 installed <13>Mar 15 12:07:25 rpmi: python-dev-2.7.16-alt1.M90P.1 p9+244933.100.1.1 1579867218 installed <86>Mar 15 12:07:25 groupadd[3170411]: group added to /etc/group: name=sasl, GID=498 <86>Mar 15 12:07:25 groupadd[3170411]: group added to /etc/gshadow: name=sasl <86>Mar 15 12:07:25 groupadd[3170411]: new group: name=sasl, GID=498 <13>Mar 15 12:07:25 rpmi: libsasl2-3-2.1.27-alt2 sisyphus+228101.100.1.1 1556139863 installed <13>Mar 15 12:07:25 rpmi: libldap-2.4.48-alt3 p9+238817.100.1.1 1570449122 installed <13>Mar 15 12:07:25 rpmi: libpq5-12.2-alt1 p9+245909.100.1.1 1581494342 installed <13>Mar 15 12:07:25 rpmi: python3-module-psycopg2-2.8.3-alt1 p9+232795.100.2.1 1561367501 installed <13>Mar 15 12:07:27 rpmi: python3-module-django2.2-2.2.4-alt1 p9+235518.200.1.1 1565024032 installed <13>Mar 15 12:07:27 rpmi: python3-module-wtforms-2.1-alt1.1 sisyphus+227538.700.1.2 1555968316 installed <13>Mar 15 12:07:27 rpmi: python-module-setuptools-1:40.8.0-alt2 sisyphus+229158.200.2.1 1557735221 installed <13>Mar 15 12:07:27 rpmi: python-module-sphinx-devel-1:1.6.5-alt4 sisyphus+228232.100.1.1 1556298645 installed <13>Mar 15 12:07:27 rpmi: flask-sphinx-themes-20130715-alt1 1413118751 installed <13>Mar 15 12:07:27 rpmi: python-module-flask-babel-0.11.1-alt1 sisyphus+227489.200.1.3 1555826346 installed <13>Mar 15 12:07:27 rpmi: python-module-nose-1:1.3.7-alt4.git20160316 sisyphus+229068.100.1.1 1557255939 installed <13>Mar 15 12:07:27 rpmi: python-module-wtforms-2.1-alt1.1 sisyphus+227538.700.1.2 1555968316 installed <13>Mar 15 12:07:27 rpmi: python3-module-setuptools-1:40.8.0-alt2 sisyphus+229158.200.2.1 1557735221 installed <13>Mar 15 12:07:27 rpmi: python3-module-flask-babel-0.11.1-alt1 sisyphus+227489.200.1.3 1555826346 installed <13>Mar 15 12:07:27 rpmi: python3-module-nose-1:1.3.7-alt4.git20160316 sisyphus+229068.100.1.1 1557255939 installed <13>Mar 15 12:07:27 rpmi: python3-module-speaklater-1.3-alt1.git20120701.1.1 sisyphus+228372.2600.1.1 1556569722 installed <13>Mar 15 12:07:27 rpmi: python-module-speaklater-1.3-alt1.git20120701.1.1 sisyphus+228372.2600.1.1 1556569722 installed Building target platforms: i586 Building for target i586 Wrote: /usr/src/in/nosrpm/python-module-flask-wtf-0.14.2-alt1.1.nosrc.rpm Installing python-module-flask-wtf-0.14.2-alt1.1.src.rpm Building target platforms: i586 Building for target i586 Executing(%prep): /bin/sh -e /usr/src/tmp/rpm-tmp.8669 + umask 022 + /bin/mkdir -p /usr/src/RPM/BUILD + cd /usr/src/RPM/BUILD + cd /usr/src/RPM/BUILD + rm -rf python-module-flask-wtf-0.14.2 + echo 'Source #0 (python-module-flask-wtf-0.14.2.tar):' Source #0 (python-module-flask-wtf-0.14.2.tar): + /bin/tar -xf /usr/src/RPM/SOURCES/python-module-flask-wtf-0.14.2.tar + cd python-module-flask-wtf-0.14.2 + /bin/chmod -c -Rf u+rwX,go-w . + echo 'Patch #1 (flask-wtf-0.14.2-alt-docs.patch):' Patch #1 (flask-wtf-0.14.2-alt-docs.patch): + /usr/bin/patch -p1 patching file docs/conf.py + echo 'Patch #2 (flask-wtf-0.14.2-upstream-sphinx.patch):' Patch #2 (flask-wtf-0.14.2-upstream-sphinx.patch): + /usr/bin/patch -p1 patching file .gitmodules patching file docs/conf.py Hunk #1 succeeded at 115 (offset 1 line). Hunk #2 succeeded at 123 (offset 1 line). + cp -fR . ../python3 + install -pm644 /usr/share/python-sphinx/objects.inv ./ + '[' -e ./conf.py ']' + cp -u /usr/lib/python2.7/site-packages/sphinx/conf.py.template ./conf.py + ln -s ../objects.inv docs/ + exit 0 Executing(%build): /bin/sh -e /usr/src/tmp/rpm-tmp.70418 + umask 022 + /bin/mkdir -p /usr/src/RPM/BUILD + cd /usr/src/RPM/BUILD + cd python-module-flask-wtf-0.14.2 + CFLAGS='-pipe -frecord-gcc-switches -Wall -g -O2 -march=i586 -mtune=generic' + export CFLAGS + CXXFLAGS='-pipe -frecord-gcc-switches -Wall -g -O2 -march=i586 -mtune=generic' + export CXXFLAGS + FFLAGS='-pipe -frecord-gcc-switches -Wall -g -O2 -march=i586 -mtune=generic' + export FFLAGS + /usr/bin/python setup.py build --debug running build running build_py creating build creating build/lib creating build/lib/flask_wtf copying flask_wtf/i18n.py -> build/lib/flask_wtf copying flask_wtf/html5.py -> build/lib/flask_wtf copying flask_wtf/form.py -> build/lib/flask_wtf copying flask_wtf/file.py -> build/lib/flask_wtf copying flask_wtf/csrf.py -> build/lib/flask_wtf copying flask_wtf/_compat.py -> build/lib/flask_wtf copying flask_wtf/__init__.py -> build/lib/flask_wtf creating build/lib/flask_wtf/recaptcha copying flask_wtf/recaptcha/widgets.py -> build/lib/flask_wtf/recaptcha copying flask_wtf/recaptcha/validators.py -> build/lib/flask_wtf/recaptcha copying flask_wtf/recaptcha/fields.py -> build/lib/flask_wtf/recaptcha copying flask_wtf/recaptcha/__init__.py -> build/lib/flask_wtf/recaptcha + pushd ../python3 ~/RPM/BUILD/python3 ~/RPM/BUILD/python-module-flask-wtf-0.14.2 + CFLAGS='-pipe -frecord-gcc-switches -Wall -g -O2 -march=i586 -mtune=generic' + export CFLAGS + CXXFLAGS='-pipe -frecord-gcc-switches -Wall -g -O2 -march=i586 -mtune=generic' + export CXXFLAGS + FFLAGS='-pipe -frecord-gcc-switches -Wall -g -O2 -march=i586 -mtune=generic' + export FFLAGS + /usr/bin/python3 setup.py build --debug running build running build_py creating build creating build/lib creating build/lib/flask_wtf copying flask_wtf/i18n.py -> build/lib/flask_wtf copying flask_wtf/html5.py -> build/lib/flask_wtf copying flask_wtf/form.py -> build/lib/flask_wtf copying flask_wtf/file.py -> build/lib/flask_wtf copying flask_wtf/csrf.py -> build/lib/flask_wtf copying flask_wtf/_compat.py -> build/lib/flask_wtf copying flask_wtf/__init__.py -> build/lib/flask_wtf creating build/lib/flask_wtf/recaptcha copying flask_wtf/recaptcha/widgets.py -> build/lib/flask_wtf/recaptcha copying flask_wtf/recaptcha/validators.py -> build/lib/flask_wtf/recaptcha copying flask_wtf/recaptcha/fields.py -> build/lib/flask_wtf/recaptcha copying flask_wtf/recaptcha/__init__.py -> build/lib/flask_wtf/recaptcha + popd ~/RPM/BUILD/python-module-flask-wtf-0.14.2 + exit 0 Executing(%install): /bin/sh -e /usr/src/tmp/rpm-tmp.46901 + umask 022 + /bin/mkdir -p /usr/src/RPM/BUILD + cd /usr/src/RPM/BUILD + /bin/chmod -Rf u+rwX -- /usr/src/tmp/python-module-flask-wtf-buildroot + : + /bin/rm -rf -- /usr/src/tmp/python-module-flask-wtf-buildroot + cd python-module-flask-wtf-0.14.2 + CFLAGS='-pipe -frecord-gcc-switches -Wall -g -O2 -march=i586 -mtune=generic' + export CFLAGS + CXXFLAGS='-pipe -frecord-gcc-switches -Wall -g -O2 -march=i586 -mtune=generic' + export CXXFLAGS + FFLAGS='-pipe -frecord-gcc-switches -Wall -g -O2 -march=i586 -mtune=generic' + export FFLAGS + /usr/bin/python setup.py install --skip-build --root=/usr/src/tmp/python-module-flask-wtf-buildroot --force running install running install_lib creating /usr/src/tmp/python-module-flask-wtf-buildroot creating /usr/src/tmp/python-module-flask-wtf-buildroot/usr creating /usr/src/tmp/python-module-flask-wtf-buildroot/usr/lib creating /usr/src/tmp/python-module-flask-wtf-buildroot/usr/lib/python2.7 creating /usr/src/tmp/python-module-flask-wtf-buildroot/usr/lib/python2.7/site-packages creating /usr/src/tmp/python-module-flask-wtf-buildroot/usr/lib/python2.7/site-packages/flask_wtf creating /usr/src/tmp/python-module-flask-wtf-buildroot/usr/lib/python2.7/site-packages/flask_wtf/recaptcha copying build/lib/flask_wtf/recaptcha/__init__.py -> /usr/src/tmp/python-module-flask-wtf-buildroot/usr/lib/python2.7/site-packages/flask_wtf/recaptcha copying build/lib/flask_wtf/recaptcha/fields.py -> /usr/src/tmp/python-module-flask-wtf-buildroot/usr/lib/python2.7/site-packages/flask_wtf/recaptcha copying build/lib/flask_wtf/recaptcha/validators.py -> /usr/src/tmp/python-module-flask-wtf-buildroot/usr/lib/python2.7/site-packages/flask_wtf/recaptcha copying build/lib/flask_wtf/recaptcha/widgets.py -> /usr/src/tmp/python-module-flask-wtf-buildroot/usr/lib/python2.7/site-packages/flask_wtf/recaptcha copying build/lib/flask_wtf/__init__.py -> /usr/src/tmp/python-module-flask-wtf-buildroot/usr/lib/python2.7/site-packages/flask_wtf copying build/lib/flask_wtf/_compat.py -> /usr/src/tmp/python-module-flask-wtf-buildroot/usr/lib/python2.7/site-packages/flask_wtf copying build/lib/flask_wtf/csrf.py -> /usr/src/tmp/python-module-flask-wtf-buildroot/usr/lib/python2.7/site-packages/flask_wtf copying build/lib/flask_wtf/file.py -> /usr/src/tmp/python-module-flask-wtf-buildroot/usr/lib/python2.7/site-packages/flask_wtf copying build/lib/flask_wtf/form.py -> /usr/src/tmp/python-module-flask-wtf-buildroot/usr/lib/python2.7/site-packages/flask_wtf copying build/lib/flask_wtf/html5.py -> /usr/src/tmp/python-module-flask-wtf-buildroot/usr/lib/python2.7/site-packages/flask_wtf copying build/lib/flask_wtf/i18n.py -> /usr/src/tmp/python-module-flask-wtf-buildroot/usr/lib/python2.7/site-packages/flask_wtf byte-compiling /usr/src/tmp/python-module-flask-wtf-buildroot/usr/lib/python2.7/site-packages/flask_wtf/recaptcha/__init__.py to __init__.pyc byte-compiling /usr/src/tmp/python-module-flask-wtf-buildroot/usr/lib/python2.7/site-packages/flask_wtf/recaptcha/fields.py to fields.pyc byte-compiling /usr/src/tmp/python-module-flask-wtf-buildroot/usr/lib/python2.7/site-packages/flask_wtf/recaptcha/validators.py to validators.pyc byte-compiling /usr/src/tmp/python-module-flask-wtf-buildroot/usr/lib/python2.7/site-packages/flask_wtf/recaptcha/widgets.py to widgets.pyc byte-compiling /usr/src/tmp/python-module-flask-wtf-buildroot/usr/lib/python2.7/site-packages/flask_wtf/__init__.py to __init__.pyc byte-compiling /usr/src/tmp/python-module-flask-wtf-buildroot/usr/lib/python2.7/site-packages/flask_wtf/_compat.py to _compat.pyc byte-compiling /usr/src/tmp/python-module-flask-wtf-buildroot/usr/lib/python2.7/site-packages/flask_wtf/csrf.py to csrf.pyc byte-compiling /usr/src/tmp/python-module-flask-wtf-buildroot/usr/lib/python2.7/site-packages/flask_wtf/file.py to file.pyc byte-compiling /usr/src/tmp/python-module-flask-wtf-buildroot/usr/lib/python2.7/site-packages/flask_wtf/form.py to form.pyc byte-compiling /usr/src/tmp/python-module-flask-wtf-buildroot/usr/lib/python2.7/site-packages/flask_wtf/html5.py to html5.pyc byte-compiling /usr/src/tmp/python-module-flask-wtf-buildroot/usr/lib/python2.7/site-packages/flask_wtf/i18n.py to i18n.pyc running install_egg_info running egg_info creating Flask_WTF.egg-info writing requirements to Flask_WTF.egg-info/requires.txt writing Flask_WTF.egg-info/PKG-INFO writing top-level names to Flask_WTF.egg-info/top_level.txt writing dependency_links to Flask_WTF.egg-info/dependency_links.txt writing manifest file 'Flask_WTF.egg-info/SOURCES.txt' reading manifest file 'Flask_WTF.egg-info/SOURCES.txt' reading manifest template 'MANIFEST.in' warning: no previously-included files matching '*.pyc' found under directory 'tests' warning: no previously-included files matching '*.pyo' found under directory 'tests' no previously-included directories found matching 'docs/_build' warning: no previously-included files found matching 'docs/_themes/.git*' warning: no previously-included files matching '*.pyc' found under directory 'docs' warning: no previously-included files matching '*.pyo' found under directory 'docs' writing manifest file 'Flask_WTF.egg-info/SOURCES.txt' Copying Flask_WTF.egg-info to /usr/src/tmp/python-module-flask-wtf-buildroot/usr/lib/python2.7/site-packages/Flask_WTF-0.14.2.dev20200315-py2.7.egg-info running install_scripts + pushd ../python3 ~/RPM/BUILD/python3 ~/RPM/BUILD/python-module-flask-wtf-0.14.2 + CFLAGS='-pipe -frecord-gcc-switches -Wall -g -O2 -march=i586 -mtune=generic' + export CFLAGS + CXXFLAGS='-pipe -frecord-gcc-switches -Wall -g -O2 -march=i586 -mtune=generic' + export CXXFLAGS + FFLAGS='-pipe -frecord-gcc-switches -Wall -g -O2 -march=i586 -mtune=generic' + export FFLAGS + /usr/bin/python3 setup.py install --skip-build --root=/usr/src/tmp/python-module-flask-wtf-buildroot --force running install running install_lib creating /usr/src/tmp/python-module-flask-wtf-buildroot/usr/lib/python3 creating /usr/src/tmp/python-module-flask-wtf-buildroot/usr/lib/python3/site-packages creating /usr/src/tmp/python-module-flask-wtf-buildroot/usr/lib/python3/site-packages/flask_wtf creating /usr/src/tmp/python-module-flask-wtf-buildroot/usr/lib/python3/site-packages/flask_wtf/recaptcha copying build/lib/flask_wtf/recaptcha/__init__.py -> /usr/src/tmp/python-module-flask-wtf-buildroot/usr/lib/python3/site-packages/flask_wtf/recaptcha copying build/lib/flask_wtf/recaptcha/fields.py -> /usr/src/tmp/python-module-flask-wtf-buildroot/usr/lib/python3/site-packages/flask_wtf/recaptcha copying build/lib/flask_wtf/recaptcha/validators.py -> /usr/src/tmp/python-module-flask-wtf-buildroot/usr/lib/python3/site-packages/flask_wtf/recaptcha copying build/lib/flask_wtf/recaptcha/widgets.py -> /usr/src/tmp/python-module-flask-wtf-buildroot/usr/lib/python3/site-packages/flask_wtf/recaptcha copying build/lib/flask_wtf/__init__.py -> /usr/src/tmp/python-module-flask-wtf-buildroot/usr/lib/python3/site-packages/flask_wtf copying build/lib/flask_wtf/_compat.py -> /usr/src/tmp/python-module-flask-wtf-buildroot/usr/lib/python3/site-packages/flask_wtf copying build/lib/flask_wtf/csrf.py -> /usr/src/tmp/python-module-flask-wtf-buildroot/usr/lib/python3/site-packages/flask_wtf copying build/lib/flask_wtf/file.py -> /usr/src/tmp/python-module-flask-wtf-buildroot/usr/lib/python3/site-packages/flask_wtf copying build/lib/flask_wtf/form.py -> /usr/src/tmp/python-module-flask-wtf-buildroot/usr/lib/python3/site-packages/flask_wtf copying build/lib/flask_wtf/html5.py -> /usr/src/tmp/python-module-flask-wtf-buildroot/usr/lib/python3/site-packages/flask_wtf copying build/lib/flask_wtf/i18n.py -> /usr/src/tmp/python-module-flask-wtf-buildroot/usr/lib/python3/site-packages/flask_wtf byte-compiling /usr/src/tmp/python-module-flask-wtf-buildroot/usr/lib/python3/site-packages/flask_wtf/recaptcha/__init__.py to __init__.cpython-37.pyc byte-compiling /usr/src/tmp/python-module-flask-wtf-buildroot/usr/lib/python3/site-packages/flask_wtf/recaptcha/fields.py to fields.cpython-37.pyc byte-compiling /usr/src/tmp/python-module-flask-wtf-buildroot/usr/lib/python3/site-packages/flask_wtf/recaptcha/validators.py to validators.cpython-37.pyc byte-compiling /usr/src/tmp/python-module-flask-wtf-buildroot/usr/lib/python3/site-packages/flask_wtf/recaptcha/widgets.py to widgets.cpython-37.pyc byte-compiling /usr/src/tmp/python-module-flask-wtf-buildroot/usr/lib/python3/site-packages/flask_wtf/__init__.py to __init__.cpython-37.pyc byte-compiling /usr/src/tmp/python-module-flask-wtf-buildroot/usr/lib/python3/site-packages/flask_wtf/_compat.py to _compat.cpython-37.pyc byte-compiling /usr/src/tmp/python-module-flask-wtf-buildroot/usr/lib/python3/site-packages/flask_wtf/csrf.py to csrf.cpython-37.pyc byte-compiling /usr/src/tmp/python-module-flask-wtf-buildroot/usr/lib/python3/site-packages/flask_wtf/file.py to file.cpython-37.pyc byte-compiling /usr/src/tmp/python-module-flask-wtf-buildroot/usr/lib/python3/site-packages/flask_wtf/form.py to form.cpython-37.pyc byte-compiling /usr/src/tmp/python-module-flask-wtf-buildroot/usr/lib/python3/site-packages/flask_wtf/html5.py to html5.cpython-37.pyc byte-compiling /usr/src/tmp/python-module-flask-wtf-buildroot/usr/lib/python3/site-packages/flask_wtf/i18n.py to i18n.cpython-37.pyc running install_egg_info running egg_info creating Flask_WTF.egg-info writing Flask_WTF.egg-info/PKG-INFO writing dependency_links to Flask_WTF.egg-info/dependency_links.txt writing requirements to Flask_WTF.egg-info/requires.txt writing top-level names to Flask_WTF.egg-info/top_level.txt writing manifest file 'Flask_WTF.egg-info/SOURCES.txt' reading manifest file 'Flask_WTF.egg-info/SOURCES.txt' reading manifest template 'MANIFEST.in' warning: no previously-included files matching '*.pyc' found under directory 'tests' warning: no previously-included files matching '*.pyo' found under directory 'tests' no previously-included directories found matching 'docs/_build' warning: no previously-included files found matching 'docs/_themes/.git*' warning: no previously-included files matching '*.pyc' found under directory 'docs' warning: no previously-included files matching '*.pyo' found under directory 'docs' writing manifest file 'Flask_WTF.egg-info/SOURCES.txt' Copying Flask_WTF.egg-info to /usr/src/tmp/python-module-flask-wtf-buildroot/usr/lib/python3/site-packages/Flask_WTF-0.14.2.dev20200315-py3.7.egg-info running install_scripts + popd ~/RPM/BUILD/python-module-flask-wtf-0.14.2 ++ pwd + PYTHONPATH=/usr/src/RPM/BUILD/python-module-flask-wtf-0.14.2 + make -C docs pickle make: Entering directory '/usr/src/RPM/BUILD/python-module-flask-wtf-0.14.2/docs' sphinx-build -b pickle -d _build/doctrees . _build/pickle Running Sphinx v1.6.5 making output directory... ------------------------------------------------------------------------ Flask theme not found. Run "pip install flask-sphinx-themes" to get it. ------------------------------------------------------------------------ Generating grammar tables from /usr/lib/python2.7/site-packages/sphinx/pycode/Grammar-py2.txt loading pickled environment... not yet created loading intersphinx inventory from objects.inv... loading intersphinx inventory from objects.inv... loading intersphinx inventory from objects.inv... loading intersphinx inventory from objects.inv... loading intersphinx inventory from objects.inv... building [mo]: targets for 0 po files that are out of date building [pickle]: targets for 11 source files that are out of date updating environment: 11 added, 0 changed, 0 removed reading sources... [ 9%] api /usr/lib/python2.7/site-packages/sphinx/environment/__init__.py:686: RemovedInSphinx17Warning: html_use_smartypants option is deprecated. Smart quotes are on by default; if you want to disable or customize them, use the smart_quotes option in docutils.conf. RemovedInSphinx17Warning) reading sources... [ 18%] authors reading sources... [ 27%] changelog reading sources... [ 36%] config reading sources... [ 45%] csrf reading sources... [ 54%] form reading sources... [ 63%] index reading sources... [ 72%] install reading sources... [ 81%] license reading sources... [ 90%] quickstart reading sources... [100%] upgrade looking for now-outdated files... none found pickling environment... done checking consistency... done preparing documents... done writing output... [ 9%] api writing output... [ 18%] authors writing output... [ 27%] changelog writing output... [ 36%] config writing output... [ 45%] csrf writing output... [ 54%] form writing output... [ 63%] index writing output... [ 72%] install writing output... [ 81%] license writing output... [ 90%] quickstart writing output... [100%] upgrade generating indices... writing additional pages... search opensearch copying static files... done copying extra files... done dumping search index in English (code: en) ... done dumping object inventory... done build succeeded. Build finished; now you can process the pickle files. make: Leaving directory '/usr/src/RPM/BUILD/python-module-flask-wtf-0.14.2/docs' ++ pwd + PYTHONPATH=/usr/src/RPM/BUILD/python-module-flask-wtf-0.14.2 + make -C docs html make: Entering directory '/usr/src/RPM/BUILD/python-module-flask-wtf-0.14.2/docs' sphinx-build -b html -d _build/doctrees . _build/html Running Sphinx v1.6.5 making output directory... ------------------------------------------------------------------------ Flask theme not found. Run "pip install flask-sphinx-themes" to get it. ------------------------------------------------------------------------ Generating grammar tables from /usr/lib/python2.7/site-packages/sphinx/pycode/Grammar-py2.txt loading pickled environment... done loading intersphinx inventory from objects.inv... loading intersphinx inventory from objects.inv... loading intersphinx inventory from objects.inv... loading intersphinx inventory from objects.inv... loading intersphinx inventory from objects.inv... building [mo]: targets for 0 po files that are out of date building [html]: targets for 11 source files that are out of date updating environment: 0 added, 0 changed, 0 removed looking for now-outdated files... none found preparing documents... done writing output... [ 9%] api writing output... [ 18%] authors writing output... [ 27%] changelog writing output... [ 36%] config writing output... [ 45%] csrf writing output... [ 54%] form writing output... [ 63%] index writing output... [ 72%] install writing output... [ 81%] license writing output... [ 90%] quickstart writing output... [100%] upgrade generating indices... writing additional pages... search opensearch copying static files... done copying extra files... done dumping search index in English (code: en) ... done dumping object inventory... done build succeeded. Build finished. The HTML pages are in _build/html. make: Leaving directory '/usr/src/RPM/BUILD/python-module-flask-wtf-0.14.2/docs' + install -d /usr/src/tmp/python-module-flask-wtf-buildroot/usr/lib/python2.7/site-packages/flask-wtf + cp -fR docs/_build/pickle /usr/src/tmp/python-module-flask-wtf-buildroot/usr/lib/python2.7/site-packages/flask-wtf/ + /usr/lib/rpm/brp-alt Cleaning files in /usr/src/tmp/python-module-flask-wtf-buildroot (auto) Verifying and fixing files in /usr/src/tmp/python-module-flask-wtf-buildroot (binconfig,pkgconfig,libtool,desktop) Checking contents of files in /usr/src/tmp/python-module-flask-wtf-buildroot/ (default) Compressing files in /usr/src/tmp/python-module-flask-wtf-buildroot (auto) Adjusting library links in /usr/src/tmp/python-module-flask-wtf-buildroot ./usr/lib: Verifying ELF objects in /usr/src/tmp/python-module-flask-wtf-buildroot (arch=normal,fhs=normal,lfs=relaxed,lint=relaxed,rpath=normal,stack=normal,textrel=normal,unresolved=normal) Bytecompiling python modules in /usr/src/tmp/python-module-flask-wtf-buildroot using /usr/bin/python unlink /usr/src/tmp/python-module-flask-wtf-buildroot/usr/lib/python2.7/site-packages/flask_wtf/recaptcha/__init__.pyc unlink /usr/src/tmp/python-module-flask-wtf-buildroot/usr/lib/python2.7/site-packages/flask_wtf/recaptcha/fields.pyc unlink /usr/src/tmp/python-module-flask-wtf-buildroot/usr/lib/python2.7/site-packages/flask_wtf/recaptcha/validators.pyc unlink /usr/src/tmp/python-module-flask-wtf-buildroot/usr/lib/python2.7/site-packages/flask_wtf/recaptcha/widgets.pyc compile /usr/src/tmp/python-module-flask-wtf-buildroot/usr/lib/python2.7/site-packages/flask_wtf/recaptcha/__init__.py compile /usr/src/tmp/python-module-flask-wtf-buildroot/usr/lib/python2.7/site-packages/flask_wtf/recaptcha/fields.py compile /usr/src/tmp/python-module-flask-wtf-buildroot/usr/lib/python2.7/site-packages/flask_wtf/recaptcha/validators.py compile /usr/src/tmp/python-module-flask-wtf-buildroot/usr/lib/python2.7/site-packages/flask_wtf/recaptcha/widgets.py unlink /usr/src/tmp/python-module-flask-wtf-buildroot/usr/lib/python2.7/site-packages/flask_wtf/__init__.pyc unlink /usr/src/tmp/python-module-flask-wtf-buildroot/usr/lib/python2.7/site-packages/flask_wtf/_compat.pyc unlink /usr/src/tmp/python-module-flask-wtf-buildroot/usr/lib/python2.7/site-packages/flask_wtf/csrf.pyc unlink /usr/src/tmp/python-module-flask-wtf-buildroot/usr/lib/python2.7/site-packages/flask_wtf/file.pyc unlink /usr/src/tmp/python-module-flask-wtf-buildroot/usr/lib/python2.7/site-packages/flask_wtf/form.pyc unlink /usr/src/tmp/python-module-flask-wtf-buildroot/usr/lib/python2.7/site-packages/flask_wtf/html5.pyc unlink /usr/src/tmp/python-module-flask-wtf-buildroot/usr/lib/python2.7/site-packages/flask_wtf/i18n.pyc compile /usr/src/tmp/python-module-flask-wtf-buildroot/usr/lib/python2.7/site-packages/flask_wtf/__init__.py compile /usr/src/tmp/python-module-flask-wtf-buildroot/usr/lib/python2.7/site-packages/flask_wtf/_compat.py compile /usr/src/tmp/python-module-flask-wtf-buildroot/usr/lib/python2.7/site-packages/flask_wtf/csrf.py compile /usr/src/tmp/python-module-flask-wtf-buildroot/usr/lib/python2.7/site-packages/flask_wtf/file.py compile /usr/src/tmp/python-module-flask-wtf-buildroot/usr/lib/python2.7/site-packages/flask_wtf/form.py compile /usr/src/tmp/python-module-flask-wtf-buildroot/usr/lib/python2.7/site-packages/flask_wtf/html5.py compile /usr/src/tmp/python-module-flask-wtf-buildroot/usr/lib/python2.7/site-packages/flask_wtf/i18n.py Bytecompiling python modules with optimization in /usr/src/tmp/python-module-flask-wtf-buildroot using /usr/bin/python -O compile /usr/src/tmp/python-module-flask-wtf-buildroot/usr/lib/python2.7/site-packages/flask_wtf/recaptcha/__init__.py compile /usr/src/tmp/python-module-flask-wtf-buildroot/usr/lib/python2.7/site-packages/flask_wtf/recaptcha/fields.py compile /usr/src/tmp/python-module-flask-wtf-buildroot/usr/lib/python2.7/site-packages/flask_wtf/recaptcha/validators.py compile /usr/src/tmp/python-module-flask-wtf-buildroot/usr/lib/python2.7/site-packages/flask_wtf/recaptcha/widgets.py compile /usr/src/tmp/python-module-flask-wtf-buildroot/usr/lib/python2.7/site-packages/flask_wtf/__init__.py compile /usr/src/tmp/python-module-flask-wtf-buildroot/usr/lib/python2.7/site-packages/flask_wtf/_compat.py compile /usr/src/tmp/python-module-flask-wtf-buildroot/usr/lib/python2.7/site-packages/flask_wtf/csrf.py compile /usr/src/tmp/python-module-flask-wtf-buildroot/usr/lib/python2.7/site-packages/flask_wtf/file.py compile /usr/src/tmp/python-module-flask-wtf-buildroot/usr/lib/python2.7/site-packages/flask_wtf/form.py compile /usr/src/tmp/python-module-flask-wtf-buildroot/usr/lib/python2.7/site-packages/flask_wtf/html5.py compile /usr/src/tmp/python-module-flask-wtf-buildroot/usr/lib/python2.7/site-packages/flask_wtf/i18n.py Bytecompiling python3 modules in /usr/src/tmp/python-module-flask-wtf-buildroot using /usr/bin/python3 unlink /usr/src/tmp/python-module-flask-wtf-buildroot/usr/lib/python3/site-packages/flask_wtf/__pycache__/__init__.cpython-37.pyc unlink /usr/src/tmp/python-module-flask-wtf-buildroot/usr/lib/python3/site-packages/flask_wtf/__pycache__/_compat.cpython-37.pyc unlink /usr/src/tmp/python-module-flask-wtf-buildroot/usr/lib/python3/site-packages/flask_wtf/__pycache__/csrf.cpython-37.pyc unlink /usr/src/tmp/python-module-flask-wtf-buildroot/usr/lib/python3/site-packages/flask_wtf/__pycache__/file.cpython-37.pyc unlink /usr/src/tmp/python-module-flask-wtf-buildroot/usr/lib/python3/site-packages/flask_wtf/__pycache__/form.cpython-37.pyc unlink /usr/src/tmp/python-module-flask-wtf-buildroot/usr/lib/python3/site-packages/flask_wtf/__pycache__/html5.cpython-37.pyc unlink /usr/src/tmp/python-module-flask-wtf-buildroot/usr/lib/python3/site-packages/flask_wtf/__pycache__/i18n.cpython-37.pyc unlink /usr/src/tmp/python-module-flask-wtf-buildroot/usr/lib/python3/site-packages/flask_wtf/recaptcha/__pycache__/__init__.cpython-37.pyc unlink /usr/src/tmp/python-module-flask-wtf-buildroot/usr/lib/python3/site-packages/flask_wtf/recaptcha/__pycache__/fields.cpython-37.pyc unlink /usr/src/tmp/python-module-flask-wtf-buildroot/usr/lib/python3/site-packages/flask_wtf/recaptcha/__pycache__/validators.cpython-37.pyc unlink /usr/src/tmp/python-module-flask-wtf-buildroot/usr/lib/python3/site-packages/flask_wtf/recaptcha/__pycache__/widgets.cpython-37.pyc compile /usr/src/tmp/python-module-flask-wtf-buildroot/usr/lib/python3/site-packages/flask_wtf/recaptcha/__init__.py compile /usr/src/tmp/python-module-flask-wtf-buildroot/usr/lib/python3/site-packages/flask_wtf/recaptcha/fields.py compile /usr/src/tmp/python-module-flask-wtf-buildroot/usr/lib/python3/site-packages/flask_wtf/recaptcha/validators.py compile /usr/src/tmp/python-module-flask-wtf-buildroot/usr/lib/python3/site-packages/flask_wtf/recaptcha/widgets.py compile /usr/src/tmp/python-module-flask-wtf-buildroot/usr/lib/python3/site-packages/flask_wtf/__init__.py compile /usr/src/tmp/python-module-flask-wtf-buildroot/usr/lib/python3/site-packages/flask_wtf/_compat.py compile /usr/src/tmp/python-module-flask-wtf-buildroot/usr/lib/python3/site-packages/flask_wtf/csrf.py compile /usr/src/tmp/python-module-flask-wtf-buildroot/usr/lib/python3/site-packages/flask_wtf/file.py compile /usr/src/tmp/python-module-flask-wtf-buildroot/usr/lib/python3/site-packages/flask_wtf/form.py compile /usr/src/tmp/python-module-flask-wtf-buildroot/usr/lib/python3/site-packages/flask_wtf/html5.py compile /usr/src/tmp/python-module-flask-wtf-buildroot/usr/lib/python3/site-packages/flask_wtf/i18n.py Bytecompiling python3 modules with optimization in /usr/src/tmp/python-module-flask-wtf-buildroot using /usr/bin/python3 -O compile /usr/src/tmp/python-module-flask-wtf-buildroot/usr/lib/python3/site-packages/flask_wtf/recaptcha/__init__.py compile /usr/src/tmp/python-module-flask-wtf-buildroot/usr/lib/python3/site-packages/flask_wtf/recaptcha/fields.py compile /usr/src/tmp/python-module-flask-wtf-buildroot/usr/lib/python3/site-packages/flask_wtf/recaptcha/validators.py compile /usr/src/tmp/python-module-flask-wtf-buildroot/usr/lib/python3/site-packages/flask_wtf/recaptcha/widgets.py compile /usr/src/tmp/python-module-flask-wtf-buildroot/usr/lib/python3/site-packages/flask_wtf/__init__.py compile /usr/src/tmp/python-module-flask-wtf-buildroot/usr/lib/python3/site-packages/flask_wtf/_compat.py compile /usr/src/tmp/python-module-flask-wtf-buildroot/usr/lib/python3/site-packages/flask_wtf/csrf.py compile /usr/src/tmp/python-module-flask-wtf-buildroot/usr/lib/python3/site-packages/flask_wtf/file.py compile /usr/src/tmp/python-module-flask-wtf-buildroot/usr/lib/python3/site-packages/flask_wtf/form.py compile /usr/src/tmp/python-module-flask-wtf-buildroot/usr/lib/python3/site-packages/flask_wtf/html5.py compile /usr/src/tmp/python-module-flask-wtf-buildroot/usr/lib/python3/site-packages/flask_wtf/i18n.py Bytecompiling python3 modules with optimization-2 in /usr/src/tmp/python-module-flask-wtf-buildroot using /usr/bin/python3 -OO compile /usr/src/tmp/python-module-flask-wtf-buildroot/usr/lib/python3/site-packages/flask_wtf/recaptcha/__init__.py compile /usr/src/tmp/python-module-flask-wtf-buildroot/usr/lib/python3/site-packages/flask_wtf/recaptcha/fields.py compile /usr/src/tmp/python-module-flask-wtf-buildroot/usr/lib/python3/site-packages/flask_wtf/recaptcha/validators.py compile /usr/src/tmp/python-module-flask-wtf-buildroot/usr/lib/python3/site-packages/flask_wtf/recaptcha/widgets.py compile /usr/src/tmp/python-module-flask-wtf-buildroot/usr/lib/python3/site-packages/flask_wtf/__init__.py compile /usr/src/tmp/python-module-flask-wtf-buildroot/usr/lib/python3/site-packages/flask_wtf/_compat.py compile /usr/src/tmp/python-module-flask-wtf-buildroot/usr/lib/python3/site-packages/flask_wtf/csrf.py compile /usr/src/tmp/python-module-flask-wtf-buildroot/usr/lib/python3/site-packages/flask_wtf/file.py compile /usr/src/tmp/python-module-flask-wtf-buildroot/usr/lib/python3/site-packages/flask_wtf/form.py compile /usr/src/tmp/python-module-flask-wtf-buildroot/usr/lib/python3/site-packages/flask_wtf/html5.py compile /usr/src/tmp/python-module-flask-wtf-buildroot/usr/lib/python3/site-packages/flask_wtf/i18n.py Hardlinking identical .pyc and .opt-?.pyc files './usr/lib/python3/site-packages/flask_wtf/__pycache__/i18n.cpython-37.opt-1.pyc' => './usr/lib/python3/site-packages/flask_wtf/__pycache__/i18n.cpython-37.pyc' './usr/lib/python3/site-packages/flask_wtf/__pycache__/html5.cpython-37.opt-1.pyc' => './usr/lib/python3/site-packages/flask_wtf/__pycache__/html5.cpython-37.pyc' './usr/lib/python3/site-packages/flask_wtf/__pycache__/html5.cpython-37.opt-2.pyc' => './usr/lib/python3/site-packages/flask_wtf/__pycache__/html5.cpython-37.opt-1.pyc' './usr/lib/python3/site-packages/flask_wtf/__pycache__/form.cpython-37.opt-1.pyc' => './usr/lib/python3/site-packages/flask_wtf/__pycache__/form.cpython-37.pyc' './usr/lib/python3/site-packages/flask_wtf/__pycache__/file.cpython-37.opt-1.pyc' => './usr/lib/python3/site-packages/flask_wtf/__pycache__/file.cpython-37.pyc' './usr/lib/python3/site-packages/flask_wtf/__pycache__/csrf.cpython-37.opt-1.pyc' => './usr/lib/python3/site-packages/flask_wtf/__pycache__/csrf.cpython-37.pyc' './usr/lib/python3/site-packages/flask_wtf/__pycache__/_compat.cpython-37.opt-1.pyc' => './usr/lib/python3/site-packages/flask_wtf/__pycache__/_compat.cpython-37.pyc' './usr/lib/python3/site-packages/flask_wtf/__pycache__/__init__.cpython-37.opt-1.pyc' => './usr/lib/python3/site-packages/flask_wtf/__pycache__/__init__.cpython-37.pyc' './usr/lib/python3/site-packages/flask_wtf/recaptcha/__pycache__/widgets.cpython-37.opt-1.pyc' => './usr/lib/python3/site-packages/flask_wtf/recaptcha/__pycache__/widgets.cpython-37.pyc' './usr/lib/python3/site-packages/flask_wtf/recaptcha/__pycache__/validators.cpython-37.opt-1.pyc' => './usr/lib/python3/site-packages/flask_wtf/recaptcha/__pycache__/validators.cpython-37.pyc' './usr/lib/python3/site-packages/flask_wtf/recaptcha/__pycache__/fields.cpython-37.opt-1.pyc' => './usr/lib/python3/site-packages/flask_wtf/recaptcha/__pycache__/fields.cpython-37.pyc' './usr/lib/python3/site-packages/flask_wtf/recaptcha/__pycache__/fields.cpython-37.opt-2.pyc' => './usr/lib/python3/site-packages/flask_wtf/recaptcha/__pycache__/fields.cpython-37.opt-1.pyc' './usr/lib/python3/site-packages/flask_wtf/recaptcha/__pycache__/__init__.cpython-37.opt-1.pyc' => './usr/lib/python3/site-packages/flask_wtf/recaptcha/__pycache__/__init__.cpython-37.pyc' './usr/lib/python3/site-packages/flask_wtf/recaptcha/__pycache__/__init__.cpython-37.opt-2.pyc' => './usr/lib/python3/site-packages/flask_wtf/recaptcha/__pycache__/__init__.cpython-37.opt-1.pyc' Hardlinking identical .pyc and .pyo files './usr/lib/python2.7/site-packages/flask_wtf/i18n.pyo' => './usr/lib/python2.7/site-packages/flask_wtf/i18n.pyc' './usr/lib/python2.7/site-packages/flask_wtf/html5.pyo' => './usr/lib/python2.7/site-packages/flask_wtf/html5.pyc' './usr/lib/python2.7/site-packages/flask_wtf/form.pyo' => './usr/lib/python2.7/site-packages/flask_wtf/form.pyc' './usr/lib/python2.7/site-packages/flask_wtf/file.pyo' => './usr/lib/python2.7/site-packages/flask_wtf/file.pyc' './usr/lib/python2.7/site-packages/flask_wtf/csrf.pyo' => './usr/lib/python2.7/site-packages/flask_wtf/csrf.pyc' './usr/lib/python2.7/site-packages/flask_wtf/_compat.pyo' => './usr/lib/python2.7/site-packages/flask_wtf/_compat.pyc' './usr/lib/python2.7/site-packages/flask_wtf/__init__.pyo' => './usr/lib/python2.7/site-packages/flask_wtf/__init__.pyc' './usr/lib/python2.7/site-packages/flask_wtf/recaptcha/widgets.pyo' => './usr/lib/python2.7/site-packages/flask_wtf/recaptcha/widgets.pyc' './usr/lib/python2.7/site-packages/flask_wtf/recaptcha/validators.pyo' => './usr/lib/python2.7/site-packages/flask_wtf/recaptcha/validators.pyc' './usr/lib/python2.7/site-packages/flask_wtf/recaptcha/fields.pyo' => './usr/lib/python2.7/site-packages/flask_wtf/recaptcha/fields.pyc' './usr/lib/python2.7/site-packages/flask_wtf/recaptcha/__init__.pyo' => './usr/lib/python2.7/site-packages/flask_wtf/recaptcha/__init__.pyc' Executing(%check): /bin/sh -e /usr/src/tmp/rpm-tmp.13616 + umask 022 + /bin/mkdir -p /usr/src/RPM/BUILD + cd /usr/src/RPM/BUILD + cd python-module-flask-wtf-0.14.2 + py.test ============================= test session starts ============================== platform linux2 -- Python 2.7.16, pytest-3.10.1, py-1.8.0, pluggy-0.11.0 rootdir: /usr/src/RPM/BUILD/python-module-flask-wtf-0.14.2, inifile: collected 53 items tests/test_csrf.py .................... [ 37%] tests/test_deprecated.py .... [ 45%] tests/test_i18n.py .. [ 49%] tests/test_recaptcha.py ....F. [ 60%] tests/test_uploads.py ........ [ 75%] tests/test_validation.py ..........F.. [100%] =================================== FAILURES =================================== __________________ TestRecaptcha.test_send_recaptcha_request ___________________ self = def test_send_recaptcha_request(self): response = self.client.post('/', data={ 'g-recaptcha-response': 'test' }) > assert b'invalid' in response.data E AssertionError: assert 'invalid' in '\n500 Internal Server Error\n

Internal Serve...nd was unable to complete your request. Either the server is overloaded or there is an error in the application.

\n' E + where '\n500 Internal Server Error\n

Internal Serve...nd was unable to complete your request. Either the server is overloaded or there is an error in the application.

\n' = .data tests/test_recaptcha.py:46: AssertionError ------------------------------ Captured log call ------------------------------- app.py 1891 ERROR Exception on / [POST] Traceback (most recent call last): File "/usr/lib/python2.7/site-packages/flask/app.py", line 2446, in wsgi_app response = self.full_dispatch_request() File "/usr/lib/python2.7/site-packages/flask/app.py", line 1951, in full_dispatch_request rv = self.handle_user_exception(e) File "/usr/lib/python2.7/site-packages/flask/app.py", line 1820, in handle_user_exception reraise(exc_type, exc_value, tb) File "/usr/lib/python2.7/site-packages/flask/app.py", line 1949, in full_dispatch_request rv = self.dispatch_request() File "/usr/lib/python2.7/site-packages/flask/app.py", line 1935, in dispatch_request return self.view_functions[rule.endpoint](**req.view_args) File "/usr/src/RPM/BUILD/python-module-flask-wtf-0.14.2/tests/test_recaptcha.py", line 29, in index if form.validate_on_submit(): File "/usr/src/RPM/BUILD/python-module-flask-wtf-0.14.2/flask_wtf/form.py", line 101, in validate_on_submit return self.is_submitted() and self.validate() File "/usr/lib/python2.7/site-packages/wtforms/form.py", line 310, in validate return super(Form, self).validate(extra) File "/usr/lib/python2.7/site-packages/wtforms/form.py", line 152, in validate if not field.validate(self, extra): File "/usr/lib/python2.7/site-packages/wtforms/fields/core.py", line 204, in validate stop_validation = self._run_validation_chain(form, chain) File "/usr/lib/python2.7/site-packages/wtforms/fields/core.py", line 224, in _run_validation_chain validator(form, self) File "/usr/src/RPM/BUILD/python-module-flask-wtf-0.14.2/flask_wtf/recaptcha/validators.py", line 46, in __call__ if not self._validate_recaptcha(response, remote_ip): File "/usr/src/RPM/BUILD/python-module-flask-wtf-0.14.2/flask_wtf/recaptcha/validators.py", line 63, in _validate_recaptcha http_response = http.urlopen(RECAPTCHA_VERIFY_SERVER, to_bytes(data)) File "/usr/lib/python2.7/urllib2.py", line 154, in urlopen return opener.open(url, data, timeout) File "/usr/lib/python2.7/urllib2.py", line 429, in open response = self._open(req, data) File "/usr/lib/python2.7/urllib2.py", line 447, in _open '_open', req) File "/usr/lib/python2.7/urllib2.py", line 407, in _call_chain result = func(*args) File "/usr/lib/python2.7/urllib2.py", line 1241, in https_open context=self._context) File "/usr/lib/python2.7/urllib2.py", line 1198, in do_open raise URLError(err) URLError: __________________________ TestCSRF.test_invalid_csrf __________________________ self = def test_invalid_csrf(self): from flask_wtf.csrf import logger with capture_logging(logger) as handler: response = self.client.post("/", data={"name": "danny"}) assert b'DANNY' not in response.data assert b'The CSRF token is missing.' in response.data > self.assertEqual(1, len(handler)) E AssertionError: 1 != 0 tests/test_validation.py:70: AssertionError =============================== warnings summary =============================== tests/test_uploads.py::TestFileUpload::test_multiple_files /usr/src/RPM/BUILD/python-module-flask-wtf-0.14.2/flask_wtf/file.py:33: FlaskWTFDeprecationWarning: "has_file" is deprecated and will be removed in 1.0. The data is checked during processing instead. '"has_file" is deprecated and will be removed in 1.0. The data is ' /usr/src/RPM/BUILD/python-module-flask-wtf-0.14.2/flask_wtf/file.py:33: FlaskWTFDeprecationWarning: "has_file" is deprecated and will be removed in 1.0. The data is checked during processing instead. '"has_file" is deprecated and will be removed in 1.0. The data is ' /usr/src/RPM/BUILD/python-module-flask-wtf-0.14.2/flask_wtf/file.py:33: FlaskWTFDeprecationWarning: "has_file" is deprecated and will be removed in 1.0. The data is checked during processing instead. '"has_file" is deprecated and will be removed in 1.0. The data is ' -- Docs: https://docs.pytest.org/en/latest/warnings.html =============== 2 failed, 51 passed, 3 warnings in 1.22 seconds ================ + : + pushd ../python3 ~/RPM/BUILD/python3 ~/RPM/BUILD/python-module-flask-wtf-0.14.2 + py.test3 /usr/src/tmp/rpm-tmp.13616: line 128: py.test3: command not found + : + popd ~/RPM/BUILD/python-module-flask-wtf-0.14.2 + exit 0 Processing files: python-module-flask-wtf-0.14.2-alt1.1 Executing(%doc): /bin/sh -e /usr/src/tmp/rpm-tmp.21773 + umask 022 + /bin/mkdir -p /usr/src/RPM/BUILD + cd /usr/src/RPM/BUILD + cd python-module-flask-wtf-0.14.2 + DOCDIR=/usr/src/tmp/python-module-flask-wtf-buildroot/usr/share/doc/python-module-flask-wtf-0.14.2 + export DOCDIR + rm -rf /usr/src/tmp/python-module-flask-wtf-buildroot/usr/share/doc/python-module-flask-wtf-0.14.2 + /bin/mkdir -p /usr/src/tmp/python-module-flask-wtf-buildroot/usr/share/doc/python-module-flask-wtf-0.14.2 + cp -prL AUTHORS README.rst /usr/src/tmp/python-module-flask-wtf-buildroot/usr/share/doc/python-module-flask-wtf-0.14.2 + chmod -R go-w /usr/src/tmp/python-module-flask-wtf-buildroot/usr/share/doc/python-module-flask-wtf-0.14.2 + chmod -R a+rX /usr/src/tmp/python-module-flask-wtf-buildroot/usr/share/doc/python-module-flask-wtf-0.14.2 + exit 0 Finding Provides (using /usr/lib/rpm/find-provides) Executing: /bin/sh -e /usr/src/tmp/rpm-tmp.cmkRNG find-provides: running scripts (alternatives,debuginfo,lib,pam,perl,pkgconfig,python,python3,shell) Finding Requires (using /usr/lib/rpm/find-requires) Executing: /bin/sh -e /usr/src/tmp/rpm-tmp.ezKcAb find-requires: running scripts (cpp,debuginfo,files,lib,pam,perl,pkgconfig,pkgconfiglib,python,python3,rpmlib,shebang,shell,static,symlinks) /usr/lib/rpm/python.req.py: /usr/src/tmp/python-module-flask-wtf-buildroot/usr/lib/python2.7/site-packages/flask_wtf/__init__.py: line=15 possible relative import from ., UNIMPLEMENTED /usr/lib/rpm/python.req.py: /usr/src/tmp/python-module-flask-wtf-buildroot/usr/lib/python2.7/site-packages/flask_wtf/__init__.py: line=16 possible relative import from ., UNIMPLEMENTED /usr/lib/rpm/python.req.py: /usr/src/tmp/python-module-flask-wtf-buildroot/usr/lib/python2.7/site-packages/flask_wtf/__init__.py: line=17 possible relative import from ., UNIMPLEMENTED python.req: /usr/src/tmp/python-module-flask-wtf-buildroot/usr/lib/python2.7/site-packages/flask_wtf/_compat.py: skipping sys /usr/lib/rpm/python.req.py: /usr/src/tmp/python-module-flask-wtf-buildroot/usr/lib/python2.7/site-packages/flask_wtf/_compat.py: line=9 IGNORE (for REQ=slight and deep=8) module=urllib /usr/lib/rpm/python.req.py: /usr/src/tmp/python-module-flask-wtf-buildroot/usr/lib/python2.7/site-packages/flask_wtf/_compat.py: line=13 IGNORE (for REQ=slight and deep=8) module=urlparse /usr/lib/rpm/python.req.py: /usr/src/tmp/python-module-flask-wtf-buildroot/usr/lib/python2.7/site-packages/flask_wtf/csrf.py: line=14 possible relative import from ., UNIMPLEMENTED /usr/lib/rpm/python.req.py: /usr/src/tmp/python-module-flask-wtf-buildroot/usr/lib/python2.7/site-packages/flask_wtf/file.py: line=8 possible relative import from ., UNIMPLEMENTED /usr/lib/rpm/python.req.py: /usr/src/tmp/python-module-flask-wtf-buildroot/usr/lib/python2.7/site-packages/flask_wtf/form.py: line=12 possible relative import from ., UNIMPLEMENTED /usr/lib/rpm/python.req.py: /usr/src/tmp/python-module-flask-wtf-buildroot/usr/lib/python2.7/site-packages/flask_wtf/form.py: line=13 possible relative import from ., UNIMPLEMENTED /usr/lib/rpm/python.req.py: /usr/src/tmp/python-module-flask-wtf-buildroot/usr/lib/python2.7/site-packages/flask_wtf/form.py: line=16 possible relative import from ., UNIMPLEMENTED python.req: /usr/src/tmp/python-module-flask-wtf-buildroot/usr/lib/python2.7/site-packages/flask_wtf/html5.py: hiding flask_wtf, which SEEMS TO BE SELF-SATISFIED /usr/lib/rpm/python.req.py: /usr/src/tmp/python-module-flask-wtf-buildroot/usr/lib/python2.7/site-packages/flask_wtf/i18n.py: line=14 IGNORE (for REQ=slight and deep=8) module=flask_babel /usr/lib/rpm/python.req.py: /usr/src/tmp/python-module-flask-wtf-buildroot/usr/lib/python2.7/site-packages/flask_wtf/i18n.py: line=16 IGNORE (for REQ=slight and deep=8) module=flask_babelex /usr/lib/rpm/python.req.py: /usr/src/tmp/python-module-flask-wtf-buildroot/usr/lib/python2.7/site-packages/flask_wtf/i18n.py: line=18 IGNORE (for REQ=slight and deep=8) module=wtforms /usr/lib/rpm/python.req.py: /usr/src/tmp/python-module-flask-wtf-buildroot/usr/lib/python2.7/site-packages/flask_wtf/i18n.py: line=20 IGNORE (for REQ=slight and deep=8) module=wtforms /usr/lib/rpm/python.req.py: /usr/src/tmp/python-module-flask-wtf-buildroot/usr/lib/python2.7/site-packages/flask_wtf/recaptcha/__init__.py: line=2 possible relative import from ., UNIMPLEMENTED /usr/lib/rpm/python.req.py: /usr/src/tmp/python-module-flask-wtf-buildroot/usr/lib/python2.7/site-packages/flask_wtf/recaptcha/__init__.py: line=3 possible relative import from ., UNIMPLEMENTED /usr/lib/rpm/python.req.py: /usr/src/tmp/python-module-flask-wtf-buildroot/usr/lib/python2.7/site-packages/flask_wtf/recaptcha/__init__.py: line=4 possible relative import from ., UNIMPLEMENTED /usr/lib/rpm/python.req.py: /usr/src/tmp/python-module-flask-wtf-buildroot/usr/lib/python2.7/site-packages/flask_wtf/recaptcha/fields.py: line=3 possible relative import from ., UNIMPLEMENTED /usr/lib/rpm/python.req.py: /usr/src/tmp/python-module-flask-wtf-buildroot/usr/lib/python2.7/site-packages/flask_wtf/recaptcha/fields.py: line=4 possible relative import from ., UNIMPLEMENTED /usr/lib/rpm/python.req.py: /usr/src/tmp/python-module-flask-wtf-buildroot/usr/lib/python2.7/site-packages/flask_wtf/recaptcha/validators.py: line=2 IGNORE (for REQ=slight and deep=8) module=urllib2 /usr/lib/rpm/python.req.py: /usr/src/tmp/python-module-flask-wtf-buildroot/usr/lib/python2.7/site-packages/flask_wtf/recaptcha/validators.py: line=5 IGNORE (for REQ=slight and deep=8) module=urllib /usr/lib/rpm/python.req.py: /usr/src/tmp/python-module-flask-wtf-buildroot/usr/lib/python2.7/site-packages/flask_wtf/recaptcha/validators.py: line=10 possible relative import from ., UNIMPLEMENTED Provides: python2.7(flask_wtf), python2.7(flask_wtf._compat), python2.7(flask_wtf.csrf), python2.7(flask_wtf.file), python2.7(flask_wtf.form), python2.7(flask_wtf.html5), python2.7(flask_wtf.i18n), python2.7(flask_wtf.recaptcha), python2.7(flask_wtf.recaptcha.fields), python2.7(flask_wtf.recaptcha.validators), python2.7(flask_wtf.recaptcha.widgets) Requires: /usr/lib/python2.7/site-packages, python-modules, python2.7(babel), python2.7(flask), python2.7(itsdangerous), python2.7(jinja2), python2.7(json), python2.7(logging), python2.7(werkzeug), python2.7(wtforms) Processing files: python3-module-flask-wtf-0.14.2-alt1.1 Executing(%doc): /bin/sh -e /usr/src/tmp/rpm-tmp.41210 + umask 022 + /bin/mkdir -p /usr/src/RPM/BUILD + cd /usr/src/RPM/BUILD + cd python-module-flask-wtf-0.14.2 + DOCDIR=/usr/src/tmp/python-module-flask-wtf-buildroot/usr/share/doc/python3-module-flask-wtf-0.14.2 + export DOCDIR + rm -rf /usr/src/tmp/python-module-flask-wtf-buildroot/usr/share/doc/python3-module-flask-wtf-0.14.2 + /bin/mkdir -p /usr/src/tmp/python-module-flask-wtf-buildroot/usr/share/doc/python3-module-flask-wtf-0.14.2 + cp -prL AUTHORS README.rst /usr/src/tmp/python-module-flask-wtf-buildroot/usr/share/doc/python3-module-flask-wtf-0.14.2 + chmod -R go-w /usr/src/tmp/python-module-flask-wtf-buildroot/usr/share/doc/python3-module-flask-wtf-0.14.2 + chmod -R a+rX /usr/src/tmp/python-module-flask-wtf-buildroot/usr/share/doc/python3-module-flask-wtf-0.14.2 + exit 0 Finding Provides (using /usr/lib/rpm/find-provides) Executing: /bin/sh -e /usr/src/tmp/rpm-tmp.SlYOkE find-provides: running scripts (alternatives,debuginfo,lib,pam,perl,pkgconfig,python,python3,shell) Finding Requires (using /usr/lib/rpm/find-requires) Executing: /bin/sh -e /usr/src/tmp/rpm-tmp.s3TxJ5 find-requires: running scripts (cpp,debuginfo,files,lib,pam,perl,pkgconfig,pkgconfiglib,python,python3,rpmlib,shebang,shell,static,symlinks) /usr/lib/rpm/python3.req.py: /usr/src/tmp/python-module-flask-wtf-buildroot/usr/lib/python3/site-packages/flask_wtf/__init__.py: line=15 possible relative import from ., UNIMPLEMENTED /usr/lib/rpm/python3.req.py: /usr/src/tmp/python-module-flask-wtf-buildroot/usr/lib/python3/site-packages/flask_wtf/__init__.py: line=16 possible relative import from ., UNIMPLEMENTED /usr/lib/rpm/python3.req.py: /usr/src/tmp/python-module-flask-wtf-buildroot/usr/lib/python3/site-packages/flask_wtf/__init__.py: line=17 possible relative import from ., UNIMPLEMENTED python3.req: /usr/src/tmp/python-module-flask-wtf-buildroot/usr/lib/python3/site-packages/flask_wtf/_compat.py: skipping sys /usr/lib/rpm/python3.req.py: /usr/src/tmp/python-module-flask-wtf-buildroot/usr/lib/python3/site-packages/flask_wtf/_compat.py: line=9 IGNORE (for REQ=slight and deep=8) module=urllib.parse /usr/lib/rpm/python3.req.py: /usr/src/tmp/python-module-flask-wtf-buildroot/usr/lib/python3/site-packages/flask_wtf/_compat.py: line=13 IGNORE (for REQ=slight and deep=8) module=urlparse /usr/lib/rpm/python3.req.py: /usr/src/tmp/python-module-flask-wtf-buildroot/usr/lib/python3/site-packages/flask_wtf/csrf.py: line=14 possible relative import from ., UNIMPLEMENTED /usr/lib/rpm/python3.req.py: /usr/src/tmp/python-module-flask-wtf-buildroot/usr/lib/python3/site-packages/flask_wtf/file.py: line=8 possible relative import from ., UNIMPLEMENTED /usr/lib/rpm/python3.req.py: /usr/src/tmp/python-module-flask-wtf-buildroot/usr/lib/python3/site-packages/flask_wtf/form.py: line=12 possible relative import from ., UNIMPLEMENTED /usr/lib/rpm/python3.req.py: /usr/src/tmp/python-module-flask-wtf-buildroot/usr/lib/python3/site-packages/flask_wtf/form.py: line=13 possible relative import from ., UNIMPLEMENTED /usr/lib/rpm/python3.req.py: /usr/src/tmp/python-module-flask-wtf-buildroot/usr/lib/python3/site-packages/flask_wtf/form.py: line=16 possible relative import from ., UNIMPLEMENTED /usr/lib/rpm/python3.req.py: /usr/src/tmp/python-module-flask-wtf-buildroot/usr/lib/python3/site-packages/flask_wtf/i18n.py: line=14 IGNORE (for REQ=slight and deep=8) module=flask_babel /usr/lib/rpm/python3.req.py: /usr/src/tmp/python-module-flask-wtf-buildroot/usr/lib/python3/site-packages/flask_wtf/i18n.py: line=16 IGNORE (for REQ=slight and deep=8) module=flask_babelex /usr/lib/rpm/python3.req.py: /usr/src/tmp/python-module-flask-wtf-buildroot/usr/lib/python3/site-packages/flask_wtf/i18n.py: line=18 IGNORE (for REQ=slight and deep=8) module=wtforms.i18n /usr/lib/rpm/python3.req.py: /usr/src/tmp/python-module-flask-wtf-buildroot/usr/lib/python3/site-packages/flask_wtf/i18n.py: line=20 IGNORE (for REQ=slight and deep=8) module=wtforms.ext.i18n.utils /usr/lib/rpm/python3.req.py: /usr/src/tmp/python-module-flask-wtf-buildroot/usr/lib/python3/site-packages/flask_wtf/recaptcha/__init__.py: line=2 possible relative import from ., UNIMPLEMENTED /usr/lib/rpm/python3.req.py: /usr/src/tmp/python-module-flask-wtf-buildroot/usr/lib/python3/site-packages/flask_wtf/recaptcha/__init__.py: line=3 possible relative import from ., UNIMPLEMENTED /usr/lib/rpm/python3.req.py: /usr/src/tmp/python-module-flask-wtf-buildroot/usr/lib/python3/site-packages/flask_wtf/recaptcha/__init__.py: line=4 possible relative import from ., UNIMPLEMENTED /usr/lib/rpm/python3.req.py: /usr/src/tmp/python-module-flask-wtf-buildroot/usr/lib/python3/site-packages/flask_wtf/recaptcha/fields.py: line=3 possible relative import from ., UNIMPLEMENTED /usr/lib/rpm/python3.req.py: /usr/src/tmp/python-module-flask-wtf-buildroot/usr/lib/python3/site-packages/flask_wtf/recaptcha/fields.py: line=4 possible relative import from ., UNIMPLEMENTED /usr/lib/rpm/python3.req.py: /usr/src/tmp/python-module-flask-wtf-buildroot/usr/lib/python3/site-packages/flask_wtf/recaptcha/validators.py: line=2 IGNORE (for REQ=slight and deep=8) module=urllib2 /usr/lib/rpm/python3.req.py: /usr/src/tmp/python-module-flask-wtf-buildroot/usr/lib/python3/site-packages/flask_wtf/recaptcha/validators.py: line=5 IGNORE (for REQ=slight and deep=8) module=urllib /usr/lib/rpm/python3.req.py: /usr/src/tmp/python-module-flask-wtf-buildroot/usr/lib/python3/site-packages/flask_wtf/recaptcha/validators.py: line=10 possible relative import from ., UNIMPLEMENTED Provides: python3(flask_wtf), python3(flask_wtf._compat), python3(flask_wtf.csrf), python3(flask_wtf.file), python3(flask_wtf.form), python3(flask_wtf.html5), python3(flask_wtf.i18n), python3(flask_wtf.recaptcha), python3(flask_wtf.recaptcha.fields), python3(flask_wtf.recaptcha.validators), python3(flask_wtf.recaptcha.widgets) Requires: /usr/lib/python3/site-packages, python3(__future__) < 0, python3(babel) < 0, python3(collections) < 0, python3(flask) < 0, python3(functools) < 0, python3(hashlib) < 0, python3(itsdangerous) < 0, python3(jinja2) < 0, python3(json) < 0, python3(logging) < 0, python3(os) < 0, python3(warnings) < 0, python3(werkzeug) < 0, python3(werkzeug.datastructures) < 0, python3(werkzeug.exceptions) < 0, python3(werkzeug.security) < 0, python3(werkzeug.utils) < 0, python3(wtforms) < 0, python3(wtforms.csrf.core) < 0, python3(wtforms.fields) < 0, python3(wtforms.fields.html5) < 0, python3(wtforms.meta) < 0, python3(wtforms.validators) < 0, python3(wtforms.widgets) < 0, python3(wtforms.widgets.html5) < 0 Processing files: python-module-flask-wtf-pickles-0.14.2-alt1.1 Finding Provides (using /usr/lib/rpm/find-provides) Executing: /bin/sh -e /usr/src/tmp/rpm-tmp.Hy2HMo find-provides: running scripts (alternatives,debuginfo,lib,pam,perl,pkgconfig,python,python3,shell) Finding Requires (using /usr/lib/rpm/find-requires) Executing: /bin/sh -e /usr/src/tmp/rpm-tmp.k5kPwK find-requires: running scripts (cpp,debuginfo,files,lib,pam,perl,pkgconfig,pkgconfiglib,python,python3,rpmlib,shebang,shell,static,symlinks) Requires: /usr/lib/python2.7/site-packages Processing files: python-module-flask-wtf-docs-0.14.2-alt1.1 Executing(%doc): /bin/sh -e /usr/src/tmp/rpm-tmp.1014 + umask 022 + /bin/mkdir -p /usr/src/RPM/BUILD + cd /usr/src/RPM/BUILD + cd python-module-flask-wtf-0.14.2 + DOCDIR=/usr/src/tmp/python-module-flask-wtf-buildroot/usr/share/doc/python-module-flask-wtf-docs-0.14.2 + export DOCDIR + rm -rf /usr/src/tmp/python-module-flask-wtf-buildroot/usr/share/doc/python-module-flask-wtf-docs-0.14.2 + /bin/mkdir -p /usr/src/tmp/python-module-flask-wtf-buildroot/usr/share/doc/python-module-flask-wtf-docs-0.14.2 + cp -prL docs/_build/html examples /usr/src/tmp/python-module-flask-wtf-buildroot/usr/share/doc/python-module-flask-wtf-docs-0.14.2 + chmod -R go-w /usr/src/tmp/python-module-flask-wtf-buildroot/usr/share/doc/python-module-flask-wtf-docs-0.14.2 + chmod -R a+rX /usr/src/tmp/python-module-flask-wtf-buildroot/usr/share/doc/python-module-flask-wtf-docs-0.14.2 + exit 0 Finding Provides (using /usr/lib/rpm/find-provides) Executing: /bin/sh -e /usr/src/tmp/rpm-tmp.QwHkG3 find-provides: running scripts (alternatives,debuginfo,lib,pam,perl,pkgconfig,python,python3,shell) Finding Requires (using /usr/lib/rpm/find-requires) Executing: /bin/sh -e /usr/src/tmp/rpm-tmp.U6048I find-requires: running scripts (cpp,debuginfo,files,lib,pam,perl,pkgconfig,pkgconfiglib,python,python3,rpmlib,shebang,shell,static,symlinks) Wrote: /usr/src/RPM/RPMS/noarch/python-module-flask-wtf-0.14.2-alt1.1.noarch.rpm Wrote: /usr/src/RPM/RPMS/noarch/python3-module-flask-wtf-0.14.2-alt1.1.noarch.rpm Wrote: /usr/src/RPM/RPMS/noarch/python-module-flask-wtf-pickles-0.14.2-alt1.1.noarch.rpm Wrote: /usr/src/RPM/RPMS/noarch/python-module-flask-wtf-docs-0.14.2-alt1.1.noarch.rpm 35.45user 2.45system 0:56.06elapsed 67%CPU (0avgtext+0avgdata 76756maxresident)k 0inputs+0outputs (0major+400271minor)pagefaults 0swaps 54.89user 9.28system 1:30.28elapsed 71%CPU (0avgtext+0avgdata 115084maxresident)k 1976inputs+0outputs (0major+935806minor)pagefaults 0swaps --- python-module-flask-wtf-0.14.2-alt1.1.noarch.rpm.repo 2019-04-21 06:13:19.000000000 +0000 +++ python-module-flask-wtf-0.14.2-alt1.1.noarch.rpm.hasher 2020-03-15 12:08:33.884429690 +0000 @@ -1,8 +1,8 @@ -/usr/lib/python2.7/site-packages/Flask_WTF-0.14.2.dev20190421-py2.7.egg-info 40755 -/usr/lib/python2.7/site-packages/Flask_WTF-0.14.2.dev20190421-py2.7.egg-info/PKG-INFO 100644 -/usr/lib/python2.7/site-packages/Flask_WTF-0.14.2.dev20190421-py2.7.egg-info/SOURCES.txt 100644 -/usr/lib/python2.7/site-packages/Flask_WTF-0.14.2.dev20190421-py2.7.egg-info/dependency_links.txt 100644 -/usr/lib/python2.7/site-packages/Flask_WTF-0.14.2.dev20190421-py2.7.egg-info/not-zip-safe 100644 -/usr/lib/python2.7/site-packages/Flask_WTF-0.14.2.dev20190421-py2.7.egg-info/requires.txt 100644 -/usr/lib/python2.7/site-packages/Flask_WTF-0.14.2.dev20190421-py2.7.egg-info/top_level.txt 100644 +/usr/lib/python2.7/site-packages/Flask_WTF-0.14.2.dev20200315-py2.7.egg-info 40755 +/usr/lib/python2.7/site-packages/Flask_WTF-0.14.2.dev20200315-py2.7.egg-info/PKG-INFO 100644 +/usr/lib/python2.7/site-packages/Flask_WTF-0.14.2.dev20200315-py2.7.egg-info/SOURCES.txt 100644 +/usr/lib/python2.7/site-packages/Flask_WTF-0.14.2.dev20200315-py2.7.egg-info/dependency_links.txt 100644 +/usr/lib/python2.7/site-packages/Flask_WTF-0.14.2.dev20200315-py2.7.egg-info/not-zip-safe 100644 +/usr/lib/python2.7/site-packages/Flask_WTF-0.14.2.dev20200315-py2.7.egg-info/requires.txt 100644 +/usr/lib/python2.7/site-packages/Flask_WTF-0.14.2.dev20200315-py2.7.egg-info/top_level.txt 100644 /usr/lib/python2.7/site-packages/flask-wtf 40755 --- python3-module-flask-wtf-0.14.2-alt1.1.noarch.rpm.repo 2019-04-21 06:13:19.000000000 +0000 +++ python3-module-flask-wtf-0.14.2-alt1.1.noarch.rpm.hasher 2020-03-15 12:08:33.987428722 +0000 @@ -1,8 +1,8 @@ -/usr/lib/python3/site-packages/Flask_WTF-0.14.2.dev20190421-py3.7.egg-info 40755 -/usr/lib/python3/site-packages/Flask_WTF-0.14.2.dev20190421-py3.7.egg-info/PKG-INFO 100644 -/usr/lib/python3/site-packages/Flask_WTF-0.14.2.dev20190421-py3.7.egg-info/SOURCES.txt 100644 -/usr/lib/python3/site-packages/Flask_WTF-0.14.2.dev20190421-py3.7.egg-info/dependency_links.txt 100644 -/usr/lib/python3/site-packages/Flask_WTF-0.14.2.dev20190421-py3.7.egg-info/not-zip-safe 100644 -/usr/lib/python3/site-packages/Flask_WTF-0.14.2.dev20190421-py3.7.egg-info/requires.txt 100644 -/usr/lib/python3/site-packages/Flask_WTF-0.14.2.dev20190421-py3.7.egg-info/top_level.txt 100644 +/usr/lib/python3/site-packages/Flask_WTF-0.14.2.dev20200315-py3.7.egg-info 40755 +/usr/lib/python3/site-packages/Flask_WTF-0.14.2.dev20200315-py3.7.egg-info/PKG-INFO 100644 +/usr/lib/python3/site-packages/Flask_WTF-0.14.2.dev20200315-py3.7.egg-info/SOURCES.txt 100644 +/usr/lib/python3/site-packages/Flask_WTF-0.14.2.dev20200315-py3.7.egg-info/dependency_links.txt 100644 +/usr/lib/python3/site-packages/Flask_WTF-0.14.2.dev20200315-py3.7.egg-info/not-zip-safe 100644 +/usr/lib/python3/site-packages/Flask_WTF-0.14.2.dev20200315-py3.7.egg-info/requires.txt 100644 +/usr/lib/python3/site-packages/Flask_WTF-0.14.2.dev20200315-py3.7.egg-info/top_level.txt 100644 /usr/lib/python3/site-packages/flask_wtf 40755