<86>Mar  8 11:05:30 userdel[771639]: delete user 'rooter'
<86>Mar  8 11:05:30 groupadd[771644]: group added to /etc/group: name=rooter, GID=651
<86>Mar  8 11:05:30 groupadd[771644]: group added to /etc/gshadow: name=rooter
<86>Mar  8 11:05:30 groupadd[771644]: new group: name=rooter, GID=651
<86>Mar  8 11:05:30 useradd[771650]: new user: name=rooter, UID=651, GID=651, home=/root, shell=/bin/bash
<86>Mar  8 11:05:30 userdel[771658]: delete user 'builder'
<86>Mar  8 11:05:30 userdel[771658]: removed group 'builder' owned by 'builder'
<86>Mar  8 11:05:30 userdel[771658]: removed shadow group 'builder' owned by 'builder'
<86>Mar  8 11:05:30 groupadd[771663]: group added to /etc/group: name=builder, GID=652
<86>Mar  8 11:05:30 groupadd[771663]: group added to /etc/gshadow: name=builder
<86>Mar  8 11:05:30 groupadd[771663]: new group: name=builder, GID=652
<86>Mar  8 11:05:30 useradd[771667]: new user: name=builder, UID=652, GID=652, home=/usr/src, shell=/bin/bash
<13>Mar  8 11:05:32 rpmi: libgdbm-1.8.3-alt10 1454943334 installed
<13>Mar  8 11:05:32 rpmi: libexpat-2.2.4-alt1 1503305345 installed
<13>Mar  8 11:05:32 rpmi: libp11-kit-0.23.15-alt1 sisyphus+226408.100.2.1 1554288204 installed
<13>Mar  8 11:05:32 rpmi: libtasn1-4.14-alt1 p9+235792.100.2.1 1565425233 installed
<13>Mar  8 11:05:32 rpmi: rpm-macros-alternatives-0.5.1-alt1 sisyphus+226946.100.1.1 1554830426 installed
<13>Mar  8 11:05:32 rpmi: alternatives-0.5.1-alt1 sisyphus+226946.100.1.1 1554830426 installed
<13>Mar  8 11:05:32 rpmi: ca-certificates-2020.01.23-alt1 p9+245253.100.3.1 1580749631 installed
<13>Mar  8 11:05:32 rpmi: ca-trust-0.1.2-alt1 p9+233349.100.1.1 1561655062 installed
<13>Mar  8 11:05:32 rpmi: p11-kit-trust-0.23.15-alt1 sisyphus+226408.100.2.1 1554288204 installed
<13>Mar  8 11:05:33 rpmi: libcrypto1.1-1.1.1d-alt1.1 p9+237853.200.3.1 1569251834 installed
<13>Mar  8 11:05:33 rpmi: libssl1.1-1.1.1d-alt1.1 p9+237853.200.3.1 1569251834 installed
<13>Mar  8 11:05:33 rpmi: python3-3.7.4-alt2 p9+239459.100.1.1 1571444790 installed
<13>Mar  8 11:05:33 rpmi: libpython3-3.7.4-alt2 p9+239459.100.1.1 1571444790 installed
<13>Mar  8 11:05:33 rpmi: python3-base-3.7.4-alt2 p9+239459.100.1.1 1571444790 installed
<13>Mar  8 11:05:33 rpmi: tests-for-installed-python3-pkgs-0.1.13.1-alt2 1535450458 installed
<13>Mar  8 11:05:33 rpmi: rpm-build-python3-0.1.13.1-alt2 1535450458 installed
<13>Mar  8 11:05:36 rpmi: python3-module-pkg_resources-1:40.8.0-alt2 sisyphus+229158.200.2.1 1557735221 installed
<13>Mar  8 11:05:36 rpmi: python3-module-coverage-4.5.3-alt1 sisyphus+228287.200.4.1 1556524564 installed
<13>Mar  8 11:05:36 rpmi: libtinfo-devel-6.1.20180407-alt2 sisyphus+222164.200.1.1 1550686226 installed
<13>Mar  8 11:05:36 rpmi: libncurses-devel-6.1.20180407-alt2 sisyphus+222164.200.1.1 1550686226 installed
<13>Mar  8 11:05:36 rpmi: python3-dev-3.7.4-alt2 p9+239459.100.1.1 1571444790 installed
<13>Mar  8 11:05:36 rpmi: python3-module-setuptools-1:40.8.0-alt2 sisyphus+229158.200.2.1 1557735221 installed
<13>Mar  8 11:05:36 rpmi: python3-module-Cython-0.29.13-alt1 p9+235498.1200.4.1 1565036655 installed
Building target platforms: i586
Building for target i586
Wrote: /usr/src/in/nosrpm/python-module-multidict-4.5.2-alt1.nosrc.rpm
Installing python-module-multidict-4.5.2-alt1.src.rpm
Building target platforms: i586
Building for target i586
Executing(%prep): /bin/sh -e /usr/src/tmp/rpm-tmp.41931
+ umask 022
+ /bin/mkdir -p /usr/src/RPM/BUILD
+ cd /usr/src/RPM/BUILD
+ cd /usr/src/RPM/BUILD
+ rm -rf multidict-4.5.2
+ echo 'Source #0 (multidict-4.5.2.tar):'
Source #0 (multidict-4.5.2.tar):
+ /bin/tar -xf /usr/src/RPM/SOURCES/multidict-4.5.2.tar
+ cd multidict-4.5.2
+ /bin/chmod -c -Rf u+rwX,go-w .
+ exit 0
Executing(%build): /bin/sh -e /usr/src/tmp/rpm-tmp.91835
+ umask 022
+ /bin/mkdir -p /usr/src/RPM/BUILD
+ cd /usr/src/RPM/BUILD
+ cd multidict-4.5.2
+ CFLAGS='-pipe -frecord-gcc-switches -Wall -g -O2 -march=i586 -mtune=generic'
+ export CFLAGS
+ CXXFLAGS='-pipe -frecord-gcc-switches -Wall -g -O2 -march=i586 -mtune=generic'
+ export CXXFLAGS
+ FFLAGS='-pipe -frecord-gcc-switches -Wall -g -O2 -march=i586 -mtune=generic'
+ export FFLAGS
+ /usr/bin/python3 setup.py build
Compiling multidict/_multidict.pyx because it changed.
[1/1] Cythonizing multidict/_multidict.pyx
running build
running build_py
creating build
creating build/lib.linux-i686-3.7
creating build/lib.linux-i686-3.7/multidict
copying multidict/_multidict_py.py -> build/lib.linux-i686-3.7/multidict
copying multidict/_multidict_base.py -> build/lib.linux-i686-3.7/multidict
copying multidict/_compat.py -> build/lib.linux-i686-3.7/multidict
copying multidict/_abc.py -> build/lib.linux-i686-3.7/multidict
copying multidict/__init__.py -> build/lib.linux-i686-3.7/multidict
running egg_info
creating multidict.egg-info
writing multidict.egg-info/PKG-INFO
writing dependency_links to multidict.egg-info/dependency_links.txt
writing top-level names to multidict.egg-info/top_level.txt
writing manifest file 'multidict.egg-info/SOURCES.txt'
reading manifest file 'multidict.egg-info/SOURCES.txt'
reading manifest template 'MANIFEST.in'
/usr/lib/python3/site-packages/Cython/Compiler/Main.py:369: FutureWarning: Cython directive 'language_level' not set, using 2 for now (Py2). This will change in a later release! File: /usr/src/RPM/BUILD/multidict-4.5.2/multidict/_multidict.pyx
  tree = Parsing.p_module(s, pxd, full_module_name)
warning: no files found matching 'CHANGES.rst'
warning: no previously-included files matching '*.pyc' found anywhere in distribution
warning: no previously-included files found matching 'multidict/_multidict.html'
warning: no previously-included files found matching 'multidict/*.so'
warning: no previously-included files found matching 'multidict/*.pyd'
warning: no previously-included files found matching 'multidict/*.pyd'
no previously-included directories found matching 'docs/_build'
writing manifest file 'multidict.egg-info/SOURCES.txt'
copying multidict/__init__.pyi -> build/lib.linux-i686-3.7/multidict
copying multidict/_istr.c -> build/lib.linux-i686-3.7/multidict
copying multidict/_multidict.c -> build/lib.linux-i686-3.7/multidict
copying multidict/_multidict.pyx -> build/lib.linux-i686-3.7/multidict
copying multidict/_multidict_iter.c -> build/lib.linux-i686-3.7/multidict
copying multidict/_multidict_iter.h -> build/lib.linux-i686-3.7/multidict
copying multidict/_multidict_iter.pxd -> build/lib.linux-i686-3.7/multidict
copying multidict/_multidict_views.c -> build/lib.linux-i686-3.7/multidict
copying multidict/_multidict_views.h -> build/lib.linux-i686-3.7/multidict
copying multidict/_multidict_views.pxd -> build/lib.linux-i686-3.7/multidict
copying multidict/_pair_list.c -> build/lib.linux-i686-3.7/multidict
copying multidict/_pair_list.h -> build/lib.linux-i686-3.7/multidict
copying multidict/_pair_list.pxd -> build/lib.linux-i686-3.7/multidict
copying multidict/py.typed -> build/lib.linux-i686-3.7/multidict
running build_ext
building 'multidict._multidict' extension
creating build/temp.linux-i686-3.7
creating build/temp.linux-i686-3.7/multidict
i586-alt-linux-gcc -pthread -Wno-unused-result -Wsign-compare -DNDEBUG -g -fwrapv -O3 -Wall -pipe -frecord-gcc-switches -Wall -g -O3 -march=i586 -mtune=generic -pipe -frecord-gcc-switches -Wall -g -O2 -march=i586 -mtune=generic -fPIC -I./multidict -I/usr/include/python3.7m -c multidict/_multidict.c -o build/temp.linux-i686-3.7/multidict/_multidict.o -O2 -std=c99 -Wall -Wsign-compare -Wconversion -fno-strict-aliasing
multidict/_multidict.c:4507:18: warning: ‘__pyx_f_9multidict_10_multidict__str’ defined but not used [-Wunused-function]
 static PyObject *__pyx_f_9multidict_10_multidict__str(PyObject *__pyx_v_key) {
                  ^~~~~~~~~~~~~~~~~~~~~~~~~~~~~~~~~~~~
i586-alt-linux-gcc -pthread -Wno-unused-result -Wsign-compare -DNDEBUG -g -fwrapv -O3 -Wall -pipe -frecord-gcc-switches -Wall -g -O3 -march=i586 -mtune=generic -pipe -frecord-gcc-switches -Wall -g -O2 -march=i586 -mtune=generic -fPIC -I./multidict -I/usr/include/python3.7m -c multidict/_pair_list.c -o build/temp.linux-i686-3.7/multidict/_pair_list.o -O2 -std=c99 -Wall -Wsign-compare -Wconversion -fno-strict-aliasing
In file included from /usr/include/python3.7m/pyconfig.h:4,
                 from /usr/include/python3.7m/Python.h:8,
                 from multidict/_pair_list.h:10,
                 from multidict/_pair_list.c:2:
/usr/include/python3.7m/pyconfig-32.h:1522: warning: "_POSIX_C_SOURCE" redefined
 #define _POSIX_C_SOURCE 200809L
 
In file included from /usr/include/bits/libc-header-start.h:33,
                 from /usr/include/string.h:26,
                 from multidict/_pair_list.c:1:
/usr/include/features.h:294: note: this is the location of the previous definition
 # define _POSIX_C_SOURCE 199506L
 
i586-alt-linux-gcc -pthread -Wno-unused-result -Wsign-compare -DNDEBUG -g -fwrapv -O3 -Wall -pipe -frecord-gcc-switches -Wall -g -O3 -march=i586 -mtune=generic -pipe -frecord-gcc-switches -Wall -g -O2 -march=i586 -mtune=generic -fPIC -I./multidict -I/usr/include/python3.7m -c multidict/_multidict_iter.c -o build/temp.linux-i686-3.7/multidict/_multidict_iter.o -O2 -std=c99 -Wall -Wsign-compare -Wconversion -fno-strict-aliasing
In file included from /usr/include/python3.7m/pyconfig.h:4,
                 from /usr/include/python3.7m/Python.h:8,
                 from multidict/_pair_list.h:10,
                 from multidict/_multidict_iter.c:1:
/usr/include/python3.7m/pyconfig-32.h:1522: warning: "_POSIX_C_SOURCE" redefined
 #define _POSIX_C_SOURCE 200809L
 
In file included from /usr/include/bits/libc-header-start.h:33,
                 from /usr/include/stdint.h:26,
                 from /usr/lib/gcc/i586-alt-linux/8/include/stdint.h:9,
                 from multidict/_pair_list.h:9,
                 from multidict/_multidict_iter.c:1:
/usr/include/features.h:294: note: this is the location of the previous definition
 # define _POSIX_C_SOURCE 199506L
 
i586-alt-linux-gcc -pthread -Wno-unused-result -Wsign-compare -DNDEBUG -g -fwrapv -O3 -Wall -pipe -frecord-gcc-switches -Wall -g -O3 -march=i586 -mtune=generic -pipe -frecord-gcc-switches -Wall -g -O2 -march=i586 -mtune=generic -fPIC -I./multidict -I/usr/include/python3.7m -c multidict/_multidict_views.c -o build/temp.linux-i686-3.7/multidict/_multidict_views.o -O2 -std=c99 -Wall -Wsign-compare -Wconversion -fno-strict-aliasing
i586-alt-linux-gcc -pthread -shared -pipe -frecord-gcc-switches -Wall -g -O2 -march=i586 -mtune=generic build/temp.linux-i686-3.7/multidict/_multidict.o build/temp.linux-i686-3.7/multidict/_pair_list.o build/temp.linux-i686-3.7/multidict/_multidict_iter.o build/temp.linux-i686-3.7/multidict/_multidict_views.o -L/usr/lib -lpython3.7m -o build/lib.linux-i686-3.7/multidict/_multidict.cpython-37m.so
building 'multidict._istr' extension
i586-alt-linux-gcc -pthread -Wno-unused-result -Wsign-compare -DNDEBUG -g -fwrapv -O3 -Wall -pipe -frecord-gcc-switches -Wall -g -O3 -march=i586 -mtune=generic -pipe -frecord-gcc-switches -Wall -g -O2 -march=i586 -mtune=generic -fPIC -I/usr/include/python3.7m -c multidict/_istr.c -o build/temp.linux-i686-3.7/multidict/_istr.o
i586-alt-linux-gcc -pthread -shared -pipe -frecord-gcc-switches -Wall -g -O2 -march=i586 -mtune=generic build/temp.linux-i686-3.7/multidict/_istr.o -L/usr/lib -lpython3.7m -o build/lib.linux-i686-3.7/multidict/_istr.cpython-37m.so
+ exit 0
Executing(%install): /bin/sh -e /usr/src/tmp/rpm-tmp.35768
+ umask 022
+ /bin/mkdir -p /usr/src/RPM/BUILD
+ cd /usr/src/RPM/BUILD
+ /bin/chmod -Rf u+rwX -- /usr/src/tmp/python-module-multidict-buildroot
+ :
+ /bin/rm -rf -- /usr/src/tmp/python-module-multidict-buildroot
+ cd multidict-4.5.2
+ CFLAGS='-pipe -frecord-gcc-switches -Wall -g -O2 -march=i586 -mtune=generic'
+ export CFLAGS
+ CXXFLAGS='-pipe -frecord-gcc-switches -Wall -g -O2 -march=i586 -mtune=generic'
+ export CXXFLAGS
+ FFLAGS='-pipe -frecord-gcc-switches -Wall -g -O2 -march=i586 -mtune=generic'
+ export FFLAGS
+ /usr/bin/python3 setup.py install --skip-build --root=/usr/src/tmp/python-module-multidict-buildroot --force
running install
running install_lib
creating /usr/src/tmp/python-module-multidict-buildroot
creating /usr/src/tmp/python-module-multidict-buildroot/usr
creating /usr/src/tmp/python-module-multidict-buildroot/usr/lib
creating /usr/src/tmp/python-module-multidict-buildroot/usr/lib/python3
creating /usr/src/tmp/python-module-multidict-buildroot/usr/lib/python3/site-packages
creating /usr/src/tmp/python-module-multidict-buildroot/usr/lib/python3/site-packages/multidict
copying build/lib.linux-i686-3.7/multidict/_istr.cpython-37m.so -> /usr/src/tmp/python-module-multidict-buildroot/usr/lib/python3/site-packages/multidict
copying build/lib.linux-i686-3.7/multidict/_multidict.cpython-37m.so -> /usr/src/tmp/python-module-multidict-buildroot/usr/lib/python3/site-packages/multidict
copying build/lib.linux-i686-3.7/multidict/py.typed -> /usr/src/tmp/python-module-multidict-buildroot/usr/lib/python3/site-packages/multidict
copying build/lib.linux-i686-3.7/multidict/_pair_list.pxd -> /usr/src/tmp/python-module-multidict-buildroot/usr/lib/python3/site-packages/multidict
copying build/lib.linux-i686-3.7/multidict/_pair_list.h -> /usr/src/tmp/python-module-multidict-buildroot/usr/lib/python3/site-packages/multidict
copying build/lib.linux-i686-3.7/multidict/_pair_list.c -> /usr/src/tmp/python-module-multidict-buildroot/usr/lib/python3/site-packages/multidict
copying build/lib.linux-i686-3.7/multidict/_multidict_views.pxd -> /usr/src/tmp/python-module-multidict-buildroot/usr/lib/python3/site-packages/multidict
copying build/lib.linux-i686-3.7/multidict/_multidict_views.h -> /usr/src/tmp/python-module-multidict-buildroot/usr/lib/python3/site-packages/multidict
copying build/lib.linux-i686-3.7/multidict/_multidict_views.c -> /usr/src/tmp/python-module-multidict-buildroot/usr/lib/python3/site-packages/multidict
copying build/lib.linux-i686-3.7/multidict/_multidict_iter.pxd -> /usr/src/tmp/python-module-multidict-buildroot/usr/lib/python3/site-packages/multidict
copying build/lib.linux-i686-3.7/multidict/_multidict_iter.h -> /usr/src/tmp/python-module-multidict-buildroot/usr/lib/python3/site-packages/multidict
copying build/lib.linux-i686-3.7/multidict/_multidict_iter.c -> /usr/src/tmp/python-module-multidict-buildroot/usr/lib/python3/site-packages/multidict
copying build/lib.linux-i686-3.7/multidict/_multidict.pyx -> /usr/src/tmp/python-module-multidict-buildroot/usr/lib/python3/site-packages/multidict
copying build/lib.linux-i686-3.7/multidict/_multidict.c -> /usr/src/tmp/python-module-multidict-buildroot/usr/lib/python3/site-packages/multidict
copying build/lib.linux-i686-3.7/multidict/_istr.c -> /usr/src/tmp/python-module-multidict-buildroot/usr/lib/python3/site-packages/multidict
copying build/lib.linux-i686-3.7/multidict/__init__.pyi -> /usr/src/tmp/python-module-multidict-buildroot/usr/lib/python3/site-packages/multidict
copying build/lib.linux-i686-3.7/multidict/__init__.py -> /usr/src/tmp/python-module-multidict-buildroot/usr/lib/python3/site-packages/multidict
copying build/lib.linux-i686-3.7/multidict/_abc.py -> /usr/src/tmp/python-module-multidict-buildroot/usr/lib/python3/site-packages/multidict
copying build/lib.linux-i686-3.7/multidict/_compat.py -> /usr/src/tmp/python-module-multidict-buildroot/usr/lib/python3/site-packages/multidict
copying build/lib.linux-i686-3.7/multidict/_multidict_base.py -> /usr/src/tmp/python-module-multidict-buildroot/usr/lib/python3/site-packages/multidict
copying build/lib.linux-i686-3.7/multidict/_multidict_py.py -> /usr/src/tmp/python-module-multidict-buildroot/usr/lib/python3/site-packages/multidict
byte-compiling /usr/src/tmp/python-module-multidict-buildroot/usr/lib/python3/site-packages/multidict/__init__.py to __init__.cpython-37.pyc
byte-compiling /usr/src/tmp/python-module-multidict-buildroot/usr/lib/python3/site-packages/multidict/_abc.py to _abc.cpython-37.pyc
byte-compiling /usr/src/tmp/python-module-multidict-buildroot/usr/lib/python3/site-packages/multidict/_compat.py to _compat.cpython-37.pyc
byte-compiling /usr/src/tmp/python-module-multidict-buildroot/usr/lib/python3/site-packages/multidict/_multidict_base.py to _multidict_base.cpython-37.pyc
byte-compiling /usr/src/tmp/python-module-multidict-buildroot/usr/lib/python3/site-packages/multidict/_multidict_py.py to _multidict_py.cpython-37.pyc
running install_egg_info
running egg_info
writing multidict.egg-info/PKG-INFO
writing dependency_links to multidict.egg-info/dependency_links.txt
writing top-level names to multidict.egg-info/top_level.txt
reading manifest file 'multidict.egg-info/SOURCES.txt'
reading manifest template 'MANIFEST.in'
warning: no files found matching 'CHANGES.rst'
warning: no previously-included files matching '*.pyc' found anywhere in distribution
warning: no previously-included files found matching 'multidict/_multidict.html'
warning: no previously-included files found matching 'multidict/*.so'
warning: no previously-included files found matching 'multidict/*.pyd'
warning: no previously-included files found matching 'multidict/*.pyd'
no previously-included directories found matching 'docs/_build'
writing manifest file 'multidict.egg-info/SOURCES.txt'
Copying multidict.egg-info to /usr/src/tmp/python-module-multidict-buildroot/usr/lib/python3/site-packages/multidict-4.5.2-py3.7.egg-info
running install_scripts
+ rm -vf /usr/src/tmp/python-module-multidict-buildroot/usr/lib/python3/site-packages/multidict/_istr.c /usr/src/tmp/python-module-multidict-buildroot/usr/lib/python3/site-packages/multidict/_multidict.c /usr/src/tmp/python-module-multidict-buildroot/usr/lib/python3/site-packages/multidict/_multidict_iter.c /usr/src/tmp/python-module-multidict-buildroot/usr/lib/python3/site-packages/multidict/_multidict_views.c /usr/src/tmp/python-module-multidict-buildroot/usr/lib/python3/site-packages/multidict/_pair_list.c /usr/src/tmp/python-module-multidict-buildroot/usr/lib/python3/site-packages/multidict/_multidict.pyx
removed '/usr/src/tmp/python-module-multidict-buildroot/usr/lib/python3/site-packages/multidict/_istr.c'
removed '/usr/src/tmp/python-module-multidict-buildroot/usr/lib/python3/site-packages/multidict/_multidict.c'
removed '/usr/src/tmp/python-module-multidict-buildroot/usr/lib/python3/site-packages/multidict/_multidict_iter.c'
removed '/usr/src/tmp/python-module-multidict-buildroot/usr/lib/python3/site-packages/multidict/_multidict_views.c'
removed '/usr/src/tmp/python-module-multidict-buildroot/usr/lib/python3/site-packages/multidict/_pair_list.c'
removed '/usr/src/tmp/python-module-multidict-buildroot/usr/lib/python3/site-packages/multidict/_multidict.pyx'
+ /usr/lib/rpm/brp-alt
Cleaning files in /usr/src/tmp/python-module-multidict-buildroot (auto)
mode of './usr/lib/python3/site-packages/multidict/_multidict.cpython-37m.so' changed from 0755 (rwxr-xr-x) to 0644 (rw-r--r--)
mode of './usr/lib/python3/site-packages/multidict/_istr.cpython-37m.so' changed from 0755 (rwxr-xr-x) to 0644 (rw-r--r--)
Verifying and fixing files in /usr/src/tmp/python-module-multidict-buildroot (binconfig,pkgconfig,libtool,desktop)
Checking contents of files in /usr/src/tmp/python-module-multidict-buildroot/ (default)
Compressing files in /usr/src/tmp/python-module-multidict-buildroot (auto)
Adjusting library links in /usr/src/tmp/python-module-multidict-buildroot
./usr/lib:
Verifying ELF objects in /usr/src/tmp/python-module-multidict-buildroot (arch=normal,fhs=normal,lfs=relaxed,lint=relaxed,rpath=normal,stack=normal,textrel=normal,unresolved=normal)
Bytecompiling python modules in /usr/src/tmp/python-module-multidict-buildroot using /usr/bin/python
Bytecompiling python modules with optimization in /usr/src/tmp/python-module-multidict-buildroot using /usr/bin/python -O
Bytecompiling python3 modules in /usr/src/tmp/python-module-multidict-buildroot using /usr/bin/python3
unlink /usr/src/tmp/python-module-multidict-buildroot/usr/lib/python3/site-packages/multidict/__pycache__/__init__.cpython-37.pyc
unlink /usr/src/tmp/python-module-multidict-buildroot/usr/lib/python3/site-packages/multidict/__pycache__/_abc.cpython-37.pyc
unlink /usr/src/tmp/python-module-multidict-buildroot/usr/lib/python3/site-packages/multidict/__pycache__/_compat.cpython-37.pyc
unlink /usr/src/tmp/python-module-multidict-buildroot/usr/lib/python3/site-packages/multidict/__pycache__/_multidict_base.cpython-37.pyc
unlink /usr/src/tmp/python-module-multidict-buildroot/usr/lib/python3/site-packages/multidict/__pycache__/_multidict_py.cpython-37.pyc
compile /usr/src/tmp/python-module-multidict-buildroot/usr/lib/python3/site-packages/multidict/__init__.py
compile /usr/src/tmp/python-module-multidict-buildroot/usr/lib/python3/site-packages/multidict/_abc.py
compile /usr/src/tmp/python-module-multidict-buildroot/usr/lib/python3/site-packages/multidict/_compat.py
compile /usr/src/tmp/python-module-multidict-buildroot/usr/lib/python3/site-packages/multidict/_multidict_base.py
compile /usr/src/tmp/python-module-multidict-buildroot/usr/lib/python3/site-packages/multidict/_multidict_py.py
Bytecompiling python3 modules with optimization in /usr/src/tmp/python-module-multidict-buildroot using /usr/bin/python3 -O
compile /usr/src/tmp/python-module-multidict-buildroot/usr/lib/python3/site-packages/multidict/__init__.py
compile /usr/src/tmp/python-module-multidict-buildroot/usr/lib/python3/site-packages/multidict/_abc.py
compile /usr/src/tmp/python-module-multidict-buildroot/usr/lib/python3/site-packages/multidict/_compat.py
compile /usr/src/tmp/python-module-multidict-buildroot/usr/lib/python3/site-packages/multidict/_multidict_base.py
compile /usr/src/tmp/python-module-multidict-buildroot/usr/lib/python3/site-packages/multidict/_multidict_py.py
Bytecompiling python3 modules with optimization-2 in /usr/src/tmp/python-module-multidict-buildroot using /usr/bin/python3 -OO
compile /usr/src/tmp/python-module-multidict-buildroot/usr/lib/python3/site-packages/multidict/__init__.py
compile /usr/src/tmp/python-module-multidict-buildroot/usr/lib/python3/site-packages/multidict/_abc.py
compile /usr/src/tmp/python-module-multidict-buildroot/usr/lib/python3/site-packages/multidict/_compat.py
compile /usr/src/tmp/python-module-multidict-buildroot/usr/lib/python3/site-packages/multidict/_multidict_base.py
compile /usr/src/tmp/python-module-multidict-buildroot/usr/lib/python3/site-packages/multidict/_multidict_py.py
Hardlinking identical .pyc and .opt-?.pyc files
'./usr/lib/python3/site-packages/multidict/__pycache__/_multidict_base.cpython-37.opt-1.pyc' => './usr/lib/python3/site-packages/multidict/__pycache__/_multidict_base.cpython-37.pyc'
'./usr/lib/python3/site-packages/multidict/__pycache__/_compat.cpython-37.opt-1.pyc' => './usr/lib/python3/site-packages/multidict/__pycache__/_compat.cpython-37.pyc'
'./usr/lib/python3/site-packages/multidict/__pycache__/_compat.cpython-37.opt-2.pyc' => './usr/lib/python3/site-packages/multidict/__pycache__/_compat.cpython-37.opt-1.pyc'
'./usr/lib/python3/site-packages/multidict/__pycache__/_abc.cpython-37.opt-1.pyc' => './usr/lib/python3/site-packages/multidict/__pycache__/_abc.cpython-37.pyc'
'./usr/lib/python3/site-packages/multidict/__pycache__/_abc.cpython-37.opt-2.pyc' => './usr/lib/python3/site-packages/multidict/__pycache__/_abc.cpython-37.opt-1.pyc'
'./usr/lib/python3/site-packages/multidict/__pycache__/__init__.cpython-37.opt-1.pyc' => './usr/lib/python3/site-packages/multidict/__pycache__/__init__.cpython-37.pyc'
Hardlinking identical .pyc and .pyo files
Processing files: python3-module-multidict-4.5.2-alt1
Executing(%doc): /bin/sh -e /usr/src/tmp/rpm-tmp.49351
+ umask 022
+ /bin/mkdir -p /usr/src/RPM/BUILD
+ cd /usr/src/RPM/BUILD
+ cd multidict-4.5.2
+ DOCDIR=/usr/src/tmp/python-module-multidict-buildroot/usr/share/doc/python3-module-multidict-4.5.2
+ export DOCDIR
+ rm -rf /usr/src/tmp/python-module-multidict-buildroot/usr/share/doc/python3-module-multidict-4.5.2
+ /bin/mkdir -p /usr/src/tmp/python-module-multidict-buildroot/usr/share/doc/python3-module-multidict-4.5.2
+ cp -prL LICENSE README.rst /usr/src/tmp/python-module-multidict-buildroot/usr/share/doc/python3-module-multidict-4.5.2
+ chmod -R go-w /usr/src/tmp/python-module-multidict-buildroot/usr/share/doc/python3-module-multidict-4.5.2
+ chmod -R a+rX /usr/src/tmp/python-module-multidict-buildroot/usr/share/doc/python3-module-multidict-4.5.2
+ exit 0
Finding Provides (using /usr/lib/rpm/find-provides)
Executing: /bin/sh -e /usr/src/tmp/rpm-tmp.BIsVQR
find-provides: running scripts (alternatives,debuginfo,lib,pam,perl,pkgconfig,python,python3,shell)
Finding Requires (using /usr/lib/rpm/find-requires)
Executing: /bin/sh -e /usr/src/tmp/rpm-tmp.jEG2fV
find-requires: running scripts (cpp,debuginfo,files,lib,pam,perl,pkgconfig,pkgconfiglib,python,python3,rpmlib,shebang,shell,static,symlinks)
/usr/src/tmp/python-module-multidict-buildroot/usr/lib/python3/site-packages/multidict/_pair_list.h:10:10: fatal error: Python.h: No such file or directory
 #include "Python.h"
          ^~~~~~~~~~
compilation terminated.
cpp.req: /usr/src/tmp/python-module-multidict-buildroot/usr/lib/python3/site-packages/multidict/_pair_list.h: cpp failed, trying c++ mode
i586-alt-linux-cpp: error trying to exec 'cc1plus': execvp: No such file or directory
cpp.req: WARNING: /usr/src/tmp/python-module-multidict-buildroot/usr/lib/python3/site-packages/multidict/_pair_list.h: cpp failed
/usr/src/tmp/python-module-multidict-buildroot/usr/lib/python3/site-packages/multidict/_multidict_iter.h:8:10: fatal error: Python.h: No such file or directory
 #include "Python.h"
          ^~~~~~~~~~
compilation terminated.
cpp.req: WARNING: /usr/src/tmp/python-module-multidict-buildroot/usr/lib/python3/site-packages/multidict/_multidict_iter.h: cpp failed
/usr/src/tmp/python-module-multidict-buildroot/usr/lib/python3/site-packages/multidict/_multidict_views.h:8:10: fatal error: Python.h: No such file or directory
 #include "Python.h"
          ^~~~~~~~~~
compilation terminated.
cpp.req: WARNING: /usr/src/tmp/python-module-multidict-buildroot/usr/lib/python3/site-packages/multidict/_multidict_views.h: cpp failed
/usr/lib/rpm/python3.req.py: /usr/src/tmp/python-module-multidict-buildroot/usr/lib/python3/site-packages/multidict/__init__.py: line=8 possible relative import from ., UNIMPLEMENTED
/usr/lib/rpm/python3.req.py: /usr/src/tmp/python-module-multidict-buildroot/usr/lib/python3/site-packages/multidict/__init__.py: line=18 possible relative import from ., UNIMPLEMENTED
/usr/lib/rpm/python3.req.py: /usr/src/tmp/python-module-multidict-buildroot/usr/lib/python3/site-packages/multidict/__init__.py: line=23 possible relative import from ., UNIMPLEMENTED
/usr/lib/rpm/python3.req.py: /usr/src/tmp/python-module-multidict-buildroot/usr/lib/python3/site-packages/multidict/__init__.py: line=29 possible relative import from ., UNIMPLEMENTED
python3.req: /usr/src/tmp/python-module-multidict-buildroot/usr/lib/python3/site-packages/multidict/_multidict_py.py: skipping sys
/usr/lib/rpm/python3.req.py: /usr/src/tmp/python-module-multidict-buildroot/usr/lib/python3/site-packages/multidict/_multidict_py.py: line=5 possible relative import from ., UNIMPLEMENTED
Provides: python3(multidict), python3(multidict._abc), python3(multidict._compat), python3(multidict._istr), python3(multidict._multidict), python3(multidict._multidict_base), python3(multidict._multidict_py)
Requires: /usr/lib/python3/site-packages, libc.so.6(GLIBC_2.0), libc.so.6(GLIBC_2.1.3), libc.so.6(GLIBC_2.4), libpython3.7m.so.1.0 >= set:ogcAdhFbJ9rdI91WDwLZ10yGElP1ZE0meSA8Xh14wwryoe1AQFe0MYsV0dnPFPP4pJIhAF6cMH2g7TriO9GxDZwiIOTafopBbx0Z6qaHZwXPp8uZqPUV5yWyNXZ5ZpIwEJ2FOBzVVDbm66TqWXJB04QYD7lU3iBVNIMS4ugM7qnhV4tz05AVO26v3wqYMODGI7lhh6JImJivwVG1gK7sT8Aq5ZF6s8gZguohDlbvnrj41oZiP1YZx32BLq318tzpeUFM7rELoBRmZqiW0o80ZGzstdkfgBVqigFdwTwar9BeUYe10wdkc9DdQThxHAJP3aqLtV6fZ2iz16CZpXEdqz40u5BOczbCiQQOZqBRrJug1, python3(abc) < 0, python3(array) < 0, python3(collections) < 0, python3(collections.abc) < 0, python3(os) < 0, python3(platform) < 0, python3.7-ABI, rtld(GNU_HASH)
Requires(rpmlib): rpmlib(SetVersions)
Finding debuginfo files (using /usr/lib/rpm/find-debuginfo-files)
Executing: /bin/sh -e /usr/src/tmp/rpm-tmp.CKPZDa
Creating python3-module-multidict-debuginfo package
Processing files: python3-module-multidict-debuginfo-4.5.2-alt1
Finding Provides (using /usr/lib/rpm/find-provides)
Executing: /bin/sh -e /usr/src/tmp/rpm-tmp.QGKbMM
find-provides: running scripts (debuginfo)
Finding Requires (using /usr/lib/rpm/find-requires)
Executing: /bin/sh -e /usr/src/tmp/rpm-tmp.Z6OaLN
find-requires: running scripts (debuginfo)
Requires: python3-module-multidict = 4.5.2-alt1, debug(libc.so.6), debug(libpython3.7m.so.1.0)
Adding to python3-module-multidict-debuginfo a strict dependency on python3-module-multidict
Wrote: /usr/src/RPM/RPMS/i586/python3-module-multidict-4.5.2-alt1.i586.rpm
Wrote: /usr/src/RPM/RPMS/i586/python3-module-multidict-debuginfo-4.5.2-alt1.i586.rpm
9.80user 1.06system 0:15.65elapsed 69%CPU (0avgtext+0avgdata 74324maxresident)k
0inputs+0outputs (0major+361516minor)pagefaults 0swaps
16.36user 3.70system 0:26.12elapsed 76%CPU (0avgtext+0avgdata 115112maxresident)k
0inputs+0outputs (0major+769180minor)pagefaults 0swaps