86>Feb 23 13:15:30 userdel[498126]: delete user 'rooter'
<86>Feb 23 13:15:30 userdel[498126]: removed shadow group 'rooter' owned by 'rooter'
<86>Feb 23 13:15:30 groupadd[498234]: group added to /etc/group: name=rooter, GID=585
<86>Feb 23 13:15:30 groupadd[498234]: group added to /etc/gshadow: name=rooter
<86>Feb 23 13:15:30 groupadd[498234]: new group: name=rooter, GID=585
<86>Feb 23 13:15:30 useradd[498272]: new user: name=rooter, UID=585, GID=585, home=/root, shell=/bin/bash
<86>Feb 23 13:15:30 userdel[498402]: delete user 'builder'
<86>Feb 23 13:15:30 userdel[498402]: removed group 'builder' owned by 'builder'
<86>Feb 23 13:15:30 userdel[498402]: removed shadow group 'builder' owned by 'builder'
<86>Feb 23 13:15:30 groupadd[498508]: group added to /etc/group: name=builder, GID=586
<86>Feb 23 13:15:30 groupadd[498508]: group added to /etc/gshadow: name=builder
<86>Feb 23 13:15:30 groupadd[498508]: new group: name=builder, GID=586
<86>Feb 23 13:15:30 useradd[498650]: new user: name=builder, UID=586, GID=586, home=/usr/src, shell=/bin/bash
warning: user igor does not exist - using root
warning: group igor does not exist - using root
warning: user igor does not exist - using root
warning: group igor does not exist - using root
warning: user igor does not exist - using root
warning: group igor does not exist - using root
warning: Macro %pom_xpath_set not found
warning: Macro %pom_change_dep not found
warning: Macro %pom_remove_plugin not found
warning: Macro %pom_remove_plugin not found
warning: Macro %pom_remove_plugin not found
warning: Macro %pom_remove_plugin not found
warning: Macro %pom_xpath_set not found
warning: Macro %pom_add_plugin not found
warning: Macro %pom_change_dep not found
warning: Macro %mvn_build not found
warning: Macro %mvn_install not found
<13>Feb 23 13:15:40 rpmi: javapackages-tools-1:5.0.0-alt1_12jpp8 sisyphus+228348.2100.3.3 1556657006 installed
<13>Feb 23 13:15:40 rpmi: plexus-utils-0:3.0.24-alt1_5jpp8 1524376364 installed
<13>Feb 23 13:15:40 rpmi: apache-commons-io-1:2.6-alt1_3jpp8 1526474591 installed
<13>Feb 23 13:15:40 rpmi: maven-shared-utils-3.2.1-alt1_0.1jpp8 1527848452 installed
<13>Feb 23 13:15:40 rpmi: apache-commons-logging-0:1.2-alt1_14jpp8 sisyphus+220622.100.1.1 1549363457 installed
<13>Feb 23 13:15:40 rpmi: plexus-containers-component-annotations-0:1.7.1-alt1_6jpp8 1527990031 installed
<13>Feb 23 13:15:40 rpmi: slf4j-0:1.7.25-alt1_4jpp8 1525924634 installed
<13>Feb 23 13:15:40 rpmi: plexus-interpolation-0:1.22-alt1_9jpp8 1524313082 installed
<13>Feb 23 13:15:40 rpmi: maven-wagon-provider-api-0:3.0.0-alt1_1jpp8 1511394275 installed
<13>Feb 23 13:15:40 rpmi: xml-commons-apis-1.4.01-alt3_26jpp8 sisyphus+220521.100.1.1 1549294732 installed
<13>Feb 23 13:15:40 rpmi: maven-artifact-1:2.2.1-alt6_56jpp8 1510505131 installed
<13>Feb 23 13:15:40 rpmi: apache-commons-codec-0:1.11-alt1_4jpp8 sisyphus+220604.100.1.1 1549341232 installed
<13>Feb 23 13:15:40 rpmi: apache-commons-lang3-3.7-alt1_4jpp8 sisyphus+220620.100.1.1 1549356987 installed
<13>Feb 23 13:15:40 rpmi: httpcomponents-core-4.4.9-alt1_4jpp8 1525820092 installed
<13>Feb 23 13:15:40 rpmi: plexus-classworlds-0:2.5.2-alt2_9jpp8 1524311141 installed
<13>Feb 23 13:15:40 rpmi: maven-model-1:2.2.1-alt6_56jpp8 1510505131 installed
<13>Feb 23 13:15:40 rpmi: atinject-0:1-alt7_29.20100611svn86jpp8 sisyphus+220650.100.1.1 1549392067 installed
<13>Feb 23 13:15:40 rpmi: hawtjni-runtime-0:1.16-alt1_1jpp8 1527820189 installed
<13>Feb 23 13:15:40 rpmi: guava20-20.0-alt1_5jpp8 1526562255 installed
<13>Feb 23 13:15:40 rpmi: maven-resolver-api-1:1.1.1-alt1_2jpp8 1527821514 installed
<13>Feb 23 13:15:40 rpmi: maven-resolver-util-1:1.1.1-alt1_2jpp8 1527821514 installed
<13>Feb 23 13:15:40 rpmi: maven-resolver-spi-1:1.1.1-alt1_2jpp8 1527821514 installed
<13>Feb 23 13:15:40 rpmi: xmvn-api-3.0.0-alt1_18jpp8 1527991448 installed
<13>Feb 23 13:15:40 rpmi: xmvn-core-3.0.0-alt1_18jpp8 1527991448 installed
<13>Feb 23 13:15:40 rpmi: jansi-native-0:1.7-alt1_5jpp8 1523818758 installed
<13>Feb 23 13:15:40 rpmi: jcl-over-slf4j-0:1.7.25-alt1_4jpp8 1525924634 installed
<13>Feb 23 13:15:40 rpmi: aopalliance-0:1.0-alt6_17jpp8 1526473615 installed
<13>Feb 23 13:15:40 rpmi: apache-commons-cli-0:1.4-alt1_5jpp8 sisyphus+220603.100.1.1 1549340562 installed
<13>Feb 23 13:15:40 rpmi: apache-commons-collections-0:3.2.2-alt1_8jpp8 1527882341 installed
<13>Feb 23 13:15:40 rpmi: osgi-core-6.0.0-alt1_6jpp8 1524308153 installed
<13>Feb 23 13:15:40 rpmi: plexus-cipher-1.7-alt3_14jpp8 1524310885 installed
<13>Feb 23 13:15:40 rpmi: xorg-proto-devel-2018.4-alt3 1527685079 installed
<13>Feb 23 13:15:40 rpmi: libjpeg-2:2.0.2-alt1 sisyphus+226996.100.1.1 1554902907 installed
<13>Feb 23 13:15:40 rpmi: libpng16-1.6.36-alt1 sisyphus+219478.100.1.1 1547633314 installed
<13>Feb 23 13:15:40 rpmi: libexpat-2.2.4-alt1 1503305345 installed
<13>Feb 23 13:15:40 rpmi: plexus-sec-dispatcher-1.4-alt4_24jpp8 1524313702 installed
<13>Feb 23 13:15:40 rpmi: google-guice-0:4.1-alt1_12jpp8 sisyphus+221708.100.1.1 1550375735 installed
<13>Feb 23 13:15:40 rpmi: maven-resolver-connector-basic-1:1.1.1-alt1_2jpp8 1527821514 installed
<13>Feb 23 13:15:40 rpmi: maven-resolver-impl-1:1.1.1-alt1_2jpp8 1527821514 installed
<13>Feb 23 13:15:40 rpmi: maven-resolver-transport-wagon-1:1.1.1-alt1_2jpp8 1527821514 installed
<13>Feb 23 13:15:40 rpmi: maven-wagon-file-0:3.0.0-alt1_1jpp8 1511394275 installed
<13>Feb 23 13:15:40 rpmi: objenesis-0:2.6-alt1_1jpp8 1511395274 installed
<13>Feb 23 13:15:40 rpmi: apache-commons-lang-0:2.6-alt5_22jpp8 sisyphus+220619.100.1.1 1549325921 installed
<13>Feb 23 13:15:40 rpmi: hamcrest-core-0:1.3-alt3_23jpp8 1525893879 installed
<13>Feb 23 13:15:40 rpmi: junit-1:4.12-alt1_8jpp8 1525900612 installed
<13>Feb 23 13:15:40 rpmi: qdox-1:2.0-alt1_0.12.M7jpp8 1525919952 installed
<13>Feb 23 13:15:40 rpmi: beust-jcommander-1.71-alt1_3jpp8 1523858260 installed
<13>Feb 23 13:15:40 rpmi: geronimo-annotation-1.0-alt4_24jpp8 sisyphus+221131.100.1.2 1549788027 installed
<13>Feb 23 13:15:40 rpmi: xpp3-1:1.1.4-alt1_19.cjpp8 sisyphus+220580.100.1.1 1549324731 installed
<13>Feb 23 13:15:40 rpmi: libICE-1.0.9-alt1 1409902721 installed
<13>Feb 23 13:15:40 rpmi: xml-utils-1:2.9.10-alt2 p9+240157.100.1.1 1572735327 installed
<13>Feb 23 13:15:40 rpmi: libSM-1.2.3-alt1 sisyphus+226734.100.2.1 1554586158 installed
<13>Feb 23 13:15:40 rpmi: velocity-1:1.7-alt3_22jpp8 1525930039 installed
<13>Feb 23 13:15:41 rpmi: apache-commons-compress-0:1.16.1-alt1_1jpp8 1526491832 installed
<13>Feb 23 13:15:41 rpmi: xmvn-connector-aether-3.0.0-alt1_18jpp8 1527991448 installed
<13>Feb 23 13:15:41 rpmi: xmlgraphics-commons-0:2.2-alt1_2jpp8 sisyphus+220498.100.1.1 1549281765 installed
<13>Feb 23 13:15:41 rpmi: plexus-build-api-0:0.0.7-alt3_20jpp8 1525915372 installed
<13>Feb 23 13:15:41 rpmi: ant-lib-0:1.10.3-alt1_2jpp8 1528243545 installed
<13>Feb 23 13:15:41 rpmi: osgi-compendium-6.0.0-alt1_5jpp8 1524307639 installed
<13>Feb 23 13:15:41 rpmi: felix-utils-1.10.4-alt1_3jpp8 sisyphus+221058.100.1.2 1549747041 installed
<13>Feb 23 13:15:41 rpmi: liblksctp-1.0.17-alt2 1523113261 installed
<13>Feb 23 13:15:41 rpmi: libglvnd-7:1.1.1-alt1 sisyphus+224993.100.4.1 1552634542 installed
<13>Feb 23 13:15:41 rpmi: libwayland-server-1.17.0-alt1 sisyphus+225894.100.1.1 1553872805 installed
<13>Feb 23 13:15:41 rpmi: sgml-common-0.6.3-alt15 1423664786 installed
<13>Feb 23 13:15:41 rpmi: log4j12-1.2.17-alt1_23jpp8 sisyphus+220162.100.2.1 1549021303 installed
<13>Feb 23 13:15:41 rpmi: docbook-dtds-4.5-alt1 1223476557 installed
<13>Feb 23 13:15:42 rpmi: docbook-style-xsl-1.79.1-alt2 sisyphus.213665.100 1537949315 installed
<13>Feb 23 13:15:42 rpmi: lksctp-tools-1.0.17-alt2 1523113261 installed
<13>Feb 23 13:15:42 rpmi: felix-bundlerepository-2.0.10-alt1_4jpp8 sisyphus+220992.100.1.2 1549693453 installed
<13>Feb 23 13:15:42 rpmi: libICE-devel-1.0.9-alt1 1409902721 installed
<13>Feb 23 13:15:42 rpmi: libSM-devel-1.2.3-alt1 sisyphus+226734.100.2.1 1554586158 installed
<13>Feb 23 13:15:42 rpmi: kxml-2.3.0-alt3_16jpp8 1524305282 installed
<13>Feb 23 13:15:42 rpmi: maven-verifier-1.6-alt1_5jpp8 1510518576 installed
<13>Feb 23 13:15:42 rpmi: apache-commons-configuration-0:1.10-alt1_12jpp8 sisyphus+220606.100.1.1 1549344005 installed
<13>Feb 23 13:15:42 rpmi: libjasper-2.0.14-alt1 1530105217 installed
<13>Feb 23 13:15:42 rpmi: jcsp-1.1-alt1_0.10.rc5jpp8 sisyphus+221980.100.1.1 1550546630 installed
<13>Feb 23 13:15:42 rpmi: xmvn-mojo-3.0.0-alt1_18jpp8 1527991448 installed
<13>Feb 23 13:15:42 rpmi: maven-dependency-tree-3.0-alt1_4jpp8 1510507072 installed
<13>Feb 23 13:15:42 rpmi: plexus-component-api-1.0-alt4_0.24.alpha15jpp8 1524311381 installed
<13>Feb 23 13:15:42 rpmi: plexus-interactivity-api-0:1.0-alt6_0.25.alpha6jpp8 1525919089 installed
<13>Feb 23 13:15:42 rpmi: apache-commons-httpclient-1:3.1-alt6_27jpp8 1510082305 installed
<13>Feb 23 13:15:42 rpmi: maven-invoker-2.2-alt1_6jpp8 1510802103 installed
<13>Feb 23 13:15:42 rpmi: bsf-1:2.4.0-alt3_28jpp8 1525885352 installed
<13>Feb 23 13:15:42 rpmi: fontbox-0:1.8.13-alt2_4jpp8 1525914053 installed
<13>Feb 23 13:15:42 rpmi: plexus-io-0:3.0.0-alt1_2jpp8 1527187473 installed
<13>Feb 23 13:15:42 rpmi: plexus-compiler-0:2.8.2-alt1_2jpp8 1525918408 installed
<13>Feb 23 13:15:42 rpmi: apache-commons-exec-0:1.3-alt1_8jpp8 1524218803 installed
<13>Feb 23 13:15:42 rpmi: apache-ivy-0:2.4.0-alt1_12jpp8 1527882603 installed
<13>Feb 23 13:15:42 rpmi: osgi-annotation-6.0.0-alt1_7jpp8 1524306983 installed
<13>Feb 23 13:15:43 rpmi: aqute-bndlib-0:3.5.0-alt1_2jpp8 1523847009 installed
<13>Feb 23 13:15:43 rpmi: avalon-logkit-0:2.1-alt2_29jpp8 1525884624 installed
<13>Feb 23 13:15:43 rpmi: avalon-framework-0:4.3-alt4_19jpp8 1525884383 installed
<13>Feb 23 13:15:43 rpmi: jai-imageio-core-1.2-alt1_0.24.20100217cvsjpp8 sisyphus+221788.100.1.1 1550423410 installed
<13>Feb 23 13:15:43 rpmi: fusesource-pom-0:1.11-alt1_4jpp8 sisyphus+221128.100.1.1 1549752021 installed
<13>Feb 23 13:15:43 rpmi: jansi-0:1.17-alt1_1jpp8 1527875993 installed
<13>Feb 23 13:15:43 rpmi: jline-0:2.14.6-alt1_1jpp8 1527875899 installed
<13>Feb 23 13:15:43 rpmi: glassfish-el-api-3.0.1-alt1_0.9.b08jpp8 sisyphus+221160.100.1.1 1549796961 installed
<13>Feb 23 13:15:43 rpmi: jboss-interceptors-1.2-api-1.0.0-alt1_9jpp8 sisyphus+221843.100.1.1 1550450624 installed
<13>Feb 23 13:15:43 rpmi: cdi-api-1.2-alt1_9jpp8 sisyphus+220672.100.1.1 1549401296 installed
<13>Feb 23 13:15:43 rpmi: sisu-inject-2:0.3.3-alt1_3jpp8 1525924258 installed
<13>Feb 23 13:15:43 rpmi: sisu-plexus-2:0.3.3-alt1_3jpp8 1525924258 installed
<13>Feb 23 13:15:43 rpmi: dain-snappy-0.4-alt1_6jpp8 sisyphus+220815.100.1.1 1549458793 installed
<13>Feb 23 13:15:43 rpmi: jsoup-1.11.3-alt1_1jpp8 1527820709 installed
<13>Feb 23 13:15:43 rpmi: maven-filesystem-0.01-alt2.1 1460115697 installed
<13>Feb 23 13:15:43 rpmi: xpp3-minimal-1:1.1.4-alt1_19.cjpp8 sisyphus+220580.100.1.1 1549324731 installed
<13>Feb 23 13:15:43 rpmi: xstream-0:1.4.9-alt1_7jpp8 1524214178 installed
<13>Feb 23 13:15:43 rpmi: extra166y-1.7.0-alt1_10jpp8 sisyphus+220916.100.1.3 1549643912 installed
<13>Feb 23 13:15:43 rpmi: jzlib-0:1.1.3-alt1_8jpp8 1525901378 installed
<13>Feb 23 13:15:43 rpmi: netty3-3.10.6-alt2_5jpp8 sisyphus+220441.100.1.1 1549124381 installed
<13>Feb 23 13:15:43 rpmi: multiverse-0.7.0-alt1_8jpp8 1527807673 installed
<13>Feb 23 13:15:43 rpmi: java-common-1.6.0-alt1 p9+234085.100.1.1 1562573623 installed
<13>Feb 23 13:15:43 rpmi: jdeparser-2.0.0-alt1_5jpp8 sisyphus+221984.100.1.3 1550633935 installed
<13>Feb 23 13:15:43 rpmi: xz-java-1.8-alt1_2jpp8 1525824473 installed
<13>Feb 23 13:15:43 rpmi: plexus-archiver-0:3.6.0-alt1_1jpp8 1527822734 installed
<13>Feb 23 13:15:43 rpmi: zip-30000000:3.0-alt1 1332241772 installed
<13>Feb 23 13:15:43 rpmi: rpm-macros-java-1:5.0.0-alt1_12jpp8 sisyphus+228348.2100.3.3 1556657006 installed
<13>Feb 23 13:15:44 rpmi: libprotobuf17-3.6.1.3-alt2 sisyphus+227259.100.1.1 1555610584 installed
<13>Feb 23 13:15:44 rpmi: libnatspec-0.3.1-alt2 1445691580 installed
<13>Feb 23 13:15:44 rpmi: unzip-6.0-alt2.qa1 1366155324 installed
<13>Feb 23 13:15:44 rpmi: libpcsclite-1.8.25-alt1 p9+236438.100.1.1 1566468031 installed
<13>Feb 23 13:15:44 rpmi: libsqlite3-3.29.0-alt1 p9+237498.100.1.1 1568303696 installed
<13>Feb 23 13:15:44 rpmi: libnspr-1:4.21-alt2 p9+235125.520.5.1 1565694823 installed
<13>Feb 23 13:15:44 rpmi: javazi-2019c-alt1 p9+242136.100.1.1 1575295029 installed
<13>Feb 23 13:15:44 rpmi: libgif-4.1.6-alt3 1299634261 installed
<13>Feb 23 13:15:44 rpmi: libalsa-1:1.1.9-alt2 sisyphus+229323.100.1.1 1557826759 installed
<13>Feb 23 13:15:44 rpmi: liblz4-1:1.9.2-alt1 p9+238696.500.1.1 1570228299 installed
<13>Feb 23 13:15:44 rpmi: libgpg-error-1.36-alt1 sisyphus+225621.300.1.1 1553521082 installed
<13>Feb 23 13:15:44 rpmi: libgcrypt20-1.8.4-alt2 sisyphus+229280.100.1.1 1557742126 installed
<13>Feb 23 13:15:44 rpmi: libsystemd-1:243.7-alt1 p9+246412.400.5.1 1582036550 installed
<13>Feb 23 13:15:44 rpmi: libdbus-1.12.16-alt2 p9+240607.100.1.1 1573553687 installed
<13>Feb 23 13:15:44 rpmi: libavahi-0.6.32-alt1 1500485702 installed
<13>Feb 23 13:15:44 rpmi: libcups-2.2.11-alt1 sisyphus+225793.100.1.1 1553701176 installed
<13>Feb 23 13:15:44 rpmi: libxslt-1.1.33-alt1 sisyphus+226936.100.1.1 1554820937 installed
<13>Feb 23 13:15:44 rpmi: icon-theme-hicolor-0.17-alt1 1505715846 installed
<13>Feb 23 13:15:44 rpmi: libwebp7-1.0.3-alt1 p9+234901.200.1.1 1563552457 installed
<13>Feb 23 13:15:44 rpmi: libjbig-2.1-alt1 1401380926 installed
<13>Feb 23 13:15:44 rpmi: libtiff5-4.0.10.0.57.f9fc01c3-alt1 sisyphus+226958.100.1.1 1554850940 installed
<13>Feb 23 13:15:44 rpmi: shared-mime-info-1.13.1-alt1 p9+238204.100.1.1 1569496447 installed
<13>Feb 23 13:15:44 rpmi: gsettings-desktop-schemas-data-3.32.0-alt1 sisyphus+225059.300.3.2 1552843929 installed
<13>Feb 23 13:15:44 rpmi: libgio-2.60.7-alt1 p9+237353.100.2.2 1568373081 installed
<13>Feb 23 13:15:44 rpmi: gsettings-desktop-schemas-3.32.0-alt1 sisyphus+225059.300.3.2 1552843980 installed
<13>Feb 23 13:15:44 rpmi: libgdk-pixbuf-locales-2.38.2-alt1 p9+237353.1000.2.2 1568374008 installed
<13>Feb 23 13:15:44 rpmi: libgdk-pixbuf-2.38.2-alt1 p9+237353.1000.2.2 1568374336 installed
<13>Feb 23 13:15:44 rpmi: gtk-update-icon-cache-3.24.11-alt1 p9+237353.1200.2.2 1568374786 installed
<13>Feb 23 13:15:45 rpmi: libgtk+2-locales-2.24.32-alt3 sisyphus+227306.100.1.3 1555646039 installed
<13>Feb 23 13:15:45 rpmi: libdatrie-0.2.9-alt1_6 1511686676 installed
<13>Feb 23 13:15:45 rpmi: libthai-0.1.28-alt1_1 sisyphus+226107.100.1.1 1554123079 installed
<13>Feb 23 13:15:45 rpmi: libfribidi-1.0.7-alt1 p9+238309.200.1.1 1569787058 installed
<13>Feb 23 13:15:45 rpmi: libpixman-3:0.38.4-alt1 sisyphus+228006.100.1.1 1556013870 installed
<13>Feb 23 13:15:45 rpmi: libxshmfence-1.3-alt1 sisyphus+223149.1000.2.1 1551268571 installed
<13>Feb 23 13:15:45 rpmi: libwayland-client-1.17.0-alt1 sisyphus+225894.100.1.1 1553872805 installed
<13>Feb 23 13:15:45 rpmi: libpciaccess-1:0.14-alt1 1528969252 installed
<13>Feb 23 13:15:45 rpmi: libdrm-1:2.4.99-alt1 p9+236610.100.1.1 1566818128 installed
<13>Feb 23 13:15:45 rpmi: libgbm-4:19.1.8-alt1 p9+240059.100.2.1 1573598676 installed
<13>Feb 23 13:15:45 rpmi: libatk-locales-2.32.0-alt1 sisyphus+225059.600.3.2 1552845198 installed
<13>Feb 23 13:15:45 rpmi: libatk-2.32.0-alt1 sisyphus+225059.600.3.2 1552845362 installed
<13>Feb 23 13:15:45 rpmi: libX11-locales-3:1.6.7-alt1 sisyphus+226735.100.2.2 1554615009 installed
<13>Feb 23 13:15:45 rpmi: libXdmcp-1.1.3-alt1 sisyphus+225206.600.1.2 1552949353 installed
<13>Feb 23 13:15:45 rpmi: libXau-1.0.9-alt1 sisyphus+223149.200.2.1 1551268152 installed
<13>Feb 23 13:15:45 rpmi: libxcb-1.13.1-alt1 sisyphus+226527.100.2.2 1554593801 installed
<13>Feb 23 13:15:45 rpmi: libX11-3:1.6.7-alt1 sisyphus+226735.100.2.2 1554615005 installed
<13>Feb 23 13:15:45 rpmi: libXext-1.3.4-alt1 sisyphus+225206.700.1.2 1552949429 installed
<13>Feb 23 13:15:45 rpmi: libXrender-0.9.8-alt1 1371312112 installed
<13>Feb 23 13:15:45 rpmi: libXfixes-5.0.3-alt1 sisyphus+226736.100.2.2 1554614841 installed
<13>Feb 23 13:15:45 rpmi: libXi-1.7.9-alt2 sisyphus+226377.100.1.2 1554260260 installed
<13>Feb 23 13:15:45 rpmi: libXcomposite-0.4.5-alt1 sisyphus+225206.300.1.2 1552949137 installed
<13>Feb 23 13:15:45 rpmi: libXdamage-1.1.5-alt1 sisyphus+225206.500.1.2 1552949286 installed
<13>Feb 23 13:15:45 rpmi: libXcursor-1.2.0-alt1 sisyphus+225206.400.1.2 1552949218 installed
<13>Feb 23 13:15:45 rpmi: libXrandr-1.5.2-alt1 sisyphus+225206.1300.1.2 1552949710 installed
<13>Feb 23 13:15:45 rpmi: libXxf86vm-1.1.4-alt2 1527672187 installed
<13>Feb 23 13:15:45 rpmi: libGLX-mesa-4:19.1.8-alt1 p9+240059.100.2.1 1573598676 installed
<13>Feb 23 13:15:45 rpmi: libEGL-mesa-4:19.1.8-alt1 p9+240059.100.2.1 1573598676 installed
<13>Feb 23 13:15:45 rpmi: libEGL-7:1.1.1-alt1 sisyphus+224993.100.4.1 1552634542 installed
<13>Feb 23 13:15:45 rpmi: libGLX-7:1.1.1-alt1 sisyphus+224993.100.4.1 1552634542 installed
<13>Feb 23 13:15:45 rpmi: libGL-7:1.1.1-alt1 sisyphus+224993.100.4.1 1552634542 installed
<13>Feb 23 13:15:45 rpmi: libXinerama-1.1.4-alt1 sisyphus+223149.300.2.1 1551268216 installed
<13>Feb 23 13:15:45 rpmi: libXtst-1.2.2-alt1 1369984893 installed
<13>Feb 23 13:15:45 rpmi: libXt-1.1.4-alt1 1369984722 installed
<13>Feb 23 13:15:46 rpmi: libxcb-devel-1.13.1-alt1 sisyphus+226527.100.2.2 1554593801 installed
<13>Feb 23 13:15:46 rpmi: libX11-devel-3:1.6.7-alt1 sisyphus+226735.100.2.2 1554615005 installed
<13>Feb 23 13:15:46 rpmi: libXt-devel-1.1.4-alt1 1369984722 installed
<13>Feb 23 13:15:46 rpmi: libgraphite2-1.3.13-alt2 sisyphus+226799.100.1.1 1554648241 installed
<13>Feb 23 13:15:46 rpmi: libharfbuzz-2.6.2-alt1 p9+238790.200.1.1 1570435826 installed
<13>Feb 23 13:15:46 rpmi: libfreetype-2.10.0-alt2 sisyphus+226881.100.2.1 1555676286 installed
<13>Feb 23 13:15:46 rpmi: fontconfig-2.13.1-alt1 sisyphus+226691.100.2.2 1554598726 installed
Updating fonts cache: <29>Feb 23 13:15:48 fontconfig: Updating fonts cache: succeeded
[ DONE ]
<13>Feb 23 13:15:48 rpmi: libcairo-1:1.16.0-alt1 sisyphus+226534.100.2.3 1554515535 installed
<13>Feb 23 13:15:48 rpmi: fonts-type1-xorg-7.0.0-alt4 1188553211 installed
<13>Feb 23 13:15:48 rpmi: libXft-2.3.3-alt1 sisyphus+225206.1000.3.2 1552987708 installed
<13>Feb 23 13:15:48 rpmi: libpango-1.44.6-alt1 p9+237353.700.2.2 1568374131 installed
<13>Feb 23 13:15:48 rpmi: libgtk+2-2.24.32-alt3 sisyphus+227306.100.1.3 1555646092 installed
<13>Feb 23 13:15:48 rpmi: libgail-2.24.32-alt3 sisyphus+227306.100.1.3 1555646092 installed
<13>Feb 23 13:15:48 rpmi: publicsuffix-list-20200106-alt1 p9+244008.100.1.1 1578591661 installed
<13>Feb 23 13:15:48 rpmi: httpcomponents-client-4.5.5-alt1_5jpp8 sisyphus+221731.100.1.1 1550391382 installed
<13>Feb 23 13:15:48 rpmi: maven-wagon-http-shared-0:3.0.0-alt1_1jpp8 1511394275 installed
<13>Feb 23 13:15:48 rpmi: maven-wagon-http-0:3.0.0-alt1_1jpp8 1511394275 installed
<13>Feb 23 13:15:48 rpmi: maven-1:3.5.3-alt1_1jpp8 1528125011 installed
<13>Feb 23 13:15:48 rpmi: maven-lib-1:3.5.3-alt1_1jpp8 1528125011 installed
<13>Feb 23 13:15:48 rpmi: maven-archiver-0:3.2.0-alt1_1jpp8 1511392070 installed
<13>Feb 23 13:15:48 rpmi: maven-common-artifact-filters-3.0.1-alt1_3jpp8 1510506852 installed
<13>Feb 23 13:15:48 rpmi: maven-artifact-transfer-1:0.9.0-alt1_3jpp8 1511478032 installed
<13>Feb 23 13:15:48 rpmi: maven-source-plugin-3.0.1-alt1_3jpp8 1510517811 installed
<13>Feb 23 13:15:48 rpmi: maven-jar-plugin-3.1.0-alt1_1jpp8 1527821052 installed
<13>Feb 23 13:15:48 rpmi: maven-toolchain-1:2.2.1-alt6_56jpp8 1510505131 installed
<13>Feb 23 13:15:48 rpmi: maven-shared-incremental-1.1-alt1_13jpp8 1510516163 installed
<13>Feb 23 13:15:48 rpmi: maven-filtering-3.1.1-alt1_4jpp8 1510509696 installed
<13>Feb 23 13:15:48 rpmi: maven-resources-plugin-3.1.0-alt1_1jpp8 1527822052 installed
<13>Feb 23 13:15:48 rpmi: xmvn-minimal-3.0.0-alt1_18jpp8 1527991448 installed
<13>Feb 23 13:15:48 rpmi: libgdbm-1.8.3-alt10 1454943334 installed
<13>Feb 23 13:15:48 rpmi: libp11-kit-0.23.15-alt1 sisyphus+226408.100.2.1 1554288204 installed
<13>Feb 23 13:15:48 rpmi: libtasn1-4.14-alt1 p9+235792.100.2.1 1565425233 installed
<13>Feb 23 13:15:48 rpmi: rpm-macros-alternatives-0.5.1-alt1 sisyphus+226946.100.1.1 1554830426 installed
<13>Feb 23 13:15:48 rpmi: alternatives-0.5.1-alt1 sisyphus+226946.100.1.1 1554830426 installed
<13>Feb 23 13:15:48 rpmi: ca-certificates-2020.01.23-alt1 p9+245253.100.3.1 1580749631 installed
<13>Feb 23 13:15:48 rpmi: ca-trust-0.1.2-alt1 p9+233349.100.1.1 1561655062 installed
<13>Feb 23 13:15:48 rpmi: p11-kit-trust-0.23.15-alt1 sisyphus+226408.100.2.1 1554288204 installed
<13>Feb 23 13:15:48 rpmi: libcrypto1.1-1.1.1d-alt1.1 p9+237853.200.3.1 1569251834 installed
<13>Feb 23 13:15:48 rpmi: libssl1.1-1.1.1d-alt1.1 p9+237853.200.3.1 1569251834 installed
<13>Feb 23 13:15:48 rpmi: libpython3-3.7.4-alt2 p9+239459.100.1.1 1571444790 installed
<13>Feb 23 13:15:48 rpmi: python3-3.7.4-alt2 p9+239459.100.1.1 1571444790 installed
<13>Feb 23 13:15:49 rpmi: python3-base-3.7.4-alt2 p9+239459.100.1.1 1571444790 installed
<13>Feb 23 13:15:49 rpmi: python3-module-sugarbowl-0.52.1-alt1.git20141130.1.1 sisyphus+227470.1100.1.1 1555687657 installed
<13>Feb 23 13:15:49 rpmi: python3-module-six-1.12.0-alt1 sisyphus+219665.100.2.1 1548148570 installed
<13>Feb 23 13:15:49 rpmi: python3-module-markupsafe-0.23-alt1.2.1.1 sisyphus+225625.12200.91.1 1555289337 installed
<13>Feb 23 13:15:49 rpmi: python3-module-jinja2-2.10-alt1 1521724576 installed
<13>Feb 23 13:15:49 rpmi: python3-module-clyde-0.8.0-alt1.git20141130.2.1 sisyphus+227465.1600.1.2 1555756906 installed
<13>Feb 23 13:15:49 rpmi: python3-module-pkg_resources-1:40.8.0-alt2 sisyphus+229158.200.2.1 1557735221 installed
<13>Feb 23 13:15:49 rpmi: python3-module-runfile-0.46.1-alt1.git20141130.2.1 sisyphus+227469.1300.2.3 1555706376 installed
<13>Feb 23 13:15:49 rpmi: objectweb-asm-0:6.1.1-alt1_1jpp8 1528136365 installed
<13>Feb 23 13:15:49 rpmi: plexus-languages-0.9.3-alt2_4jpp8 1528196710 installed
<13>Feb 23 13:15:49 rpmi: cglib-0:3.2.4-alt1_8jpp8 sisyphus+220673.100.1.2 1549447239 installed
<13>Feb 23 13:15:49 rpmi: easymock-0:3.5-alt1_2jpp8 1524176696 installed
<13>Feb 23 13:15:49 rpmi: hamcrest-0:1.3-alt3_23jpp8 1525893879 installed
<13>Feb 23 13:15:49 rpmi: mockito-0:1.10.19-alt1_15jpp8 1525908038 installed
<13>Feb 23 13:15:49 rpmi: maven-compiler-plugin-3.7.0-alt1_1jpp8 1527175304 installed
<13>Feb 23 13:15:49 rpmi: xmvn-install-3.0.0-alt1_18jpp8 1527991448 installed
<13>Feb 23 13:15:49 rpmi: parboiled-1.1.6-alt1_13jpp8 1524290710 installed
<13>Feb 23 13:15:49 rpmi: pegdown-1.4.2-alt1_12jpp8 1524309539 installed
<13>Feb 23 13:15:50 rpmi: antlr-tool-0:2.7.7-alt12_53jpp8 1525882426 installed
<13>Feb 23 13:15:50 rpmi: gpars-1.2.1-alt1_12jpp8 sisyphus+221710.100.1.1 1550377267 installed
<13>Feb 23 13:15:50 rpmi: groovy-lib-0:2.4.8-alt1_5jpp8 1524261040 installed
<13>Feb 23 13:15:50 rpmi: xbean-0:4.8-alt1_1jpp8 1527831195 installed
<13>Feb 23 13:15:50 rpmi: plexus-containers-container-default-0:1.7.1-alt1_6jpp8 1527990031 installed
<13>Feb 23 13:15:50 rpmi: maven-artifact-manager-1:2.2.1-alt6_56jpp8 1510505131 installed
<13>Feb 23 13:15:50 rpmi: maven-plugin-registry-1:2.2.1-alt6_56jpp8 1510505131 installed
<13>Feb 23 13:15:50 rpmi: maven-doxia-logging-api-0:1.7-alt1_9jpp8 sisyphus+220185.100.1.1 1548779496 installed
<13>Feb 23 13:15:50 rpmi: maven-doxia-sink-api-0:1.7-alt1_9jpp8 sisyphus+220185.100.1.1 1548779496 installed
<13>Feb 23 13:15:50 rpmi: maven-reporting-api-1:3.0-alt3_13jpp8 1510514759 installed
<13>Feb 23 13:15:50 rpmi: maven-plugin-annotations-0:3.5.1-alt1_1jpp8 1525824925 installed
<13>Feb 23 13:15:50 rpmi: maven-surefire-0:2.21.0-alt1_1jpp8 1527848673 installed
<13>Feb 23 13:15:50 rpmi: maven-surefire-plugin-0:2.21.0-alt1_1jpp8 1527848673 installed
<13>Feb 23 13:15:50 rpmi: maven-surefire-provider-junit-0:2.21.0-alt1_1jpp8 1527848673 installed
<13>Feb 23 13:15:50 rpmi: maven-surefire-provider-testng-0:2.21.0-alt1_1jpp8 1527848673 installed
<13>Feb 23 13:15:50 rpmi: maven-surefire-report-parser-0:2.21.0-alt1_1jpp8 1527848673 installed
<13>Feb 23 13:15:50 rpmi: maven-profile-1:2.2.1-alt6_56jpp8 1510505131 installed
<13>Feb 23 13:15:50 rpmi: maven-settings-1:2.2.1-alt6_56jpp8 1510505131 installed
<13>Feb 23 13:15:50 rpmi: maven-project-1:2.2.1-alt6_56jpp8 1510505131 installed
<13>Feb 23 13:15:50 rpmi: plexus-i18n-0:1.0-alt7_0.11.b10.4jpp8 1524312824 installed
<13>Feb 23 13:15:50 rpmi: plexus-velocity-0:1.2-alt1_4jpp8 1524376629 installed
<13>Feb 23 13:15:50 rpmi: xml-commons-resolver-0:1.2-alt1_24jpp8 1525932051 installed
<13>Feb 23 13:15:50 rpmi: xalan-j2-0:2.7.1-alt4_34jpp8 1525931290 installed
<13>Feb 23 13:15:51 rpmi: xerces-j2-0:2.11.0-alt3_31jpp8 1524211519 installed
<13>Feb 23 13:15:51 rpmi: batik-css-0:1.10-alt1_2jpp8 sisyphus+220497.100.1.2 1549284940 installed
<13>Feb 23 13:15:51 rpmi: batik-0:1.10-alt1_2jpp8 sisyphus+220497.100.1.2 1549284940 installed
<13>Feb 23 13:15:51 rpmi: xmlunit-0:1.6-alt1_7jpp8 1525933352 installed
<13>Feb 23 13:15:51 rpmi: maven-doxia-core-0:1.7-alt1_9jpp8 sisyphus+220185.100.1.1 1548779496 installed
<13>Feb 23 13:15:51 rpmi: maven-doxia-module-xhtml-0:1.7-alt1_9jpp8 sisyphus+220185.100.1.1 1548779496 installed
<13>Feb 23 13:15:51 rpmi: maven-doxia-module-markdown-0:1.7-alt1_9jpp8 sisyphus+220185.100.1.1 1548779496 installed
<13>Feb 23 13:15:51 rpmi: maven-doxia-module-apt-0:1.7-alt1_9jpp8 sisyphus+220185.100.1.1 1548779496 installed
<13>Feb 23 13:15:51 rpmi: maven-doxia-module-fml-0:1.7-alt1_9jpp8 sisyphus+220185.100.1.1 1548779496 installed
<13>Feb 23 13:15:51 rpmi: maven-doxia-module-xdoc-0:1.7-alt1_9jpp8 sisyphus+220185.100.1.1 1548779496 installed
<13>Feb 23 13:15:51 rpmi: bsh-0:2.0-alt1_9.b6jpp8 1525885592 installed
<13>Feb 23 13:15:51 rpmi: xmvn-subst-3.0.0-alt1_18jpp8 1527991448 installed
<13>Feb 23 13:15:51 rpmi: xmvn-resolve-3.0.0-alt1_18jpp8 1527991448 installed
<13>Feb 23 13:15:51 rpmi: python3-module-genshi-0.7-alt2 sisyphus+229363.100.1.1 1557847335 installed
<13>Feb 23 13:15:51 rpmi: python3-module-webencodings-0.5.1-alt1.1 1517943573 installed
<13>Feb 23 13:15:51 rpmi: python3-module-cssselect-0.9.1-alt1.2 sisyphus+227479.1100.1.2 1555757152 installed
<13>Feb 23 13:15:51 rpmi: python3-module-html5lib-1:0.999999999-alt4.qa1 sisyphus+227493.600.1.3 1555835341 installed
<13>Feb 23 13:15:51 rpmi: python3-module-lxml-4.4.2-alt1 p9+244111.100.1.1 1578758819 installed
<13>Feb 23 13:15:51 rpmi: python3-module-javapackages-1:5.0.0-alt1_12jpp8 sisyphus+228348.2100.3.3 1556657006 installed
<13>Feb 23 13:15:51 rpmi: javapackages-local-1:5.0.0-alt1_12jpp8 sisyphus+228348.2100.3.3 1556657006 installed
<13>Feb 23 13:15:51 rpmi: rpm-build-java-1:5.0.0-alt1_12jpp8 sisyphus+228348.2100.3.3 1556657006 installed
<13>Feb 23 13:15:51 rpmi: ca-trust-java-0.1.2-alt1 p9+233349.100.1.1 1561655062 installed
<13>Feb 23 13:15:51 rpmi: libnss-3.45.0-alt1 p9+235125.540.6.1 1565821502 installed
<13>Feb 23 13:15:54 rpmi: java-1.8.0-openjdk-headless-0:1.8.0.212.b04-alt2_0jpp8 p9+234508.100.3.1 1563175746 installed
<13>Feb 23 13:15:55 rpmi: java-1.8.0-openjdk-0:1.8.0.212.b04-alt2_0jpp8 p9+234508.100.3.1 1563175746 installed
<13>Feb 23 13:15:56 rpmi: fop-0:2.0-alt1_9jpp8 1524189893 installed
<13>Feb 23 13:15:56 rpmi: maven-doxia-module-fo-0:1.7-alt1_9jpp8 sisyphus+220185.100.1.1 1548779496 installed
<13>Feb 23 13:15:56 rpmi: maven-doxia-sitetools-0:1.7.5-alt1_1jpp8 1511392380 installed
<13>Feb 23 13:15:56 rpmi: maven-reporting-impl-3.0.0-alt1_1jpp8 1511427039 installed
<13>Feb 23 13:15:56 rpmi: maven-javadoc-plugin-3.0.0-alt1_4jpp8 1527985821 installed
<13>Feb 23 13:15:57 rpmi: java-1.8.0-openjdk-devel-0:1.8.0.212.b04-alt2_0jpp8 p9+234508.100.3.1 1563175746 installed
<13>Feb 23 13:15:57 rpmi: java-stub-javadoc-0.1-alt1 1229813340 installed
<13>Feb 23 13:15:57 rpmi: jpackage-generic-compat-0.29-alt1 1523537205 installed
<13>Feb 23 13:15:57 rpmi: maven-local-1:5.0.0-alt1_12jpp8 sisyphus+228348.2100.3.3 1556657006 installed
<13>Feb 23 13:15:57 rpmi: maven-plugin-bundle-3.5.0-alt1_1jpp8 1525822813 installed
<13>Feb 23 13:15:57 rpmi: maven-surefire-report-plugin-0:2.21.0-alt1_1jpp8 1527848673 installed
<13>Feb 23 13:15:57 rpmi: maven-plugin-build-helper-1.9.1-alt1_5jpp8 1510513188 installed
<13>Feb 23 13:15:57 rpmi: exec-maven-plugin-1.6.0-alt1_4jpp8 sisyphus+220915.100.1.2 1549635346 installed
<13>Feb 23 13:15:57 rpmi: maven-antrun-plugin-1.8-alt1_5jpp8 1510505790 installed
<13>Feb 23 13:15:57 rpmi: assertj-core-3.8.0-alt1_3jpp8 sisyphus+220649.100.1.2 1549437602 installed
<13>Feb 23 13:15:57 rpmi: jboss-parent-0:20-alt1_5jpp8 sisyphus+221881.100.1.1 1550460473 installed
<13>Feb 23 13:15:57 rpmi: protobuf-compiler-3.6.1.3-alt2 sisyphus+227259.100.1.1 1555610584 installed
<13>Feb 23 13:15:57 rpmi: jboss-logging-tools-2.0.1-alt1_7jpp8 sisyphus+221872.100.1.1 1550464230 installed
<13>Feb 23 13:15:57 rpmi: javassist-0:3.18.1-alt1_9jpp8 sisyphus+221818.100.1.1 1550433048 installed
<13>Feb 23 13:15:57 rpmi: jboss-logging-3.3.0-alt1_5jpp8 sisyphus+221870.100.1.1 1550465412 installed
<13>Feb 23 13:15:57 rpmi: jboss-marshalling-1.4.11-alt1_5jpp8 sisyphus+221875.100.1.1 1550466866 installed
<13>Feb 23 13:15:57 rpmi: jcip-annotations-1:1-alt3_24.20060626jpp8 sisyphus+221976.100.1.1 1550544445 installed
<13>Feb 23 13:15:57 rpmi: protobuf-java-3.6.1.3-alt2 sisyphus+227259.100.1.1 1555610513 installed
<13>Feb 23 13:15:57 rpmi: protoparser-3.1.5-alt1_4jpp8 1524377471 installed
Building target platforms: i586
Building for target i586
Wrote: /usr/src/in/nosrpm/protostream-3.0.4-alt1_5jpp8.nosrc.rpm
Installing protostream-3.0.4-alt1_5jpp8.src.rpm
Building target platforms: i586
Building for target i586
Executing(%prep): /bin/sh -e /usr/src/tmp/rpm-tmp.61862
+ umask 022
+ /bin/mkdir -p /usr/src/RPM/BUILD
+ cd /usr/src/RPM/BUILD
+ cd /usr/src/RPM/BUILD
+ rm -rf protostream-3.0.4.Final
+ echo 'Source #0 (protostream-3.0.4.Final.tar.gz):'
Source #0 (protostream-3.0.4.Final.tar.gz):
+ /bin/gzip -dc /usr/src/RPM/SOURCES/protostream-3.0.4.Final.tar.gz
+ /bin/tar -xf -
+ cd protostream-3.0.4.Final
+ /bin/chmod -c -Rf u+rwX,go-w .
+ /usr/bin/python3 /usr/share/java-utils/pom_editor.py pom_xpath_set pom:properties/pom:version.log4j 12 parent
/usr/share/java-utils/pom_editor.py:203: DeprecationWarning: inspect.getargspec() is deprecated since Python 3.0, use inspect.signature() or inspect.getfullargspec()
(arglist, _, _, defaults) = inspect.getargspec(function)
+ /usr/bin/python3 /usr/share/java-utils/pom_editor.py pom_change_dep :log4j '::${version.log4j}' core
/usr/share/java-utils/pom_editor.py:203: DeprecationWarning: inspect.getargspec() is deprecated since Python 3.0, use inspect.signature() or inspect.getfullargspec()
(arglist, _, _, defaults) = inspect.getargspec(function)
+ /usr/bin/python3 /usr/share/java-utils/pom_editor.py pom_remove_plugin -r :maven-source-plugin
/usr/share/java-utils/pom_editor.py:203: DeprecationWarning: inspect.getargspec() is deprecated since Python 3.0, use inspect.signature() or inspect.getfullargspec()
(arglist, _, _, defaults) = inspect.getargspec(function)
+ /usr/bin/python3 /usr/share/java-utils/pom_editor.py pom_remove_plugin -r :maven-compiler-plugin
/usr/share/java-utils/pom_editor.py:203: DeprecationWarning: inspect.getargspec() is deprecated since Python 3.0, use inspect.signature() or inspect.getfullargspec()
(arglist, _, _, defaults) = inspect.getargspec(function)
+ /usr/bin/python3 /usr/share/java-utils/pom_editor.py pom_remove_plugin :maven-shade-plugin core
/usr/share/java-utils/pom_editor.py:203: DeprecationWarning: inspect.getargspec() is deprecated since Python 3.0, use inspect.signature() or inspect.getfullargspec()
(arglist, _, _, defaults) = inspect.getargspec(function)
+ /usr/bin/python3 /usr/share/java-utils/pom_editor.py pom_remove_plugin :maven-bundle-plugin core
/usr/share/java-utils/pom_editor.py:203: DeprecationWarning: inspect.getargspec() is deprecated since Python 3.0, use inspect.signature() or inspect.getfullargspec()
(arglist, _, _, defaults) = inspect.getargspec(function)
+ /usr/bin/python3 /usr/share/java-utils/pom_editor.py pom_xpath_set pom:project/pom:packaging bundle core
/usr/share/java-utils/pom_editor.py:203: DeprecationWarning: inspect.getargspec() is deprecated since Python 3.0, use inspect.signature() or inspect.getfullargspec()
(arglist, _, _, defaults) = inspect.getargspec(function)
+ /usr/bin/python3 /usr/share/java-utils/pom_editor.py pom_add_plugin org.apache.felix:maven-bundle-plugin core '
true
true
${project.groupId}.sampledomain.*;version=${project.version};-split-package:=error
bundle-manifest
process-classes
manifest
'
/usr/share/java-utils/pom_editor.py:203: DeprecationWarning: inspect.getargspec() is deprecated since Python 3.0, use inspect.signature() or inspect.getfullargspec()
(arglist, _, _, defaults) = inspect.getargspec(function)
+ /usr/bin/python3 /usr/share/java-utils/pom_editor.py pom_change_dep org.easytesting:fest-assert-core org.assertj:assertj-core:2.0.0 core
/usr/share/java-utils/pom_editor.py:203: DeprecationWarning: inspect.getargspec() is deprecated since Python 3.0, use inspect.signature() or inspect.getfullargspec()
(arglist, _, _, defaults) = inspect.getargspec(function)
+ find ./core -name '*.java' -exec sed -i s/org.fest.assertions/org.assertj.core/g '{}' +
+ rm core/src/test/java/org/infinispan/protostream/impl/parser/impl/DescriptorsTest.java core/src/test/java/org/infinispan/protostream/annotations/impl/ProtoSchemaBuilderTest.java
+ exit 0
Executing(%build): /bin/sh -e /usr/src/tmp/rpm-tmp.84762
+ umask 022
+ /bin/mkdir -p /usr/src/RPM/BUILD
+ cd /usr/src/RPM/BUILD
+ cd protostream-3.0.4.Final
+ /usr/bin/python3 /usr/share/java-utils/mvn_build.py
Executing: xmvn --batch-mode --offline verify org.fedoraproject.xmvn:xmvn-mojo:install org.apache.maven.plugins:maven-javadoc-plugin:aggregate org.fedoraproject.xmvn:xmvn-mojo:builddep
['xmvn', '--batch-mode', '--offline', 'verify', 'org.fedoraproject.xmvn:xmvn-mojo:install', 'org.apache.maven.plugins:maven-javadoc-plugin:aggregate', 'org.fedoraproject.xmvn:xmvn-mojo:builddep']
[INFO] Scanning for projects...
[WARNING]
[WARNING] Some problems were encountered while building the effective model for org.infinispan.protostream:sample-domain-definition:bundle:3.0.4.Final
[WARNING] 'build.plugins.plugin.version' for org.apache.felix:maven-bundle-plugin is missing. @ org.infinispan.protostream:sample-domain-definition:[unknown-version], /usr/src/RPM/BUILD/protostream-3.0.4.Final/sample-domain-definition/pom.xml, line 32, column 18
[WARNING]
[WARNING] Some problems were encountered while building the effective model for org.infinispan.protostream:sample-domain-implementation:bundle:3.0.4.Final
[WARNING] 'build.plugins.plugin.version' for org.apache.felix:maven-bundle-plugin is missing. @ org.infinispan.protostream:sample-domain-implementation:[unknown-version], /usr/src/RPM/BUILD/protostream-3.0.4.Final/sample-domain-implementation/pom.xml, line 39, column 21
[WARNING]
[WARNING] It is highly recommended to fix these problems because they threaten the stability of your build.
[WARNING]
[WARNING] For this reason, future Maven versions might no longer support building such malformed projects.
[WARNING]
[INFO] ------------------------------------------------------------------------
[INFO] Reactor Build Order:
[INFO]
[INFO] Parent for all ProtoStream modules [pom]
[INFO] Sample domain model definitions in proto file [bundle]
[INFO] ProtoStream - core [bundle]
[INFO] Sample domain model implementation, including marshallers [bundle]
[INFO] Aggregator module for the ProtoStream project [pom]
[INFO]
[INFO] -----------------< org.infinispan.protostream:parent >------------------
[INFO] Building Parent for all ProtoStream modules 3.0.4.Final [1/5]
[INFO] --------------------------------[ pom ]---------------------------------
[INFO]
[INFO] --------< org.infinispan.protostream:sample-domain-definition >---------
[INFO] Building Sample domain model definitions in proto file 3.0.4.Final [2/5]
[INFO] -------------------------------[ bundle ]-------------------------------
[INFO]
[INFO] --- maven-resources-plugin:3.1.0:resources (default-resources) @ sample-domain-definition ---
[INFO] Using 'UTF-8' encoding to copy filtered resources.
[INFO] Copying 1 resource
[INFO]
[INFO] --- maven-compiler-plugin:3.7.0:compile (default-compile) @ sample-domain-definition ---
[INFO] No sources to compile
[INFO]
[INFO] --- maven-resources-plugin:3.1.0:testResources (default-testResources) @ sample-domain-definition ---
[INFO] Using 'UTF-8' encoding to copy filtered resources.
[INFO] skip non existing resourceDirectory /usr/src/RPM/BUILD/protostream-3.0.4.Final/sample-domain-definition/src/test/resources
[INFO]
[INFO] --- maven-compiler-plugin:3.7.0:testCompile (default-testCompile) @ sample-domain-definition ---
[INFO] No sources to compile
[INFO]
[INFO] --- maven-surefire-plugin:2.21.0:test (default-test) @ sample-domain-definition ---
[INFO] No tests to run.
[INFO]
[INFO] --- maven-bundle-plugin:3.5.0:bundle (default-bundle) @ sample-domain-definition ---
[INFO]
[INFO] ---------------< org.infinispan.protostream:protostream >---------------
[INFO] Building ProtoStream - core 3.0.4.Final [3/5]
[INFO] -------------------------------[ bundle ]-------------------------------
[WARNING] The POM for com.sun:tools:jar:any is missing, no dependency information available
[INFO]
[INFO] --- maven-resources-plugin:3.1.0:resources (default-resources) @ protostream ---
[INFO] Using 'UTF-8' encoding to copy filtered resources.
[INFO] Copying 1 resource
[INFO] Copying 1 resource
[INFO]
[INFO] --- maven-compiler-plugin:3.7.0:compile (default-compile) @ protostream ---
[INFO] Changes detected - recompiling the module!
[INFO] Compiling 94 source files to /usr/src/RPM/BUILD/protostream-3.0.4.Final/core/target/classes
[INFO] /usr/src/RPM/BUILD/protostream-3.0.4.Final/core/src/main/java/org/infinispan/protostream/impl/MessageMarshallerDelegate.java: Some input files use or override a deprecated API.
[INFO] /usr/src/RPM/BUILD/protostream-3.0.4.Final/core/src/main/java/org/infinispan/protostream/impl/MessageMarshallerDelegate.java: Recompile with -Xlint:deprecation for details.
[INFO] /usr/src/RPM/BUILD/protostream-3.0.4.Final/core/src/main/java/org/infinispan/protostream/impl/AnnotatedDescriptorImpl.java: Some input files use unchecked or unsafe operations.
[INFO] /usr/src/RPM/BUILD/protostream-3.0.4.Final/core/src/main/java/org/infinispan/protostream/impl/AnnotatedDescriptorImpl.java: Recompile with -Xlint:unchecked for details.
[INFO]
[INFO] --- maven-bundle-plugin:3.5.0:manifest (bundle-manifest) @ protostream ---
[WARNING] Manifest org.infinispan.protostream:protostream:bundle:3.0.4.Final : Unused Export-Package instructions: [org.infinispan.protostream.sampledomain.*]
[INFO]
[INFO] --- maven-resources-plugin:3.1.0:testResources (default-testResources) @ protostream ---
[INFO] Using 'UTF-8' encoding to copy filtered resources.
[INFO] Copying 4 resources
[INFO]
[INFO] --- maven-compiler-plugin:3.7.0:testCompile (default-testCompile) @ protostream ---
[INFO] Changes detected - recompiling the module!
[INFO] Compiling 36 source files to /usr/src/RPM/BUILD/protostream-3.0.4.Final/core/target/test-classes
[INFO] /usr/src/RPM/BUILD/protostream-3.0.4.Final/core/src/test/java/org/infinispan/protostream/domain/User.java: Some input files use or override a deprecated API.
[INFO] /usr/src/RPM/BUILD/protostream-3.0.4.Final/core/src/test/java/org/infinispan/protostream/domain/User.java: Recompile with -Xlint:deprecation for details.
[INFO] /usr/src/RPM/BUILD/protostream-3.0.4.Final/core/src/test/java/org/infinispan/protostream/WrappingTest.java: /usr/src/RPM/BUILD/protostream-3.0.4.Final/core/src/test/java/org/infinispan/protostream/WrappingTest.java uses unchecked or unsafe operations.
[INFO] /usr/src/RPM/BUILD/protostream-3.0.4.Final/core/src/test/java/org/infinispan/protostream/WrappingTest.java: Recompile with -Xlint:unchecked for details.
[INFO]
[INFO] --- maven-surefire-plugin:2.21.0:test (default-test) @ protostream ---
[INFO]
[INFO] -------------------------------------------------------
[INFO] T E S T S
[INFO] -------------------------------------------------------
[INFO] Running org.infinispan.protostream.config.AnnotationConfigTest
[INFO] Tests run: 3, Failures: 0, Errors: 0, Skipped: 0, Time elapsed: 0.151 s - in org.infinispan.protostream.config.AnnotationConfigTest
[INFO] Running org.infinispan.protostream.MarshallingTest
13:16:38,663 (main) DEBUG SerializationContextImpl - Registering proto files : [org/infinispan/protostream/message-wrapping.proto]
13:16:38,688 (main) DEBUG SerializationContextImpl - Registering file descriptor : fileName=org/infinispan/protostream/message-wrapping.proto types=[org.infinispan.protostream.WrappedMessage]
13:16:38,691 (main) DEBUG SerializationContextImpl - Registering proto files : [sample_bank_account/bank.proto]
13:16:38,703 (main) DEBUG SerializationContextImpl - Registering file descriptor : fileName=org/infinispan/protostream/message-wrapping.proto types=[org.infinispan.protostream.WrappedMessage]
13:16:38,704 (main) DEBUG SerializationContextImpl - Registering file descriptor : fileName=sample_bank_account/bank.proto types=[sample_bank_account.Transaction, sample_bank_account.User, sample_bank_account.Account, sample_bank_account.Account.Limits, sample_bank_account.int_array, sample_bank_account.User.Gender, sample_bank_account.User.Address, sample_bank_account.user_list]
13:16:38,785 (main) DEBUG SerializationContextImpl - Registering proto files : [org/infinispan/protostream/message-wrapping.proto]
13:16:38,786 (main) DEBUG SerializationContextImpl - Registering file descriptor : fileName=org/infinispan/protostream/message-wrapping.proto types=[org.infinispan.protostream.WrappedMessage]
13:16:38,789 (main) DEBUG SerializationContextImpl - Registering proto files : [sample_bank_account/bank.proto]
13:16:38,792 (main) DEBUG SerializationContextImpl - Registering file descriptor : fileName=org/infinispan/protostream/message-wrapping.proto types=[org.infinispan.protostream.WrappedMessage]
13:16:38,792 (main) DEBUG SerializationContextImpl - Registering file descriptor : fileName=sample_bank_account/bank.proto types=[sample_bank_account.Transaction, sample_bank_account.User, sample_bank_account.Account, sample_bank_account.Account.Limits, sample_bank_account.int_array, sample_bank_account.User.Gender, sample_bank_account.User.Address, sample_bank_account.user_list]
13:16:38,797 (main) WARN ProtoStreamReaderImpl - PROTOSTREAM000001: Field sample_bank_account.User.name was read out of sequence leading to sub-optimal performance
[INFO] Tests run: 2, Failures: 0, Errors: 0, Skipped: 0, Time elapsed: 0.242 s - in org.infinispan.protostream.MarshallingTest
[INFO] Running org.infinispan.protostream.ProtobufParserTest
13:16:38,802 (main) DEBUG SerializationContextImpl - Registering proto files : [org/infinispan/protostream/message-wrapping.proto]
13:16:38,803 (main) DEBUG SerializationContextImpl - Registering file descriptor : fileName=org/infinispan/protostream/message-wrapping.proto types=[org.infinispan.protostream.WrappedMessage]
13:16:38,805 (main) DEBUG SerializationContextImpl - Registering proto files : [sample_bank_account/bank.proto]
13:16:38,807 (main) DEBUG SerializationContextImpl - Registering file descriptor : fileName=org/infinispan/protostream/message-wrapping.proto types=[org.infinispan.protostream.WrappedMessage]
13:16:38,807 (main) DEBUG SerializationContextImpl - Registering file descriptor : fileName=sample_bank_account/bank.proto types=[sample_bank_account.Transaction, sample_bank_account.User, sample_bank_account.Account, sample_bank_account.Account.Limits, sample_bank_account.int_array, sample_bank_account.User.Gender, sample_bank_account.User.Address, sample_bank_account.user_list]
13:16:38,809 (main) TRACE ProtobufParserTest - onStart
13:16:38,810 (main) TRACE ProtobufParserTest - onTag wrappedDescriptorId 42
13:16:38,810 (main) TRACE ProtobufParserTest - onTag wrappedMessageBytes [B@af6cff
13:16:38,810 (main) TRACE ProtobufParserTest - onStart
13:16:38,810 (main) TRACE ProtobufParserTest - onTag id 1
13:16:38,810 (main) TRACE ProtobufParserTest - onTag accountIds 1
13:16:38,811 (main) TRACE ProtobufParserTest - onTag accountIds 3
13:16:38,811 (main) TRACE ProtobufParserTest - onTag name John
13:16:38,811 (main) TRACE ProtobufParserTest - onTag surname Batman
13:16:38,812 (main) TRACE ProtobufParserTest - onStartNested addresses
13:16:38,812 (main) TRACE ProtobufParserTest - onTag street Old Street
13:16:38,812 (main) TRACE ProtobufParserTest - onTag postCode XYZ42
13:16:38,812 (main) TRACE ProtobufParserTest - onTag number -12
13:16:38,812 (main) TRACE ProtobufParserTest - onEndNested addresses
13:16:38,812 (main) TRACE ProtobufParserTest - onTag gender 0
13:16:38,812 (main) TRACE ProtobufParserTest - onEnd
13:16:38,812 (main) TRACE ProtobufParserTest - onEnd
[INFO] Tests run: 1, Failures: 0, Errors: 0, Skipped: 0, Time elapsed: 0.04 s - in org.infinispan.protostream.ProtobufParserTest
[INFO] Running org.infinispan.protostream.impl.SerializationContextImplTest
13:16:38,814 (main) DEBUG SerializationContextImpl - Registering proto files : [org/infinispan/protostream/message-wrapping.proto]
13:16:38,817 (main) DEBUG SerializationContextImpl - Registering file descriptor : fileName=org/infinispan/protostream/message-wrapping.proto types=[org.infinispan.protostream.WrappedMessage]
13:16:38,818 (main) DEBUG SerializationContextImpl - Registering proto files : [file2.proto, file1.proto]
13:16:38,819 (main) DEBUG SerializationContextImpl - Registering file descriptor : fileName=org/infinispan/protostream/message-wrapping.proto types=[org.infinispan.protostream.WrappedMessage]
13:16:38,819 (main) DEBUG FileDescriptor - File resolved successfully : file1.proto
13:16:38,819 (main) DEBUG FileDescriptor - File has errors : file2.proto
13:16:38,819 (main) DEBUG SerializationContextImpl - Registering file descriptor : fileName=file1.proto types=[p.A]
[INFO] Tests run: 1, Failures: 0, Errors: 0, Skipped: 0, Time elapsed: 0.026 s - in org.infinispan.protostream.impl.SerializationContextImplTest
[INFO] Running org.infinispan.protostream.impl.UnknownFieldSetImplTest
13:16:38,823 (main) DEBUG SerializationContextImpl - Registering proto files : [org/infinispan/protostream/message-wrapping.proto]
13:16:38,824 (main) DEBUG SerializationContextImpl - Registering file descriptor : fileName=org/infinispan/protostream/message-wrapping.proto types=[org.infinispan.protostream.WrappedMessage]
13:16:38,824 (main) DEBUG SerializationContextImpl - Registering proto files : [sample_bank_account/bank.proto]
13:16:38,827 (main) DEBUG SerializationContextImpl - Registering file descriptor : fileName=org/infinispan/protostream/message-wrapping.proto types=[org.infinispan.protostream.WrappedMessage]
13:16:38,827 (main) DEBUG SerializationContextImpl - Registering file descriptor : fileName=sample_bank_account/bank.proto types=[sample_bank_account.Transaction, sample_bank_account.User, sample_bank_account.Account, sample_bank_account.Account.Limits, sample_bank_account.int_array, sample_bank_account.User.Gender, sample_bank_account.User.Address, sample_bank_account.user_list]
13:16:38,860 (main) DEBUG SerializationContextImpl - Registering proto files : [org/infinispan/protostream/message-wrapping.proto]
13:16:38,861 (main) DEBUG SerializationContextImpl - Registering file descriptor : fileName=org/infinispan/protostream/message-wrapping.proto types=[org.infinispan.protostream.WrappedMessage]
13:16:38,862 (main) DEBUG SerializationContextImpl - Registering proto files : [sample_bank_account/bank.proto]
13:16:38,863 (main) DEBUG SerializationContextImpl - Registering file descriptor : fileName=org/infinispan/protostream/message-wrapping.proto types=[org.infinispan.protostream.WrappedMessage]
13:16:38,867 (main) DEBUG SerializationContextImpl - Registering file descriptor : fileName=sample_bank_account/bank.proto types=[sample_bank_account.Transaction, sample_bank_account.User, sample_bank_account.Account, sample_bank_account.Account.Limits, sample_bank_account.int_array, sample_bank_account.User.Gender, sample_bank_account.User.Address, sample_bank_account.user_list]
[INFO] Tests run: 2, Failures: 0, Errors: 0, Skipped: 0, Time elapsed: 0.052 s - in org.infinispan.protostream.impl.UnknownFieldSetImplTest
[INFO] Running org.infinispan.protostream.impl.parser.AnnotationParserTest
13:16:38,879 (main) DEBUG AnnotationParserTest -
13:16:38,883 (main) DEBUG AnnotationParserTest - @XXX.yyy.zzzz(
value=false
)
@ABC(
x=some.class.or.enum,
y=45,
z=333333
)
@IndexedField2(
)
@IndexedField3(
value=Store.NO
)
@IndexedField4(
x=Store.NO,
y=true
)
@IndexedField5(
store=Store.YES,
quickAndDirty=true
)
@Test(
x=9,
cc={
34,
0,
{
34,
44
}
},
y=true,
y2=false,
y3=null,
b=45.9,
v=f,
xx=axxxxx\\xxxxxxxb,
_xx=,
yy=@Moooo(
)
)
@XXX.yyy.zz(
value=false
)
@ABCd(
)
@XXX(
)
@XXX2(
)
13:16:38,886 (main) DEBUG AnnotationParserTest - @Indexed(
)
[INFO] Tests run: 3, Failures: 0, Errors: 0, Skipped: 0, Time elapsed: 0.017 s - in org.infinispan.protostream.impl.parser.AnnotationParserTest
[INFO] Running org.infinispan.protostream.WrappingTest
13:16:38,896 (main) DEBUG SerializationContextImpl - Registering proto files : [org/infinispan/protostream/message-wrapping.proto]
13:16:38,901 (main) DEBUG SerializationContextImpl - Registering file descriptor : fileName=org/infinispan/protostream/message-wrapping.proto types=[org.infinispan.protostream.WrappedMessage]
13:16:38,901 (main) DEBUG SerializationContextImpl - Registering proto files : [sample_bank_account/bank.proto]
13:16:38,903 (main) DEBUG SerializationContextImpl - Registering file descriptor : fileName=org/infinispan/protostream/message-wrapping.proto types=[org.infinispan.protostream.WrappedMessage]
13:16:38,903 (main) DEBUG SerializationContextImpl - Registering file descriptor : fileName=sample_bank_account/bank.proto types=[sample_bank_account.Transaction, sample_bank_account.User, sample_bank_account.Account, sample_bank_account.Account.Limits, sample_bank_account.int_array, sample_bank_account.User.Gender, sample_bank_account.User.Address, sample_bank_account.user_list]
13:16:38,905 (main) DEBUG SerializationContextImpl - Registering proto files : [org/infinispan/protostream/message-wrapping.proto]
13:16:38,905 (main) DEBUG SerializationContextImpl - Registering file descriptor : fileName=org/infinispan/protostream/message-wrapping.proto types=[org.infinispan.protostream.WrappedMessage]
13:16:38,906 (main) DEBUG SerializationContextImpl - Registering proto files : [sample_bank_account/bank.proto]
13:16:38,907 (main) DEBUG SerializationContextImpl - Registering file descriptor : fileName=org/infinispan/protostream/message-wrapping.proto types=[org.infinispan.protostream.WrappedMessage]
13:16:38,908 (main) DEBUG SerializationContextImpl - Registering file descriptor : fileName=sample_bank_account/bank.proto types=[sample_bank_account.Transaction, sample_bank_account.User, sample_bank_account.Account, sample_bank_account.Account.Limits, sample_bank_account.int_array, sample_bank_account.User.Gender, sample_bank_account.User.Address, sample_bank_account.user_list]
13:16:38,909 (main) DEBUG SerializationContextImpl - Registering proto files : [org/infinispan/protostream/message-wrapping.proto]
13:16:38,910 (main) DEBUG SerializationContextImpl - Registering file descriptor : fileName=org/infinispan/protostream/message-wrapping.proto types=[org.infinispan.protostream.WrappedMessage]
13:16:38,910 (main) DEBUG SerializationContextImpl - Registering proto files : [sample_bank_account/bank.proto]
13:16:38,917 (main) DEBUG SerializationContextImpl - Registering file descriptor : fileName=org/infinispan/protostream/message-wrapping.proto types=[org.infinispan.protostream.WrappedMessage]
13:16:38,917 (main) DEBUG SerializationContextImpl - Registering file descriptor : fileName=sample_bank_account/bank.proto types=[sample_bank_account.Transaction, sample_bank_account.User, sample_bank_account.Account, sample_bank_account.Account.Limits, sample_bank_account.int_array, sample_bank_account.User.Gender, sample_bank_account.User.Address, sample_bank_account.user_list]
13:16:38,918 (main) DEBUG SerializationContextImpl - Registering proto files : [org/infinispan/protostream/message-wrapping.proto]
13:16:38,921 (main) DEBUG SerializationContextImpl - Registering file descriptor : fileName=org/infinispan/protostream/message-wrapping.proto types=[org.infinispan.protostream.WrappedMessage]
13:16:38,922 (main) DEBUG SerializationContextImpl - Registering proto files : [sample_bank_account/bank.proto]
13:16:38,923 (main) DEBUG SerializationContextImpl - Registering file descriptor : fileName=org/infinispan/protostream/message-wrapping.proto types=[org.infinispan.protostream.WrappedMessage]
13:16:38,923 (main) DEBUG SerializationContextImpl - Registering file descriptor : fileName=sample_bank_account/bank.proto types=[sample_bank_account.Transaction, sample_bank_account.User, sample_bank_account.Account, sample_bank_account.Account.Limits, sample_bank_account.int_array, sample_bank_account.User.Gender, sample_bank_account.User.Address, sample_bank_account.user_list]
13:16:38,925 (main) DEBUG SerializationContextImpl - Registering proto files : [org/infinispan/protostream/message-wrapping.proto]
13:16:38,925 (main) DEBUG SerializationContextImpl - Registering file descriptor : fileName=org/infinispan/protostream/message-wrapping.proto types=[org.infinispan.protostream.WrappedMessage]
13:16:38,926 (main) DEBUG SerializationContextImpl - Registering proto files : [sample_bank_account/bank.proto]
13:16:38,926 (main) DEBUG SerializationContextImpl - Registering file descriptor : fileName=org/infinispan/protostream/message-wrapping.proto types=[org.infinispan.protostream.WrappedMessage]
13:16:38,929 (main) DEBUG SerializationContextImpl - Registering file descriptor : fileName=sample_bank_account/bank.proto types=[sample_bank_account.Transaction, sample_bank_account.User, sample_bank_account.Account, sample_bank_account.Account.Limits, sample_bank_account.int_array, sample_bank_account.User.Gender, sample_bank_account.User.Address, sample_bank_account.user_list]
13:16:38,929 (main) DEBUG SerializationContextImpl - Registering proto files : [org/infinispan/protostream/message-wrapping.proto]
13:16:38,930 (main) DEBUG SerializationContextImpl - Registering file descriptor : fileName=org/infinispan/protostream/message-wrapping.proto types=[org.infinispan.protostream.WrappedMessage]
13:16:38,931 (main) DEBUG SerializationContextImpl - Registering proto files : [sample_bank_account/bank.proto]
13:16:38,933 (main) DEBUG SerializationContextImpl - Registering file descriptor : fileName=org/infinispan/protostream/message-wrapping.proto types=[org.infinispan.protostream.WrappedMessage]
13:16:38,934 (main) DEBUG SerializationContextImpl - Registering file descriptor : fileName=sample_bank_account/bank.proto types=[sample_bank_account.Transaction, sample_bank_account.User, sample_bank_account.Account, sample_bank_account.Account.Limits, sample_bank_account.int_array, sample_bank_account.User.Gender, sample_bank_account.User.Address, sample_bank_account.user_list]
13:16:38,934 (main) WARN ProtoStreamReaderImpl - PROTOSTREAM000001: Field sample_bank_account.User.name was read out of sequence leading to sub-optimal performance
13:16:38,936 (main) DEBUG SerializationContextImpl - Registering proto files : [org/infinispan/protostream/message-wrapping.proto]
13:16:38,936 (main) DEBUG SerializationContextImpl - Registering file descriptor : fileName=org/infinispan/protostream/message-wrapping.proto types=[org.infinispan.protostream.WrappedMessage]
13:16:38,938 (main) DEBUG SerializationContextImpl - Registering proto files : [sample_bank_account/bank.proto]
13:16:38,939 (main) DEBUG SerializationContextImpl - Registering file descriptor : fileName=org/infinispan/protostream/message-wrapping.proto types=[org.infinispan.protostream.WrappedMessage]
13:16:38,939 (main) DEBUG SerializationContextImpl - Registering file descriptor : fileName=sample_bank_account/bank.proto types=[sample_bank_account.Transaction, sample_bank_account.User, sample_bank_account.Account, sample_bank_account.Account.Limits, sample_bank_account.int_array, sample_bank_account.User.Gender, sample_bank_account.User.Address, sample_bank_account.user_list]
13:16:38,943 (main) WARN ProtoStreamReaderImpl - PROTOSTREAM000001: Field sample_bank_account.User.name was read out of sequence leading to sub-optimal performance
13:16:38,943 (main) WARN ProtoStreamReaderImpl - PROTOSTREAM000001: Field sample_bank_account.User.name was read out of sequence leading to sub-optimal performance
13:16:38,943 (main) WARN ProtoStreamReaderImpl - PROTOSTREAM000001: Field sample_bank_account.User.name was read out of sequence leading to sub-optimal performance
13:16:38,946 (main) DEBUG SerializationContextImpl - Registering proto files : [org/infinispan/protostream/message-wrapping.proto]
13:16:38,946 (main) DEBUG SerializationContextImpl - Registering file descriptor : fileName=org/infinispan/protostream/message-wrapping.proto types=[org.infinispan.protostream.WrappedMessage]
13:16:38,947 (main) DEBUG SerializationContextImpl - Registering proto files : [sample_bank_account/bank.proto]
13:16:38,948 (main) DEBUG SerializationContextImpl - Registering file descriptor : fileName=org/infinispan/protostream/message-wrapping.proto types=[org.infinispan.protostream.WrappedMessage]
13:16:38,948 (main) DEBUG SerializationContextImpl - Registering file descriptor : fileName=sample_bank_account/bank.proto types=[sample_bank_account.Transaction, sample_bank_account.User, sample_bank_account.Account, sample_bank_account.Account.Limits, sample_bank_account.int_array, sample_bank_account.User.Gender, sample_bank_account.User.Address, sample_bank_account.user_list]
13:16:38,950 (main) DEBUG SerializationContextImpl - Registering proto files : [org/infinispan/protostream/message-wrapping.proto]
13:16:38,950 (main) DEBUG SerializationContextImpl - Registering file descriptor : fileName=org/infinispan/protostream/message-wrapping.proto types=[org.infinispan.protostream.WrappedMessage]
13:16:38,954 (main) DEBUG SerializationContextImpl - Registering proto files : [sample_bank_account/bank.proto]
13:16:38,955 (main) DEBUG SerializationContextImpl - Registering file descriptor : fileName=org/infinispan/protostream/message-wrapping.proto types=[org.infinispan.protostream.WrappedMessage]
13:16:38,955 (main) DEBUG SerializationContextImpl - Registering file descriptor : fileName=sample_bank_account/bank.proto types=[sample_bank_account.Transaction, sample_bank_account.User, sample_bank_account.Account, sample_bank_account.Account.Limits, sample_bank_account.int_array, sample_bank_account.User.Gender, sample_bank_account.User.Address, sample_bank_account.user_list]
13:16:38,958 (main) DEBUG SerializationContextImpl - Registering proto files : [org/infinispan/protostream/message-wrapping.proto]
13:16:38,959 (main) DEBUG SerializationContextImpl - Registering file descriptor : fileName=org/infinispan/protostream/message-wrapping.proto types=[org.infinispan.protostream.WrappedMessage]
13:16:38,959 (main) DEBUG SerializationContextImpl - Registering proto files : [sample_bank_account/bank.proto]
13:16:38,961 (main) DEBUG SerializationContextImpl - Registering file descriptor : fileName=org/infinispan/protostream/message-wrapping.proto types=[org.infinispan.protostream.WrappedMessage]
13:16:38,962 (main) DEBUG SerializationContextImpl - Registering file descriptor : fileName=sample_bank_account/bank.proto types=[sample_bank_account.Transaction, sample_bank_account.User, sample_bank_account.Account, sample_bank_account.Account.Limits, sample_bank_account.int_array, sample_bank_account.User.Gender, sample_bank_account.User.Address, sample_bank_account.user_list]
13:16:38,962 (main) DEBUG SerializationContextImpl - Registering proto files : [org/infinispan/protostream/message-wrapping.proto]
13:16:38,964 (main) DEBUG SerializationContextImpl - Registering file descriptor : fileName=org/infinispan/protostream/message-wrapping.proto types=[org.infinispan.protostream.WrappedMessage]
13:16:38,965 (main) DEBUG SerializationContextImpl - Registering proto files : [sample_bank_account/bank.proto]
13:16:38,965 (main) DEBUG SerializationContextImpl - Registering file descriptor : fileName=org/infinispan/protostream/message-wrapping.proto types=[org.infinispan.protostream.WrappedMessage]
13:16:38,967 (main) DEBUG SerializationContextImpl - Registering file descriptor : fileName=sample_bank_account/bank.proto types=[sample_bank_account.Transaction, sample_bank_account.User, sample_bank_account.Account, sample_bank_account.Account.Limits, sample_bank_account.int_array, sample_bank_account.User.Gender, sample_bank_account.User.Address, sample_bank_account.user_list]
13:16:38,968 (main) DEBUG SerializationContextImpl - Registering proto files : [org/infinispan/protostream/message-wrapping.proto]
13:16:38,968 (main) DEBUG SerializationContextImpl - Registering file descriptor : fileName=org/infinispan/protostream/message-wrapping.proto types=[org.infinispan.protostream.WrappedMessage]
13:16:38,973 (main) DEBUG SerializationContextImpl - Registering proto files : [sample_bank_account/bank.proto]
13:16:38,973 (main) DEBUG SerializationContextImpl - Registering file descriptor : fileName=org/infinispan/protostream/message-wrapping.proto types=[org.infinispan.protostream.WrappedMessage]
13:16:38,975 (main) DEBUG SerializationContextImpl - Registering file descriptor : fileName=sample_bank_account/bank.proto types=[sample_bank_account.Transaction, sample_bank_account.User, sample_bank_account.Account, sample_bank_account.Account.Limits, sample_bank_account.int_array, sample_bank_account.User.Gender, sample_bank_account.User.Address, sample_bank_account.user_list]
13:16:38,976 (main) DEBUG SerializationContextImpl - Registering proto files : [org/infinispan/protostream/message-wrapping.proto]
13:16:38,976 (main) DEBUG SerializationContextImpl - Registering file descriptor : fileName=org/infinispan/protostream/message-wrapping.proto types=[org.infinispan.protostream.WrappedMessage]
13:16:38,981 (main) DEBUG SerializationContextImpl - Registering proto files : [sample_bank_account/bank.proto]
13:16:38,981 (main) DEBUG SerializationContextImpl - Registering file descriptor : fileName=org/infinispan/protostream/message-wrapping.proto types=[org.infinispan.protostream.WrappedMessage]
13:16:38,986 (main) DEBUG SerializationContextImpl - Registering file descriptor : fileName=sample_bank_account/bank.proto types=[sample_bank_account.Transaction, sample_bank_account.User, sample_bank_account.Account, sample_bank_account.Account.Limits, sample_bank_account.int_array, sample_bank_account.User.Gender, sample_bank_account.User.Address, sample_bank_account.user_list]
13:16:38,987 (main) DEBUG SerializationContextImpl - Registering proto files : [org/infinispan/protostream/message-wrapping.proto]
13:16:38,987 (main) DEBUG SerializationContextImpl - Registering file descriptor : fileName=org/infinispan/protostream/message-wrapping.proto types=[org.infinispan.protostream.WrappedMessage]
13:16:38,991 (main) DEBUG SerializationContextImpl - Registering proto files : [sample_bank_account/bank.proto]
13:16:38,991 (main) DEBUG SerializationContextImpl - Registering file descriptor : fileName=org/infinispan/protostream/message-wrapping.proto types=[org.infinispan.protostream.WrappedMessage]
13:16:38,991 (main) DEBUG SerializationContextImpl - Registering file descriptor : fileName=sample_bank_account/bank.proto types=[sample_bank_account.Transaction, sample_bank_account.User, sample_bank_account.Account, sample_bank_account.Account.Limits, sample_bank_account.int_array, sample_bank_account.User.Gender, sample_bank_account.User.Address, sample_bank_account.user_list]
13:16:38,997 (main) DEBUG SerializationContextImpl - Registering proto files : [org/infinispan/protostream/message-wrapping.proto]
13:16:38,997 (main) DEBUG SerializationContextImpl - Registering file descriptor : fileName=org/infinispan/protostream/message-wrapping.proto types=[org.infinispan.protostream.WrappedMessage]
13:16:39,001 (main) DEBUG SerializationContextImpl - Registering proto files : [sample_bank_account/bank.proto]
13:16:39,004 (main) DEBUG SerializationContextImpl - Registering file descriptor : fileName=org/infinispan/protostream/message-wrapping.proto types=[org.infinispan.protostream.WrappedMessage]
13:16:39,005 (main) DEBUG SerializationContextImpl - Registering file descriptor : fileName=sample_bank_account/bank.proto types=[sample_bank_account.Transaction, sample_bank_account.User, sample_bank_account.Account, sample_bank_account.Account.Limits, sample_bank_account.int_array, sample_bank_account.User.Gender, sample_bank_account.User.Address, sample_bank_account.user_list]
[INFO] Tests run: 14, Failures: 0, Errors: 0, Skipped: 0, Time elapsed: 0.365 s - in org.infinispan.protostream.WrappingTest
[INFO] Running org.infinispan.protostream.test.AnnotationsPerformanceTest
[WARNING] Tests run: 1, Failures: 0, Errors: 0, Skipped: 1, Time elapsed: 0.002 s - in org.infinispan.protostream.test.AnnotationsPerformanceTest
[INFO] Running org.infinispan.protostream.test.PerformanceTest
[WARNING] Tests run: 1, Failures: 0, Errors: 0, Skipped: 1, Time elapsed: 0.003 s - in org.infinispan.protostream.test.PerformanceTest
[INFO]
[INFO] Results:
[INFO]
[WARNING] Tests run: 28, Failures: 0, Errors: 0, Skipped: 2
[INFO]
[INFO]
[INFO] --- maven-bundle-plugin:3.5.0:bundle (default-bundle) @ protostream ---
[WARNING] Bundle org.infinispan.protostream:protostream:bundle:3.0.4.Final : Unused Export-Package instructions: [org.infinispan.protostream.sampledomain.*]
[INFO]
[INFO] --- build-helper-maven-plugin:1.9.1:attach-artifact (attach-artifacts) @ protostream ---
[INFO]
[INFO] >>> maven-surefire-report-plugin:2.21.0:report (default) > [surefire]test @ protostream >>>
[INFO]
[INFO] --- maven-resources-plugin:3.1.0:resources (default-resources) @ protostream ---
[INFO] Using 'UTF-8' encoding to copy filtered resources.
[INFO] Copying 1 resource
[INFO] Copying 1 resource
[INFO]
[INFO] --- maven-compiler-plugin:3.7.0:compile (default-compile) @ protostream ---
[INFO] Changes detected - recompiling the module!
[INFO] Compiling 94 source files to /usr/src/RPM/BUILD/protostream-3.0.4.Final/core/target/classes
[INFO] /usr/src/RPM/BUILD/protostream-3.0.4.Final/core/src/main/java/org/infinispan/protostream/impl/MessageMarshallerDelegate.java: Some input files use or override a deprecated API.
[INFO] /usr/src/RPM/BUILD/protostream-3.0.4.Final/core/src/main/java/org/infinispan/protostream/impl/MessageMarshallerDelegate.java: Recompile with -Xlint:deprecation for details.
[INFO] /usr/src/RPM/BUILD/protostream-3.0.4.Final/core/src/main/java/org/infinispan/protostream/impl/AnnotatedDescriptorImpl.java: Some input files use unchecked or unsafe operations.
[INFO] /usr/src/RPM/BUILD/protostream-3.0.4.Final/core/src/main/java/org/infinispan/protostream/impl/AnnotatedDescriptorImpl.java: Recompile with -Xlint:unchecked for details.
[INFO]
[INFO] --- maven-bundle-plugin:3.5.0:manifest (bundle-manifest) @ protostream ---
[WARNING] Manifest org.infinispan.protostream:protostream:bundle:3.0.4.Final : Unused Export-Package instructions: [org.infinispan.protostream.sampledomain.*]
[INFO]
[INFO] --- maven-resources-plugin:3.1.0:testResources (default-testResources) @ protostream ---
[INFO] Using 'UTF-8' encoding to copy filtered resources.
[INFO] Copying 4 resources
[INFO]
[INFO] --- maven-compiler-plugin:3.7.0:testCompile (default-testCompile) @ protostream ---
[INFO] Nothing to compile - all classes are up to date
[INFO]
[INFO] --- maven-surefire-plugin:2.21.0:test (default-test) @ protostream ---
[INFO] Skipping execution of surefire because it has already been run for this configuration
[INFO]
[INFO] <<< maven-surefire-report-plugin:2.21.0:report (default) < [surefire]test @ protostream <<<
[INFO]
[INFO]
[INFO] --- maven-surefire-report-plugin:2.21.0:report (default) @ protostream ---
[WARNING] Unable to locate Test Source XRef to link to - DISABLED
[INFO]
[INFO] ------< org.infinispan.protostream:sample-domain-implementation >-------
[INFO] Building Sample domain model implementation, including marshallers 3.0.4.Final [4/5]
[INFO] -------------------------------[ bundle ]-------------------------------
[INFO]
[INFO] --- maven-resources-plugin:3.1.0:resources (default-resources) @ sample-domain-implementation ---
[INFO] Using 'UTF-8' encoding to copy filtered resources.
[INFO] skip non existing resourceDirectory /usr/src/RPM/BUILD/protostream-3.0.4.Final/sample-domain-implementation/src/main/resources
[INFO]
[INFO] --- maven-compiler-plugin:3.7.0:compile (default-compile) @ sample-domain-implementation ---
[INFO] Changes detected - recompiling the module!
[INFO] Compiling 12 source files to /usr/src/RPM/BUILD/protostream-3.0.4.Final/sample-domain-implementation/target/classes
[INFO] /usr/src/RPM/BUILD/protostream-3.0.4.Final/sample-domain-implementation/src/main/java/org/infinispan/protostream/sampledomain/Address.java: Some input files use or override a deprecated API.
[INFO] /usr/src/RPM/BUILD/protostream-3.0.4.Final/sample-domain-implementation/src/main/java/org/infinispan/protostream/sampledomain/Address.java: Recompile with -Xlint:deprecation for details.
[INFO]
[INFO] --- maven-resources-plugin:3.1.0:testResources (default-testResources) @ sample-domain-implementation ---
[INFO] Using 'UTF-8' encoding to copy filtered resources.
[INFO] skip non existing resourceDirectory /usr/src/RPM/BUILD/protostream-3.0.4.Final/sample-domain-implementation/src/test/resources
[INFO]
[INFO] --- maven-compiler-plugin:3.7.0:testCompile (default-testCompile) @ sample-domain-implementation ---
[INFO] No sources to compile
[INFO]
[INFO] --- maven-surefire-plugin:2.21.0:test (default-test) @ sample-domain-implementation ---
[INFO] No tests to run.
[INFO]
[INFO] --- maven-bundle-plugin:3.5.0:bundle (default-bundle) @ sample-domain-implementation ---
[INFO]
[INFO] >>> maven-surefire-report-plugin:2.21.0:report (default) > [surefire]test @ sample-domain-implementation >>>
[INFO]
[INFO] --- maven-resources-plugin:3.1.0:resources (default-resources) @ sample-domain-implementation ---
[INFO] Using 'UTF-8' encoding to copy filtered resources.
[INFO] skip non existing resourceDirectory /usr/src/RPM/BUILD/protostream-3.0.4.Final/sample-domain-implementation/src/main/resources
[INFO]
[INFO] --- maven-compiler-plugin:3.7.0:compile (default-compile) @ sample-domain-implementation ---
[INFO] Nothing to compile - all classes are up to date
[INFO]
[INFO] --- maven-resources-plugin:3.1.0:testResources (default-testResources) @ sample-domain-implementation ---
[INFO] Using 'UTF-8' encoding to copy filtered resources.
[INFO] skip non existing resourceDirectory /usr/src/RPM/BUILD/protostream-3.0.4.Final/sample-domain-implementation/src/test/resources
[INFO]
[INFO] --- maven-compiler-plugin:3.7.0:testCompile (default-testCompile) @ sample-domain-implementation ---
[INFO] No sources to compile
[INFO]
[INFO] --- maven-surefire-plugin:2.21.0:test (default-test) @ sample-domain-implementation ---
[INFO] No tests to run.
[INFO] Skipping execution of surefire because it has already been run for this configuration
[INFO]
[INFO] <<< maven-surefire-report-plugin:2.21.0:report (default) < [surefire]test @ sample-domain-implementation <<<
[INFO]
[INFO]
[INFO] --- maven-surefire-report-plugin:2.21.0:report (default) @ sample-domain-implementation ---
[WARNING] Unable to locate Test Source XRef to link to - DISABLED
[INFO]
[INFO] ---------< org.infinispan.protostream:protostream-aggregator >----------
[INFO] Building Aggregator module for the ProtoStream project 3.0.4.Final [5/5]
[INFO] --------------------------------[ pom ]---------------------------------
[INFO]
[INFO] >>> maven-surefire-report-plugin:2.21.0:report (default) > [surefire]test @ protostream-aggregator >>>
[INFO]
[INFO] <<< maven-surefire-report-plugin:2.21.0:report (default) < [surefire]test @ protostream-aggregator <<<
[INFO]
[INFO]
[INFO] --- maven-surefire-report-plugin:2.21.0:report (default) @ protostream-aggregator ---
[WARNING] Unable to locate Test Source XRef to link to - DISABLED
[INFO]
[INFO] ---------< org.infinispan.protostream:protostream-aggregator >----------
[INFO] Building Aggregator module for the ProtoStream project 3.0.4.Final [6/5]
[INFO] --------------------------------[ pom ]---------------------------------
[INFO]
[INFO] --- xmvn-mojo:3.0.0:install (default-cli) @ protostream-aggregator ---
[INFO]
[INFO] >>> maven-javadoc-plugin:3.0.0:aggregate (default-cli) > compile @ protostream-aggregator >>>
[INFO]
[INFO] >>>>>>>>>>>>>>>>>>>>>>>>>>>>>>>>>>>>>>>>>>>>>>>>>>>>>>>>>>>>>>>>>>>>>>>>
[INFO] Forking Sample domain model definitions in proto file 3.0.4.Final
[INFO] >>>>>>>>>>>>>>>>>>>>>>>>>>>>>>>>>>>>>>>>>>>>>>>>>>>>>>>>>>>>>>>>>>>>>>>>
[INFO]
[INFO] --- maven-resources-plugin:3.1.0:resources (default-resources) @ sample-domain-definition ---
[INFO] Using 'UTF-8' encoding to copy filtered resources.
[INFO] Copying 1 resource
[INFO]
[INFO] --- maven-compiler-plugin:3.7.0:compile (default-compile) @ sample-domain-definition ---
[INFO] No sources to compile
[INFO]
[INFO] >>>>>>>>>>>>>>>>>>>>>>>>>>>>>>>>>>>>>>>>>>>>>>>>>>>>>>>>>>>>>>>>>>>>>>>>
[INFO] Forking ProtoStream - core 3.0.4.Final
[INFO] >>>>>>>>>>>>>>>>>>>>>>>>>>>>>>>>>>>>>>>>>>>>>>>>>>>>>>>>>>>>>>>>>>>>>>>>
[INFO]
[INFO] --- maven-resources-plugin:3.1.0:resources (default-resources) @ protostream ---
[INFO] Using 'UTF-8' encoding to copy filtered resources.
[INFO] Copying 1 resource
[INFO] Copying 1 resource
[INFO]
[INFO] --- maven-compiler-plugin:3.7.0:compile (default-compile) @ protostream ---
[INFO] Changes detected - recompiling the module!
[INFO] Compiling 94 source files to /usr/src/RPM/BUILD/protostream-3.0.4.Final/core/target/classes
[INFO] /usr/src/RPM/BUILD/protostream-3.0.4.Final/core/src/main/java/org/infinispan/protostream/impl/MessageMarshallerDelegate.java: Some input files use or override a deprecated API.
[INFO] /usr/src/RPM/BUILD/protostream-3.0.4.Final/core/src/main/java/org/infinispan/protostream/impl/MessageMarshallerDelegate.java: Recompile with -Xlint:deprecation for details.
[INFO] /usr/src/RPM/BUILD/protostream-3.0.4.Final/core/src/main/java/org/infinispan/protostream/impl/AnnotatedDescriptorImpl.java: Some input files use unchecked or unsafe operations.
[INFO] /usr/src/RPM/BUILD/protostream-3.0.4.Final/core/src/main/java/org/infinispan/protostream/impl/AnnotatedDescriptorImpl.java: Recompile with -Xlint:unchecked for details.
[INFO]
[INFO] >>>>>>>>>>>>>>>>>>>>>>>>>>>>>>>>>>>>>>>>>>>>>>>>>>>>>>>>>>>>>>>>>>>>>>>>
[INFO] Forking Sample domain model implementation, including marshallers 3.0.4.Final
[INFO] >>>>>>>>>>>>>>>>>>>>>>>>>>>>>>>>>>>>>>>>>>>>>>>>>>>>>>>>>>>>>>>>>>>>>>>>
[INFO]
[INFO] --- maven-resources-plugin:3.1.0:resources (default-resources) @ sample-domain-implementation ---
[INFO] Using 'UTF-8' encoding to copy filtered resources.
[INFO] skip non existing resourceDirectory /usr/src/RPM/BUILD/protostream-3.0.4.Final/sample-domain-implementation/src/main/resources
[INFO]
[INFO] --- maven-compiler-plugin:3.7.0:compile (default-compile) @ sample-domain-implementation ---
[INFO] Nothing to compile - all classes are up to date
[INFO]
[INFO] <<< maven-javadoc-plugin:3.0.0:aggregate (default-cli) < compile @ protostream-aggregator <<<
[INFO]
[INFO]
[INFO] --- maven-javadoc-plugin:3.0.0:aggregate (default-cli) @ protostream-aggregator ---
[ERROR] no module descriptor for org.infinispan.protostream:protostream-aggregator
[ERROR] no module descriptor for org.infinispan.protostream:parent
[ERROR] no module descriptor for org.infinispan.protostream:sample-domain-definition
[ERROR] no module descriptor for org.infinispan.protostream:protostream
[ERROR] no module descriptor for org.infinispan.protostream:sample-domain-implementation
[INFO]
Loading source files for package org.infinispan.protostream...
Loading source files for package org.infinispan.protostream.impl...
Loading source files for package org.infinispan.protostream.impl.parser...
Loading source files for package org.infinispan.protostream.impl.parser.mappers...
Loading source files for package org.infinispan.protostream.descriptors...
Loading source files for package org.infinispan.protostream.config...
Loading source files for package org.infinispan.protostream.annotations...
Loading source files for package org.infinispan.protostream.annotations.impl...
Loading source files for package org.infinispan.protostream.sampledomain.marshallers...
Loading source files for package org.infinispan.protostream.sampledomain...
Constructing Javadoc information...
Standard Doclet version 1.8.0_212
Building tree for all the packages and classes...
Generating /usr/src/RPM/BUILD/protostream-3.0.4.Final/target/site/apidocs/org/infinispan/protostream/AnnotationMetadataCreator.html...
Generating /usr/src/RPM/BUILD/protostream-3.0.4.Final/target/site/apidocs/org/infinispan/protostream/AnnotationParserException.html...
Generating /usr/src/RPM/BUILD/protostream-3.0.4.Final/target/site/apidocs/org/infinispan/protostream/BaseMarshaller.html...
Generating /usr/src/RPM/BUILD/protostream-3.0.4.Final/target/site/apidocs/org/infinispan/protostream/BaseMessage.html...
Generating /usr/src/RPM/BUILD/protostream-3.0.4.Final/target/site/apidocs/org/infinispan/protostream/DescriptorParser.html...
Generating /usr/src/RPM/BUILD/protostream-3.0.4.Final/target/site/apidocs/org/infinispan/protostream/DescriptorParserException.html...
Generating /usr/src/RPM/BUILD/protostream-3.0.4.Final/target/site/apidocs/org/infinispan/protostream/EnumMarshaller.html...
Generating /usr/src/RPM/BUILD/protostream-3.0.4.Final/target/site/apidocs/org/infinispan/protostream/FileDescriptorSource.html...
Generating /usr/src/RPM/BUILD/protostream-3.0.4.Final/target/site/apidocs/org/infinispan/protostream/FileDescriptorSource.ProgressCallback.html...
Generating /usr/src/RPM/BUILD/protostream-3.0.4.Final/target/site/apidocs/org/infinispan/protostream/Message.html...
Generating /usr/src/RPM/BUILD/protostream-3.0.4.Final/target/site/apidocs/org/infinispan/protostream/MessageContext.html...
Generating /usr/src/RPM/BUILD/protostream-3.0.4.Final/target/site/apidocs/org/infinispan/protostream/MessageMarshaller.html...
Generating /usr/src/RPM/BUILD/protostream-3.0.4.Final/target/site/apidocs/org/infinispan/protostream/MessageMarshaller.ProtoStreamReader.html...
Generating /usr/src/RPM/BUILD/protostream-3.0.4.Final/target/site/apidocs/org/infinispan/protostream/MessageMarshaller.ProtoStreamWriter.html...
Generating /usr/src/RPM/BUILD/protostream-3.0.4.Final/target/site/apidocs/org/infinispan/protostream/ProtobufParser.html...
Generating /usr/src/RPM/BUILD/protostream-3.0.4.Final/target/site/apidocs/org/infinispan/protostream/ProtobufUtil.html...
Generating /usr/src/RPM/BUILD/protostream-3.0.4.Final/target/site/apidocs/org/infinispan/protostream/RawProtobufMarshaller.html...
Generating /usr/src/RPM/BUILD/protostream-3.0.4.Final/target/site/apidocs/org/infinispan/protostream/RawProtoStreamReader.html...
Generating /usr/src/RPM/BUILD/protostream-3.0.4.Final/target/site/apidocs/org/infinispan/protostream/RawProtoStreamWriter.html...
Generating /usr/src/RPM/BUILD/protostream-3.0.4.Final/target/site/apidocs/org/infinispan/protostream/SerializationContext.html...
Generating /usr/src/RPM/BUILD/protostream-3.0.4.Final/target/site/apidocs/org/infinispan/protostream/TagHandler.html...
Generating /usr/src/RPM/BUILD/protostream-3.0.4.Final/target/site/apidocs/org/infinispan/protostream/UnknownFieldSet.html...
Generating /usr/src/RPM/BUILD/protostream-3.0.4.Final/target/site/apidocs/org/infinispan/protostream/UnknownFieldSetHandler.html...
Generating /usr/src/RPM/BUILD/protostream-3.0.4.Final/target/site/apidocs/org/infinispan/protostream/WrappedMessage.html...
Generating /usr/src/RPM/BUILD/protostream-3.0.4.Final/target/site/apidocs/org/infinispan/protostream/WrappedMessage.Marshaller.html...
Generating /usr/src/RPM/BUILD/protostream-3.0.4.Final/target/site/apidocs/org/infinispan/protostream/impl/AnnotatedDescriptorImpl.html...
Generating /usr/src/RPM/BUILD/protostream-3.0.4.Final/target/site/apidocs/org/infinispan/protostream/impl/BaseMarshallerDelegate.html...
Generating /usr/src/RPM/BUILD/protostream-3.0.4.Final/target/site/apidocs/org/infinispan/protostream/impl/ByteArrayOutputStreamEx.html...
Generating /usr/src/RPM/BUILD/protostream-3.0.4.Final/target/site/apidocs/org/infinispan/protostream/impl/EnumMarshallerDelegate.html...
Generating /usr/src/RPM/BUILD/protostream-3.0.4.Final/target/site/apidocs/org/infinispan/protostream/impl/Log.html...
Generating /usr/src/RPM/BUILD/protostream-3.0.4.Final/target/site/apidocs/org/infinispan/protostream/impl/Log.LogFactory.html...
Generating /usr/src/RPM/BUILD/protostream-3.0.4.Final/target/site/apidocs/org/infinispan/protostream/impl/ProtocMessageMarshaller.html...
Generating /usr/src/RPM/BUILD/protostream-3.0.4.Final/target/site/apidocs/org/infinispan/protostream/impl/RawProtoStreamReaderImpl.html...
Generating /usr/src/RPM/BUILD/protostream-3.0.4.Final/target/site/apidocs/org/infinispan/protostream/impl/RawProtoStreamWriterImpl.html...
Generating /usr/src/RPM/BUILD/protostream-3.0.4.Final/target/site/apidocs/org/infinispan/protostream/impl/SerializationContextImpl.html...
Generating /usr/src/RPM/BUILD/protostream-3.0.4.Final/target/site/apidocs/org/infinispan/protostream/impl/WireFormat.html...
Generating /usr/src/RPM/BUILD/protostream-3.0.4.Final/target/site/apidocs/org/infinispan/protostream/impl/parser/AnnotationParser.html...
Generating /usr/src/RPM/BUILD/protostream-3.0.4.Final/target/site/apidocs/org/infinispan/protostream/impl/parser/SquareProtoParser.html...
Generating /usr/src/RPM/BUILD/protostream-3.0.4.Final/target/site/apidocs/org/infinispan/protostream/impl/parser/mappers/ProtofileMapper.html...
Generating /usr/src/RPM/BUILD/protostream-3.0.4.Final/target/site/apidocs/org/infinispan/protostream/descriptors/AnnotatedDescriptor.html...
Generating /usr/src/RPM/BUILD/protostream-3.0.4.Final/target/site/apidocs/org/infinispan/protostream/descriptors/AnnotationElement.html...
Generating /usr/src/RPM/BUILD/protostream-3.0.4.Final/target/site/apidocs/org/infinispan/protostream/descriptors/AnnotationElement.Annotation.html...
Generating /usr/src/RPM/BUILD/protostream-3.0.4.Final/target/site/apidocs/org/infinispan/protostream/descriptors/AnnotationElement.Array.html...
Generating /usr/src/RPM/BUILD/protostream-3.0.4.Final/target/site/apidocs/org/infinispan/protostream/descriptors/AnnotationElement.Attribute.html...
Generating /usr/src/RPM/BUILD/protostream-3.0.4.Final/target/site/apidocs/org/infinispan/protostream/descriptors/AnnotationElement.Identifier.html...
Generating /usr/src/RPM/BUILD/protostream-3.0.4.Final/target/site/apidocs/org/infinispan/protostream/descriptors/AnnotationElement.Literal.html...
Generating /usr/src/RPM/BUILD/protostream-3.0.4.Final/target/site/apidocs/org/infinispan/protostream/descriptors/AnnotationElement.Value.html...
Generating /usr/src/RPM/BUILD/protostream-3.0.4.Final/target/site/apidocs/org/infinispan/protostream/descriptors/AnnotationElement.Visitor.html...
Generating /usr/src/RPM/BUILD/protostream-3.0.4.Final/target/site/apidocs/org/infinispan/protostream/descriptors/Descriptor.html...
Generating /usr/src/RPM/BUILD/protostream-3.0.4.Final/target/site/apidocs/org/infinispan/protostream/descriptors/Descriptor.Builder.html...
Generating /usr/src/RPM/BUILD/protostream-3.0.4.Final/target/site/apidocs/org/infinispan/protostream/descriptors/EnumDescriptor.html...
Generating /usr/src/RPM/BUILD/protostream-3.0.4.Final/target/site/apidocs/org/infinispan/protostream/descriptors/EnumDescriptor.Builder.html...
Generating /usr/src/RPM/BUILD/protostream-3.0.4.Final/target/site/apidocs/org/infinispan/protostream/descriptors/EnumValueDescriptor.html...
Generating /usr/src/RPM/BUILD/protostream-3.0.4.Final/target/site/apidocs/org/infinispan/protostream/descriptors/EnumValueDescriptor.Builder.html...
Generating /usr/src/RPM/BUILD/protostream-3.0.4.Final/target/site/apidocs/org/infinispan/protostream/descriptors/ExtendDescriptor.html...
Generating /usr/src/RPM/BUILD/protostream-3.0.4.Final/target/site/apidocs/org/infinispan/protostream/descriptors/ExtendDescriptor.Builder.html...
Generating /usr/src/RPM/BUILD/protostream-3.0.4.Final/target/site/apidocs/org/infinispan/protostream/descriptors/FieldDescriptor.html...
Generating /usr/src/RPM/BUILD/protostream-3.0.4.Final/target/site/apidocs/org/infinispan/protostream/descriptors/FieldDescriptor.Builder.html...
Generating /usr/src/RPM/BUILD/protostream-3.0.4.Final/target/site/apidocs/org/infinispan/protostream/descriptors/FileDescriptor.html...
Generating /usr/src/RPM/BUILD/protostream-3.0.4.Final/target/site/apidocs/org/infinispan/protostream/descriptors/FileDescriptor.Builder.html...
Generating /usr/src/RPM/BUILD/protostream-3.0.4.Final/target/site/apidocs/org/infinispan/protostream/descriptors/GenericDescriptor.html...
Generating /usr/src/RPM/BUILD/protostream-3.0.4.Final/target/site/apidocs/org/infinispan/protostream/descriptors/JavaType.html...
Generating /usr/src/RPM/BUILD/protostream-3.0.4.Final/target/site/apidocs/org/infinispan/protostream/descriptors/Option.html...
Generating /usr/src/RPM/BUILD/protostream-3.0.4.Final/target/site/apidocs/org/infinispan/protostream/descriptors/Rule.html...
Generating /usr/src/RPM/BUILD/protostream-3.0.4.Final/target/site/apidocs/org/infinispan/protostream/descriptors/Type.html...
Generating /usr/src/RPM/BUILD/protostream-3.0.4.Final/target/site/apidocs/org/infinispan/protostream/config/AnnotationAttributeConfig.html...
Generating /usr/src/RPM/BUILD/protostream-3.0.4.Final/target/site/apidocs/org/infinispan/protostream/config/AnnotationAttributeConfig.AttributeType.html...
Generating /usr/src/RPM/BUILD/protostream-3.0.4.Final/target/site/apidocs/org/infinispan/protostream/config/AnnotationAttributeConfig.Builder.html...
Generating /usr/src/RPM/BUILD/protostream-3.0.4.Final/target/site/apidocs/org/infinispan/protostream/config/AnnotationConfig.html...
Generating /usr/src/RPM/BUILD/protostream-3.0.4.Final/target/site/apidocs/org/infinispan/protostream/config/AnnotationConfig.Builder.html...
Generating /usr/src/RPM/BUILD/protostream-3.0.4.Final/target/site/apidocs/org/infinispan/protostream/config/Configuration.html...
Generating /usr/src/RPM/BUILD/protostream-3.0.4.Final/target/site/apidocs/org/infinispan/protostream/config/Configuration.Builder.html...
Generating /usr/src/RPM/BUILD/protostream-3.0.4.Final/target/site/apidocs/org/infinispan/protostream/annotations/ProtoDoc.html...
Generating /usr/src/RPM/BUILD/protostream-3.0.4.Final/target/site/apidocs/org/infinispan/protostream/annotations/ProtoEnum.html...
Generating /usr/src/RPM/BUILD/protostream-3.0.4.Final/target/site/apidocs/org/infinispan/protostream/annotations/ProtoEnumValue.html...
Generating /usr/src/RPM/BUILD/protostream-3.0.4.Final/target/site/apidocs/org/infinispan/protostream/annotations/ProtoField.html...
Generating /usr/src/RPM/BUILD/protostream-3.0.4.Final/target/site/apidocs/org/infinispan/protostream/annotations/ProtoMessage.html...
Generating /usr/src/RPM/BUILD/protostream-3.0.4.Final/target/site/apidocs/org/infinispan/protostream/annotations/ProtoSchemaBuilder.html...
Generating /usr/src/RPM/BUILD/protostream-3.0.4.Final/target/site/apidocs/org/infinispan/protostream/annotations/ProtoSchemaBuilderException.html...
Generating /usr/src/RPM/BUILD/protostream-3.0.4.Final/target/site/apidocs/org/infinispan/protostream/annotations/ProtoUnknownFieldSet.html...
Generating /usr/src/RPM/BUILD/protostream-3.0.4.Final/target/site/apidocs/org/infinispan/protostream/annotations/impl/GeneratedMarshallerBase.html...
Generating /usr/src/RPM/BUILD/protostream-3.0.4.Final/target/site/apidocs/org/infinispan/protostream/annotations/impl/ProtoSchemaGenerator.html...
Generating /usr/src/RPM/BUILD/protostream-3.0.4.Final/target/site/apidocs/org/infinispan/protostream/sampledomain/marshallers/AccountMarshaller.html...
Generating /usr/src/RPM/BUILD/protostream-3.0.4.Final/target/site/apidocs/org/infinispan/protostream/sampledomain/marshallers/AddressMarshaller.html...
Generating /usr/src/RPM/BUILD/protostream-3.0.4.Final/target/site/apidocs/org/infinispan/protostream/sampledomain/marshallers/GenderMarshaller.html...
Generating /usr/src/RPM/BUILD/protostream-3.0.4.Final/target/site/apidocs/org/infinispan/protostream/sampledomain/marshallers/LimitsMarshaller.html...
Generating /usr/src/RPM/BUILD/protostream-3.0.4.Final/target/site/apidocs/org/infinispan/protostream/sampledomain/marshallers/MarshallerRegistration.html...
Generating /usr/src/RPM/BUILD/protostream-3.0.4.Final/target/site/apidocs/org/infinispan/protostream/sampledomain/marshallers/TransactionMarshaller.html...
Generating /usr/src/RPM/BUILD/protostream-3.0.4.Final/target/site/apidocs/org/infinispan/protostream/sampledomain/marshallers/UserMarshaller.html...
Generating /usr/src/RPM/BUILD/protostream-3.0.4.Final/target/site/apidocs/org/infinispan/protostream/sampledomain/Account.html...
Generating /usr/src/RPM/BUILD/protostream-3.0.4.Final/target/site/apidocs/org/infinispan/protostream/sampledomain/Account.Limits.html...
Generating /usr/src/RPM/BUILD/protostream-3.0.4.Final/target/site/apidocs/org/infinispan/protostream/sampledomain/Address.html...
Generating /usr/src/RPM/BUILD/protostream-3.0.4.Final/target/site/apidocs/org/infinispan/protostream/sampledomain/Note.html...
Generating /usr/src/RPM/BUILD/protostream-3.0.4.Final/target/site/apidocs/org/infinispan/protostream/sampledomain/Transaction.html...
Generating /usr/src/RPM/BUILD/protostream-3.0.4.Final/target/site/apidocs/org/infinispan/protostream/sampledomain/User.html...
Generating /usr/src/RPM/BUILD/protostream-3.0.4.Final/target/site/apidocs/org/infinispan/protostream/sampledomain/User.Gender.html...
Generating /usr/src/RPM/BUILD/protostream-3.0.4.Final/target/site/apidocs/overview-frame.html...
Generating /usr/src/RPM/BUILD/protostream-3.0.4.Final/target/site/apidocs/org/infinispan/protostream/package-frame.html...
Generating /usr/src/RPM/BUILD/protostream-3.0.4.Final/target/site/apidocs/org/infinispan/protostream/package-summary.html...
Generating /usr/src/RPM/BUILD/protostream-3.0.4.Final/target/site/apidocs/org/infinispan/protostream/package-tree.html...
Generating /usr/src/RPM/BUILD/protostream-3.0.4.Final/target/site/apidocs/org/infinispan/protostream/annotations/package-frame.html...
Generating /usr/src/RPM/BUILD/protostream-3.0.4.Final/target/site/apidocs/org/infinispan/protostream/annotations/package-summary.html...
Generating /usr/src/RPM/BUILD/protostream-3.0.4.Final/target/site/apidocs/org/infinispan/protostream/annotations/package-tree.html...
Generating /usr/src/RPM/BUILD/protostream-3.0.4.Final/target/site/apidocs/org/infinispan/protostream/annotations/impl/package-frame.html...
Generating /usr/src/RPM/BUILD/protostream-3.0.4.Final/target/site/apidocs/org/infinispan/protostream/annotations/impl/package-summary.html...
Generating /usr/src/RPM/BUILD/protostream-3.0.4.Final/target/site/apidocs/org/infinispan/protostream/annotations/impl/package-tree.html...
Generating /usr/src/RPM/BUILD/protostream-3.0.4.Final/target/site/apidocs/org/infinispan/protostream/config/package-frame.html...
Generating /usr/src/RPM/BUILD/protostream-3.0.4.Final/target/site/apidocs/org/infinispan/protostream/config/package-summary.html...
Generating /usr/src/RPM/BUILD/protostream-3.0.4.Final/target/site/apidocs/org/infinispan/protostream/config/package-tree.html...
Generating /usr/src/RPM/BUILD/protostream-3.0.4.Final/target/site/apidocs/org/infinispan/protostream/descriptors/package-frame.html...
Generating /usr/src/RPM/BUILD/protostream-3.0.4.Final/target/site/apidocs/org/infinispan/protostream/descriptors/package-summary.html...
Generating /usr/src/RPM/BUILD/protostream-3.0.4.Final/target/site/apidocs/org/infinispan/protostream/descriptors/package-tree.html...
Generating /usr/src/RPM/BUILD/protostream-3.0.4.Final/target/site/apidocs/org/infinispan/protostream/impl/package-frame.html...
Generating /usr/src/RPM/BUILD/protostream-3.0.4.Final/target/site/apidocs/org/infinispan/protostream/impl/package-summary.html...
Generating /usr/src/RPM/BUILD/protostream-3.0.4.Final/target/site/apidocs/org/infinispan/protostream/impl/package-tree.html...
Generating /usr/src/RPM/BUILD/protostream-3.0.4.Final/target/site/apidocs/org/infinispan/protostream/impl/parser/package-frame.html...
Generating /usr/src/RPM/BUILD/protostream-3.0.4.Final/target/site/apidocs/org/infinispan/protostream/impl/parser/package-summary.html...
Generating /usr/src/RPM/BUILD/protostream-3.0.4.Final/target/site/apidocs/org/infinispan/protostream/impl/parser/package-tree.html...
Generating /usr/src/RPM/BUILD/protostream-3.0.4.Final/target/site/apidocs/org/infinispan/protostream/impl/parser/mappers/package-frame.html...
Generating /usr/src/RPM/BUILD/protostream-3.0.4.Final/target/site/apidocs/org/infinispan/protostream/impl/parser/mappers/package-summary.html...
Generating /usr/src/RPM/BUILD/protostream-3.0.4.Final/target/site/apidocs/org/infinispan/protostream/impl/parser/mappers/package-tree.html...
Generating /usr/src/RPM/BUILD/protostream-3.0.4.Final/target/site/apidocs/org/infinispan/protostream/sampledomain/package-frame.html...
Generating /usr/src/RPM/BUILD/protostream-3.0.4.Final/target/site/apidocs/org/infinispan/protostream/sampledomain/package-summary.html...
Generating /usr/src/RPM/BUILD/protostream-3.0.4.Final/target/site/apidocs/org/infinispan/protostream/sampledomain/package-tree.html...
Generating /usr/src/RPM/BUILD/protostream-3.0.4.Final/target/site/apidocs/org/infinispan/protostream/sampledomain/marshallers/package-frame.html...
Generating /usr/src/RPM/BUILD/protostream-3.0.4.Final/target/site/apidocs/org/infinispan/protostream/sampledomain/marshallers/package-summary.html...
Generating /usr/src/RPM/BUILD/protostream-3.0.4.Final/target/site/apidocs/org/infinispan/protostream/sampledomain/marshallers/package-tree.html...
Generating /usr/src/RPM/BUILD/protostream-3.0.4.Final/target/site/apidocs/constant-values.html...
Generating /usr/src/RPM/BUILD/protostream-3.0.4.Final/target/site/apidocs/serialized-form.html...
Generating /usr/src/RPM/BUILD/protostream-3.0.4.Final/target/site/apidocs/org/infinispan/protostream/class-use/AnnotationParserException.html...
Generating /usr/src/RPM/BUILD/protostream-3.0.4.Final/target/site/apidocs/org/infinispan/protostream/class-use/FileDescriptorSource.html...
Generating /usr/src/RPM/BUILD/protostream-3.0.4.Final/target/site/apidocs/org/infinispan/protostream/class-use/FileDescriptorSource.ProgressCallback.html...
Generating /usr/src/RPM/BUILD/protostream-3.0.4.Final/target/site/apidocs/org/infinispan/protostream/class-use/DescriptorParserException.html...
Generating /usr/src/RPM/BUILD/protostream-3.0.4.Final/target/site/apidocs/org/infinispan/protostream/class-use/AnnotationMetadataCreator.html...
Generating /usr/src/RPM/BUILD/protostream-3.0.4.Final/target/site/apidocs/org/infinispan/protostream/class-use/MessageMarshaller.html...
Generating /usr/src/RPM/BUILD/protostream-3.0.4.Final/target/site/apidocs/org/infinispan/protostream/class-use/MessageMarshaller.ProtoStreamReader.html...
Generating /usr/src/RPM/BUILD/protostream-3.0.4.Final/target/site/apidocs/org/infinispan/protostream/class-use/MessageMarshaller.ProtoStreamWriter.html...
Generating /usr/src/RPM/BUILD/protostream-3.0.4.Final/target/site/apidocs/org/infinispan/protostream/class-use/BaseMarshaller.html...
Generating /usr/src/RPM/BUILD/protostream-3.0.4.Final/target/site/apidocs/org/infinispan/protostream/class-use/SerializationContext.html...
Generating /usr/src/RPM/BUILD/protostream-3.0.4.Final/target/site/apidocs/org/infinispan/protostream/class-use/MessageContext.html...
Generating /usr/src/RPM/BUILD/protostream-3.0.4.Final/target/site/apidocs/org/infinispan/protostream/class-use/RawProtoStreamReader.html...
Generating /usr/src/RPM/BUILD/protostream-3.0.4.Final/target/site/apidocs/org/infinispan/protostream/class-use/UnknownFieldSet.html...
Generating /usr/src/RPM/BUILD/protostream-3.0.4.Final/target/site/apidocs/org/infinispan/protostream/class-use/DescriptorParser.html...
Generating /usr/src/RPM/BUILD/protostream-3.0.4.Final/target/site/apidocs/org/infinispan/protostream/class-use/RawProtoStreamWriter.html...
Generating /usr/src/RPM/BUILD/protostream-3.0.4.Final/target/site/apidocs/org/infinispan/protostream/class-use/WrappedMessage.html...
Generating /usr/src/RPM/BUILD/protostream-3.0.4.Final/target/site/apidocs/org/infinispan/protostream/class-use/WrappedMessage.Marshaller.html...
Generating /usr/src/RPM/BUILD/protostream-3.0.4.Final/target/site/apidocs/org/infinispan/protostream/class-use/RawProtobufMarshaller.html...
Generating /usr/src/RPM/BUILD/protostream-3.0.4.Final/target/site/apidocs/org/infinispan/protostream/class-use/EnumMarshaller.html...
Generating /usr/src/RPM/BUILD/protostream-3.0.4.Final/target/site/apidocs/org/infinispan/protostream/class-use/BaseMessage.html...
Generating /usr/src/RPM/BUILD/protostream-3.0.4.Final/target/site/apidocs/org/infinispan/protostream/class-use/Message.html...
Generating /usr/src/RPM/BUILD/protostream-3.0.4.Final/target/site/apidocs/org/infinispan/protostream/class-use/ProtobufParser.html...
Generating /usr/src/RPM/BUILD/protostream-3.0.4.Final/target/site/apidocs/org/infinispan/protostream/class-use/TagHandler.html...
Generating /usr/src/RPM/BUILD/protostream-3.0.4.Final/target/site/apidocs/org/infinispan/protostream/class-use/ProtobufUtil.html...
Generating /usr/src/RPM/BUILD/protostream-3.0.4.Final/target/site/apidocs/org/infinispan/protostream/class-use/UnknownFieldSetHandler.html...
Generating /usr/src/RPM/BUILD/protostream-3.0.4.Final/target/site/apidocs/org/infinispan/protostream/impl/class-use/WireFormat.html...
Generating /usr/src/RPM/BUILD/protostream-3.0.4.Final/target/site/apidocs/org/infinispan/protostream/impl/class-use/AnnotatedDescriptorImpl.html...
Generating /usr/src/RPM/BUILD/protostream-3.0.4.Final/target/site/apidocs/org/infinispan/protostream/impl/class-use/Log.html...
Generating /usr/src/RPM/BUILD/protostream-3.0.4.Final/target/site/apidocs/org/infinispan/protostream/impl/class-use/Log.LogFactory.html...
Generating /usr/src/RPM/BUILD/protostream-3.0.4.Final/target/site/apidocs/org/infinispan/protostream/impl/class-use/SerializationContextImpl.html...
Generating /usr/src/RPM/BUILD/protostream-3.0.4.Final/target/site/apidocs/org/infinispan/protostream/impl/class-use/BaseMarshallerDelegate.html...
Generating /usr/src/RPM/BUILD/protostream-3.0.4.Final/target/site/apidocs/org/infinispan/protostream/impl/class-use/RawProtoStreamWriterImpl.html...
Generating /usr/src/RPM/BUILD/protostream-3.0.4.Final/target/site/apidocs/org/infinispan/protostream/impl/class-use/ProtocMessageMarshaller.html...
Generating /usr/src/RPM/BUILD/protostream-3.0.4.Final/target/site/apidocs/org/infinispan/protostream/impl/class-use/ByteArrayOutputStreamEx.html...
Generating /usr/src/RPM/BUILD/protostream-3.0.4.Final/target/site/apidocs/org/infinispan/protostream/impl/class-use/RawProtoStreamReaderImpl.html...
Generating /usr/src/RPM/BUILD/protostream-3.0.4.Final/target/site/apidocs/org/infinispan/protostream/impl/class-use/EnumMarshallerDelegate.html...
Generating /usr/src/RPM/BUILD/protostream-3.0.4.Final/target/site/apidocs/org/infinispan/protostream/impl/parser/class-use/AnnotationParser.html...
Generating /usr/src/RPM/BUILD/protostream-3.0.4.Final/target/site/apidocs/org/infinispan/protostream/impl/parser/class-use/SquareProtoParser.html...
Generating /usr/src/RPM/BUILD/protostream-3.0.4.Final/target/site/apidocs/org/infinispan/protostream/impl/parser/mappers/class-use/ProtofileMapper.html...
Generating /usr/src/RPM/BUILD/protostream-3.0.4.Final/target/site/apidocs/org/infinispan/protostream/descriptors/class-use/Type.html...
Generating /usr/src/RPM/BUILD/protostream-3.0.4.Final/target/site/apidocs/org/infinispan/protostream/descriptors/class-use/JavaType.html...
Generating /usr/src/RPM/BUILD/protostream-3.0.4.Final/target/site/apidocs/org/infinispan/protostream/descriptors/class-use/ExtendDescriptor.html...
Generating /usr/src/RPM/BUILD/protostream-3.0.4.Final/target/site/apidocs/org/infinispan/protostream/descriptors/class-use/ExtendDescriptor.Builder.html...
Generating /usr/src/RPM/BUILD/protostream-3.0.4.Final/target/site/apidocs/org/infinispan/protostream/descriptors/class-use/FieldDescriptor.html...
Generating /usr/src/RPM/BUILD/protostream-3.0.4.Final/target/site/apidocs/org/infinispan/protostream/descriptors/class-use/FieldDescriptor.Builder.html...
Generating /usr/src/RPM/BUILD/protostream-3.0.4.Final/target/site/apidocs/org/infinispan/protostream/descriptors/class-use/AnnotatedDescriptor.html...
Generating /usr/src/RPM/BUILD/protostream-3.0.4.Final/target/site/apidocs/org/infinispan/protostream/descriptors/class-use/EnumDescriptor.html...
Generating /usr/src/RPM/BUILD/protostream-3.0.4.Final/target/site/apidocs/org/infinispan/protostream/descriptors/class-use/EnumDescriptor.Builder.html...
Generating /usr/src/RPM/BUILD/protostream-3.0.4.Final/target/site/apidocs/org/infinispan/protostream/descriptors/class-use/GenericDescriptor.html...
Generating /usr/src/RPM/BUILD/protostream-3.0.4.Final/target/site/apidocs/org/infinispan/protostream/descriptors/class-use/EnumValueDescriptor.html...
Generating /usr/src/RPM/BUILD/protostream-3.0.4.Final/target/site/apidocs/org/infinispan/protostream/descriptors/class-use/EnumValueDescriptor.Builder.html...
Generating /usr/src/RPM/BUILD/protostream-3.0.4.Final/target/site/apidocs/org/infinispan/protostream/descriptors/class-use/Descriptor.html...
Generating /usr/src/RPM/BUILD/protostream-3.0.4.Final/target/site/apidocs/org/infinispan/protostream/descriptors/class-use/Descriptor.Builder.html...
Generating /usr/src/RPM/BUILD/protostream-3.0.4.Final/target/site/apidocs/org/infinispan/protostream/descriptors/class-use/Option.html...
Generating /usr/src/RPM/BUILD/protostream-3.0.4.Final/target/site/apidocs/org/infinispan/protostream/descriptors/class-use/FileDescriptor.html...
Generating /usr/src/RPM/BUILD/protostream-3.0.4.Final/target/site/apidocs/org/infinispan/protostream/descriptors/class-use/FileDescriptor.Builder.html...
Generating /usr/src/RPM/BUILD/protostream-3.0.4.Final/target/site/apidocs/org/infinispan/protostream/descriptors/class-use/Rule.html...
Generating /usr/src/RPM/BUILD/protostream-3.0.4.Final/target/site/apidocs/org/infinispan/protostream/descriptors/class-use/AnnotationElement.html...
Generating /usr/src/RPM/BUILD/protostream-3.0.4.Final/target/site/apidocs/org/infinispan/protostream/descriptors/class-use/AnnotationElement.Value.html...
Generating /usr/src/RPM/BUILD/protostream-3.0.4.Final/target/site/apidocs/org/infinispan/protostream/descriptors/class-use/AnnotationElement.Annotation.html...
Generating /usr/src/RPM/BUILD/protostream-3.0.4.Final/target/site/apidocs/org/infinispan/protostream/descriptors/class-use/AnnotationElement.Attribute.html...
Generating /usr/src/RPM/BUILD/protostream-3.0.4.Final/target/site/apidocs/org/infinispan/protostream/descriptors/class-use/AnnotationElement.Identifier.html...
Generating /usr/src/RPM/BUILD/protostream-3.0.4.Final/target/site/apidocs/org/infinispan/protostream/descriptors/class-use/AnnotationElement.Array.html...
Generating /usr/src/RPM/BUILD/protostream-3.0.4.Final/target/site/apidocs/org/infinispan/protostream/descriptors/class-use/AnnotationElement.Literal.html...
Generating /usr/src/RPM/BUILD/protostream-3.0.4.Final/target/site/apidocs/org/infinispan/protostream/descriptors/class-use/AnnotationElement.Visitor.html...
Generating /usr/src/RPM/BUILD/protostream-3.0.4.Final/target/site/apidocs/org/infinispan/protostream/config/class-use/AnnotationConfig.html...
Generating /usr/src/RPM/BUILD/protostream-3.0.4.Final/target/site/apidocs/org/infinispan/protostream/config/class-use/AnnotationConfig.Builder.html...
Generating /usr/src/RPM/BUILD/protostream-3.0.4.Final/target/site/apidocs/org/infinispan/protostream/config/class-use/AnnotationAttributeConfig.html...
Generating /usr/src/RPM/BUILD/protostream-3.0.4.Final/target/site/apidocs/org/infinispan/protostream/config/class-use/AnnotationAttributeConfig.AttributeType.html...
Generating /usr/src/RPM/BUILD/protostream-3.0.4.Final/target/site/apidocs/org/infinispan/protostream/config/class-use/AnnotationAttributeConfig.Builder.html...
Generating /usr/src/RPM/BUILD/protostream-3.0.4.Final/target/site/apidocs/org/infinispan/protostream/config/class-use/Configuration.html...
Generating /usr/src/RPM/BUILD/protostream-3.0.4.Final/target/site/apidocs/org/infinispan/protostream/config/class-use/Configuration.Builder.html...
Generating /usr/src/RPM/BUILD/protostream-3.0.4.Final/target/site/apidocs/org/infinispan/protostream/annotations/class-use/ProtoSchemaBuilderException.html...
Generating /usr/src/RPM/BUILD/protostream-3.0.4.Final/target/site/apidocs/org/infinispan/protostream/annotations/class-use/ProtoField.html...
Generating /usr/src/RPM/BUILD/protostream-3.0.4.Final/target/site/apidocs/org/infinispan/protostream/annotations/class-use/ProtoMessage.html...
Generating /usr/src/RPM/BUILD/protostream-3.0.4.Final/target/site/apidocs/org/infinispan/protostream/annotations/class-use/ProtoUnknownFieldSet.html...
Generating /usr/src/RPM/BUILD/protostream-3.0.4.Final/target/site/apidocs/org/infinispan/protostream/annotations/class-use/ProtoEnum.html...
Generating /usr/src/RPM/BUILD/protostream-3.0.4.Final/target/site/apidocs/org/infinispan/protostream/annotations/class-use/ProtoDoc.html...
Generating /usr/src/RPM/BUILD/protostream-3.0.4.Final/target/site/apidocs/org/infinispan/protostream/annotations/class-use/ProtoEnumValue.html...
Generating /usr/src/RPM/BUILD/protostream-3.0.4.Final/target/site/apidocs/org/infinispan/protostream/annotations/class-use/ProtoSchemaBuilder.html...
Generating /usr/src/RPM/BUILD/protostream-3.0.4.Final/target/site/apidocs/org/infinispan/protostream/annotations/impl/class-use/ProtoSchemaGenerator.html...
Generating /usr/src/RPM/BUILD/protostream-3.0.4.Final/target/site/apidocs/org/infinispan/protostream/annotations/impl/class-use/GeneratedMarshallerBase.html...
Generating /usr/src/RPM/BUILD/protostream-3.0.4.Final/target/site/apidocs/org/infinispan/protostream/sampledomain/marshallers/class-use/MarshallerRegistration.html...
Generating /usr/src/RPM/BUILD/protostream-3.0.4.Final/target/site/apidocs/org/infinispan/protostream/sampledomain/marshallers/class-use/GenderMarshaller.html...
Generating /usr/src/RPM/BUILD/protostream-3.0.4.Final/target/site/apidocs/org/infinispan/protostream/sampledomain/marshallers/class-use/AccountMarshaller.html...
Generating /usr/src/RPM/BUILD/protostream-3.0.4.Final/target/site/apidocs/org/infinispan/protostream/sampledomain/marshallers/class-use/TransactionMarshaller.html...
Generating /usr/src/RPM/BUILD/protostream-3.0.4.Final/target/site/apidocs/org/infinispan/protostream/sampledomain/marshallers/class-use/LimitsMarshaller.html...
Generating /usr/src/RPM/BUILD/protostream-3.0.4.Final/target/site/apidocs/org/infinispan/protostream/sampledomain/marshallers/class-use/UserMarshaller.html...
Generating /usr/src/RPM/BUILD/protostream-3.0.4.Final/target/site/apidocs/org/infinispan/protostream/sampledomain/marshallers/class-use/AddressMarshaller.html...
Generating /usr/src/RPM/BUILD/protostream-3.0.4.Final/target/site/apidocs/org/infinispan/protostream/sampledomain/class-use/User.html...
Generating /usr/src/RPM/BUILD/protostream-3.0.4.Final/target/site/apidocs/org/infinispan/protostream/sampledomain/class-use/User.Gender.html...
Generating /usr/src/RPM/BUILD/protostream-3.0.4.Final/target/site/apidocs/org/infinispan/protostream/sampledomain/class-use/Address.html...
Generating /usr/src/RPM/BUILD/protostream-3.0.4.Final/target/site/apidocs/org/infinispan/protostream/sampledomain/class-use/Note.html...
Generating /usr/src/RPM/BUILD/protostream-3.0.4.Final/target/site/apidocs/org/infinispan/protostream/sampledomain/class-use/Account.html...
Generating /usr/src/RPM/BUILD/protostream-3.0.4.Final/target/site/apidocs/org/infinispan/protostream/sampledomain/class-use/Account.Limits.html...
Generating /usr/src/RPM/BUILD/protostream-3.0.4.Final/target/site/apidocs/org/infinispan/protostream/sampledomain/class-use/Transaction.html...
Generating /usr/src/RPM/BUILD/protostream-3.0.4.Final/target/site/apidocs/org/infinispan/protostream/package-use.html...
Generating /usr/src/RPM/BUILD/protostream-3.0.4.Final/target/site/apidocs/org/infinispan/protostream/annotations/package-use.html...
Generating /usr/src/RPM/BUILD/protostream-3.0.4.Final/target/site/apidocs/org/infinispan/protostream/annotations/impl/package-use.html...
Generating /usr/src/RPM/BUILD/protostream-3.0.4.Final/target/site/apidocs/org/infinispan/protostream/config/package-use.html...
Generating /usr/src/RPM/BUILD/protostream-3.0.4.Final/target/site/apidocs/org/infinispan/protostream/descriptors/package-use.html...
Generating /usr/src/RPM/BUILD/protostream-3.0.4.Final/target/site/apidocs/org/infinispan/protostream/impl/package-use.html...
Generating /usr/src/RPM/BUILD/protostream-3.0.4.Final/target/site/apidocs/org/infinispan/protostream/impl/parser/package-use.html...
Generating /usr/src/RPM/BUILD/protostream-3.0.4.Final/target/site/apidocs/org/infinispan/protostream/impl/parser/mappers/package-use.html...
Generating /usr/src/RPM/BUILD/protostream-3.0.4.Final/target/site/apidocs/org/infinispan/protostream/sampledomain/package-use.html...
Generating /usr/src/RPM/BUILD/protostream-3.0.4.Final/target/site/apidocs/org/infinispan/protostream/sampledomain/marshallers/package-use.html...
Building index for all the packages and classes...
Generating /usr/src/RPM/BUILD/protostream-3.0.4.Final/target/site/apidocs/overview-tree.html...
Generating /usr/src/RPM/BUILD/protostream-3.0.4.Final/target/site/apidocs/index-all.html...
Generating /usr/src/RPM/BUILD/protostream-3.0.4.Final/target/site/apidocs/deprecated-list.html...
Building index for all classes...
Generating /usr/src/RPM/BUILD/protostream-3.0.4.Final/target/site/apidocs/allclasses-frame.html...
Generating /usr/src/RPM/BUILD/protostream-3.0.4.Final/target/site/apidocs/allclasses-noframe.html...
Generating /usr/src/RPM/BUILD/protostream-3.0.4.Final/target/site/apidocs/index.html...
Generating /usr/src/RPM/BUILD/protostream-3.0.4.Final/target/site/apidocs/overview-summary.html...
Generating /usr/src/RPM/BUILD/protostream-3.0.4.Final/target/site/apidocs/help-doc.html...
2 warnings
[WARNING] Javadoc Warnings
[WARNING] /usr/src/RPM/BUILD/protostream-3.0.4.Final/core/src/main/java/org/infinispan/protostream/ProtobufUtil.java:97: warning - @return tag has no arguments.
[WARNING] /usr/src/RPM/BUILD/protostream-3.0.4.Final/core/src/main/java/org/infinispan/protostream/descriptors/AnnotatedDescriptor.java:38: warning - @return tag has no arguments.
[INFO]
[INFO] --- xmvn-mojo:3.0.0:builddep (default-cli) @ protostream-aggregator ---
[INFO] ------------------------------------------------------------------------
[INFO] Reactor Summary:
[INFO]
[INFO] Parent for all ProtoStream modules ................. SUCCESS [ 0.013 s]
[INFO] Sample domain model definitions in proto file ...... SUCCESS [ 1.641 s]
[INFO] ProtoStream - core ................................. SUCCESS [ 21.639 s]
[INFO] Sample domain model implementation, including marshallers SUCCESS [ 1.500 s]
[INFO] Aggregator module for the ProtoStream project 3.0.4.Final SUCCESS [ 18.900 s]
[INFO] ------------------------------------------------------------------------
[INFO] BUILD SUCCESS
[INFO] ------------------------------------------------------------------------
[INFO] Total time: 54.319 s
[INFO] Finished at: 2020-02-23T13:17:13Z
[INFO] ------------------------------------------------------------------------
-----BEGIN MAVEN BUILD DEPENDENCIES-----
H4sIAAAAAAACA8WVwW7bMAyG730KLXcq67Cjm2LbKYedigG7yjajyJBFjZSM9u0nN8maXJQtLrCb
Rf7gx58g4ebxefRqQhZH4WF1rz+uFIaOehfsw+rHE3x5+rbdrh43d80HAPU1O9+rHiOGvsgcirIY
kE3CXrUv6uf3KSiAoj7XbO6Uegu8zM8SsEw5bvsNsdUmmm6PeofePTfrU+agM5zcznSpBEYzYYA2
h94jRJ+tC836LD9z1pegOrcYxb3JokcaqAJuZ9+wRx+R4dDFe+CPtl8L6kNBuWpfMuPOMQJjJE6L
G/FkPw8V6jF/Wb5Ijkuzuf/UrE/f/zyBoSURXRDFgq008aqDP7olQ78JCZGpQxHi2+EdjdoSWY+6
VEvU5l0Ff5LAYCazDCq/smHM8RotGhbkhdMt3Yo4SbXJvmkW2BopCHTeVUAXqkWHKmUwqXYlRwV0
xHg7a8jBVSd3yN9aPmDSQ+dqizCnwYRAyaRy0fIetzaWvdob7//m3i60/w0N7KZrl3D2mv9xvwHS
NwQlSgcAAA==
-----END MAVEN BUILD DEPENDENCIES-----
+ exit 0
Executing(%install): /bin/sh -e /usr/src/tmp/rpm-tmp.11953
+ umask 022
+ /bin/mkdir -p /usr/src/RPM/BUILD
+ cd /usr/src/RPM/BUILD
+ /bin/chmod -Rf u+rwX -- /usr/src/tmp/protostream-buildroot
+ :
+ /bin/rm -rf -- /usr/src/tmp/protostream-buildroot
+ cd protostream-3.0.4.Final
+ xmvn-install -R .xmvn-reactor -n protostream -d /usr/src/tmp/protostream-buildroot
[INFO] Installing artifact org.infinispan.protostream:parent:pom:3.0.4.Final
[INFO] Installing artifact org.infinispan.protostream:sample-domain-definition:jar:3.0.4.Final
[INFO] Installing artifact org.infinispan.protostream:sample-domain-definition:pom:3.0.4.Final
[INFO] Installing artifact org.infinispan.protostream:protostream:jar:3.0.4.Final
[INFO] Installing artifact org.infinispan.protostream:protostream:pom:3.0.4.Final
[INFO] Installing artifact org.infinispan.protostream:sample-domain-implementation:jar:3.0.4.Final
[INFO] Installing artifact org.infinispan.protostream:sample-domain-implementation:pom:3.0.4.Final
[INFO] Installing artifact org.infinispan.protostream:protostream-aggregator:pom:3.0.4.Final
[INFO] Installation successful
+ jdir=target/site/apidocs
+ '[' -d .xmvn/apidocs ']'
+ jdir=.xmvn/apidocs
+ /bin/mkdir -p /usr/src/tmp/protostream-buildroot/usr/share/license
+ '[' -d .xmvn/apidocs ']'
+ install -dm755 /usr/src/tmp/protostream-buildroot/usr/share/javadoc/protostream
+ cp -pr .xmvn/apidocs/allclasses-frame.html .xmvn/apidocs/allclasses-noframe.html .xmvn/apidocs/constant-values.html .xmvn/apidocs/deprecated-list.html .xmvn/apidocs/help-doc.html .xmvn/apidocs/index-all.html .xmvn/apidocs/index.html .xmvn/apidocs/org .xmvn/apidocs/overview-frame.html .xmvn/apidocs/overview-summary.html .xmvn/apidocs/overview-tree.html .xmvn/apidocs/package-list .xmvn/apidocs/script.js .xmvn/apidocs/serialized-form.html .xmvn/apidocs/stylesheet.css /usr/src/tmp/protostream-buildroot/usr/share/javadoc/protostream
+ echo /usr/share/javadoc/protostream
+ /usr/lib/rpm/brp-alt
Cleaning files in /usr/src/tmp/protostream-buildroot (auto)
Verifying and fixing files in /usr/src/tmp/protostream-buildroot (binconfig,pkgconfig,libtool,desktop)
Checking contents of files in /usr/src/tmp/protostream-buildroot/ (default)
Compressing files in /usr/src/tmp/protostream-buildroot (auto)
Verifying ELF objects in /usr/src/tmp/protostream-buildroot (arch=normal,fhs=normal,lfs=relaxed,lint=relaxed,rpath=normal,stack=normal,textrel=normal,unresolved=normal)
Hardlinking identical .pyc and .pyo files
Processing files: protostream-3.0.4-alt1_5jpp8
Executing(%doc): /bin/sh -e /usr/src/tmp/rpm-tmp.79914
+ umask 022
+ /bin/mkdir -p /usr/src/RPM/BUILD
+ cd /usr/src/RPM/BUILD
+ cd protostream-3.0.4.Final
+ DOCDIR=/usr/src/tmp/protostream-buildroot/usr/share/doc/protostream-3.0.4
+ export DOCDIR
+ rm -rf /usr/src/tmp/protostream-buildroot/usr/share/doc/protostream-3.0.4
+ /bin/mkdir -p /usr/src/tmp/protostream-buildroot/usr/share/doc/protostream-3.0.4
+ cp -prL README.md /usr/src/tmp/protostream-buildroot/usr/share/doc/protostream-3.0.4
+ chmod -R go-w /usr/src/tmp/protostream-buildroot/usr/share/doc/protostream-3.0.4
+ chmod -R a+rX /usr/src/tmp/protostream-buildroot/usr/share/doc/protostream-3.0.4
+ cp -prL --no-dereference LICENSE PROTOPARSER_LICENSE.txt /usr/src/tmp/protostream-buildroot/usr/share/doc/protostream-3.0.4
+ chmod -R go-w /usr/src/tmp/protostream-buildroot/usr/share/doc/protostream-3.0.4
+ chmod -R a+rX /usr/src/tmp/protostream-buildroot/usr/share/doc/protostream-3.0.4
+ exit 0
Finding Provides (using /usr/lib/rpm/find-provides)
Executing: /bin/sh -e /usr/src/tmp/rpm-tmp.JqSQHY
find-provides: running scripts (alternatives,debuginfo,lib,maven,osgi-fc,pam,perl,pkgconfig,python,shell)
[INFO maven.prov] input: ['/usr/src/tmp/protostream-buildroot/usr/share/maven-metadata/protostream.xml']
[INFO maven.prov] mvn(org.infinispan.protostream:protostream:pom:) = 3.0.4.Final, mvn(org.infinispan.protostream:protostream) = 3.0.4.Final, mvn(org.infinispan.protostream:sample-domain-implementation) = 3.0.4.Final, mvn(org.infinispan.protostream:protostream-aggregator:pom:) = 3.0.4.Final, mvn(org.infinispan.protostream:sample-domain-implementation:pom:) = 3.0.4.Final, mvn(org.infinispan.protostream:sample-domain-definition:pom:) = 3.0.4.Final, mvn(org.infinispan.protostream:sample-domain-definition) = 3.0.4.Final, mvn(org.infinispan.protostream:parent:pom:) = 3.0.4.Final
[INFO osgi.prov] input: ['/usr/src/tmp/protostream-buildroot/usr/share/java/protostream/protostream.jar', '/usr/src/tmp/protostream-buildroot/usr/share/java/protostream/sample-domain-definition.jar', '/usr/src/tmp/protostream-buildroot/usr/share/java/protostream/sample-domain-implementation.jar']
[INFO osgi.prov] osgi(org.infinispan.protostream) = 3.0.4, osgi(org.infinispan.protostream.sample-domain-definition) = 3.0.4, osgi(org.infinispan.protostream.sample-domain-implementation) = 3.0.4
Finding Requires (using /usr/lib/rpm/find-requires)
Executing: /bin/sh -e /usr/src/tmp/rpm-tmp.qwWy0Y
find-requires: running scripts (cpp,debuginfo,files,javadoc,lib,maven,osgi-fc,pam,perl,pkgconfig,pkgconfiglib,python,rpmlib,shebang,shell,static,symlinks)
[INFO maven.req] input: ['/usr/src/tmp/protostream-buildroot/usr/share/maven-metadata/protostream.xml']
[INFO maven.req] mvn(commons-cli:commons-cli), mvn(org.jboss.logging:jboss-logging), javapackages-tools, mvn(com.google.protobuf:protobuf-java), mvn(com.squareup:protoparser)
[INFO osgi.req] input: ['/usr/src/tmp/protostream-buildroot/usr/share/java/protostream/protostream.jar', '/usr/src/tmp/protostream-buildroot/usr/share/java/protostream/sample-domain-definition.jar', '/usr/src/tmp/protostream-buildroot/usr/share/java/protostream/sample-domain-implementation.jar']
Provides: mvn(org.infinispan.protostream:parent:pom:) = 3.0.4.Final, mvn(org.infinispan.protostream:protostream) = 3.0.4.Final, mvn(org.infinispan.protostream:protostream-aggregator:pom:) = 3.0.4.Final, mvn(org.infinispan.protostream:protostream:pom:) = 3.0.4.Final, mvn(org.infinispan.protostream:sample-domain-definition) = 3.0.4.Final, mvn(org.infinispan.protostream:sample-domain-definition:pom:) = 3.0.4.Final, mvn(org.infinispan.protostream:sample-domain-implementation) = 3.0.4.Final, mvn(org.infinispan.protostream:sample-domain-implementation:pom:) = 3.0.4.Final, osgi(org.infinispan.protostream) = 3.0.4, osgi(org.infinispan.protostream.sample-domain-definition) = 3.0.4, osgi(org.infinispan.protostream.sample-domain-implementation) = 3.0.4
Requires: javapackages-tools, mvn(com.google.protobuf:protobuf-java), mvn(com.squareup:protoparser), mvn(commons-cli:commons-cli), mvn(org.jboss.logging:jboss-logging)
Processing files: protostream-javadoc-3.0.4-alt1_5jpp8
Executing(%doc): /bin/sh -e /usr/src/tmp/rpm-tmp.93071
+ umask 022
+ /bin/mkdir -p /usr/src/RPM/BUILD
+ cd /usr/src/RPM/BUILD
+ cd protostream-3.0.4.Final
+ DOCDIR=/usr/src/tmp/protostream-buildroot/usr/share/doc/protostream-javadoc-3.0.4
+ export DOCDIR
+ rm -rf /usr/src/tmp/protostream-buildroot/usr/share/doc/protostream-javadoc-3.0.4
+ /bin/mkdir -p /usr/src/tmp/protostream-buildroot/usr/share/doc/protostream-javadoc-3.0.4
+ cp -prL --no-dereference LICENSE PROTOPARSER_LICENSE.txt /usr/src/tmp/protostream-buildroot/usr/share/doc/protostream-javadoc-3.0.4
+ chmod -R go-w /usr/src/tmp/protostream-buildroot/usr/share/doc/protostream-javadoc-3.0.4
+ chmod -R a+rX /usr/src/tmp/protostream-buildroot/usr/share/doc/protostream-javadoc-3.0.4
+ exit 0
Finding Provides (using /usr/lib/rpm/find-provides)
Executing: /bin/sh -e /usr/src/tmp/rpm-tmp.mdZyUS
find-provides: running scripts (alternatives,debuginfo,lib,maven,osgi-fc,pam,perl,pkgconfig,python,shell)
Finding Requires (using /usr/lib/rpm/find-requires)
Executing: /bin/sh -e /usr/src/tmp/rpm-tmp.AaHIzV
find-requires: running scripts (cpp,debuginfo,files,javadoc,lib,maven,osgi-fc,pam,perl,pkgconfig,pkgconfiglib,python,rpmlib,shebang,shell,static,symlinks)
Requires: javapackages-tools
Wrote: /usr/src/RPM/RPMS/noarch/protostream-3.0.4-alt1_5jpp8.noarch.rpm
Wrote: /usr/src/RPM/RPMS/noarch/protostream-javadoc-3.0.4-alt1_5jpp8.noarch.rpm
66.61user 1.93system 1:14.22elapsed 92%CPU (0avgtext+0avgdata 503344maxresident)k
0inputs+0outputs (0major+291629minor)pagefaults 0swaps
93.97user 6.63system 1:59.67elapsed 84%CPU (0avgtext+0avgdata 503344maxresident)k
0inputs+0outputs (0major+891352minor)pagefaults 0swaps