86>Jan 26 13:20:00 userdel[3508035]: delete user 'rooter'
<86>Jan 26 13:20:00 userdel[3508035]: removed group 'rooter' owned by 'rooter'
<86>Jan 26 13:20:00 userdel[3508035]: removed shadow group 'rooter' owned by 'rooter'
<86>Jan 26 13:20:00 groupadd[3508053]: group added to /etc/group: name=rooter, GID=573
<86>Jan 26 13:20:00 groupadd[3508053]: group added to /etc/gshadow: name=rooter
<86>Jan 26 13:20:00 groupadd[3508053]: new group: name=rooter, GID=573
<86>Jan 26 13:20:00 useradd[3508064]: new user: name=rooter, UID=573, GID=573, home=/root, shell=/bin/bash
<86>Jan 26 13:20:00 userdel[3508091]: delete user 'builder'
<86>Jan 26 13:20:00 userdel[3508091]: removed group 'builder' owned by 'builder'
<86>Jan 26 13:20:00 userdel[3508091]: removed shadow group 'builder' owned by 'builder'
<86>Jan 26 13:20:00 groupadd[3508107]: group added to /etc/group: name=builder, GID=574
<86>Jan 26 13:20:00 groupadd[3508107]: group added to /etc/gshadow: name=builder
<86>Jan 26 13:20:00 groupadd[3508107]: new group: name=builder, GID=574
<86>Jan 26 13:20:00 useradd[3508119]: new user: name=builder, UID=574, GID=574, home=/usr/src, shell=/bin/bash
warning: user igor does not exist - using root
warning: group igor does not exist - using root
warning: user igor does not exist - using root
warning: group igor does not exist - using root
warning: user igor does not exist - using root
warning: group igor does not exist - using root
warning: user igor does not exist - using root
warning: group igor does not exist - using root
warning: user igor does not exist - using root
warning: group igor does not exist - using root
warning: user igor does not exist - using root
warning: group igor does not exist - using root
warning: user igor does not exist - using root
warning: group igor does not exist - using root
warning: user igor does not exist - using root
warning: group igor does not exist - using root
<13>Jan 26 13:20:03 rpmi: rpm-macros-java-1:5.0.0-alt1_12jpp8 sisyphus+228348.2100.3.3 1556657006 installed
<13>Jan 26 13:20:09 rpmi: javapackages-tools-1:5.0.0-alt1_12jpp8 sisyphus+228348.2100.3.3 1556657006 installed
<13>Jan 26 13:20:09 rpmi: plexus-utils-0:3.0.24-alt1_5jpp8 1524376364 installed
<13>Jan 26 13:20:09 rpmi: apache-commons-io-1:2.6-alt1_3jpp8 1526474591 installed
<13>Jan 26 13:20:09 rpmi: maven-shared-utils-3.2.1-alt1_0.1jpp8 1527848452 installed
<13>Jan 26 13:20:09 rpmi: apache-commons-logging-0:1.2-alt1_14jpp8 sisyphus+220622.100.1.1 1549363457 installed
<13>Jan 26 13:20:09 rpmi: plexus-containers-component-annotations-0:1.7.1-alt1_6jpp8 1527990031 installed
<13>Jan 26 13:20:09 rpmi: plexus-interpolation-0:1.22-alt1_9jpp8 1524313082 installed
<13>Jan 26 13:20:09 rpmi: maven-wagon-provider-api-0:3.0.0-alt1_1jpp8 1511394275 installed
<13>Jan 26 13:20:09 rpmi: slf4j-0:1.7.25-alt1_4jpp8 1525924634 installed
<13>Jan 26 13:20:09 rpmi: xml-commons-apis-1.4.01-alt3_26jpp8 sisyphus+220521.100.1.1 1549294732 installed
<13>Jan 26 13:20:09 rpmi: apache-commons-codec-0:1.11-alt1_4jpp8 sisyphus+220604.100.1.1 1549341232 installed
<13>Jan 26 13:20:09 rpmi: apache-commons-lang3-3.7-alt1_4jpp8 sisyphus+220620.100.1.1 1549356987 installed
<13>Jan 26 13:20:09 rpmi: httpcomponents-core-4.4.9-alt1_4jpp8 1525820092 installed
<13>Jan 26 13:20:09 rpmi: plexus-classworlds-0:2.5.2-alt2_9jpp8 1524311141 installed
<13>Jan 26 13:20:09 rpmi: atinject-0:1-alt7_29.20100611svn86jpp8 sisyphus+220650.100.1.1 1549392067 installed
<13>Jan 26 13:20:09 rpmi: guava20-20.0-alt1_5jpp8 1526562255 installed
<13>Jan 26 13:20:09 rpmi: hawtjni-runtime-0:1.16-alt1_1jpp8 1527820189 installed
<13>Jan 26 13:20:09 rpmi: xmvn-api-3.0.0-alt1_18jpp8 1527991448 installed
<13>Jan 26 13:20:10 rpmi: xmvn-core-3.0.0-alt1_18jpp8 1527991448 installed
<13>Jan 26 13:20:10 rpmi: maven-resolver-api-1:1.1.1-alt1_2jpp8 1527821514 installed
<13>Jan 26 13:20:10 rpmi: maven-resolver-util-1:1.1.1-alt1_2jpp8 1527821514 installed
<13>Jan 26 13:20:10 rpmi: maven-resolver-spi-1:1.1.1-alt1_2jpp8 1527821514 installed
<13>Jan 26 13:20:10 rpmi: jansi-native-0:1.7-alt1_5jpp8 1523818758 installed
<13>Jan 26 13:20:10 rpmi: jcl-over-slf4j-0:1.7.25-alt1_4jpp8 1525924634 installed
<13>Jan 26 13:20:10 rpmi: aopalliance-0:1.0-alt6_17jpp8 1526473615 installed
<13>Jan 26 13:20:10 rpmi: apache-commons-cli-0:1.4-alt1_5jpp8 sisyphus+220603.100.1.1 1549340562 installed
<13>Jan 26 13:20:10 rpmi: apache-commons-collections-0:3.2.2-alt1_8jpp8 1527882341 installed
<13>Jan 26 13:20:10 rpmi: osgi-core-6.0.0-alt1_6jpp8 1524308153 installed
<13>Jan 26 13:20:10 rpmi: plexus-cipher-1.7-alt3_14jpp8 1524310885 installed
<13>Jan 26 13:20:10 rpmi: xorg-proto-devel-2018.4-alt3 1527685079 installed
<13>Jan 26 13:20:10 rpmi: libjpeg-2:2.0.2-alt1 sisyphus+226996.100.1.1 1554902907 installed
<13>Jan 26 13:20:10 rpmi: libpng16-1.6.36-alt1 sisyphus+219478.100.1.1 1547633314 installed
<13>Jan 26 13:20:10 rpmi: libexpat-2.2.4-alt1 1503305345 installed
<13>Jan 26 13:20:10 rpmi: plexus-sec-dispatcher-1.4-alt4_24jpp8 1524313702 installed
<13>Jan 26 13:20:10 rpmi: google-guice-0:4.1-alt1_12jpp8 sisyphus+221708.100.1.1 1550375735 installed
<13>Jan 26 13:20:10 rpmi: maven-resolver-connector-basic-1:1.1.1-alt1_2jpp8 1527821514 installed
<13>Jan 26 13:20:10 rpmi: maven-resolver-impl-1:1.1.1-alt1_2jpp8 1527821514 installed
<13>Jan 26 13:20:10 rpmi: maven-resolver-transport-wagon-1:1.1.1-alt1_2jpp8 1527821514 installed
<13>Jan 26 13:20:10 rpmi: maven-wagon-file-0:3.0.0-alt1_1jpp8 1511394275 installed
<13>Jan 26 13:20:10 rpmi: maven-artifact-1:2.2.1-alt6_56jpp8 1510505131 installed
<13>Jan 26 13:20:10 rpmi: maven-model-1:2.2.1-alt6_56jpp8 1510505131 installed
<13>Jan 26 13:20:10 rpmi: ant-lib-0:1.10.3-alt1_2jpp8 1528243545 installed
<13>Jan 26 13:20:10 rpmi: apache-commons-lang-0:2.6-alt5_22jpp8 sisyphus+220619.100.1.1 1549325921 installed
<13>Jan 26 13:20:10 rpmi: beust-jcommander-1.71-alt1_3jpp8 1523858260 installed
<13>Jan 26 13:20:10 rpmi: geronimo-annotation-1.0-alt4_24jpp8 sisyphus+221131.100.1.2 1549788027 installed
<13>Jan 26 13:20:10 rpmi: xpp3-1:1.1.4-alt1_19.cjpp8 sisyphus+220580.100.1.1 1549324731 installed
<13>Jan 26 13:20:10 rpmi: xml-utils-1:2.9.10-alt2 p9+240157.100.1.1 1572735327 installed
<13>Jan 26 13:20:10 rpmi: libICE-1.0.9-alt1 1409902721 installed
<13>Jan 26 13:20:10 rpmi: libSM-1.2.3-alt1 sisyphus+226734.100.2.1 1554586158 installed
<13>Jan 26 13:20:10 rpmi: velocity-1:1.7-alt3_22jpp8 1525930039 installed
<13>Jan 26 13:20:10 rpmi: ant-0:1.10.3-alt1_2jpp8 1528243545 installed
<13>Jan 26 13:20:10 rpmi: xmvn-connector-aether-3.0.0-alt1_18jpp8 1527991448 installed
<13>Jan 26 13:20:10 rpmi: xmlgraphics-commons-0:2.2-alt1_2jpp8 sisyphus+220498.100.1.1 1549281765 installed
<13>Jan 26 13:20:10 rpmi: plexus-io-0:3.0.0-alt1_2jpp8 1527187473 installed
<13>Jan 26 13:20:10 rpmi: plexus-build-api-0:0.0.7-alt3_20jpp8 1525915372 installed
<13>Jan 26 13:20:10 rpmi: osgi-compendium-6.0.0-alt1_5jpp8 1524307639 installed
<13>Jan 26 13:20:10 rpmi: felix-utils-1.10.4-alt1_3jpp8 sisyphus+221058.100.1.2 1549747041 installed
<13>Jan 26 13:20:10 rpmi: qdox-1:2.0-alt1_0.12.M7jpp8 1525919952 installed
<13>Jan 26 13:20:10 rpmi: sgml-common-0.6.3-alt15 1423664786 installed
<13>Jan 26 13:20:10 rpmi: log4j12-1.2.17-alt1_23jpp8 sisyphus+220162.100.2.1 1549021303 installed
<13>Jan 26 13:20:10 rpmi: liblksctp-1.0.17-alt2 1523113261 installed
<13>Jan 26 13:20:10 rpmi: libglvnd-7:1.1.1-alt1 sisyphus+224993.100.4.1 1552634542 installed
<13>Jan 26 13:20:10 rpmi: libwayland-server-1.17.0-alt1 sisyphus+225894.100.1.1 1553872805 installed
<13>Jan 26 13:20:10 rpmi: lksctp-tools-1.0.17-alt2 1523113261 installed
<13>Jan 26 13:20:10 rpmi: docbook-dtds-4.5-alt1 1223476557 installed
<13>Jan 26 13:20:11 rpmi: docbook-style-xsl-1.79.1-alt2 sisyphus.213665.100 1537949315 installed
<13>Jan 26 13:20:11 rpmi: felix-bundlerepository-2.0.10-alt1_4jpp8 sisyphus+220992.100.1.2 1549693453 installed
<13>Jan 26 13:20:11 rpmi: libICE-devel-1.0.9-alt1 1409902721 installed
<13>Jan 26 13:20:11 rpmi: libSM-devel-1.2.3-alt1 sisyphus+226734.100.2.1 1554586158 installed
<13>Jan 26 13:20:11 rpmi: kxml-2.3.0-alt3_16jpp8 1524305282 installed
<13>Jan 26 13:20:11 rpmi: apache-commons-configuration-0:1.10-alt1_12jpp8 sisyphus+220606.100.1.1 1549344005 installed
<13>Jan 26 13:20:11 rpmi: libjasper-2.0.14-alt1 1530105217 installed
<13>Jan 26 13:20:11 rpmi: jcsp-1.1-alt1_0.10.rc5jpp8 sisyphus+221980.100.1.1 1550546630 installed
<13>Jan 26 13:20:11 rpmi: maven-dependency-tree-3.0-alt1_4jpp8 1510507072 installed
<13>Jan 26 13:20:11 rpmi: xmvn-mojo-3.0.0-alt1_18jpp8 1527991448 installed
<13>Jan 26 13:20:11 rpmi: plexus-component-api-1.0-alt4_0.24.alpha15jpp8 1524311381 installed
<13>Jan 26 13:20:11 rpmi: plexus-interactivity-api-0:1.0-alt6_0.25.alpha6jpp8 1525919089 installed
<13>Jan 26 13:20:11 rpmi: apache-commons-httpclient-1:3.1-alt6_27jpp8 1510082305 installed
<13>Jan 26 13:20:11 rpmi: maven-invoker-2.2-alt1_6jpp8 1510802103 installed
<13>Jan 26 13:20:11 rpmi: fontbox-0:1.8.13-alt2_4jpp8 1525914053 installed
<13>Jan 26 13:20:11 rpmi: plexus-compiler-0:2.8.2-alt1_2jpp8 1525918408 installed
<13>Jan 26 13:20:11 rpmi: hamcrest-core-0:1.3-alt3_23jpp8 1525893879 installed
<13>Jan 26 13:20:11 rpmi: junit-1:4.12-alt1_8jpp8 1525900612 installed
<13>Jan 26 13:20:11 rpmi: maven-verifier-1.6-alt1_5jpp8 1510518576 installed
<13>Jan 26 13:20:11 rpmi: objenesis-0:2.6-alt1_1jpp8 1511395274 installed
<13>Jan 26 13:20:11 rpmi: apache-commons-compress-0:1.16.1-alt1_1jpp8 1526491832 installed
<13>Jan 26 13:20:11 rpmi: apache-ivy-0:2.4.0-alt1_12jpp8 1527882603 installed
<13>Jan 26 13:20:11 rpmi: osgi-annotation-6.0.0-alt1_7jpp8 1524306983 installed
<13>Jan 26 13:20:11 rpmi: aqute-bndlib-0:3.5.0-alt1_2jpp8 1523847009 installed
<13>Jan 26 13:20:11 rpmi: avalon-logkit-0:2.1-alt2_29jpp8 1525884624 installed
<13>Jan 26 13:20:11 rpmi: avalon-framework-0:4.3-alt4_19jpp8 1525884383 installed
<13>Jan 26 13:20:11 rpmi: jai-imageio-core-1.2-alt1_0.24.20100217cvsjpp8 sisyphus+221788.100.1.1 1550423410 installed
<13>Jan 26 13:20:11 rpmi: glassfish-el-api-3.0.1-alt1_0.9.b08jpp8 sisyphus+221160.100.1.1 1549796961 installed
<13>Jan 26 13:20:11 rpmi: jboss-interceptors-1.2-api-1.0.0-alt1_9jpp8 sisyphus+221843.100.1.1 1550450624 installed
<13>Jan 26 13:20:11 rpmi: cdi-api-1.2-alt1_9jpp8 sisyphus+220672.100.1.1 1549401296 installed
<13>Jan 26 13:20:11 rpmi: sisu-inject-2:0.3.3-alt1_3jpp8 1525924258 installed
<13>Jan 26 13:20:12 rpmi: sisu-plexus-2:0.3.3-alt1_3jpp8 1525924258 installed
<13>Jan 26 13:20:12 rpmi: dain-snappy-0.4-alt1_6jpp8 sisyphus+220815.100.1.1 1549458793 installed
<13>Jan 26 13:20:12 rpmi: extra166y-1.7.0-alt1_10jpp8 sisyphus+220916.100.1.3 1549643912 installed
<13>Jan 26 13:20:12 rpmi: java-common-1.6.0-alt1 p9+234085.100.1.1 1562573623 installed
<13>Jan 26 13:20:12 rpmi: fusesource-pom-0:1.11-alt1_4jpp8 sisyphus+221128.100.1.1 1549752021 installed
<13>Jan 26 13:20:12 rpmi: jansi-0:1.17-alt1_1jpp8 1527875993 installed
<13>Jan 26 13:20:12 rpmi: xpp3-minimal-1:1.1.4-alt1_19.cjpp8 sisyphus+220580.100.1.1 1549324731 installed
<13>Jan 26 13:20:12 rpmi: xstream-0:1.4.9-alt1_7jpp8 1524214178 installed
<13>Jan 26 13:20:12 rpmi: jzlib-0:1.1.3-alt1_8jpp8 1525901378 installed
<13>Jan 26 13:20:12 rpmi: netty3-3.10.6-alt2_5jpp8 sisyphus+220441.100.1.1 1549124381 installed
<13>Jan 26 13:20:12 rpmi: multiverse-0.7.0-alt1_8jpp8 1527807673 installed
<13>Jan 26 13:20:12 rpmi: jsoup-1.11.3-alt1_1jpp8 1527820709 installed
<13>Jan 26 13:20:12 rpmi: maven-filesystem-0.01-alt2.1 1460115697 installed
<13>Jan 26 13:20:12 rpmi: xz-java-1.8-alt1_2jpp8 1525824473 installed
<13>Jan 26 13:20:12 rpmi: plexus-archiver-0:3.6.0-alt1_1jpp8 1527822734 installed
<13>Jan 26 13:20:12 rpmi: zip-30000000:3.0-alt1 1332241772 installed
<13>Jan 26 13:20:12 rpmi: libnatspec-0.3.1-alt2 1445691580 installed
<13>Jan 26 13:20:12 rpmi: unzip-6.0-alt2.qa1 1366155324 installed
<13>Jan 26 13:20:12 rpmi: publicsuffix-list-20200106-alt1 p9+244008.100.1.1 1578591661 installed
<13>Jan 26 13:20:12 rpmi: httpcomponents-client-4.5.5-alt1_5jpp8 sisyphus+221731.100.1.1 1550391382 installed
<13>Jan 26 13:20:12 rpmi: maven-wagon-http-shared-0:3.0.0-alt1_1jpp8 1511394275 installed
<13>Jan 26 13:20:12 rpmi: maven-wagon-http-0:3.0.0-alt1_1jpp8 1511394275 installed
<13>Jan 26 13:20:12 rpmi: maven-1:3.5.3-alt1_1jpp8 1528125011 installed
<13>Jan 26 13:20:13 rpmi: maven-lib-1:3.5.3-alt1_1jpp8 1528125011 installed
<13>Jan 26 13:20:13 rpmi: maven-archiver-0:3.2.0-alt1_1jpp8 1511392070 installed
<13>Jan 26 13:20:13 rpmi: maven-common-artifact-filters-3.0.1-alt1_3jpp8 1510506852 installed
<13>Jan 26 13:20:13 rpmi: maven-artifact-transfer-1:0.9.0-alt1_3jpp8 1511478032 installed
<13>Jan 26 13:20:13 rpmi: maven-shared-io-1:3.0.0-alt1_4jpp8 1510516386 installed
<13>Jan 26 13:20:13 rpmi: maven-filtering-3.1.1-alt1_4jpp8 1510509696 installed
<13>Jan 26 13:20:13 rpmi: maven-resources-plugin-3.1.0-alt1_1jpp8 1527822052 installed
<13>Jan 26 13:20:13 rpmi: maven-file-management-1:3.0.0-alt1_4jpp8 1510509475 installed
<13>Jan 26 13:20:13 rpmi: maven-jar-plugin-3.1.0-alt1_1jpp8 1527821052 installed
<13>Jan 26 13:20:13 rpmi: maven-shared-incremental-1.1-alt1_13jpp8 1510516163 installed
<13>Jan 26 13:20:13 rpmi: xmvn-minimal-3.0.0-alt1_18jpp8 1527991448 installed
<13>Jan 26 13:20:13 rpmi: gcc-c++-common-1.4.23-alt1 sisyphus+221902.2500.4.1 1550596716 installed
<13>Jan 26 13:20:13 rpmi: libstdc++8-devel-8.3.1-alt5 p9+240194.100.1.1 1572928737 installed
<13>Jan 26 13:20:14 rpmi: gcc8-c++-8.3.1-alt5 p9+240194.100.1.1 1572928737 installed
<13>Jan 26 13:20:14 rpmi: libpcsclite-1.8.25-alt1 p9+236438.100.1.1 1566468031 installed
<13>Jan 26 13:20:14 rpmi: libsqlite3-3.29.0-alt1 p9+237498.100.1.1 1568303696 installed
<13>Jan 26 13:20:14 rpmi: libnspr-1:4.21-alt2 p9+235125.520.5.1 1565694823 installed
<13>Jan 26 13:20:14 rpmi: javazi-2019c-alt1 p9+242136.100.1.1 1575295029 installed
<13>Jan 26 13:20:14 rpmi: libgif-4.1.6-alt3 1299634261 installed
<13>Jan 26 13:20:14 rpmi: libalsa-1:1.1.9-alt2 sisyphus+229323.100.1.1 1557826759 installed
<13>Jan 26 13:20:14 rpmi: liblz4-1:1.9.2-alt1 p9+238696.500.1.1 1570228299 installed
<13>Jan 26 13:20:14 rpmi: libgpg-error-1.36-alt1 sisyphus+225621.300.1.1 1553521082 installed
<13>Jan 26 13:20:14 rpmi: libgcrypt20-1.8.4-alt2 sisyphus+229280.100.1.1 1557742126 installed
<13>Jan 26 13:20:14 rpmi: libsystemd-1:242-alt12 p9+239240.100.1.1 1571079084 installed
<13>Jan 26 13:20:14 rpmi: libdbus-1.12.16-alt2 p9+240607.100.1.1 1573553687 installed
<13>Jan 26 13:20:14 rpmi: libavahi-0.6.32-alt1 1500485702 installed
<13>Jan 26 13:20:14 rpmi: libcups-2.2.11-alt1 sisyphus+225793.100.1.1 1553701176 installed
<13>Jan 26 13:20:14 rpmi: libxslt-1.1.33-alt1 sisyphus+226936.100.1.1 1554820937 installed
<13>Jan 26 13:20:15 rpmi: icon-theme-hicolor-0.17-alt1 1505715846 installed
<13>Jan 26 13:20:15 rpmi: libwebp7-1.0.3-alt1 p9+234901.200.1.1 1563552457 installed
<13>Jan 26 13:20:15 rpmi: libjbig-2.1-alt1 1401380926 installed
<13>Jan 26 13:20:15 rpmi: libtiff5-4.0.10.0.57.f9fc01c3-alt1 sisyphus+226958.100.1.1 1554850940 installed
<13>Jan 26 13:20:15 rpmi: shared-mime-info-1.13.1-alt1 p9+238204.100.1.1 1569496447 installed
<13>Jan 26 13:20:15 rpmi: gsettings-desktop-schemas-data-3.32.0-alt1 sisyphus+225059.300.3.2 1552843929 installed
<13>Jan 26 13:20:15 rpmi: libgio-2.60.7-alt1 p9+237353.100.2.2 1568373081 installed
<13>Jan 26 13:20:15 rpmi: gsettings-desktop-schemas-3.32.0-alt1 sisyphus+225059.300.3.2 1552843980 installed
<13>Jan 26 13:20:15 rpmi: libgdk-pixbuf-locales-2.38.2-alt1 p9+237353.1000.2.2 1568374008 installed
<13>Jan 26 13:20:15 rpmi: libgdk-pixbuf-2.38.2-alt1 p9+237353.1000.2.2 1568374336 installed
<13>Jan 26 13:20:15 rpmi: gtk-update-icon-cache-3.24.11-alt1 p9+237353.1200.2.2 1568374786 installed
<13>Jan 26 13:20:15 rpmi: libgtk+2-locales-2.24.32-alt3 sisyphus+227306.100.1.3 1555646039 installed
<13>Jan 26 13:20:15 rpmi: libdatrie-0.2.9-alt1_6 1511686676 installed
<13>Jan 26 13:20:15 rpmi: libthai-0.1.28-alt1_1 sisyphus+226107.100.1.1 1554123079 installed
<13>Jan 26 13:20:15 rpmi: libfribidi-1.0.7-alt1 p9+238309.200.1.1 1569787058 installed
<13>Jan 26 13:20:15 rpmi: libpixman-3:0.38.4-alt1 sisyphus+228006.100.1.1 1556013870 installed
<13>Jan 26 13:20:15 rpmi: libxshmfence-1.3-alt1 sisyphus+223149.1000.2.1 1551268571 installed
<13>Jan 26 13:20:15 rpmi: libwayland-client-1.17.0-alt1 sisyphus+225894.100.1.1 1553872805 installed
<13>Jan 26 13:20:15 rpmi: libpciaccess-1:0.14-alt1 1528969252 installed
<13>Jan 26 13:20:15 rpmi: libdrm-1:2.4.99-alt1 p9+236610.100.1.1 1566818128 installed
<13>Jan 26 13:20:15 rpmi: libgbm-4:19.1.8-alt1 p9+240059.100.2.1 1573598676 installed
<13>Jan 26 13:20:15 rpmi: libatk-locales-2.32.0-alt1 sisyphus+225059.600.3.2 1552845198 installed
<13>Jan 26 13:20:15 rpmi: libatk-2.32.0-alt1 sisyphus+225059.600.3.2 1552845362 installed
<13>Jan 26 13:20:15 rpmi: libX11-locales-3:1.6.7-alt1 sisyphus+226735.100.2.2 1554615009 installed
<13>Jan 26 13:20:15 rpmi: libXdmcp-1.1.3-alt1 sisyphus+225206.600.1.2 1552949353 installed
<13>Jan 26 13:20:15 rpmi: libXau-1.0.9-alt1 sisyphus+223149.200.2.1 1551268152 installed
<13>Jan 26 13:20:15 rpmi: libxcb-1.13.1-alt1 sisyphus+226527.100.2.2 1554593801 installed
<13>Jan 26 13:20:15 rpmi: libX11-3:1.6.7-alt1 sisyphus+226735.100.2.2 1554615005 installed
<13>Jan 26 13:20:15 rpmi: libXext-1.3.4-alt1 sisyphus+225206.700.1.2 1552949429 installed
<13>Jan 26 13:20:15 rpmi: libXrender-0.9.8-alt1 1371312112 installed
<13>Jan 26 13:20:15 rpmi: libXfixes-5.0.3-alt1 sisyphus+226736.100.2.2 1554614841 installed
<13>Jan 26 13:20:15 rpmi: libXi-1.7.9-alt2 sisyphus+226377.100.1.2 1554260260 installed
<13>Jan 26 13:20:15 rpmi: libXcomposite-0.4.5-alt1 sisyphus+225206.300.1.2 1552949137 installed
<13>Jan 26 13:20:15 rpmi: libXdamage-1.1.5-alt1 sisyphus+225206.500.1.2 1552949286 installed
<13>Jan 26 13:20:15 rpmi: libXcursor-1.2.0-alt1 sisyphus+225206.400.1.2 1552949218 installed
<13>Jan 26 13:20:15 rpmi: libXrandr-1.5.2-alt1 sisyphus+225206.1300.1.2 1552949710 installed
<13>Jan 26 13:20:15 rpmi: libXxf86vm-1.1.4-alt2 1527672187 installed
<13>Jan 26 13:20:15 rpmi: libGLX-mesa-4:19.1.8-alt1 p9+240059.100.2.1 1573598676 installed
<13>Jan 26 13:20:15 rpmi: libEGL-mesa-4:19.1.8-alt1 p9+240059.100.2.1 1573598676 installed
<13>Jan 26 13:20:15 rpmi: libEGL-7:1.1.1-alt1 sisyphus+224993.100.4.1 1552634542 installed
<13>Jan 26 13:20:15 rpmi: libGLX-7:1.1.1-alt1 sisyphus+224993.100.4.1 1552634542 installed
<13>Jan 26 13:20:15 rpmi: libGL-7:1.1.1-alt1 sisyphus+224993.100.4.1 1552634542 installed
<13>Jan 26 13:20:15 rpmi: libXinerama-1.1.4-alt1 sisyphus+223149.300.2.1 1551268216 installed
<13>Jan 26 13:20:15 rpmi: libXtst-1.2.2-alt1 1369984893 installed
<13>Jan 26 13:20:15 rpmi: libXt-1.1.4-alt1 1369984722 installed
<13>Jan 26 13:20:17 rpmi: libxcb-devel-1.13.1-alt1 sisyphus+226527.100.2.2 1554593801 installed
<13>Jan 26 13:20:17 rpmi: libX11-devel-3:1.6.7-alt1 sisyphus+226735.100.2.2 1554615005 installed
<13>Jan 26 13:20:17 rpmi: libXt-devel-1.1.4-alt1 1369984722 installed
<13>Jan 26 13:20:17 rpmi: libgraphite2-1.3.13-alt2 sisyphus+226799.100.1.1 1554648241 installed
<13>Jan 26 13:20:17 rpmi: libharfbuzz-2.6.2-alt1 p9+238790.200.1.1 1570435826 installed
<13>Jan 26 13:20:17 rpmi: libfreetype-2.10.0-alt2 sisyphus+226881.100.2.1 1555676286 installed
<13>Jan 26 13:20:17 rpmi: fontconfig-2.13.1-alt1 sisyphus+226691.100.2.2 1554598726 installed
Updating fonts cache: <29>Jan 26 13:20:18 fontconfig: Updating fonts cache: succeeded
[ DONE ]
<13>Jan 26 13:20:19 rpmi: libcairo-1:1.16.0-alt1 sisyphus+226534.100.2.3 1554515535 installed
<13>Jan 26 13:20:19 rpmi: fonts-type1-xorg-7.0.0-alt4 1188553211 installed
<13>Jan 26 13:20:19 rpmi: libXft-2.3.3-alt1 sisyphus+225206.1000.3.2 1552987708 installed
<13>Jan 26 13:20:19 rpmi: libpango-1.44.6-alt1 p9+237353.700.2.2 1568374131 installed
<13>Jan 26 13:20:19 rpmi: libgtk+2-2.24.32-alt3 sisyphus+227306.100.1.3 1555646092 installed
<13>Jan 26 13:20:19 rpmi: libgail-2.24.32-alt3 sisyphus+227306.100.1.3 1555646092 installed
<13>Jan 26 13:20:19 rpmi: libgdbm-1.8.3-alt10 1454943334 installed
<13>Jan 26 13:20:19 rpmi: libp11-kit-0.23.15-alt1 sisyphus+226408.100.2.1 1554288204 installed
<13>Jan 26 13:20:19 rpmi: libtasn1-4.14-alt1 p9+235792.100.2.1 1565425233 installed
<13>Jan 26 13:20:19 rpmi: rpm-macros-alternatives-0.5.1-alt1 sisyphus+226946.100.1.1 1554830426 installed
<13>Jan 26 13:20:19 rpmi: alternatives-0.5.1-alt1 sisyphus+226946.100.1.1 1554830426 installed
<13>Jan 26 13:20:19 rpmi: ca-certificates-2019.10.28-alt1 p9+240634.100.1.1 1573575926 installed
<13>Jan 26 13:20:19 rpmi: ca-trust-0.1.2-alt1 p9+233349.100.1.1 1561655062 installed
<13>Jan 26 13:20:19 rpmi: p11-kit-trust-0.23.15-alt1 sisyphus+226408.100.2.1 1554288204 installed
<13>Jan 26 13:20:19 rpmi: libcrypto1.1-1.1.1d-alt1.1 p9+237853.200.3.1 1569251834 installed
<13>Jan 26 13:20:19 rpmi: libssl1.1-1.1.1d-alt1.1 p9+237853.200.3.1 1569251834 installed
<13>Jan 26 13:20:19 rpmi: libpython3-3.7.4-alt2 p9+239459.100.1.1 1571444790 installed
<13>Jan 26 13:20:19 rpmi: python3-3.7.4-alt2 p9+239459.100.1.1 1571444790 installed
<13>Jan 26 13:20:20 rpmi: python3-base-3.7.4-alt2 p9+239459.100.1.1 1571444790 installed
<13>Jan 26 13:20:20 rpmi: python3-module-sugarbowl-0.52.1-alt1.git20141130.1.1 sisyphus+227470.1100.1.1 1555687657 installed
<13>Jan 26 13:20:20 rpmi: python3-module-six-1.12.0-alt1 sisyphus+219665.100.2.1 1548148570 installed
<13>Jan 26 13:20:20 rpmi: python3-module-markupsafe-0.23-alt1.2.1.1 sisyphus+225625.12200.91.1 1555289337 installed
<13>Jan 26 13:20:20 rpmi: python3-module-jinja2-2.10-alt1 1521724576 installed
<13>Jan 26 13:20:20 rpmi: python3-module-clyde-0.8.0-alt1.git20141130.2.1 sisyphus+227465.1600.1.2 1555756906 installed
<13>Jan 26 13:20:20 rpmi: python3-module-pkg_resources-1:40.8.0-alt2 sisyphus+229158.200.2.1 1557735221 installed
<13>Jan 26 13:20:20 rpmi: python3-module-runfile-0.46.1-alt1.git20141130.2.1 sisyphus+227469.1300.2.3 1555706376 installed
<13>Jan 26 13:20:20 rpmi: objectweb-asm-0:6.1.1-alt1_1jpp8 1528136365 installed
<13>Jan 26 13:20:20 rpmi: plexus-languages-0.9.3-alt2_4jpp8 1528196710 installed
<13>Jan 26 13:20:20 rpmi: maven-compiler-plugin-3.7.0-alt1_1jpp8 1527175304 installed
<13>Jan 26 13:20:20 rpmi: xmvn-install-3.0.0-alt1_18jpp8 1527991448 installed
<13>Jan 26 13:20:20 rpmi: parboiled-1.1.6-alt1_13jpp8 1524290710 installed
<13>Jan 26 13:20:20 rpmi: pegdown-1.4.2-alt1_12jpp8 1524309539 installed
<13>Jan 26 13:20:20 rpmi: xml-commons-resolver-0:1.2-alt1_24jpp8 1525932051 installed
<13>Jan 26 13:20:20 rpmi: xalan-j2-0:2.7.1-alt4_34jpp8 1525931290 installed
<13>Jan 26 13:20:21 rpmi: xerces-j2-0:2.11.0-alt3_31jpp8 1524211519 installed
<13>Jan 26 13:20:21 rpmi: batik-css-0:1.10-alt1_2jpp8 sisyphus+220497.100.1.2 1549284940 installed
<13>Jan 26 13:20:21 rpmi: batik-0:1.10-alt1_2jpp8 sisyphus+220497.100.1.2 1549284940 installed
<13>Jan 26 13:20:21 rpmi: xmlunit-0:1.6-alt1_7jpp8 1525933352 installed
<13>Jan 26 13:20:21 rpmi: antlr-tool-0:2.7.7-alt12_53jpp8 1525882426 installed
<13>Jan 26 13:20:21 rpmi: gpars-1.2.1-alt1_12jpp8 sisyphus+221710.100.1.1 1550377267 installed
<13>Jan 26 13:20:22 rpmi: groovy-lib-0:2.4.8-alt1_5jpp8 1524261040 installed
<13>Jan 26 13:20:22 rpmi: xbean-0:4.8-alt1_1jpp8 1527831195 installed
<13>Jan 26 13:20:22 rpmi: plexus-containers-container-default-0:1.7.1-alt1_6jpp8 1527990031 installed
<13>Jan 26 13:20:22 rpmi: maven-plugin-registry-1:2.2.1-alt6_56jpp8 1510505131 installed
<13>Jan 26 13:20:22 rpmi: maven-doxia-logging-api-0:1.7-alt1_9jpp8 sisyphus+220185.100.1.1 1548779496 installed
<13>Jan 26 13:20:22 rpmi: maven-doxia-sink-api-0:1.7-alt1_9jpp8 sisyphus+220185.100.1.1 1548779496 installed
<13>Jan 26 13:20:22 rpmi: maven-doxia-core-0:1.7-alt1_9jpp8 sisyphus+220185.100.1.1 1548779496 installed
<13>Jan 26 13:20:22 rpmi: maven-reporting-api-1:3.0-alt3_13jpp8 1510514759 installed
<13>Jan 26 13:20:22 rpmi: maven-doxia-module-xhtml-0:1.7-alt1_9jpp8 sisyphus+220185.100.1.1 1548779496 installed
<13>Jan 26 13:20:22 rpmi: maven-doxia-module-markdown-0:1.7-alt1_9jpp8 sisyphus+220185.100.1.1 1548779496 installed
<13>Jan 26 13:20:22 rpmi: maven-doxia-module-apt-0:1.7-alt1_9jpp8 sisyphus+220185.100.1.1 1548779496 installed
<13>Jan 26 13:20:22 rpmi: maven-doxia-module-fml-0:1.7-alt1_9jpp8 sisyphus+220185.100.1.1 1548779496 installed
<13>Jan 26 13:20:22 rpmi: maven-doxia-module-xdoc-0:1.7-alt1_9jpp8 sisyphus+220185.100.1.1 1548779496 installed
<13>Jan 26 13:20:22 rpmi: maven-plugin-annotations-0:3.5.1-alt1_1jpp8 1525824925 installed
<13>Jan 26 13:20:22 rpmi: maven-surefire-0:2.21.0-alt1_1jpp8 1527848673 installed
<13>Jan 26 13:20:22 rpmi: maven-surefire-plugin-0:2.21.0-alt1_1jpp8 1527848673 installed
<13>Jan 26 13:20:22 rpmi: maven-surefire-provider-junit-0:2.21.0-alt1_1jpp8 1527848673 installed
<13>Jan 26 13:20:22 rpmi: maven-surefire-provider-testng-0:2.21.0-alt1_1jpp8 1527848673 installed
<13>Jan 26 13:20:22 rpmi: maven-artifact-manager-1:2.2.1-alt6_56jpp8 1510505131 installed
<13>Jan 26 13:20:22 rpmi: maven-profile-1:2.2.1-alt6_56jpp8 1510505131 installed
<13>Jan 26 13:20:22 rpmi: maven-settings-1:2.2.1-alt6_56jpp8 1510505131 installed
<13>Jan 26 13:20:22 rpmi: maven-project-1:2.2.1-alt6_56jpp8 1510505131 installed
<13>Jan 26 13:20:22 rpmi: plexus-i18n-0:1.0-alt7_0.11.b10.4jpp8 1524312824 installed
<13>Jan 26 13:20:22 rpmi: plexus-velocity-0:1.2-alt1_4jpp8 1524376629 installed
<13>Jan 26 13:20:22 rpmi: xmvn-subst-3.0.0-alt1_18jpp8 1527991448 installed
<13>Jan 26 13:20:22 rpmi: xmvn-resolve-3.0.0-alt1_18jpp8 1527991448 installed
<13>Jan 26 13:20:22 rpmi: python3-module-genshi-0.7-alt2 sisyphus+229363.100.1.1 1557847335 installed
<13>Jan 26 13:20:22 rpmi: python3-module-webencodings-0.5.1-alt1.1 1517943573 installed
<13>Jan 26 13:20:22 rpmi: python3-module-cssselect-0.9.1-alt1.2 sisyphus+227479.1100.1.2 1555757152 installed
<13>Jan 26 13:20:22 rpmi: python3-module-html5lib-1:0.999999999-alt4.qa1 sisyphus+227493.600.1.3 1555835341 installed
<13>Jan 26 13:20:22 rpmi: python3-module-lxml-4.4.2-alt1 p9+244111.100.1.1 1578758819 installed
<13>Jan 26 13:20:22 rpmi: python3-module-javapackages-1:5.0.0-alt1_12jpp8 sisyphus+228348.2100.3.3 1556657006 installed
<13>Jan 26 13:20:22 rpmi: javapackages-local-1:5.0.0-alt1_12jpp8 sisyphus+228348.2100.3.3 1556657006 installed
<13>Jan 26 13:20:22 rpmi: rpm-build-java-1:5.0.0-alt1_12jpp8 sisyphus+228348.2100.3.3 1556657006 installed
<13>Jan 26 13:20:22 rpmi: ca-trust-java-0.1.2-alt1 p9+233349.100.1.1 1561655062 installed
<13>Jan 26 13:20:22 rpmi: libnss-3.45.0-alt1 p9+235125.540.6.1 1565821502 installed
<13>Jan 26 13:20:26 rpmi: java-1.8.0-openjdk-headless-0:1.8.0.212.b04-alt2_0jpp8 p9+234508.100.3.1 1563175746 installed
<13>Jan 26 13:20:27 rpmi: java-1.8.0-openjdk-0:1.8.0.212.b04-alt2_0jpp8 p9+234508.100.3.1 1563175746 installed
<13>Jan 26 13:20:27 rpmi: fop-0:2.0-alt1_9jpp8 1524189893 installed
<13>Jan 26 13:20:27 rpmi: maven-doxia-module-fo-0:1.7-alt1_9jpp8 sisyphus+220185.100.1.1 1548779496 installed
<13>Jan 26 13:20:27 rpmi: maven-doxia-sitetools-0:1.7.5-alt1_1jpp8 1511392380 installed
<13>Jan 26 13:20:27 rpmi: maven-javadoc-plugin-3.0.0-alt1_4jpp8 1527985821 installed
<13>Jan 26 13:20:27 rpmi: maven-reporting-impl-3.0.0-alt1_1jpp8 1511427039 installed
<13>Jan 26 13:20:29 rpmi: java-1.8.0-openjdk-devel-0:1.8.0.212.b04-alt2_0jpp8 p9+234508.100.3.1 1563175746 installed
<13>Jan 26 13:20:29 rpmi: java-stub-javadoc-0.1-alt1 1229813340 installed
<13>Jan 26 13:20:29 rpmi: jpackage-generic-compat-0.29-alt1 1523537205 installed
<13>Jan 26 13:20:29 rpmi: maven-plugin-bundle-3.5.0-alt1_1jpp8 1525822813 installed
<13>Jan 26 13:20:29 rpmi: maven-local-1:5.0.0-alt1_12jpp8 sisyphus+228348.2100.3.3 1556657006 installed
<13>Jan 26 13:20:29 rpmi: maven-antrun-plugin-1.8-alt1_5jpp8 1510505790 installed
<13>Jan 26 13:20:29 rpmi: ant-contrib-0:1.0-alt5_0.33.b3jpp8 sisyphus+220596.100.1.1 1549334751 installed
<13>Jan 26 13:20:29 rpmi: gcc-c++-8-alt1 sisyphus+222164.100.1.1 1550685959 installed
<13>Jan 26 13:20:29 rpmi: maven-assembly-plugin-3.1.0-alt1_3jpp8 1525905529 installed
<13>Jan 26 13:20:29 rpmi: ant-junit-0:1.10.3-alt1_2jpp8 1528243545 installed
<13>Jan 26 13:20:29 rpmi: geronimo-jms-1.1.1-alt3_26jpp8 sisyphus+221149.100.1.1 1549794513 installed
<13>Jan 26 13:20:29 rpmi: jakarta-oro-0:2.0.8-alt2_23jpp8 1525895909 installed
<13>Jan 26 13:20:29 rpmi: javamail-1.5.2-alt1_8jpp8 sisyphus+221812.100.1.1 1550428192 installed
Building target platforms: i586
Building for target i586
Wrote: /usr/src/in/nosrpm/log4j12-1.2.17-alt1_23jpp8.nosrc.rpm
Installing log4j12-1.2.17-alt1_23jpp8.src.rpm
Building target platforms: i586
Building for target i586
Executing(%prep): /bin/sh -e /usr/src/tmp/rpm-tmp.98863
+ umask 022
+ /bin/mkdir -p /usr/src/RPM/BUILD
+ cd /usr/src/RPM/BUILD
+ cd /usr/src/RPM/BUILD
+ rm -rf log4j-1_2_17
+ echo 'Source #0 (v1_2_17.tar.gz):'
Source #0 (v1_2_17.tar.gz):
+ /bin/gzip -dc /usr/src/RPM/SOURCES/v1_2_17.tar.gz
+ /bin/tar -xf -
+ cd log4j-1_2_17
+ /bin/chmod -c -Rf u+rwX,go-w .
+ find . -name '*.jar' -print -delete
+ find . -name '*.class' -print -delete
+ find . -name '*.dll' -print -delete
./NTEventLogAppender.amd64.dll
+ rm -rf docs/api
+ echo 'Patch #0 (0001-logfactor5-changed-userdir.patch):'
Patch #0 (0001-logfactor5-changed-userdir.patch):
+ /usr/bin/patch -p1 -b --suffix .logfactor-home
patching file src/main/java/org/apache/log4j/lf5/viewer/configure/ConfigurationManager.java
patching file src/main/java/org/apache/log4j/lf5/viewer/configure/MRUFileManager.java
+ echo 'Patch #1 (0009-Fix-tests.patch):'
Patch #1 (0009-Fix-tests.patch):
+ /usr/bin/patch -p1 -b --suffix .fix-tests
patching file tests/build.xml
+ echo 'Patch #2 (0010-Fix-javadoc-link.patch):'
Patch #2 (0010-Fix-javadoc-link.patch):
+ /usr/bin/patch -p1 -b --suffix .xlink-javadoc
patching file build.xml
patch unexpectedly ends in middle of line
+ echo 'Patch #3 (0001-Backport-fix-for-CVE-2017-5645.patch):'
Patch #3 (0001-Backport-fix-for-CVE-2017-5645.patch):
+ /usr/bin/patch -p1
patching file src/main/java/org/apache/log4j/FilteredObjectInputStream.java
patching file src/main/java/org/apache/log4j/net/SocketNode.java
+ /usr/bin/python3 /usr/share/java-utils/pom_editor.py pom_remove_plugin :clirr-maven-plugin
/usr/share/java-utils/pom_editor.py:203: DeprecationWarning: inspect.getargspec() is deprecated since Python 3.0, use inspect.signature() or inspect.getfullargspec()
(arglist, _, _, defaults) = inspect.getargspec(function)
+ /usr/bin/python3 /usr/share/java-utils/pom_editor.py pom_remove_plugin :maven-site-plugin
/usr/share/java-utils/pom_editor.py:203: DeprecationWarning: inspect.getargspec() is deprecated since Python 3.0, use inspect.signature() or inspect.getfullargspec()
(arglist, _, _, defaults) = inspect.getargspec(function)
+ /usr/bin/python3 /usr/share/java-utils/pom_editor.py pom_remove_plugin :maven-source-plugin
/usr/share/java-utils/pom_editor.py:203: DeprecationWarning: inspect.getargspec() is deprecated since Python 3.0, use inspect.signature() or inspect.getfullargspec()
(arglist, _, _, defaults) = inspect.getargspec(function)
+ /usr/bin/python3 /usr/share/java-utils/pom_editor.py pom_remove_plugin :rat-maven-plugin
/usr/share/java-utils/pom_editor.py:203: DeprecationWarning: inspect.getargspec() is deprecated since Python 3.0, use inspect.signature() or inspect.getfullargspec()
(arglist, _, _, defaults) = inspect.getargspec(function)
+ /usr/bin/python3 /usr/share/java-utils/pom_editor.py pom_xpath_remove 'pom:build/pom:plugins/pom:plugin[pom:artifactId = '\''maven-javadoc-plugin'\'']/pom:executions'
/usr/share/java-utils/pom_editor.py:203: DeprecationWarning: inspect.getargspec() is deprecated since Python 3.0, use inspect.signature() or inspect.getfullargspec()
(arglist, _, _, defaults) = inspect.getargspec(function)
+ /usr/bin/python3 /usr/share/java-utils/pom_editor.py pom_remove_dep org.apache.openejb:javaee-api
/usr/share/java-utils/pom_editor.py:203: DeprecationWarning: inspect.getargspec() is deprecated since Python 3.0, use inspect.signature() or inspect.getfullargspec()
(arglist, _, _, defaults) = inspect.getargspec(function)
+ sed -i.ant 's|groupId>ant<|groupId>org.apache.ant<|g' pom.xml
+ sed -i.javac 's|1.4|1.6|g' pom.xml build.xml
+ sed -i.javac 's|1.4|1.6|g' pom.xml build.xml
+ sed -i.javac 's|1.1|1.6|g' tests/build.xml
+ sed -i.javac 's|1.1|1.6|g' tests/build.xml
+ sed -i.javax.jmdns 's|javax.jmdns.*;resolution:=optional,|!javax.jmdns.*,|g' pom.xml
+ /usr/bin/python3 /usr/share/java-utils/pom_editor.py pom_xpath_inject 'pom:build/pom:plugins/pom:plugin[pom:artifactId = '\''maven-bundle-plugin'\'']/pom:configuration/pom:instructions' '
org.apache.log4j
<_nouses>true'
/usr/share/java-utils/pom_editor.py:203: DeprecationWarning: inspect.getargspec() is deprecated since Python 3.0, use inspect.signature() or inspect.getfullargspec()
(arglist, _, _, defaults) = inspect.getargspec(function)
+ /usr/bin/python3 /usr/share/java-utils/pom_editor.py pom_xpath_remove 'pom:build/pom:plugins/pom:plugin[pom:artifactId = '\''maven-antrun-plugin'\'']/pom:executions/pom:execution[pom:phase = '\''process-classes'\'' ]'
/usr/share/java-utils/pom_editor.py:203: DeprecationWarning: inspect.getargspec() is deprecated since Python 3.0, use inspect.signature() or inspect.getfullargspec()
(arglist, _, _, defaults) = inspect.getargspec(function)
+ /usr/bin/python3 /usr/share/java-utils/pom_editor.py pom_xpath_set 'pom:plugin[pom:artifactId='\''maven-assembly-plugin'\'']/pom:executions/pom:execution/pom:goals/pom:goal[text()='\''assembly'\'']' single
/usr/share/java-utils/pom_editor.py:203: DeprecationWarning: inspect.getargspec() is deprecated since Python 3.0, use inspect.signature() or inspect.getfullargspec()
(arglist, _, _, defaults) = inspect.getargspec(function)
+ sed -i 's/\r//g' LICENSE NOTICE src/site/resources/css/maven-base.css src/site/resources/css/site.css
+ for i in contribs/JimMoore/mail*
+ iconv --from=ISO-8859-1 --to=UTF-8 contribs/JimMoore/mail-2001-03-12T1326
+ mv new contribs/JimMoore/mail-2001-03-12T1326
+ for i in contribs/JimMoore/mail*
+ iconv --from=ISO-8859-1 --to=UTF-8 contribs/JimMoore/mail-2001-03-12T1454
+ mv new contribs/JimMoore/mail-2001-03-12T1454
+ for i in contribs/JimMoore/mail*
+ iconv --from=ISO-8859-1 --to=UTF-8 contribs/JimMoore/mail-2001-03-13T0646
+ mv new contribs/JimMoore/mail-2001-03-13T0646
+ mkdir -p tests/lib/
+ cd tests/lib/
++ build-classpath jakarta-oro
+ ln -s /usr/share/java/jakarta-oro.jar
++ build-classpath javamail/mail
+ ln -s /usr/share/java/javamail/mail.jar
++ build-classpath junit
+ ln -s /usr/share/java/junit.jar
+ /usr/bin/python3 /usr/share/java-utils/mvn_compat_version.py log4j:log4j 1.2.17 1.2.16 1.2.15 1.2.14 1.2.13 1.2.12 12
+ rm -r src/main/java/org/apache/log4j/nt/NTEventLogAppender.java tests/src/java/org/apache/log4j/nt/NTEventLogAppenderTest.java
+ rm tests/src/java/org/apache/log4j/net/TelnetAppenderTest.java
+ sed -i /TelnetAppenderTest/d tests/src/java/org/apache/log4j/CoreTestSuite.java
+ /usr/bin/python3 /usr/share/java-utils/mvn_file.py log4j:log4j log4j log4j12
+ exit 0
Executing(%build): /bin/sh -e /usr/src/tmp/rpm-tmp.8814
+ umask 022
+ /bin/mkdir -p /usr/src/RPM/BUILD
+ cd /usr/src/RPM/BUILD
+ cd log4j-1_2_17
+ /usr/bin/python3 /usr/share/java-utils/mvn_build.py
Executing: xmvn --batch-mode --offline verify org.fedoraproject.xmvn:xmvn-mojo:install org.apache.maven.plugins:maven-javadoc-plugin:aggregate org.fedoraproject.xmvn:xmvn-mojo:builddep
['xmvn', '--batch-mode', '--offline', 'verify', 'org.fedoraproject.xmvn:xmvn-mojo:install', 'org.apache.maven.plugins:maven-javadoc-plugin:aggregate', 'org.fedoraproject.xmvn:xmvn-mojo:builddep']
[INFO] Scanning for projects...
[WARNING]
[WARNING] Some problems were encountered while building the effective model for log4j:log4j:bundle:1.2.17
[WARNING] 'build.plugins.plugin.version' for org.apache.maven.plugins:maven-resources-plugin is missing. @ line 87, column 15
[WARNING]
[WARNING] It is highly recommended to fix these problems because they threaten the stability of your build.
[WARNING]
[WARNING] For this reason, future Maven versions might no longer support building such malformed projects.
[WARNING]
[INFO]
[INFO] ----------------------------< log4j:log4j >-----------------------------
[INFO] Building Apache Log4j 1.2.17
[INFO] -------------------------------[ bundle ]-------------------------------
[INFO]
[INFO] --- maven-antrun-plugin:1.8:run (javadoc.resources) @ log4j ---
[WARNING] The POM for ant-contrib:ant-contrib:jar:1.0b2 is missing, no dependency information available
[WARNING] Parameter tasks is deprecated, use target instead
[INFO] Executing tasks
main:
[copy] Copying 2 files to /usr/src/RPM/BUILD/log4j-1_2_17/target/apidocs/META-INF
[INFO] Executed tasks
[INFO]
[INFO] --- maven-resources-plugin:3.1.0:resources (default-resources) @ log4j ---
[INFO] Using 'UTF-8' encoding to copy filtered resources.
[INFO] Copying 7 resources
[INFO]
[INFO] --- maven-compiler-plugin:3.7.0:compile (default-compile) @ log4j ---
[INFO] Changes detected - recompiling the module!
[INFO] Compiling 213 source files to /usr/src/RPM/BUILD/log4j-1_2_17/target/classes
[INFO] /usr/src/RPM/BUILD/log4j-1_2_17/src/main/java/org/apache/log4j/lf5/viewer/LogBrokerMonitor.java: Some input files use or override a deprecated API.
[INFO] /usr/src/RPM/BUILD/log4j-1_2_17/src/main/java/org/apache/log4j/lf5/viewer/LogBrokerMonitor.java: Recompile with -Xlint:deprecation for details.
[INFO] /usr/src/RPM/BUILD/log4j-1_2_17/src/main/java/org/apache/log4j/rewrite/ReflectionRewritePolicy.java: Some input files use unchecked or unsafe operations.
[INFO] /usr/src/RPM/BUILD/log4j-1_2_17/src/main/java/org/apache/log4j/rewrite/ReflectionRewritePolicy.java: Recompile with -Xlint:unchecked for details.
[INFO]
[INFO] --- maven-resources-plugin:3.1.0:testResources (default-testResources) @ log4j ---
[INFO] Using 'UTF-8' encoding to copy filtered resources.
[INFO] Copying 12 resources
[INFO]
[INFO] --- maven-compiler-plugin:3.7.0:testCompile (default-testCompile) @ log4j ---
[INFO] Changes detected - recompiling the module!
[INFO] Compiling 88 source files to /usr/src/RPM/BUILD/log4j-1_2_17/target/test-classes
[INFO] /usr/src/RPM/BUILD/log4j-1_2_17/tests/src/java/org/apache/log4j/LogCapture.java: Some input files use or override a deprecated API.
[INFO] /usr/src/RPM/BUILD/log4j-1_2_17/tests/src/java/org/apache/log4j/LogCapture.java: Recompile with -Xlint:deprecation for details.
[INFO] /usr/src/RPM/BUILD/log4j-1_2_17/tests/src/java/org/apache/log4j/VectorAppender.java: Some input files use unchecked or unsafe operations.
[INFO] /usr/src/RPM/BUILD/log4j-1_2_17/tests/src/java/org/apache/log4j/VectorAppender.java: Recompile with -Xlint:unchecked for details.
[INFO]
[INFO] --- maven-antrun-plugin:1.8:run (mkdir_tests_output) @ log4j ---
[WARNING] Parameter tasks is deprecated, use target instead
[INFO] Executing tasks
main:
[mkdir] Created dir: /usr/src/RPM/BUILD/log4j-1_2_17/tests/output
[INFO] Executed tasks
[INFO]
[INFO] --- maven-surefire-plugin:2.21.0:test (default-test) @ log4j ---
[INFO] Tests are skipped.
[INFO]
[INFO] --- maven-antrun-plugin:1.8:run (runAll) @ log4j ---
[WARNING] Parameter tasks is deprecated, use target instead
[INFO] Executing tasks
main:
parentBuild:
prepare:
[available] DEPRECATED - used to override an existing property.
[available] Build file should not reuse the same property name for different values.
[mkdir] Created dir: /usr/src/RPM/BUILD/log4j-1_2_17/tests/classes
build:
[javac] /usr/src/RPM/BUILD/log4j-1_2_17/tests/build.xml:144: warning: 'includeantruntime' was not set, defaulting to build.sysclasspath=last; set to false for repeatable builds
[javac] Compiling 88 source files to /usr/src/RPM/BUILD/log4j-1_2_17/tests/classes
warning: [options] bootstrap class path not set in conjunction with -source 1.6
Note: Some input files use or override a deprecated API.
Note: Recompile with -Xlint:deprecation for details.
Note: Some input files use unchecked or unsafe operations.
Note: Recompile with -Xlint:unchecked for details.
1 warning
Core:
[junit] Running org.apache.log4j.CoreTestSuite
[junit] Testsuite: org.apache.log4j.CoreTestSuite
[junit] Tests run: 502, Failures: 0, Errors: 0, Skipped: 0, Time elapsed: 25.818 sec
[junit] Tests run: 502, Failures: 0, Errors: 0, Skipped: 0, Time elapsed: 25.818 sec
[junit] ------------- Standard Output ---------------
[junit] จ., ก.ค. 03, 00:00:00.000 GMT
[junit] จ., ก.ค. 03, 00:00:00.000 GMT
[junit] จ., ก.ค. 03, 00:00:00.000 GMT
[junit] จ., ก.ค. 03, 00:00:00.000 GMT
[junit] จ., ก.ค. 03, 00:00:00.008 GMT
[junit] จ., ก.ค. 03, 00:00:00.008 GMT
[junit] ------------- ---------------- ---------------
[junit] ------------- Standard Error -----------------
[junit] log4j:ERROR Could not read configuration file [output/badescape.properties].
[junit] java.lang.IllegalArgumentException: Malformed \uxxxx encoding.
[junit] at java.util.Properties.loadConvert(Properties.java:574)
[junit] at java.util.Properties.load0(Properties.java:391)
[junit] at java.util.Properties.load(Properties.java:341)
[junit] at org.apache.log4j.PropertyConfigurator.doConfigure(PropertyConfigurator.java:373)
[junit] at org.apache.log4j.PropertyConfigurator.configure(PropertyConfigurator.java:403)
[junit] at org.apache.log4j.PropertyConfiguratorTest.testBadUnicodeEscape(PropertyConfiguratorTest.java:58)
[junit] at sun.reflect.NativeMethodAccessorImpl.invoke0(Native Method)
[junit] at sun.reflect.NativeMethodAccessorImpl.invoke(NativeMethodAccessorImpl.java:62)
[junit] at sun.reflect.DelegatingMethodAccessorImpl.invoke(DelegatingMethodAccessorImpl.java:43)
[junit] at java.lang.reflect.Method.invoke(Method.java:498)
[junit] at junit.framework.TestCase.runTest(TestCase.java:176)
[junit] at junit.framework.TestCase.runBare(TestCase.java:141)
[junit] at junit.framework.TestResult$1.protect(TestResult.java:122)
[junit] at junit.framework.TestResult.runProtected(TestResult.java:142)
[junit] at junit.framework.TestResult.run(TestResult.java:125)
[junit] at junit.framework.TestCase.run(TestCase.java:129)
[junit] at junit.framework.TestSuite.runTest(TestSuite.java:252)
[junit] at junit.framework.TestSuite.run(TestSuite.java:247)
[junit] at junit.framework.TestSuite.runTest(TestSuite.java:252)
[junit] at junit.framework.TestSuite.run(TestSuite.java:247)
[junit] at org.apache.tools.ant.taskdefs.optional.junit.JUnitTestRunner.run(JUnitTestRunner.java:536)
[junit] at org.apache.tools.ant.taskdefs.optional.junit.JUnitTestRunner.launch(JUnitTestRunner.java:1205)
[junit] at org.apache.tools.ant.taskdefs.optional.junit.JUnitTestRunner.main(JUnitTestRunner.java:1048)
[junit] log4j:ERROR Ignoring configuration file [output/badescape.properties].
[junit] log4j:ERROR Could not read configuration file from URL [file:/usr/src/RPM/BUILD/log4j-1_2_17/tests/output/urlbadescape.properties].
[junit] java.lang.IllegalArgumentException: Malformed \uxxxx encoding.
[junit] at java.util.Properties.loadConvert(Properties.java:574)
[junit] at java.util.Properties.load0(Properties.java:391)
[junit] at java.util.Properties.load(Properties.java:341)
[junit] at org.apache.log4j.PropertyConfigurator.doConfigure(PropertyConfigurator.java:558)
[junit] at org.apache.log4j.PropertyConfigurator.configure(PropertyConfigurator.java:415)
[junit] at org.apache.log4j.PropertyConfiguratorTest.testURLBadEscape(PropertyConfiguratorTest.java:92)
[junit] at sun.reflect.NativeMethodAccessorImpl.invoke0(Native Method)
[junit] at sun.reflect.NativeMethodAccessorImpl.invoke(NativeMethodAccessorImpl.java:62)
[junit] at sun.reflect.DelegatingMethodAccessorImpl.invoke(DelegatingMethodAccessorImpl.java:43)
[junit] at java.lang.reflect.Method.invoke(Method.java:498)
[junit] at junit.framework.TestCase.runTest(TestCase.java:176)
[junit] at junit.framework.TestCase.runBare(TestCase.java:141)
[junit] at junit.framework.TestResult$1.protect(TestResult.java:122)
[junit] at junit.framework.TestResult.runProtected(TestResult.java:142)
[junit] at junit.framework.TestResult.run(TestResult.java:125)
[junit] at junit.framework.TestCase.run(TestCase.java:129)
[junit] at junit.framework.TestSuite.runTest(TestSuite.java:252)
[junit] at junit.framework.TestSuite.run(TestSuite.java:247)
[junit] at junit.framework.TestSuite.runTest(TestSuite.java:252)
[junit] at junit.framework.TestSuite.run(TestSuite.java:247)
[junit] at org.apache.tools.ant.taskdefs.optional.junit.JUnitTestRunner.run(JUnitTestRunner.java:536)
[junit] at org.apache.tools.ant.taskdefs.optional.junit.JUnitTestRunner.launch(JUnitTestRunner.java:1205)
[junit] at org.apache.tools.ant.taskdefs.optional.junit.JUnitTestRunner.main(JUnitTestRunner.java:1048)
[junit] log4j:ERROR Ignoring configuration file [file:/usr/src/RPM/BUILD/log4j-1_2_17/tests/output/urlbadescape.properties].
[junit] log4j:ERROR Unrecognized format specifier [bogus]
[junit] log4j:ERROR Unrecognized conversion specifier [bogus] starting at position 6 in conversion pattern.
[junit] log4j:ERROR Unrecognized format specifier []
[junit] log4j:ERROR Empty conversion specifier starting at position 2 in conversion pattern.
[junit] log4j:ERROR Unrecognized format specifier []
[junit] log4j:ERROR Empty conversion specifier starting at position 6 in conversion pattern.
[junit] ------------- ---------------- ---------------
[junit]
[junit] Testcase: testLocationInfoNoFQCN took 0.008 sec
[junit] Testcase: testSerializationMDC took 0.036 sec
[junit] Testcase: testSerializationNDC took 0.002 sec
[junit] Testcase: testBadMessage took 0.003 sec
[junit] Testcase: testLevel took 0 sec
[junit] Testcase: testSerializationWithException took 0.059 sec
[junit] Testcase: testDeserializationWithException took 0.015 sec
[junit] Testcase: testDeserializationSimple took 0.002 sec
[junit] Testcase: testDeserializationWithLocation took 0.004 sec
[junit] Testcase: testSerializationSimple took 0 sec
[junit] Testcase: testFQNOfCategoryClass took 0 sec
[junit] Testcase: testSerializationWithLocation took 0.001 sec
[junit] Testcase: testSerializeINFO took 0.001 sec
[junit] Testcase: testALL took 0 sec
[junit] Testcase: testOFF took 0 sec
[junit] Testcase: testDEBUG took 0 sec
[junit] Testcase: testERROR took 0 sec
[junit] Testcase: testFATAL took 0 sec
[junit] Testcase: testTRACE took 0 sec
[junit] Testcase: testTrace took 0 sec
[junit] Testcase: testINFO took 0 sec
[junit] Testcase: testWARN took 0 sec
[junit] Testcase: testCustomLevelSerialization took 0.004 sec
[junit] Testcase: testDottedLowerI took 0.004 sec
[junit] Testcase: testIntToFatal took 0 sec
[junit] Testcase: testIntToTrace took 0 sec
[junit] Testcase: testDotlessLowerI took 0.007 sec
[junit] Testcase: testSerialVersionUID took 0 sec
[junit] Testcase: testLevelExtendsPriority took 0 sec
[junit] Testcase: testStringToTrace took 0 sec
[junit] Testcase: testIntToAll took 0 sec
[junit] Testcase: testIntToOff took 0 sec
[junit] Testcase: testToLevelNull took 0 sec
[junit] Testcase: testToLevelUnrecognizedInt took 0 sec
[junit] Testcase: testDeserializeINFO took 0 sec
[junit] Testcase: testTraceInt took 0 sec
[junit] Testcase: testToPriorityIntPriority took 0 sec
[junit] Testcase: testToPriorityStringPriority took 0 sec
[junit] Testcase: testEqualsLevel took 0 sec
[junit] Testcase: testToPriorityString took 0 sec
[junit] Testcase: testDEBUG took 0 sec
[junit] Testcase: testERROR took 0 sec
[junit] Testcase: testFatal took 0 sec
[junit] Testcase: testINFO took 0 sec
[junit] Testcase: testWARN took 0 sec
[junit] Testcase: testDottedLowerI took 0 sec
[junit] Testcase: testEqualsNull took 0.002 sec
[junit] Testcase: testDotlessLowerI took 0 sec
[junit] Testcase: testGetAllPossiblePriorities took 0 sec
[junit] Testcase: testWarnInt took 0 sec
[junit] Testcase: testAllInt took 0 sec
[junit] Testcase: testDebugInt took 0 sec
[junit] Testcase: testToPriorityInt took 0 sec
[junit] Testcase: testInfoInt took 0 sec
[junit] Testcase: testOffInt took 0 sec
[junit] Testcase: testFatalInt took 0 sec
[junit] Testcase: testErrorInt took 0 sec
[junit] Testcase: testForcedLog took 0.109 sec
[junit] Testcase: testSetPriority took 0.001 sec
[junit] Testcase: testL7dlog4Param took 0 sec
[junit] Testcase: testL7dlog took 0 sec
[junit] Testcase: testGetChainedPriorityReturnType took 0 sec
[junit] Testcase: testgetSetThreshold took 0.003 sec
[junit] Testcase: testGetThresholdReturnType took 0.003 sec
[junit] Testcase: testDirectoryCreation took 0.014 sec
[junit] Testcase: testIsAsSevereAsThreshold took 0 sec
[junit] Testcase: testConfiguratorClassKey took 0 sec
[junit] Testcase: testDefaultConfigurationFile took 0 sec
[junit] Testcase: testDefaultXmlConfigurationFile took 0 sec
[junit] Testcase: testDefaultConfigurationKey took 0 sec
[junit] Testcase: testDefaultInitOverrideKey took 0 sec
[junit] Testcase: testConfigDebugKey took 0 sec
[junit] Testcase: testDebugKey took 0.001 sec
[junit] Testcase: testLineSepLen took 0 sec
[junit] Testcase: testLineSep took 0 sec
[junit] Testcase: testIgnoresThrowable took 0 sec
[junit] Testcase: testGetFooter took 0 sec
[junit] Testcase: testGetHeader took 0 sec
[junit] Testcase: testFormat took 0 sec
[junit] Testcase: testGetContentType took 0 sec
[junit] Testcase: testSetDateFormatWithFormat took 0.021 sec
[junit] Testcase: testISO8601Format took 0.001 sec
[junit] Testcase: testSetDateFormatNullString took 0 sec
[junit] Testcase: testSetDateFormatNull took 0 sec
[junit] Testcase: testRelativeTimeDateFormat took 0.002 sec
[junit] Testcase: testSetDateFormat took 0.001 sec
[junit] Testcase: testGetOptionStrings took 0 sec
[junit] Testcase: testDateFormatOption took 0 sec
[junit] Testcase: testSetTimeZone took 0 sec
[junit] Testcase: testSetDateFormatAbsolute took 0 sec
[junit] Testcase: testSetDateFormatDateTime took 0 sec
[junit] Testcase: testSetDateFormatSimple took 0.003 sec
[junit] Testcase: testSetOptionDateFormat took 0 sec
[junit] Testcase: testActivateOptions took 0 sec
[junit] Testcase: testDateTimeFormat took 0 sec
[junit] Testcase: testTimeZoneOption took 0 sec
[junit] Testcase: testSetOptionTimeZone took 0.001 sec
[junit] Testcase: testNullDateFormat took 0 sec
[junit] Testcase: testSetDateFormatRelative took 0 sec
[junit] Testcase: testSetDateFormatISO8601 took 0 sec
[junit] Testcase: testLineSepLen took 0 sec
[junit] Testcase: testLineSep took 0 sec
[junit] Testcase: testIgnoresThrowable took 0 sec
[junit] Testcase: testGetFooter took 0 sec
[junit] Testcase: testGetHeader took 0 sec
[junit] Testcase: testFormat took 0 sec
[junit] Testcase: testGetContentType took 0 sec
[junit] Testcase: testGetSetCategoryPrefixing took 0 sec
[junit] Testcase: testGetSetContextPrinting took 0 sec
[junit] Testcase: testFormat took 0 sec
[junit] Testcase: testGetSetThreadPrinting took 0 sec
[junit] Testcase: testSetDateFormatWithFormat took 0.002 sec
[junit] Testcase: testISO8601Format took 0.001 sec
[junit] Testcase: testSetDateFormatNullString took 0 sec
[junit] Testcase: testSetDateFormatNull took 0 sec
[junit] Testcase: testRelativeTimeDateFormat took 0 sec
[junit] Testcase: testSetDateFormat took 0 sec
[junit] Testcase: testGetOptionStrings took 0 sec
[junit] Testcase: testDateFormatOption took 0 sec
[junit] Testcase: testSetTimeZone took 0 sec
[junit] Testcase: testSetDateFormatAbsolute took 0 sec
[junit] Testcase: testSetDateFormatDateTime took 0.001 sec
[junit] Testcase: testSetDateFormatSimple took 0 sec
[junit] Testcase: testSetOptionDateFormat took 0 sec
[junit] Testcase: testActivateOptions took 0 sec
[junit] Testcase: testDateTimeFormat took 0.002 sec
[junit] Testcase: testTimeZoneOption took 0 sec
[junit] Testcase: testSetOptionTimeZone took 0 sec
[junit] Testcase: testNullDateFormat took 0 sec
[junit] Testcase: testSetDateFormatRelative took 0 sec
[junit] Testcase: testSetDateFormatISO8601 took 0 sec
[junit] Testcase: testLineSepLen took 0 sec
[junit] Testcase: testLineSep took 0 sec
[junit] Testcase: testIgnoresThrowable took 0 sec
[junit] Testcase: testGetFooter took 0 sec
[junit] Testcase: testGetHeader took 0 sec
[junit] Testcase: testGetContentType took 0 sec
[junit] Testcase: testNDCWithCDATA took 0.088 sec
[junit] Testcase: testFormatWithException took 0.014 sec
[junit] Testcase: testExceptionWithCDATA took 0.004 sec
[junit] Testcase: testActivateOptions took 0 sec
[junit] Testcase: testGetSetLocationInfo took 0.002 sec
[junit] Testcase: testFormatWithNDC took 0.004 sec
[junit] Testcase: testFormat took 0.003 sec
[junit] Testcase: testProblemCharacters took 0.012 sec
[junit] Testcase: testLineSepLen took 0 sec
[junit] Testcase: testLineSep took 0 sec
[junit] Testcase: testIgnoresThrowable took 0 sec
[junit] Testcase: testGetFooter took 0 sec
[junit] Testcase: testGetHeader took 0 sec
[junit] Testcase: testGetContentType took 0 sec
[junit] Testcase: testGetSetTitle took 0.004 sec
[junit] Testcase: testFormatResize took 0 sec
[junit] Testcase: testGetHeaderWithLocation took 0.013 sec
[junit] Testcase: testActivateOptions took 0 sec
[junit] Testcase: testGetSetLocationInfo took 0 sec
[junit] Testcase: testGetFooter took 0 sec
[junit] Testcase: testGetHeader took 0 sec
[junit] Testcase: testFormat took 0.017 sec
[junit] Testcase: testProblemCharacters took 0.028 sec
[junit] Testcase: testLineSepLen took 0 sec
[junit] Testcase: testLineSep took 0 sec
[junit] Testcase: testIgnoresThrowable took 0 sec
[junit] Testcase: testGetContentType took 0 sec
[junit] Testcase: testFormatResize took 0.003 sec
[junit] Testcase: testGetPatternFormat took 0 sec
[junit] Testcase: testDefaultConversionPattern took 0 sec
[junit] Testcase: testFormat took 0 sec
[junit] Testcase: testTTCCConversionPattern took 0 sec
[junit] Testcase: testLineSepLen took 0 sec
[junit] Testcase: testLineSep took 0 sec
[junit] Testcase: testIgnoresThrowable took 0 sec
[junit] Testcase: testGetFooter took 0 sec
[junit] Testcase: testGetHeader took 0.004 sec
[junit] Testcase: testGetContentType took 0 sec
[junit] Testcase: testLocationInfoNoFQCN took 0 sec
[junit] Testcase: testSerializationMDC took 0 sec
[junit] Testcase: testSerializationNDC took 0 sec
[junit] Testcase: testBadMessage took 0 sec
[junit] Testcase: testLevel took 0 sec
[junit] Testcase: testSerializationWithException took 0.001 sec
[junit] Testcase: testDeserializationWithException took 0.004 sec
[junit] Testcase: testDeserializationSimple took 0 sec
[junit] Testcase: testDeserializationWithLocation took 0.004 sec
[junit] Testcase: testSerializationSimple took 0 sec
[junit] Testcase: testFQNOfCategoryClass took 0 sec
[junit] Testcase: testSerializationWithLocation took 0.003 sec
[junit] Testcase: testLineFeedBlank took 0.001 sec
[junit] Testcase: testEmpty took 0 sec
[junit] Testcase: testParsing took 0 sec
[junit] Testcase: testNull took 0 sec
[junit] Testcase: testCarriageReturn took 0 sec
[junit] Testcase: testGetThrowable took 0 sec
[junit] Testcase: testNotOverriddenBehavior took 0.004 sec
[junit] Testcase: testOverriddenBehavior took 0 sec
[junit] Testcase: testIsolation took 0 sec
[junit] Testcase: testNastyException took 0 sec
[junit] Testcase: testLineFeed took 0 sec
[junit] Testcase: testFourParamConstructor took 0.001 sec
[junit] Testcase: testLocationInfo took 0.003 sec
[junit] Testcase: testBadUnicodeEscape took 0.008 sec
[junit] Testcase: testURL took 0.004 sec
[junit] Testcase: testURLBadEscape took 0.004 sec
[junit] Testcase: testReset took 0.004 sec
[junit] Testcase: testInputStream took 0.172 sec
[junit] Testcase: testThrowableRenderer took 0.005 sec
[junit] Testcase: testJarURL took 0.02 sec
[junit] Testcase: testNested took 0.001 sec
[junit] Testcase: testTrigger took 0.221 sec
[junit] Testcase: testDefaultRender took 0 sec
[junit] Testcase: testEnhancedRender took 0.009 sec
[junit] Testcase: testThrowing took 0.105 sec
[junit] Testcase: testExiting took 0.1 sec
[junit] Testcase: testEnteringNullNullNullArray took 0.1 sec
[junit] Testcase: testExitingNullNullNull took 0.1 sec
[junit] Testcase: testEntering took 0.1 sec
[junit] Testcase: testExitingWithValue took 0.1 sec
[junit] Testcase: testEnteringWithBadParam took 0.1 sec
[junit] Testcase: testExitingNullNull took 0.1 sec
[junit] Testcase: testEnteringWithBadParams took 0.1 sec
[junit] Testcase: testThrowingNullNullNull took 0.1 sec
[junit] Testcase: testExitingWithBadValue took 0.1 sec
[junit] Testcase: testEnteringNullNullNull took 0.1 sec
[junit] Testcase: testEnteringWithParam took 0.1 sec
[junit] Testcase: testEnteringNullNull took 0.101 sec
[junit] Testcase: testLogDouble took 0.112 sec
[junit] Testcase: testWarnFourArg took 0.103 sec
[junit] Testcase: testLogrbBoolean took 0.102 sec
[junit] Testcase: testInfoDouble took 0.1 sec
[junit] Testcase: testLogrbArrayArg took 0.1 sec
[junit] Testcase: testLogThreeArg took 0.101 sec
[junit] Testcase: testLogString took 0.101 sec
[junit] Testcase: testLogTwoArg took 0.1 sec
[junit] Testcase: testLogFloat took 0.101 sec
[junit] Testcase: testLogNoArg took 0.1 sec
[junit] Testcase: testLogShort took 0.1 sec
[junit] Testcase: testLogrbMissingArg took 0.1 sec
[junit] Testcase: testLogrbInt took 0.1 sec
[junit] Testcase: testInfoString took 0.1 sec
[junit] Testcase: testInfoTwoArg took 0.101 sec
[junit] Testcase: testDebugArrayArg took 0.1 sec
[junit] Testcase: testTraceNullArrayArg took 0.1 sec
[junit] Testcase: testWarnBoolean took 0.102 sec
[junit] Testcase: testTraceThreeArg took 0.101 sec
[junit] Testcase: testInfoArrayArg took 0.1 sec
[junit] Testcase: testWarnFloat took 0.101 sec
[junit] Testcase: testDebugFullPrecisionAndPercent took 0.101 sec
[junit] Testcase: testWarnNoArg took 0.1 sec
[junit] Testcase: testWarnShort took 0.1 sec
[junit] Testcase: testLogMissingArg took 0.1 sec
[junit] Testcase: testInfo10ParamBrace9 took 0.1 sec
[junit] Testcase: testTraceMissingArg took 0.1 sec
[junit] Testcase: testTraceDouble took 0.101 sec
[junit] Testcase: testLogrbByte took 0.1 sec
[junit] Testcase: testLogrbChar took 0.1 sec
[junit] Testcase: testLogrbLong took 0.101 sec
[junit] Testcase: testLogrbNull took 0.1 sec
[junit] Testcase: testInfoNullPattern took 0.1 sec
[junit] Testcase: testDebugBadPattern took 0.1 sec
[junit] Testcase: testTraceString took 0.102 sec
[junit] Testcase: testInfoMissingArg took 0.1 sec
[junit] Testcase: testTraceTwoArg took 0.101 sec
[junit] Testcase: testWarnMissingArg took 0.101 sec
[junit] Testcase: testLogArrayArg took 0.101 sec
[junit] Testcase: testLogByte took 0.101 sec
[junit] Testcase: testLogChar took 0.1 sec
[junit] Testcase: testLogLong took 0.1 sec
[junit] Testcase: testLogNull took 0.101 sec
[junit] Testcase: testLogrbNullBundle took 0.1 sec
[junit] Testcase: testWarnDouble took 0.101 sec
[junit] Testcase: testTraceArrayArg took 0.1 sec
[junit] Testcase: testLogrbNullKey took 0.101 sec
[junit] Testcase: testTraceFloat took 0.101 sec
[junit] Testcase: testTraceNoArg took 0.1 sec
[junit] Testcase: testTraceShort took 0.101 sec
[junit] Testcase: testWarnThreeArg took 0.101 sec
[junit] Testcase: testLogNullPattern took 0.1 sec
[junit] Testcase: testDebugByte took 0.1 sec
[junit] Testcase: testDebugChar took 0.101 sec
[junit] Testcase: testDebugDate took 0.102 sec
[junit] Testcase: testDebugLong took 0.1 sec
[junit] Testcase: testDebugNull took 0.101 sec
[junit] Testcase: testLogrbBadPattern took 0.101 sec
[junit] Testcase: testWarnString took 0.1 sec
[junit] Testcase: testWarnTwoArg took 0.102 sec
[junit] Testcase: testTraceFourArg took 0.1 sec
[junit] Testcase: testClassName took 0.001 sec
[junit] Testcase: testWarnInt took 0.1 sec
[junit] Testcase: testLogrbFloat took 0.101 sec
[junit] Testcase: testLogrbNoArg took 0.1 sec
[junit] Testcase: testLogrbShort took 0.101 sec
[junit] Testcase: testLogFourArg took 0.101 sec
[junit] Testcase: testLogrbThreeArg took 0.1 sec
[junit] Testcase: testInfoByte took 0.101 sec
[junit] Testcase: testInfoChar took 0.101 sec
[junit] Testcase: testInfoLong took 0.101 sec
[junit] Testcase: testInfoNull took 0.1 sec
[junit] Testcase: testLogrbDouble took 0.101 sec
[junit] Testcase: testInfoFourArg took 0.1 sec
[junit] Testcase: testInfo1ParamBrace9 took 0.101 sec
[junit] Testcase: testLogBadPattern took 0.101 sec
[junit] Testcase: testInfo2ParamBrace9 took 0.101 sec
[junit] Testcase: testDebugNullArrayArg took 0.101 sec
[junit] Testcase: testWarnByte took 0.101 sec
[junit] Testcase: testWarnChar took 0.101 sec
[junit] Testcase: testWarnLong took 0.101 sec
[junit] Testcase: testWarnNull took 0.101 sec
[junit] Testcase: testTraceBadPattern took 0.102 sec
[junit] Testcase: testDebugPercent took 0.1 sec
[junit] Testcase: testDebugFourArg took 0.1 sec
[junit] Testcase: testDebugInt took 0.1 sec
[junit] Testcase: testDebugThreeArg took 0.102 sec
[junit] Testcase: testTraceBoolean took 0.101 sec
[junit] Testcase: testTraceByte took 0.101 sec
[junit] Testcase: testTraceChar took 0.101 sec
[junit] Testcase: testTraceLong took 0.101 sec
[junit] Testcase: testTraceNull took 0.101 sec
[junit] Testcase: testLogrbString took 0.101 sec
[junit] Testcase: testLogrbTwoArg took 0.101 sec
[junit] Testcase: testDebugMissingArg took 0.101 sec
[junit] Testcase: testInfoThreeArg took 0.101 sec
[junit] Testcase: testLogInt took 0.1 sec
[junit] Testcase: testLogrbFourArg took 0.101 sec
[junit] Testcase: testInfoInt took 0.101 sec
[junit] Testcase: testLogBoolean took 0.1 sec
[junit] Testcase: testDebugDouble took 0.102 sec
[junit] Testcase: testDebugFloat took 0.1 sec
[junit] Testcase: testInfoBadPattern took 0.1 sec
[junit] Testcase: testDebugNoArg took 0.101 sec
[junit] Testcase: testInfoBoolean took 0.101 sec
[junit] Testcase: testDebugShort took 0.101 sec
[junit] Testcase: testWarnBadPattern took 0.1 sec
[junit] Testcase: testWarnNullPattern took 0.101 sec
[junit] Testcase: testTraceNullPattern took 0.101 sec
[junit] Testcase: testInfoFloat took 0.1 sec
[junit] Testcase: testInfoNoArg took 0.1 sec
[junit] Testcase: testWarnArrayArg took 0.1 sec
[junit] Testcase: testInfoShort took 0.101 sec
[junit] Testcase: testTraceInt took 0.1 sec
[junit] Testcase: testDebugBoolean took 0.101 sec
[junit] Testcase: testDebugQuoted took 0.101 sec
[junit] Testcase: testInfo1ParamBraceSlashColon took 0.101 sec
[junit] Testcase: testDebugNullPattern took 0.101 sec
[junit] Testcase: testDebugString took 0.101 sec
[junit] Testcase: testDebugTwoArg took 0.1 sec
[junit] Testcase: testLogDouble took 0.102 sec
[junit] Testcase: testWarnFourArg took 0.1 sec
[junit] Testcase: testLogrbBoolean took 0.103 sec
[junit] Testcase: testInfoDouble took 0.102 sec
[junit] Testcase: testLogrbArrayArg took 0.101 sec
[junit] Testcase: testLogThreeArg took 0.101 sec
[junit] Testcase: testLogString took 0.101 sec
[junit] Testcase: testLogTwoArg took 0.1 sec
[junit] Testcase: testLogFloat took 0.102 sec
[junit] Testcase: testLogNoArg took 0.1 sec
[junit] Testcase: testLogShort took 0.1 sec
[junit] Testcase: testLogrbMissingArg took 0.101 sec
[junit] Testcase: testLogrbInt took 0.1 sec
[junit] Testcase: testInfoString took 0.102 sec
[junit] Testcase: testInfoTwoArg took 0.1 sec
[junit] Testcase: testDebugArrayArg took 0.101 sec
[junit] Testcase: testTraceNullArrayArg took 0.101 sec
[junit] Testcase: testWarnBoolean took 0.101 sec
[junit] Testcase: testTraceThreeArg took 0.101 sec
[junit] Testcase: testInfoArrayArg took 0.101 sec
[junit] Testcase: testWarnFloat took 0.101 sec
[junit] Testcase: testWarnNoArg took 0.101 sec
[junit] Testcase: testWarnShort took 0.101 sec
[junit] Testcase: testLogMissingArg took 0.101 sec
[junit] Testcase: testTraceMissingArg took 0.1 sec
[junit] Testcase: testTraceDouble took 0.101 sec
[junit] Testcase: testLogrbByte took 0.1 sec
[junit] Testcase: testLogrbChar took 0.101 sec
[junit] Testcase: testLogrbLong took 0.101 sec
[junit] Testcase: testLogrbNull took 0.1 sec
[junit] Testcase: testInfoNullPattern took 0.101 sec
[junit] Testcase: testDebugBadPattern took 0.1 sec
[junit] Testcase: testTraceString took 0.1 sec
[junit] Testcase: testInfoMissingArg took 0.101 sec
[junit] Testcase: testTraceTwoArg took 0.101 sec
[junit] Testcase: testWarnMissingArg took 0.101 sec
[junit] Testcase: testLogArrayArg took 0.101 sec
[junit] Testcase: testLogByte took 0.1 sec
[junit] Testcase: testLogChar took 0.1 sec
[junit] Testcase: testLogLong took 0.1 sec
[junit] Testcase: testLogNull took 0.1 sec
[junit] Testcase: testLogrbNullBundle took 0.1 sec
[junit] Testcase: testWarnDouble took 0.1 sec
[junit] Testcase: testTraceArrayArg took 0.101 sec
[junit] Testcase: testLogrbNullKey took 0.1 sec
[junit] Testcase: testTraceFloat took 0.101 sec
[junit] Testcase: testTraceNoArg took 0.101 sec
[junit] Testcase: testTraceShort took 0.101 sec
[junit] Testcase: testWarnThreeArg took 0.101 sec
[junit] Testcase: testLogNullPattern took 0.101 sec
[junit] Testcase: testDebugByte took 0.101 sec
[junit] Testcase: testDebugChar took 0.101 sec
[junit] Testcase: testDebugLong took 0.101 sec
[junit] Testcase: testDebugNull took 0.101 sec
[junit] Testcase: testLogrbBadPattern took 0.1 sec
[junit] Testcase: testWarnString took 0.101 sec
[junit] Testcase: testWarnTwoArg took 0.101 sec
[junit] Testcase: testTraceFourArg took 0.101 sec
[junit] Testcase: testClassName took 0.001 sec
[junit] Testcase: testEscapeTwoParam took 0.1 sec
[junit] Testcase: testWarnInt took 0.101 sec
[junit] Testcase: testLogrbFloat took 0.101 sec
[junit] Testcase: testLogrbNoArg took 0.101 sec
[junit] Testcase: testLogrbShort took 0.101 sec
[junit] Testcase: testEscapeOneParam took 0.101 sec
[junit] Testcase: testLogFourArg took 0.101 sec
[junit] Testcase: testLogrbThreeArg took 0.1 sec
[junit] Testcase: testInfoByte took 0.101 sec
[junit] Testcase: testInfoChar took 0.101 sec
[junit] Testcase: testInfoLong took 0.101 sec
[junit] Testcase: testInfoNull took 0.101 sec
[junit] Testcase: testLogrbDouble took 0.101 sec
[junit] Testcase: testLogBadPattern took 0.101 sec
[junit] Testcase: testDebugNullArrayArg took 0.101 sec
[junit] Testcase: testWarnByte took 0.1 sec
[junit] Testcase: testWarnChar took 0.101 sec
[junit] Testcase: testWarnLong took 0.101 sec
[junit] Testcase: testWarnNull took 0.1 sec
[junit] Testcase: testTraceBadPattern took 0.101 sec
[junit] Testcase: testDebugFourArg took 0.1 sec
[junit] Testcase: testDebugInt took 0.101 sec
[junit] Testcase: testDebugThreeArg took 0.101 sec
[junit] Testcase: testTraceBoolean took 0.101 sec
[junit] Testcase: testTraceByte took 0.101 sec
[junit] Testcase: testTraceChar took 0.101 sec
[junit] Testcase: testTraceLong took 0.101 sec
[junit] Testcase: testTraceNull took 0.101 sec
[junit] Testcase: testLogrbString took 0.101 sec
[junit] Testcase: testLogrbTwoArg took 0.101 sec
[junit] Testcase: testDebugMissingArg took 0.1 sec
[junit] Testcase: testInfoThreeArg took 0.1 sec
[junit] Testcase: testLogInt took 0.1 sec
[junit] Testcase: testLogrbFourArg took 0.101 sec
[junit] Testcase: testInfoInt took 0.1 sec
[junit] Testcase: testLogBoolean took 0.101 sec
[junit] Testcase: testDebugDouble took 0.101 sec
[junit] Testcase: testDebugFloat took 0.101 sec
[junit] Testcase: testInfoBadPattern took 0.101 sec
[junit] Testcase: testDebugNoArg took 0.101 sec
[junit] Testcase: testInfoBoolean took 0.101 sec
[junit] Testcase: testDebugShort took 0.1 sec
[junit] Testcase: testWarnBadPattern took 0.1 sec
[junit] Testcase: testWarnNullPattern took 0.101 sec
[junit] Testcase: testTraceNullPattern took 0.1 sec
[junit] Testcase: testInfoFloat took 0.1 sec
[junit] Testcase: testInfoNoArg took 0.101 sec
[junit] Testcase: testWarnArrayArg took 0.101 sec
[junit] Testcase: testInfoShort took 0.101 sec
[junit] Testcase: testTraceInt took 0.101 sec
[junit] Testcase: testDebugBoolean took 0.1 sec
[junit] Testcase: testDebugNullPattern took 0.101 sec
[junit] Testcase: testDebugString took 0.101 sec
[junit] Testcase: testDebugTwoArg took 0.101 sec
[junit] Testcase: test10 took 0.001 sec
[junit] Testcase: test11 took 0 sec
[junit] Testcase: test12 took 0.001 sec
[junit] Testcase: test13 took 0 sec
[junit] Testcase: test14 took 0 sec
[junit] Testcase: test15 took 0 sec
[junit] Testcase: test16 took 0 sec
[junit] Testcase: test17 took 0.001 sec
[junit] Testcase: test1 took 0 sec
[junit] Testcase: test2 took 0 sec
[junit] Testcase: test3 took 0 sec
[junit] Testcase: test4 took 0.001 sec
[junit] Testcase: test5 took 0.004 sec
[junit] Testcase: test6 took 0 sec
[junit] Testcase: test8 took 0.001 sec
[junit] Testcase: test9 took 0.004 sec
[junit] Testcase: testTruncate took 0.001 sec
[junit] Testcase: testPadLeft took 0 sec
[junit] Testcase: testPadRight took 0 sec
[junit] Testcase: testGetDefault took 0 sec
[junit] Testcase: testConstructor took 0 sec
[junit] Testcase: testOne took 0.002 sec
[junit] Testcase: testTwo took 0 sec
[junit] Testcase: testBlank took 0 sec
[junit] Testcase: testMulti took 0 sec
[junit] Testcase: testZero took 0 sec
[junit] Testcase: testMinusOne took 0 sec
[junit] Testcase: testBlankOne took 0.001 sec
[junit] Testcase: testOneDot took 0 sec
[junit] Testcase: testOneTildeDot took 0 sec
[junit] Testcase: testGetDefault took 0 sec
[junit] Testcase: testBogus took 0.004 sec
[junit] Testcase: testMore took 0 sec
[junit] Testcase: testMultiOption took 0.001 sec
[junit] Testcase: testFileNamePatternFactories took 0 sec
[junit] Testcase: testMalformedOption took 0 sec
[junit] Testcase: testBasic1 took 0.001 sec
[junit] Testcase: testBasic2 took 0 sec
[junit] Testcase: testNewWord took 0 sec
[junit] Testcase: testBogusWord1 took 0 sec
[junit] Testcase: testBogusWord2 took 0 sec
[junit] Testcase: testPatternLayoutFactories took 0.001 sec
[junit] Testcase: testNewWord2 took 0 sec
[junit] Testcase: testToLevelFINEST took 0.001 sec
Minimum:
[junit] Running org.apache.log4j.MinimumTestCase
[junit] Testsuite: org.apache.log4j.MinimumTestCase
[junit] Tests run: 2, Failures: 0, Errors: 0, Skipped: 0, Time elapsed: 0.11 sec
[junit] Tests run: 2, Failures: 0, Errors: 0, Skipped: 0, Time elapsed: 0.11 sec
[junit]
[junit] Testcase: simple took 0.058 sec
[junit] Testcase: ttcc took 0.043 sec
Logger:
[junit] Running org.apache.log4j.LoggerTestCase
[junit] Testsuite: org.apache.log4j.LoggerTestCase
[junit] Tests run: 18, Failures: 0, Errors: 0, Skipped: 0, Time elapsed: 0.256 sec
[junit] Tests run: 18, Failures: 0, Errors: 0, Skipped: 0, Time elapsed: 0.256 sec
[junit] ------------- Standard Error -----------------
[junit] log4j:WARN No appenders could be found for logger (x).
[junit] log4j:WARN Please initialize the log4j system properly.
[junit] log4j:WARN See http://logging.apache.org/log4j/1.2/faq.html#noconfig for more info.
[junit] ------------- ---------------- ---------------
[junit]
[junit] Testcase: testAppender1 took 0.037 sec
[junit] Testcase: testAppender2 took 0.001 sec
[junit] Testcase: testTraceWithException took 0.102 sec
[junit] Testcase: testAppenderEvent1 took 0.002 sec
[junit] Testcase: testAppenderEvent2 took 0 sec
[junit] Testcase: testAppenderEvent3 took 0 sec
[junit] Testcase: testAppenderEvent4 took 0 sec
[junit] Testcase: testRB1 took 0.001 sec
[junit] Testcase: testRB2 took 0 sec
[junit] Testcase: testRB3 took 0 sec
[junit] Testcase: testTrace took 0.1 sec
[junit] Testcase: testAdditivity1 took 0 sec
[junit] Testcase: testAdditivity2 took 0 sec
[junit] Testcase: testAdditivity3 took 0.002 sec
[junit] Testcase: testHierarchy1 took 0 sec
[junit] Testcase: testIsTraceEnabled took 0 sec
[junit] Testcase: testDisable1 took 0 sec
[junit] Testcase: testExists took 0 sec
DOM:
[junit] Running org.apache.log4j.xml.DOMTestCase
[junit] Testsuite: org.apache.log4j.xml.DOMTestCase
[junit] Tests run: 10, Failures: 0, Errors: 0, Skipped: 0, Time elapsed: 0.452 sec
[junit] Tests run: 10, Failures: 0, Errors: 0, Skipped: 0, Time elapsed: 0.452 sec
[junit] ------------- Standard Output ---------------
[junit] /usr/src/RPM/BUILD/log4j-1_2_17/tests/input/xml/defaultInit.xml
[junit] log4j: reset attribute= "false".
[junit] log4j: Threshold ="null".
[junit] log4j: Level value for root is [OFF].
[junit] log4j: root level set to OFF
[junit] log4j: Class name: [org.apache.log4j.ConsoleAppender]
[junit] log4j: Parsing layout of class: "org.apache.log4j.PatternLayout"
[junit] log4j: Setting property [conversionPattern] to [%-5p %c{2} - %m%n].
[junit] log4j: Adding appender named [D1] to category [root].
[junit] ------------- ---------------- ---------------
[junit]
[junit] Testcase: testReset took 0.062 sec
[junit] Testcase: testOverrideSubst took 0.057 sec
[junit] Testcase: testLoggerFactory1 took 0.009 sec
[junit] Testcase: test1 took 0.123 sec
[junit] Testcase: test4 took 0.076 sec
[junit] Testcase: testConfigureAndWatch took 0.026 sec
[junit] Testcase: testCategoryFactory1 took 0.014 sec
[junit] Testcase: testCategoryFactory2 took 0.016 sec
[junit] Testcase: testThrowableRenderer1 took 0.02 sec
[junit] Testcase: testJarURL took 0.04 sec
CustomLevel:
[junit] Running org.apache.log4j.xml.CustomLevelTestCase
[junit] Testsuite: org.apache.log4j.xml.CustomLevelTestCase
[junit] Tests run: 4, Failures: 0, Errors: 0, Skipped: 0, Time elapsed: 0.467 sec
[junit] Tests run: 4, Failures: 0, Errors: 0, Skipped: 0, Time elapsed: 0.467 sec
[junit] ------------- Standard Output ---------------
[junit] log4j: reset attribute= "false".
[junit] log4j: Threshold ="null".
[junit] log4j: Level value for root is [TRACE#org.apache.log4j.xml.XLevel].
[junit] log4j: toLevel:class=[org.apache.log4j.xml.XLevel]:pri=[TRACE]
[junit] log4j: root level set to TRACE
[junit] log4j: Class name: [org.apache.log4j.FileAppender]
[junit] log4j: Setting property [append] to [false].
[junit] log4j: Setting property [file] to [output/temp].
[junit] log4j: Parsing layout of class: "org.apache.log4j.PatternLayout"
[junit] log4j: Setting property [conversionPattern] to [%-5p %c{2} - %m
[junit] ].
[junit] log4j: setFile called: output/temp, false
[junit] log4j: setFile ended
[junit] log4j: Adding appender named [TEMP] to category [root].
[junit] ------------- ---------------- ---------------
[junit]
[junit] Testcase: test1 took 0.31 sec
[junit] Testcase: test2 took 0.049 sec
[junit] Testcase: test3 took 0.041 sec
[junit] Testcase: test4 took 0.036 sec
CustomLogger:
[junit] Running org.apache.log4j.customLogger.XLoggerTestCase
[junit] Testsuite: org.apache.log4j.customLogger.XLoggerTestCase
[junit] Tests run: 2, Failures: 0, Errors: 0, Skipped: 0, Time elapsed: 0.206 sec
[junit] Tests run: 2, Failures: 0, Errors: 0, Skipped: 0, Time elapsed: 0.206 sec
[junit] ------------- Standard Output ---------------
[junit] log4j: reset attribute= "false".
[junit] log4j: Threshold ="null".
[junit] log4j: Level value for root is [TRACE].
[junit] log4j: Desired Level sub-class: [org.apache.log4j.xml.XLevel]
[junit] log4j: root level set to TRACE
[junit] log4j: Class name: [org.apache.log4j.FileAppender]
[junit] log4j: Setting property [append] to [false].
[junit] log4j: Setting property [file] to [output/temp].
[junit] log4j: Parsing layout of class: "org.apache.log4j.PatternLayout"
[junit] log4j: Setting property [conversionPattern] to [%-5p %c{2} - %m%n].
[junit] log4j: Setting property [levelToMatch] to [TRACE#org.apache.log4j.xml.XLevel].
[junit] log4j: toLevel:class=[org.apache.log4j.xml.XLevel]:pri=[TRACE]
[junit] log4j: Setting property [acceptOnMatch] to [true].
[junit] log4j: Adding filter of type [class org.apache.log4j.varia.LevelMatchFilter] to appender named [TEMP].
[junit] log4j: Adding filter of type [class org.apache.log4j.varia.DenyAllFilter] to appender named [TEMP].
[junit] log4j: setFile called: output/temp, false
[junit] log4j: setFile ended
[junit] log4j: Adding appender named [TEMP] to category [root].
[junit] ------------- ---------------- ---------------
[junit]
[junit] Testcase: test1 took 0.187 sec
[junit] Testcase: test2 took 0.013 sec
PatternLayout:
[junit] Running org.apache.log4j.PatternLayoutTestCase
[junit] Testsuite: org.apache.log4j.PatternLayoutTestCase
[junit] Tests run: 16, Failures: 0, Errors: 0, Skipped: 0, Time elapsed: 0.732 sec
[junit] Tests run: 16, Failures: 0, Errors: 0, Skipped: 0, Time elapsed: 0.732 sec
[junit]
[junit] Testcase: testMDC1 took 0.083 sec
[junit] Testcase: test10 took 0.082 sec
[junit] Testcase: test11 took 0.047 sec
[junit] Testcase: test12 took 0.055 sec
[junit] Testcase: test13 took 0.05 sec
[junit] Testcase: test14 took 0.044 sec
[junit] Testcase: testMDCClear took 0.006 sec
[junit] Testcase: test1 took 0.032 sec
[junit] Testcase: test2 took 0.09 sec
[junit] Testcase: test3 took 0.062 sec
[junit] Testcase: test4 took 0.036 sec
[junit] Testcase: test5 took 0.047 sec
[junit] Testcase: test6 took 0.022 sec
[junit] Testcase: test7 took 0.021 sec
[junit] Testcase: test8 took 0.017 sec
[junit] Testcase: test9 took 0.014 sec
[junit] Running org.apache.log4j.EnhancedPatternLayoutTestCase
[junit] Testsuite: org.apache.log4j.EnhancedPatternLayoutTestCase
[junit] Tests run: 19, Failures: 0, Errors: 0, Skipped: 0, Time elapsed: 0.362 sec
[junit] Tests run: 19, Failures: 0, Errors: 0, Skipped: 0, Time elapsed: 0.362 sec
[junit]
[junit] Testcase: testMDC1 took 0.071 sec
[junit] Testcase: testMDC2 took 0.003 sec
[junit] Testcase: test10 took 0.022 sec
[junit] Testcase: test11 took 0.017 sec
[junit] Testcase: test12 took 0.016 sec
[junit] Testcase: test13 took 0.015 sec
[junit] Testcase: test14 took 0.009 sec
[junit] Testcase: test15 took 0.015 sec
[junit] Testcase: test16 took 0.014 sec
[junit] Testcase: testThrowable took 0.007 sec
[junit] Testcase: test1 took 0.008 sec
[junit] Testcase: test2 took 0.034 sec
[junit] Testcase: test3 took 0.015 sec
[junit] Testcase: test4 took 0.014 sec
[junit] Testcase: test5 took 0.021 sec
[junit] Testcase: test6 took 0.021 sec
[junit] Testcase: test7 took 0.019 sec
[junit] Testcase: test8 took 0.02 sec
[junit] Testcase: test9 took 0.014 sec
HierarchyThreshold:
[delete] Deleting: /usr/src/RPM/BUILD/log4j-1_2_17/tests/output/temp
[junit] Running org.apache.log4j.HierarchyThresholdTestCase
[junit] Testsuite: org.apache.log4j.HierarchyThresholdTestCase
[junit] Tests run: 8, Failures: 0, Errors: 0, Skipped: 0, Time elapsed: 0.044 sec
[junit] Tests run: 8, Failures: 0, Errors: 0, Skipped: 0, Time elapsed: 0.044 sec
[junit] ------------- Standard Output ---------------
[junit] Tearing down test case.
[junit] Tearing down test case.
[junit] Tearing down test case.
[junit] Tearing down test case.
[junit] Tearing down test case.
[junit] Tearing down test case.
[junit] Tearing down test case.
[junit] Tearing down test case.
[junit] ------------- ---------------- ---------------
[junit]
[junit] Testcase: test1 took 0.032 sec
[junit] Testcase: test2 took 0.001 sec
[junit] Testcase: test3 took 0 sec
[junit] Testcase: test4 took 0.004 sec
[junit] Testcase: test5 took 0 sec
[junit] Testcase: test6 took 0.001 sec
[junit] Testcase: test7 took 0.001 sec
[junit] Testcase: test8 took 0.001 sec
DefaultInit:
[junit] Running org.apache.log4j.defaultInit.TestCase1
[junit] Testsuite: org.apache.log4j.defaultInit.TestCase1
[junit] Tests run: 1, Failures: 0, Errors: 0, Skipped: 0, Time elapsed: 0.033 sec
[junit] Tests run: 1, Failures: 0, Errors: 0, Skipped: 0, Time elapsed: 0.033 sec
[junit]
[junit] Testcase: noneTest took 0.022 sec
[copy] Copying 1 file to /usr/src/RPM/BUILD/log4j-1_2_17/tests/classes
[junit] Running org.apache.log4j.defaultInit.TestCase2
[junit] Testsuite: org.apache.log4j.defaultInit.TestCase2
[junit] Tests run: 1, Failures: 0, Errors: 0, Skipped: 0, Time elapsed: 0.249 sec
[junit] Tests run: 1, Failures: 0, Errors: 0, Skipped: 0, Time elapsed: 0.249 sec
[junit] ------------- Standard Output ---------------
[junit] log4j: reset attribute= "false".
[junit] log4j: Threshold ="null".
[junit] log4j: Level value for root is [OFF].
[junit] log4j: root level set to OFF
[junit] log4j: Class name: [org.apache.log4j.ConsoleAppender]
[junit] log4j: Parsing layout of class: "org.apache.log4j.PatternLayout"
[junit] log4j: Setting property [conversionPattern] to [%-5p %c{2} - %m%n].
[junit] log4j: Adding appender named [D1] to category [root].
[junit] ------------- ---------------- ---------------
[junit]
[junit] Testcase: xmlTest took 0.228 sec
[delete] Deleting: /usr/src/RPM/BUILD/log4j-1_2_17/tests/classes/log4j.xml
[copy] Copying 1 file to /usr/src/RPM/BUILD/log4j-1_2_17/tests/classes
[junit] Running org.apache.log4j.defaultInit.TestCase1
[junit] Testsuite: org.apache.log4j.defaultInit.TestCase1
[junit] Tests run: 1, Failures: 0, Errors: 0, Skipped: 0, Time elapsed: 0.044 sec
[junit] Tests run: 1, Failures: 0, Errors: 0, Skipped: 0, Time elapsed: 0.044 sec
[junit]
[junit] Testcase: noneTest took 0.024 sec
[delete] Deleting: /usr/src/RPM/BUILD/log4j-1_2_17/tests/classes/log4j.xml
[copy] Copying 1 file to /usr/src/RPM/BUILD/log4j-1_2_17/tests/classes
[junit] Running org.apache.log4j.defaultInit.TestCase3
[junit] Testsuite: org.apache.log4j.defaultInit.TestCase3
[junit] Tests run: 1, Failures: 0, Errors: 0, Skipped: 0, Time elapsed: 0.097 sec
[junit] Tests run: 1, Failures: 0, Errors: 0, Skipped: 0, Time elapsed: 0.097 sec
[junit]
[junit] Testcase: propertiesTest took 0.086 sec
[delete] Deleting: /usr/src/RPM/BUILD/log4j-1_2_17/tests/classes/log4j.properties
[copy] Copying 1 file to /usr/src/RPM/BUILD/log4j-1_2_17/tests/classes
[copy] Copying 1 file to /usr/src/RPM/BUILD/log4j-1_2_17/tests/classes
[junit] Running org.apache.log4j.defaultInit.TestCase4
[junit] Testsuite: org.apache.log4j.defaultInit.TestCase4
[junit] Tests run: 1, Failures: 0, Errors: 0, Skipped: 0, Time elapsed: 0.138 sec
[junit] Tests run: 1, Failures: 0, Errors: 0, Skipped: 0, Time elapsed: 0.138 sec
[junit] ------------- Standard Output ---------------
[junit] log4j: reset attribute= "false".
[junit] log4j: Threshold ="null".
[junit] log4j: Level value for root is [OFF].
[junit] log4j: root level set to OFF
[junit] log4j: Class name: [org.apache.log4j.ConsoleAppender]
[junit] log4j: Parsing layout of class: "org.apache.log4j.PatternLayout"
[junit] log4j: Setting property [conversionPattern] to [%-5p %c{2} - %m%n].
[junit] log4j: Adding appender named [D1] to category [root].
[junit] ------------- ---------------- ---------------
[junit]
[junit] Testcase: combinedTest took 0.129 sec
[delete] Deleting: /usr/src/RPM/BUILD/log4j-1_2_17/tests/classes/log4j.xml
[delete] Deleting: /usr/src/RPM/BUILD/log4j-1_2_17/tests/classes/log4j.properties
SocketServer:
[junit] Running org.apache.log4j.net.SocketServerTestCase
[junit] Testsuite: org.apache.log4j.net.SocketServerTestCase
[junit] Tests run: 8, Failures: 0, Errors: 0, Skipped: 0, Time elapsed: 12.22 sec
[junit] Tests run: 8, Failures: 0, Errors: 0, Skipped: 0, Time elapsed: 12.22 sec
[junit] ------------- Standard Output ---------------
[junit] Setting up test case.
[junit] Tearing down test case.
[junit] Setting up test case.
[junit] Tearing down test case.
[junit] Setting up test case.
[junit] Tearing down test case.
[junit] Setting up test case.
[junit] Tearing down test case.
[junit] Setting up test case.
[junit] Tearing down test case.
[junit] Setting up test case.
[junit] Tearing down test case.
[junit] Setting up test case.
[junit] Tearing down test case.
[junit] Setting up test case.
[junit] Tearing down test case.
[junit] ------------- ---------------- ---------------
[junit]
[junit] Testcase: test1 took 1.106 sec
[junit] Testcase: test2 took 1.019 sec
[junit] Testcase: test3 took 1.022 sec
[junit] Testcase: test4 took 1.017 sec
[junit] Testcase: test5 took 2.018 sec
[junit] Testcase: test6 took 2.006 sec
[junit] Testcase: test7 took 2.01 sec
[junit] Testcase: test8 took 2.011 sec
XMLLayout:
[junit] Running org.apache.log4j.xml.XMLLayoutTestCase
[junit] Testsuite: org.apache.log4j.xml.XMLLayoutTestCase
[junit] Tests run: 6, Failures: 0, Errors: 0, Skipped: 0, Time elapsed: 0.084 sec
[junit] Tests run: 6, Failures: 0, Errors: 0, Skipped: 0, Time elapsed: 0.084 sec
[junit]
[junit] Testcase: basic took 0.048 sec
[junit] Testcase: locationInfo took 0.02 sec
[junit] Testcase: testCDATA took 0.004 sec
[junit] Testcase: testNull took 0.003 sec
[junit] Testcase: testMDC took 0.004 sec
[junit] Testcase: testMDCEscaped took 0.001 sec
AsyncAppender:
[junit] Running org.apache.log4j.AsyncAppenderTestCase
[junit] Testsuite: org.apache.log4j.AsyncAppenderTestCase
[junit] Tests run: 6, Failures: 0, Errors: 0, Skipped: 0, Time elapsed: 21.934 sec
[junit] Tests run: 6, Failures: 0, Errors: 0, Skipped: 0, Time elapsed: 21.934 sec
[junit] ------------- Standard Output ---------------
[junit] Done loop.
[junit] ------------- ---------------- ---------------
[junit] ------------- Standard Error -----------------
[junit] log4j:ERROR Attempted to append to closed appender named [async-test2].
[junit] log4j:ERROR Attempted to append to closed appender named [async-test3].
[junit] ------------- ---------------- ---------------
[junit]
[junit] Testcase: testBadAppender took 0.014 sec
[junit] Testcase: testLocationInfoTrue took 0.832 sec
[junit] Testcase: test2 took 0.104 sec
[junit] Testcase: test3 took 20.069 sec
[junit] Testcase: testLocationInfoFalse took 0.808 sec
[junit] Testcase: testMutableMessage took 0.102 sec
OptionConverter:
[junit] Running org.apache.log4j.helpers.OptionConverterTestCase
[junit] Testsuite: org.apache.log4j.helpers.OptionConverterTestCase
[junit] Tests run: 11, Failures: 0, Errors: 0, Skipped: 0, Time elapsed: 0.05 sec
[junit] Tests run: 11, Failures: 0, Errors: 0, Skipped: 0, Time elapsed: 0.05 sec
[junit] ------------- Standard Output ---------------
[junit] Result is [x1].
[junit] ------------- ---------------- ---------------
[junit] ------------- Standard Error -----------------
[junit] log4j:WARN custom level class [org.apache.log4j.xml.TOTO] not found.
[junit] ------------- ---------------- ---------------
[junit]
[junit] Testcase: varSubstTest5 took 0.008 sec
[junit] Testcase: varSubstTest1 took 0 sec
[junit] Testcase: varSubstTest2 took 0 sec
[junit] Testcase: varSubstTest3 took 0.002 sec
[junit] Testcase: varSubstTest4 took 0 sec
[junit] Testcase: testInputStream took 0.033 sec
[junit] Testcase: toLevelTest1 took 0 sec
[junit] Testcase: toLevelTest2 took 0.001 sec
[junit] Testcase: toLevelTest3 took 0 sec
[junit] Testcase: toLevelTest4 took 0 sec
[junit] Testcase: toLevelTest5 took 0 sec
BoundedFIFO:
[junit] Running org.apache.log4j.helpers.BoundedFIFOTestCase
[junit] Testsuite: org.apache.log4j.helpers.BoundedFIFOTestCase
[junit] Tests run: 5, Failures: 0, Errors: 0, Skipped: 0, Time elapsed: 0.037 sec
[junit] Tests run: 5, Failures: 0, Errors: 0, Skipped: 0, Time elapsed: 0.037 sec
[junit]
[junit] Testcase: test1 took 0.02 sec
[junit] Testcase: test2 took 0 sec
[junit] Testcase: testResize1 took 0.001 sec
[junit] Testcase: testResize2 took 0.009 sec
[junit] Testcase: testResize3 took 0.003 sec
CyclicBuffer:
[junit] Running org.apache.log4j.helpers.CyclicBufferTestCase
[junit] Testsuite: org.apache.log4j.helpers.CyclicBufferTestCase
[junit] Tests run: 3, Failures: 0, Errors: 0, Skipped: 0, Time elapsed: 0.022 sec
[junit] Tests run: 3, Failures: 0, Errors: 0, Skipped: 0, Time elapsed: 0.022 sec
[junit]
[junit] Testcase: test0 took 0.001 sec
[junit] Testcase: test1 took 0.017 sec
[junit] Testcase: testResize took 0 sec
OR:
[junit] Running org.apache.log4j.or.ORTestCase
[junit] Testsuite: org.apache.log4j.or.ORTestCase
[junit] Tests run: 10, Failures: 0, Errors: 0, Skipped: 0, Time elapsed: 0.008 sec
[junit] Tests run: 10, Failures: 0, Errors: 0, Skipped: 0, Time elapsed: 0.008 sec
[junit]
[junit] Testcase: test1 took 0.001 sec
[junit] Testcase: test2 took 0 sec
[junit] Testcase: test3 took 0 sec
[junit] Testcase: test4 took 0.002 sec
[junit] Testcase: test5 took 0 sec
[junit] Testcase: test6 took 0 sec
[junit] Testcase: test7 took 0 sec
[junit] Testcase: test8 took 0 sec
[junit] Testcase: test9 took 0.001 sec
[junit] Testcase: test10 took 0 sec
LevelMatchFilter:
[junit] Running org.apache.log4j.varia.LevelMatchFilterTestCase
[junit] Testsuite: org.apache.log4j.varia.LevelMatchFilterTestCase
[junit] Tests run: 2, Failures: 0, Errors: 0, Skipped: 0, Time elapsed: 0.031 sec
[junit] Tests run: 2, Failures: 0, Errors: 0, Skipped: 0, Time elapsed: 0.031 sec
[junit]
[junit] Testcase: accept took 0.025 sec
[junit] Testcase: deny took 0.002 sec
PatternParser:
[junit] Running org.apache.log4j.helpers.PatternParserTestCase
[junit] Testsuite: org.apache.log4j.helpers.PatternParserTestCase
[junit] Tests run: 1, Failures: 0, Errors: 0, Skipped: 0, Time elapsed: 0.027 sec
[junit] Tests run: 1, Failures: 0, Errors: 0, Skipped: 0, Time elapsed: 0.027 sec
[junit]
[junit] Testcase: mdcPattern took 0.023 sec
ErrorHandler:
[junit] Running org.apache.log4j.varia.ErrorHandlerTestCase
[junit] Testsuite: org.apache.log4j.varia.ErrorHandlerTestCase
[junit] Tests run: 2, Failures: 0, Errors: 0, Skipped: 0, Time elapsed: 0.114 sec
[junit] Tests run: 2, Failures: 0, Errors: 0, Skipped: 0, Time elapsed: 0.114 sec
[junit] ------------- Standard Output ---------------
[junit] log4j: reset attribute= "false".
[junit] log4j: Threshold ="null".
[junit] log4j: Level value for root is [debug].
[junit] log4j: root level set to DEBUG
[junit] log4j: Class name: [org.apache.log4j.FileAppender]
[junit] log4j: FB: Setting primary appender to [PRIMARY].
[junit] log4j: FB: Adding logger [root].
[junit] log4j: Class name: [org.apache.log4j.FileAppender]
[junit] log4j: Setting property [file] to [output/temp].
[junit] log4j: Setting property [append] to [false].
[junit] log4j: Parsing layout of class: "org.apache.log4j.PatternLayout"
[junit] log4j: Setting property [conversionPattern] to [FALLBACK - %c - %m%n].
[junit] log4j: setFile called: output/temp, false
[junit] log4j: setFile ended
[junit] log4j: FB: Setting backup appender to [FALLBACK].
[junit] log4j: Setting property [file] to [].
[junit] log4j: Setting property [append] to [false].
[junit] log4j: Parsing layout of class: "org.apache.log4j.PatternLayout"
[junit] log4j: Setting property [conversionPattern] to [%-5p %c{2} - %m%n].
[junit] log4j: setFile called: , false
[junit] log4j: FB: The following error reported: setFile(null,false) call failed.
[junit] java.io.FileNotFoundException: (No such file or directory)
[junit] at java.io.FileOutputStream.open0(Native Method)
[junit] at java.io.FileOutputStream.open(FileOutputStream.java:270)
[junit] at java.io.FileOutputStream.(FileOutputStream.java:213)
[junit] at java.io.FileOutputStream.(FileOutputStream.java:133)
[junit] at org.apache.log4j.FileAppender.setFile(FileAppender.java:294)
[junit] at org.apache.log4j.FileAppender.activateOptions(FileAppender.java:165)
[junit] at org.apache.log4j.config.PropertySetter.activate(PropertySetter.java:307)
[junit] at org.apache.log4j.xml.DOMConfigurator.parseAppender(DOMConfigurator.java:295)
[junit] at org.apache.log4j.xml.DOMConfigurator.findAppenderByName(DOMConfigurator.java:176)
[junit] at org.apache.log4j.xml.DOMConfigurator.findAppenderByReference(DOMConfigurator.java:191)
[junit] at org.apache.log4j.xml.DOMConfigurator.parseChildrenOfLoggerElement(DOMConfigurator.java:523)
[junit] at org.apache.log4j.xml.DOMConfigurator.parseRoot(DOMConfigurator.java:492)
[junit] at org.apache.log4j.xml.DOMConfigurator.parse(DOMConfigurator.java:1006)
[junit] at org.apache.log4j.xml.DOMConfigurator.doConfigure(DOMConfigurator.java:872)
[junit] at org.apache.log4j.xml.DOMConfigurator.doConfigure(DOMConfigurator.java:755)
[junit] at org.apache.log4j.xml.DOMConfigurator.configure(DOMConfigurator.java:896)
[junit] at org.apache.log4j.varia.ErrorHandlerTestCase.test1(ErrorHandlerTestCase.java:66)
[junit] at sun.reflect.NativeMethodAccessorImpl.invoke0(Native Method)
[junit] at sun.reflect.NativeMethodAccessorImpl.invoke(NativeMethodAccessorImpl.java:62)
[junit] at sun.reflect.DelegatingMethodAccessorImpl.invoke(DelegatingMethodAccessorImpl.java:43)
[junit] at java.lang.reflect.Method.invoke(Method.java:498)
[junit] at junit.framework.TestCase.runTest(TestCase.java:176)
[junit] at junit.framework.TestCase.runBare(TestCase.java:141)
[junit] at junit.framework.TestResult$1.protect(TestResult.java:122)
[junit] at junit.framework.TestResult.runProtected(TestResult.java:142)
[junit] at junit.framework.TestResult.run(TestResult.java:125)
[junit] at junit.framework.TestCase.run(TestCase.java:129)
[junit] at junit.framework.TestSuite.runTest(TestSuite.java:252)
[junit] at junit.framework.TestSuite.run(TestSuite.java:247)
[junit] at org.apache.tools.ant.taskdefs.optional.junit.JUnitTestRunner.run(JUnitTestRunner.java:536)
[junit] at org.apache.tools.ant.taskdefs.optional.junit.JUnitTestRunner.launch(JUnitTestRunner.java:1205)
[junit] at org.apache.tools.ant.taskdefs.optional.junit.JUnitTestRunner.main(JUnitTestRunner.java:1048)
[junit] log4j: FB: INITIATING FALLBACK PROCEDURE.
[junit] log4j: FB: Searching for [PRIMARY] in logger [root].
[junit] log4j: FB: Replacing [PRIMARY] by [FALLBACK] in logger [root].
[junit] log4j: FB: Adding appender [FALLBACK] to logger root
[junit] log4j: Adding appender named [PRIMARY] to category [root].
[junit] log4j: Parsing for [root] with value=[DEBUG, PRIMARY].
[junit] log4j: Level token is [DEBUG].
[junit] log4j: Category root set to DEBUG
[junit] log4j: Parsing appender named "PRIMARY".
[junit] log4j: Parsing layout options for "PRIMARY".
[junit] log4j: Setting property [conversionPattern] to [%-5p %c{2} - %m%n].
[junit] log4j: End of parsing for "PRIMARY".
[junit] log4j: Parsing errorhandler options for "PRIMARY".
[junit] log4j: End of errorhandler parsing for "PRIMARY".
[junit] log4j: Setting property [append] to [false].
[junit] log4j: Setting property [file] to [/xyz/:x.log].
[junit] log4j: setFile called: /xyz/:x.log, false
[junit] log4j: FB: The following error reported: setFile(null,false) call failed.
[junit] java.io.FileNotFoundException: /xyz/:x.log (No such file or directory)
[junit] at java.io.FileOutputStream.open0(Native Method)
[junit] at java.io.FileOutputStream.open(FileOutputStream.java:270)
[junit] at java.io.FileOutputStream.(FileOutputStream.java:213)
[junit] at java.io.FileOutputStream.(FileOutputStream.java:133)
[junit] at org.apache.log4j.FileAppender.setFile(FileAppender.java:294)
[junit] at org.apache.log4j.FileAppender.activateOptions(FileAppender.java:165)
[junit] at org.apache.log4j.config.PropertySetter.activate(PropertySetter.java:307)
[junit] at org.apache.log4j.config.PropertySetter.setProperties(PropertySetter.java:172)
[junit] at org.apache.log4j.config.PropertySetter.setProperties(PropertySetter.java:104)
[junit] at org.apache.log4j.PropertyConfigurator.parseAppender(PropertyConfigurator.java:842)
[junit] at org.apache.log4j.PropertyConfigurator.parseCategory(PropertyConfigurator.java:768)
[junit] at org.apache.log4j.PropertyConfigurator.configureRootCategory(PropertyConfigurator.java:648)
[junit] at org.apache.log4j.PropertyConfigurator.doConfigure(PropertyConfigurator.java:514)
[junit] at org.apache.log4j.PropertyConfigurator.doConfigure(PropertyConfigurator.java:395)
[junit] at org.apache.log4j.PropertyConfigurator.configure(PropertyConfigurator.java:403)
[junit] at org.apache.log4j.varia.ErrorHandlerTestCase.test2(ErrorHandlerTestCase.java:86)
[junit] at sun.reflect.NativeMethodAccessorImpl.invoke0(Native Method)
[junit] at sun.reflect.NativeMethodAccessorImpl.invoke(NativeMethodAccessorImpl.java:62)
[junit] at sun.reflect.DelegatingMethodAccessorImpl.invoke(DelegatingMethodAccessorImpl.java:43)
[junit] at java.lang.reflect.Method.invoke(Method.java:498)
[junit] at junit.framework.TestCase.runTest(TestCase.java:176)
[junit] at junit.framework.TestCase.runBare(TestCase.java:141)
[junit] at junit.framework.TestResult$1.protect(TestResult.java:122)
[junit] at junit.framework.TestResult.runProtected(TestResult.java:142)
[junit] at junit.framework.TestResult.run(TestResult.java:125)
[junit] at junit.framework.TestCase.run(TestCase.java:129)
[junit] at junit.framework.TestSuite.runTest(TestSuite.java:252)
[junit] at junit.framework.TestSuite.run(TestSuite.java:247)
[junit] at org.apache.tools.ant.taskdefs.optional.junit.JUnitTestRunner.run(JUnitTestRunner.java:536)
[junit] at org.apache.tools.ant.taskdefs.optional.junit.JUnitTestRunner.launch(JUnitTestRunner.java:1205)
[junit] at org.apache.tools.ant.taskdefs.optional.junit.JUnitTestRunner.main(JUnitTestRunner.java:1048)
[junit] log4j: FB: INITIATING FALLBACK PROCEDURE.
[junit] log4j: Parsed "PRIMARY" options.
[junit] log4j: Finished configuring.
[junit] ------------- ---------------- ---------------
[junit]
[junit] Testcase: test1 took 0.099 sec
[junit] Testcase: test2 took 0.011 sec
Rewrite:
[junit] Running org.apache.log4j.rewrite.RewriteAppenderTest
[junit] Testsuite: org.apache.log4j.rewrite.RewriteAppenderTest
[junit] Tests run: 3, Failures: 0, Errors: 0, Skipped: 0, Time elapsed: 0.085 sec
[junit] Tests run: 3, Failures: 0, Errors: 0, Skipped: 0, Time elapsed: 0.085 sec
[junit]
[junit] Testcase: testReflectionPolicy took 0.07 sec
[junit] Testcase: testPropertyPolicy took 0.007 sec
[junit] Testcase: testMapPolicy took 0.003 sec
regression:
longUnit:
runAll:
[INFO] Executed tasks
[INFO]
[INFO] --- maven-bundle-plugin:3.5.0:bundle (default-bundle) @ log4j ---
[INFO]
[INFO] ----------------------------< log4j:log4j >-----------------------------
[INFO] Building Apache Log4j 1.2.17
[INFO] -------------------------------[ bundle ]-------------------------------
[INFO]
[INFO] --- xmvn-mojo:3.0.0:install (default-cli) @ log4j ---
[INFO]
[INFO] >>> maven-javadoc-plugin:3.0.0:aggregate (default-cli) > compile @ log4j >>>
[INFO]
[INFO] --- maven-antrun-plugin:1.8:run (javadoc.resources) @ log4j ---
[WARNING] Parameter tasks is deprecated, use target instead
[INFO] Executing tasks
main:
[INFO] Executed tasks
[INFO]
[INFO] --- maven-resources-plugin:3.1.0:resources (default-resources) @ log4j ---
[INFO] Using 'UTF-8' encoding to copy filtered resources.
[INFO] Copying 7 resources
[INFO]
[INFO] --- maven-compiler-plugin:3.7.0:compile (default-compile) @ log4j ---
[INFO] Nothing to compile - all classes are up to date
[INFO]
[INFO] <<< maven-javadoc-plugin:3.0.0:aggregate (default-cli) < compile @ log4j <<<
[INFO]
[INFO]
[INFO] --- maven-javadoc-plugin:3.0.0:aggregate (default-cli) @ log4j ---
[INFO]
Loading source files for package org.apache.log4j...
Loading source files for package org.apache.log4j.xml...
Loading source files for package org.apache.log4j.varia...
Loading source files for package org.apache.log4j.spi...
Loading source files for package org.apache.log4j.rewrite...
Loading source files for package org.apache.log4j.pattern...
Loading source files for package org.apache.log4j.or.sax...
Loading source files for package org.apache.log4j.or.jms...
Loading source files for package org.apache.log4j.or...
Loading source files for package org.apache.log4j.net...
Loading source files for package org.apache.log4j.lf5.viewer.configure...
Loading source files for package org.apache.log4j.lf5.viewer.categoryexplorer...
Loading source files for package org.apache.log4j.lf5.viewer...
Loading source files for package org.apache.log4j.lf5.util...
Loading source files for package org.apache.log4j.lf5...
Loading source files for package org.apache.log4j.jmx...
Loading source files for package org.apache.log4j.jdbc...
Loading source files for package org.apache.log4j.helpers...
Loading source files for package org.apache.log4j.config...
Loading source files for package org.apache.log4j.chainsaw...
Loading source files for package org.apache.log4j.xml.examples...
Constructing Javadoc information...
Standard Doclet version 1.8.0_212
Building tree for all the packages and classes...
Generating /usr/src/RPM/BUILD/log4j-1_2_17/target/site/apidocs/org/apache/log4j/Appender.html...
Generating /usr/src/RPM/BUILD/log4j-1_2_17/target/site/apidocs/org/apache/log4j/AppenderSkeleton.html...
Generating /usr/src/RPM/BUILD/log4j-1_2_17/target/site/apidocs/org/apache/log4j/AsyncAppender.html...
Generating /usr/src/RPM/BUILD/log4j-1_2_17/target/site/apidocs/org/apache/log4j/BasicConfigurator.html...
Generating /usr/src/RPM/BUILD/log4j-1_2_17/target/site/apidocs/org/apache/log4j/Category.html...
Generating /usr/src/RPM/BUILD/log4j-1_2_17/target/site/apidocs/org/apache/log4j/ConsoleAppender.html...
Generating /usr/src/RPM/BUILD/log4j-1_2_17/target/site/apidocs/org/apache/log4j/DailyRollingFileAppender.html...
Generating /usr/src/RPM/BUILD/log4j-1_2_17/target/site/apidocs/org/apache/log4j/DefaultThrowableRenderer.html...
Generating /usr/src/RPM/BUILD/log4j-1_2_17/target/site/apidocs/org/apache/log4j/EnhancedPatternLayout.html...
Generating /usr/src/RPM/BUILD/log4j-1_2_17/target/site/apidocs/org/apache/log4j/EnhancedThrowableRenderer.html...
Generating /usr/src/RPM/BUILD/log4j-1_2_17/target/site/apidocs/org/apache/log4j/FileAppender.html...
Generating /usr/src/RPM/BUILD/log4j-1_2_17/target/site/apidocs/org/apache/log4j/FilteredObjectInputStream.html...
Generating /usr/src/RPM/BUILD/log4j-1_2_17/target/site/apidocs/org/apache/log4j/Hierarchy.html...
Generating /usr/src/RPM/BUILD/log4j-1_2_17/target/site/apidocs/org/apache/log4j/HTMLLayout.html...
Generating /usr/src/RPM/BUILD/log4j-1_2_17/target/site/apidocs/org/apache/log4j/Layout.html...
Generating /usr/src/RPM/BUILD/log4j-1_2_17/target/site/apidocs/org/apache/log4j/Level.html...
Generating /usr/src/RPM/BUILD/log4j-1_2_17/target/site/apidocs/org/apache/log4j/Logger.html...
Generating /usr/src/RPM/BUILD/log4j-1_2_17/target/site/apidocs/org/apache/log4j/LogManager.html...
Generating /usr/src/RPM/BUILD/log4j-1_2_17/target/site/apidocs/org/apache/log4j/LogMF.html...
Generating /usr/src/RPM/BUILD/log4j-1_2_17/target/site/apidocs/org/apache/log4j/LogSF.html...
Generating /usr/src/RPM/BUILD/log4j-1_2_17/target/site/apidocs/org/apache/log4j/LogXF.html...
Generating /usr/src/RPM/BUILD/log4j-1_2_17/target/site/apidocs/org/apache/log4j/MDC.html...
Generating /usr/src/RPM/BUILD/log4j-1_2_17/target/site/apidocs/org/apache/log4j/NDC.html...
Generating /usr/src/RPM/BUILD/log4j-1_2_17/target/site/apidocs/org/apache/log4j/PatternLayout.html...
Generating /usr/src/RPM/BUILD/log4j-1_2_17/target/site/apidocs/org/apache/log4j/Priority.html...
Generating /usr/src/RPM/BUILD/log4j-1_2_17/target/site/apidocs/org/apache/log4j/PropertyConfigurator.html...
Generating /usr/src/RPM/BUILD/log4j-1_2_17/target/site/apidocs/org/apache/log4j/RollingFileAppender.html...
Generating /usr/src/RPM/BUILD/log4j-1_2_17/target/site/apidocs/org/apache/log4j/SimpleLayout.html...
Generating /usr/src/RPM/BUILD/log4j-1_2_17/target/site/apidocs/org/apache/log4j/TTCCLayout.html...
Generating /usr/src/RPM/BUILD/log4j-1_2_17/target/site/apidocs/org/apache/log4j/WriterAppender.html...
Generating /usr/src/RPM/BUILD/log4j-1_2_17/target/site/apidocs/org/apache/log4j/xml/DOMConfigurator.html...
Generating /usr/src/RPM/BUILD/log4j-1_2_17/target/site/apidocs/org/apache/log4j/xml/Log4jEntityResolver.html...
Generating /usr/src/RPM/BUILD/log4j-1_2_17/target/site/apidocs/org/apache/log4j/xml/SAXErrorHandler.html...
Generating /usr/src/RPM/BUILD/log4j-1_2_17/target/site/apidocs/org/apache/log4j/xml/UnrecognizedElementHandler.html...
Generating /usr/src/RPM/BUILD/log4j-1_2_17/target/site/apidocs/org/apache/log4j/xml/XMLLayout.html...
Generating /usr/src/RPM/BUILD/log4j-1_2_17/target/site/apidocs/org/apache/log4j/varia/DenyAllFilter.html...
Generating /usr/src/RPM/BUILD/log4j-1_2_17/target/site/apidocs/org/apache/log4j/varia/ExternallyRolledFileAppender.html...
Generating /usr/src/RPM/BUILD/log4j-1_2_17/target/site/apidocs/org/apache/log4j/varia/FallbackErrorHandler.html...
Generating /usr/src/RPM/BUILD/log4j-1_2_17/target/site/apidocs/org/apache/log4j/varia/LevelMatchFilter.html...
Generating /usr/src/RPM/BUILD/log4j-1_2_17/target/site/apidocs/org/apache/log4j/varia/LevelRangeFilter.html...
Generating /usr/src/RPM/BUILD/log4j-1_2_17/target/site/apidocs/org/apache/log4j/varia/NullAppender.html...
Generating /usr/src/RPM/BUILD/log4j-1_2_17/target/site/apidocs/org/apache/log4j/varia/ReloadingPropertyConfigurator.html...
Generating /usr/src/RPM/BUILD/log4j-1_2_17/target/site/apidocs/org/apache/log4j/varia/Roller.html...
Generating /usr/src/RPM/BUILD/log4j-1_2_17/target/site/apidocs/org/apache/log4j/varia/StringMatchFilter.html...
Generating /usr/src/RPM/BUILD/log4j-1_2_17/target/site/apidocs/org/apache/log4j/spi/AppenderAttachable.html...
Generating /usr/src/RPM/BUILD/log4j-1_2_17/target/site/apidocs/org/apache/log4j/spi/Configurator.html...
Generating /usr/src/RPM/BUILD/log4j-1_2_17/target/site/apidocs/org/apache/log4j/spi/DefaultRepositorySelector.html...
Generating /usr/src/RPM/BUILD/log4j-1_2_17/target/site/apidocs/org/apache/log4j/spi/ErrorCode.html...
Generating /usr/src/RPM/BUILD/log4j-1_2_17/target/site/apidocs/org/apache/log4j/spi/ErrorHandler.html...
Generating /usr/src/RPM/BUILD/log4j-1_2_17/target/site/apidocs/org/apache/log4j/spi/Filter.html...
Generating /usr/src/RPM/BUILD/log4j-1_2_17/target/site/apidocs/org/apache/log4j/spi/HierarchyEventListener.html...
Generating /usr/src/RPM/BUILD/log4j-1_2_17/target/site/apidocs/org/apache/log4j/spi/LocationInfo.html...
Generating /usr/src/RPM/BUILD/log4j-1_2_17/target/site/apidocs/org/apache/log4j/spi/LoggerFactory.html...
Generating /usr/src/RPM/BUILD/log4j-1_2_17/target/site/apidocs/org/apache/log4j/spi/LoggerRepository.html...
Generating /usr/src/RPM/BUILD/log4j-1_2_17/target/site/apidocs/org/apache/log4j/spi/LoggingEvent.html...
Generating /usr/src/RPM/BUILD/log4j-1_2_17/target/site/apidocs/org/apache/log4j/spi/NOPLogger.html...
Generating /usr/src/RPM/BUILD/log4j-1_2_17/target/site/apidocs/org/apache/log4j/spi/NOPLoggerRepository.html...
Generating /usr/src/RPM/BUILD/log4j-1_2_17/target/site/apidocs/org/apache/log4j/spi/OptionHandler.html...
Generating /usr/src/RPM/BUILD/log4j-1_2_17/target/site/apidocs/org/apache/log4j/spi/RendererSupport.html...
Generating /usr/src/RPM/BUILD/log4j-1_2_17/target/site/apidocs/org/apache/log4j/spi/RepositorySelector.html...
Generating /usr/src/RPM/BUILD/log4j-1_2_17/target/site/apidocs/org/apache/log4j/spi/RootCategory.html...
Generating /usr/src/RPM/BUILD/log4j-1_2_17/target/site/apidocs/org/apache/log4j/spi/RootLogger.html...
Generating /usr/src/RPM/BUILD/log4j-1_2_17/target/site/apidocs/org/apache/log4j/spi/ThrowableInformation.html...
Generating /usr/src/RPM/BUILD/log4j-1_2_17/target/site/apidocs/org/apache/log4j/spi/ThrowableRenderer.html...
Generating /usr/src/RPM/BUILD/log4j-1_2_17/target/site/apidocs/org/apache/log4j/spi/ThrowableRendererSupport.html...
Generating /usr/src/RPM/BUILD/log4j-1_2_17/target/site/apidocs/org/apache/log4j/spi/TriggeringEventEvaluator.html...
Generating /usr/src/RPM/BUILD/log4j-1_2_17/target/site/apidocs/org/apache/log4j/rewrite/MapRewritePolicy.html...
Generating /usr/src/RPM/BUILD/log4j-1_2_17/target/site/apidocs/org/apache/log4j/rewrite/PropertyRewritePolicy.html...
Generating /usr/src/RPM/BUILD/log4j-1_2_17/target/site/apidocs/org/apache/log4j/rewrite/ReflectionRewritePolicy.html...
Generating /usr/src/RPM/BUILD/log4j-1_2_17/target/site/apidocs/org/apache/log4j/rewrite/RewriteAppender.html...
Generating /usr/src/RPM/BUILD/log4j-1_2_17/target/site/apidocs/org/apache/log4j/rewrite/RewritePolicy.html...
Generating /usr/src/RPM/BUILD/log4j-1_2_17/target/site/apidocs/org/apache/log4j/pattern/BridgePatternConverter.html...
Generating /usr/src/RPM/BUILD/log4j-1_2_17/target/site/apidocs/org/apache/log4j/pattern/BridgePatternParser.html...
Generating /usr/src/RPM/BUILD/log4j-1_2_17/target/site/apidocs/org/apache/log4j/pattern/CachedDateFormat.html...
Generating /usr/src/RPM/BUILD/log4j-1_2_17/target/site/apidocs/org/apache/log4j/pattern/ClassNamePatternConverter.html...
Generating /usr/src/RPM/BUILD/log4j-1_2_17/target/site/apidocs/org/apache/log4j/pattern/DatePatternConverter.html...
Generating /usr/src/RPM/BUILD/log4j-1_2_17/target/site/apidocs/org/apache/log4j/pattern/FileDatePatternConverter.html...
Generating /usr/src/RPM/BUILD/log4j-1_2_17/target/site/apidocs/org/apache/log4j/pattern/FileLocationPatternConverter.html...
Generating /usr/src/RPM/BUILD/log4j-1_2_17/target/site/apidocs/org/apache/log4j/pattern/FormattingInfo.html...
Generating /usr/src/RPM/BUILD/log4j-1_2_17/target/site/apidocs/org/apache/log4j/pattern/FullLocationPatternConverter.html...
Generating /usr/src/RPM/BUILD/log4j-1_2_17/target/site/apidocs/org/apache/log4j/pattern/IntegerPatternConverter.html...
Generating /usr/src/RPM/BUILD/log4j-1_2_17/target/site/apidocs/org/apache/log4j/pattern/LevelPatternConverter.html...
Generating /usr/src/RPM/BUILD/log4j-1_2_17/target/site/apidocs/org/apache/log4j/pattern/LineLocationPatternConverter.html...
Generating /usr/src/RPM/BUILD/log4j-1_2_17/target/site/apidocs/org/apache/log4j/pattern/LineSeparatorPatternConverter.html...
Generating /usr/src/RPM/BUILD/log4j-1_2_17/target/site/apidocs/org/apache/log4j/pattern/LiteralPatternConverter.html...
Generating /usr/src/RPM/BUILD/log4j-1_2_17/target/site/apidocs/org/apache/log4j/pattern/LogEvent.html...
Generating /usr/src/RPM/BUILD/log4j-1_2_17/target/site/apidocs/org/apache/log4j/pattern/LoggerPatternConverter.html...
Generating /usr/src/RPM/BUILD/log4j-1_2_17/target/site/apidocs/org/apache/log4j/pattern/LoggingEventPatternConverter.html...
Generating /usr/src/RPM/BUILD/log4j-1_2_17/target/site/apidocs/org/apache/log4j/pattern/MessagePatternConverter.html...
Generating /usr/src/RPM/BUILD/log4j-1_2_17/target/site/apidocs/org/apache/log4j/pattern/MethodLocationPatternConverter.html...
Generating /usr/src/RPM/BUILD/log4j-1_2_17/target/site/apidocs/org/apache/log4j/pattern/NameAbbreviator.html...
Generating /usr/src/RPM/BUILD/log4j-1_2_17/target/site/apidocs/org/apache/log4j/pattern/NamePatternConverter.html...
Generating /usr/src/RPM/BUILD/log4j-1_2_17/target/site/apidocs/org/apache/log4j/pattern/NDCPatternConverter.html...
Generating /usr/src/RPM/BUILD/log4j-1_2_17/target/site/apidocs/org/apache/log4j/pattern/PatternConverter.html...
Generating /usr/src/RPM/BUILD/log4j-1_2_17/target/site/apidocs/org/apache/log4j/pattern/PatternParser.html...
Generating /usr/src/RPM/BUILD/log4j-1_2_17/target/site/apidocs/org/apache/log4j/pattern/PropertiesPatternConverter.html...
Generating /usr/src/RPM/BUILD/log4j-1_2_17/target/site/apidocs/org/apache/log4j/pattern/RelativeTimePatternConverter.html...
Generating /usr/src/RPM/BUILD/log4j-1_2_17/target/site/apidocs/org/apache/log4j/pattern/SequenceNumberPatternConverter.html...
Generating /usr/src/RPM/BUILD/log4j-1_2_17/target/site/apidocs/org/apache/log4j/pattern/ThreadPatternConverter.html...
Generating /usr/src/RPM/BUILD/log4j-1_2_17/target/site/apidocs/org/apache/log4j/pattern/ThrowableInformationPatternConverter.html...
Generating /usr/src/RPM/BUILD/log4j-1_2_17/target/site/apidocs/org/apache/log4j/or/sax/AttributesRenderer.html...
Generating /usr/src/RPM/BUILD/log4j-1_2_17/target/site/apidocs/org/apache/log4j/or/jms/MessageRenderer.html...
Generating /usr/src/RPM/BUILD/log4j-1_2_17/target/site/apidocs/org/apache/log4j/or/ObjectRenderer.html...
Generating /usr/src/RPM/BUILD/log4j-1_2_17/target/site/apidocs/org/apache/log4j/or/RendererMap.html...
Generating /usr/src/RPM/BUILD/log4j-1_2_17/target/site/apidocs/org/apache/log4j/or/ThreadGroupRenderer.html...
Generating /usr/src/RPM/BUILD/log4j-1_2_17/target/site/apidocs/org/apache/log4j/net/JMSAppender.html...
Generating /usr/src/RPM/BUILD/log4j-1_2_17/target/site/apidocs/org/apache/log4j/net/JMSSink.html...
Generating /usr/src/RPM/BUILD/log4j-1_2_17/target/site/apidocs/org/apache/log4j/net/SimpleSocketServer.html...
Generating /usr/src/RPM/BUILD/log4j-1_2_17/target/site/apidocs/org/apache/log4j/net/SMTPAppender.html...
Generating /usr/src/RPM/BUILD/log4j-1_2_17/target/site/apidocs/org/apache/log4j/net/SocketAppender.html...
Generating /usr/src/RPM/BUILD/log4j-1_2_17/target/site/apidocs/org/apache/log4j/net/SocketHubAppender.html...
Generating /usr/src/RPM/BUILD/log4j-1_2_17/target/site/apidocs/org/apache/log4j/net/SocketNode.html...
Generating /usr/src/RPM/BUILD/log4j-1_2_17/target/site/apidocs/org/apache/log4j/net/SocketServer.html...
Generating /usr/src/RPM/BUILD/log4j-1_2_17/target/site/apidocs/org/apache/log4j/net/SyslogAppender.html...
Generating /usr/src/RPM/BUILD/log4j-1_2_17/target/site/apidocs/org/apache/log4j/net/TelnetAppender.html...
Generating /usr/src/RPM/BUILD/log4j-1_2_17/target/site/apidocs/org/apache/log4j/net/TelnetAppender.SocketHandler.html...
Generating /usr/src/RPM/BUILD/log4j-1_2_17/target/site/apidocs/org/apache/log4j/net/ZeroConfSupport.html...
Generating /usr/src/RPM/BUILD/log4j-1_2_17/target/site/apidocs/org/apache/log4j/lf5/viewer/configure/ConfigurationManager.html...
Generating /usr/src/RPM/BUILD/log4j-1_2_17/target/site/apidocs/org/apache/log4j/lf5/viewer/configure/MRUFileManager.html...
Generating /usr/src/RPM/BUILD/log4j-1_2_17/target/site/apidocs/org/apache/log4j/lf5/viewer/categoryexplorer/CategoryAbstractCellEditor.html...
Generating /usr/src/RPM/BUILD/log4j-1_2_17/target/site/apidocs/org/apache/log4j/lf5/viewer/categoryexplorer/CategoryElement.html...
Generating /usr/src/RPM/BUILD/log4j-1_2_17/target/site/apidocs/org/apache/log4j/lf5/viewer/categoryexplorer/CategoryExplorerLogRecordFilter.html...
Generating /usr/src/RPM/BUILD/log4j-1_2_17/target/site/apidocs/org/apache/log4j/lf5/viewer/categoryexplorer/CategoryExplorerModel.html...
Generating /usr/src/RPM/BUILD/log4j-1_2_17/target/site/apidocs/org/apache/log4j/lf5/viewer/categoryexplorer/CategoryExplorerTree.html...
Generating /usr/src/RPM/BUILD/log4j-1_2_17/target/site/apidocs/org/apache/log4j/lf5/viewer/categoryexplorer/CategoryImmediateEditor.html...
Generating /usr/src/RPM/BUILD/log4j-1_2_17/target/site/apidocs/org/apache/log4j/lf5/viewer/categoryexplorer/CategoryNode.html...
Generating /usr/src/RPM/BUILD/log4j-1_2_17/target/site/apidocs/org/apache/log4j/lf5/viewer/categoryexplorer/CategoryNodeEditor.html...
Generating /usr/src/RPM/BUILD/log4j-1_2_17/target/site/apidocs/org/apache/log4j/lf5/viewer/categoryexplorer/CategoryNodeEditorRenderer.html...
Generating /usr/src/RPM/BUILD/log4j-1_2_17/target/site/apidocs/org/apache/log4j/lf5/viewer/categoryexplorer/CategoryNodeRenderer.html...
Generating /usr/src/RPM/BUILD/log4j-1_2_17/target/site/apidocs/org/apache/log4j/lf5/viewer/categoryexplorer/CategoryPath.html...
Generating /usr/src/RPM/BUILD/log4j-1_2_17/target/site/apidocs/org/apache/log4j/lf5/viewer/categoryexplorer/TreeModelAdapter.html...
Generating /usr/src/RPM/BUILD/log4j-1_2_17/target/site/apidocs/org/apache/log4j/lf5/viewer/FilteredLogTableModel.html...
Generating /usr/src/RPM/BUILD/log4j-1_2_17/target/site/apidocs/org/apache/log4j/lf5/viewer/LF5SwingUtils.html...
Generating /usr/src/RPM/BUILD/log4j-1_2_17/target/site/apidocs/org/apache/log4j/lf5/viewer/LogBrokerMonitor.html...
Generating /usr/src/RPM/BUILD/log4j-1_2_17/target/site/apidocs/org/apache/log4j/lf5/viewer/LogFactor5Dialog.html...
Generating /usr/src/RPM/BUILD/log4j-1_2_17/target/site/apidocs/org/apache/log4j/lf5/viewer/LogFactor5ErrorDialog.html...
Generating /usr/src/RPM/BUILD/log4j-1_2_17/target/site/apidocs/org/apache/log4j/lf5/viewer/LogFactor5InputDialog.html...
Generating /usr/src/RPM/BUILD/log4j-1_2_17/target/site/apidocs/org/apache/log4j/lf5/viewer/LogFactor5LoadingDialog.html...
Generating /usr/src/RPM/BUILD/log4j-1_2_17/target/site/apidocs/org/apache/log4j/lf5/viewer/LogTable.html...
Generating /usr/src/RPM/BUILD/log4j-1_2_17/target/site/apidocs/org/apache/log4j/lf5/viewer/LogTableColumn.html...
Generating /usr/src/RPM/BUILD/log4j-1_2_17/target/site/apidocs/org/apache/log4j/lf5/viewer/LogTableColumnFormatException.html...
Generating /usr/src/RPM/BUILD/log4j-1_2_17/target/site/apidocs/org/apache/log4j/lf5/viewer/LogTableModel.html...
Generating /usr/src/RPM/BUILD/log4j-1_2_17/target/site/apidocs/org/apache/log4j/lf5/viewer/LogTableRowRenderer.html...
Generating /usr/src/RPM/BUILD/log4j-1_2_17/target/site/apidocs/org/apache/log4j/lf5/viewer/TrackingAdjustmentListener.html...
Generating /usr/src/RPM/BUILD/log4j-1_2_17/target/site/apidocs/org/apache/log4j/lf5/util/AdapterLogRecord.html...
Generating /usr/src/RPM/BUILD/log4j-1_2_17/target/site/apidocs/org/apache/log4j/lf5/util/DateFormatManager.html...
Generating /usr/src/RPM/BUILD/log4j-1_2_17/target/site/apidocs/org/apache/log4j/lf5/util/LogFileParser.html...
Generating /usr/src/RPM/BUILD/log4j-1_2_17/target/site/apidocs/org/apache/log4j/lf5/util/LogMonitorAdapter.html...
Generating /usr/src/RPM/BUILD/log4j-1_2_17/target/site/apidocs/org/apache/log4j/lf5/util/Resource.html...
Generating /usr/src/RPM/BUILD/log4j-1_2_17/target/site/apidocs/org/apache/log4j/lf5/util/ResourceUtils.html...
Generating /usr/src/RPM/BUILD/log4j-1_2_17/target/site/apidocs/org/apache/log4j/lf5/util/StreamUtils.html...
Generating /usr/src/RPM/BUILD/log4j-1_2_17/target/site/apidocs/org/apache/log4j/lf5/AppenderFinalizer.html...
Generating /usr/src/RPM/BUILD/log4j-1_2_17/target/site/apidocs/org/apache/log4j/lf5/DefaultLF5Configurator.html...
Generating /usr/src/RPM/BUILD/log4j-1_2_17/target/site/apidocs/org/apache/log4j/lf5/LF5Appender.html...
Generating /usr/src/RPM/BUILD/log4j-1_2_17/target/site/apidocs/org/apache/log4j/lf5/Log4JLogRecord.html...
Generating /usr/src/RPM/BUILD/log4j-1_2_17/target/site/apidocs/org/apache/log4j/lf5/LogLevel.html...
Generating /usr/src/RPM/BUILD/log4j-1_2_17/target/site/apidocs/org/apache/log4j/lf5/LogLevelFormatException.html...
Generating /usr/src/RPM/BUILD/log4j-1_2_17/target/site/apidocs/org/apache/log4j/lf5/LogRecord.html...
Generating /usr/src/RPM/BUILD/log4j-1_2_17/target/site/apidocs/org/apache/log4j/lf5/LogRecordFilter.html...
Generating /usr/src/RPM/BUILD/log4j-1_2_17/target/site/apidocs/org/apache/log4j/lf5/PassingLogRecordFilter.html...
Generating /usr/src/RPM/BUILD/log4j-1_2_17/target/site/apidocs/org/apache/log4j/lf5/StartLogFactor5.html...
Generating /usr/src/RPM/BUILD/log4j-1_2_17/target/site/apidocs/org/apache/log4j/jmx/AbstractDynamicMBean.html...
Generating /usr/src/RPM/BUILD/log4j-1_2_17/target/site/apidocs/org/apache/log4j/jmx/Agent.html...
Generating /usr/src/RPM/BUILD/log4j-1_2_17/target/site/apidocs/org/apache/log4j/jmx/AppenderDynamicMBean.html...
Generating /usr/src/RPM/BUILD/log4j-1_2_17/target/site/apidocs/org/apache/log4j/jmx/HierarchyDynamicMBean.html...
Generating /usr/src/RPM/BUILD/log4j-1_2_17/target/site/apidocs/org/apache/log4j/jmx/LayoutDynamicMBean.html...
Generating /usr/src/RPM/BUILD/log4j-1_2_17/target/site/apidocs/org/apache/log4j/jmx/LoggerDynamicMBean.html...
Generating /usr/src/RPM/BUILD/log4j-1_2_17/target/site/apidocs/org/apache/log4j/jdbc/JDBCAppender.html...
Generating /usr/src/RPM/BUILD/log4j-1_2_17/target/site/apidocs/org/apache/log4j/helpers/AbsoluteTimeDateFormat.html...
Generating /usr/src/RPM/BUILD/log4j-1_2_17/target/site/apidocs/org/apache/log4j/helpers/AppenderAttachableImpl.html...
Generating /usr/src/RPM/BUILD/log4j-1_2_17/target/site/apidocs/org/apache/log4j/helpers/BoundedFIFO.html...
Generating /usr/src/RPM/BUILD/log4j-1_2_17/target/site/apidocs/org/apache/log4j/helpers/CountingQuietWriter.html...
Generating /usr/src/RPM/BUILD/log4j-1_2_17/target/site/apidocs/org/apache/log4j/helpers/CyclicBuffer.html...
Generating /usr/src/RPM/BUILD/log4j-1_2_17/target/site/apidocs/org/apache/log4j/helpers/DateLayout.html...
Generating /usr/src/RPM/BUILD/log4j-1_2_17/target/site/apidocs/org/apache/log4j/helpers/DateTimeDateFormat.html...
Generating /usr/src/RPM/BUILD/log4j-1_2_17/target/site/apidocs/org/apache/log4j/helpers/FileWatchdog.html...
Generating /usr/src/RPM/BUILD/log4j-1_2_17/target/site/apidocs/org/apache/log4j/helpers/FormattingInfo.html...
Generating /usr/src/RPM/BUILD/log4j-1_2_17/target/site/apidocs/org/apache/log4j/helpers/ISO8601DateFormat.html...
Generating /usr/src/RPM/BUILD/log4j-1_2_17/target/site/apidocs/org/apache/log4j/helpers/Loader.html...
Generating /usr/src/RPM/BUILD/log4j-1_2_17/target/site/apidocs/org/apache/log4j/helpers/LogLog.html...
Generating /usr/src/RPM/BUILD/log4j-1_2_17/target/site/apidocs/org/apache/log4j/helpers/MDCKeySetExtractor.html...
Generating /usr/src/RPM/BUILD/log4j-1_2_17/target/site/apidocs/org/apache/log4j/helpers/NullEnumeration.html...
Generating /usr/src/RPM/BUILD/log4j-1_2_17/target/site/apidocs/org/apache/log4j/helpers/OnlyOnceErrorHandler.html...
Generating /usr/src/RPM/BUILD/log4j-1_2_17/target/site/apidocs/org/apache/log4j/helpers/OptionConverter.html...
Generating /usr/src/RPM/BUILD/log4j-1_2_17/target/site/apidocs/org/apache/log4j/helpers/PatternConverter.html...
Generating /usr/src/RPM/BUILD/log4j-1_2_17/target/site/apidocs/org/apache/log4j/helpers/PatternParser.html...
Generating /usr/src/RPM/BUILD/log4j-1_2_17/target/site/apidocs/org/apache/log4j/helpers/QuietWriter.html...
Generating /usr/src/RPM/BUILD/log4j-1_2_17/target/site/apidocs/org/apache/log4j/helpers/RelativeTimeDateFormat.html...
Generating /usr/src/RPM/BUILD/log4j-1_2_17/target/site/apidocs/org/apache/log4j/helpers/SyslogQuietWriter.html...
Generating /usr/src/RPM/BUILD/log4j-1_2_17/target/site/apidocs/org/apache/log4j/helpers/SyslogWriter.html...
Generating /usr/src/RPM/BUILD/log4j-1_2_17/target/site/apidocs/org/apache/log4j/helpers/ThreadLocalMap.html...
Generating /usr/src/RPM/BUILD/log4j-1_2_17/target/site/apidocs/org/apache/log4j/helpers/Transform.html...
Generating /usr/src/RPM/BUILD/log4j-1_2_17/target/site/apidocs/org/apache/log4j/helpers/UtilLoggingLevel.html...
Generating /usr/src/RPM/BUILD/log4j-1_2_17/target/site/apidocs/org/apache/log4j/config/PropertyGetter.html...
Generating /usr/src/RPM/BUILD/log4j-1_2_17/target/site/apidocs/org/apache/log4j/config/PropertyGetter.PropertyCallback.html...
Generating /usr/src/RPM/BUILD/log4j-1_2_17/target/site/apidocs/org/apache/log4j/config/PropertyPrinter.html...
Generating /usr/src/RPM/BUILD/log4j-1_2_17/target/site/apidocs/org/apache/log4j/config/PropertySetter.html...
Generating /usr/src/RPM/BUILD/log4j-1_2_17/target/site/apidocs/org/apache/log4j/config/PropertySetterException.html...
Generating /usr/src/RPM/BUILD/log4j-1_2_17/target/site/apidocs/org/apache/log4j/chainsaw/Main.html...
Generating /usr/src/RPM/BUILD/log4j-1_2_17/target/site/apidocs/org/apache/log4j/xml/examples/XMLSample.html...
Generating /usr/src/RPM/BUILD/log4j-1_2_17/target/site/apidocs/overview-frame.html...
Generating /usr/src/RPM/BUILD/log4j-1_2_17/target/site/apidocs/org/apache/log4j/package-frame.html...
Generating /usr/src/RPM/BUILD/log4j-1_2_17/target/site/apidocs/org/apache/log4j/package-summary.html...
Generating /usr/src/RPM/BUILD/log4j-1_2_17/target/site/apidocs/org/apache/log4j/package-tree.html...
Generating /usr/src/RPM/BUILD/log4j-1_2_17/target/site/apidocs/org/apache/log4j/chainsaw/package-frame.html...
Generating /usr/src/RPM/BUILD/log4j-1_2_17/target/site/apidocs/org/apache/log4j/chainsaw/package-summary.html...
Copying file /usr/src/RPM/BUILD/log4j-1_2_17/src/main/java/org/apache/log4j/chainsaw/doc-files/screen_01.png to directory /usr/src/RPM/BUILD/log4j-1_2_17/target/site/apidocs/org/apache/log4j/chainsaw/doc-files...
Generating /usr/src/RPM/BUILD/log4j-1_2_17/target/site/apidocs/org/apache/log4j/chainsaw/package-tree.html...
Generating /usr/src/RPM/BUILD/log4j-1_2_17/target/site/apidocs/org/apache/log4j/config/package-frame.html...
Generating /usr/src/RPM/BUILD/log4j-1_2_17/target/site/apidocs/org/apache/log4j/config/package-summary.html...
Generating /usr/src/RPM/BUILD/log4j-1_2_17/target/site/apidocs/org/apache/log4j/config/package-tree.html...
Generating /usr/src/RPM/BUILD/log4j-1_2_17/target/site/apidocs/org/apache/log4j/helpers/package-frame.html...
Generating /usr/src/RPM/BUILD/log4j-1_2_17/target/site/apidocs/org/apache/log4j/helpers/package-summary.html...
Generating /usr/src/RPM/BUILD/log4j-1_2_17/target/site/apidocs/org/apache/log4j/helpers/package-tree.html...
Generating /usr/src/RPM/BUILD/log4j-1_2_17/target/site/apidocs/org/apache/log4j/jdbc/package-frame.html...
Generating /usr/src/RPM/BUILD/log4j-1_2_17/target/site/apidocs/org/apache/log4j/jdbc/package-summary.html...
Generating /usr/src/RPM/BUILD/log4j-1_2_17/target/site/apidocs/org/apache/log4j/jdbc/package-tree.html...
Generating /usr/src/RPM/BUILD/log4j-1_2_17/target/site/apidocs/org/apache/log4j/jmx/package-frame.html...
Generating /usr/src/RPM/BUILD/log4j-1_2_17/target/site/apidocs/org/apache/log4j/jmx/package-summary.html...
Generating /usr/src/RPM/BUILD/log4j-1_2_17/target/site/apidocs/org/apache/log4j/jmx/package-tree.html...
Generating /usr/src/RPM/BUILD/log4j-1_2_17/target/site/apidocs/org/apache/log4j/lf5/package-frame.html...
Generating /usr/src/RPM/BUILD/log4j-1_2_17/target/site/apidocs/org/apache/log4j/lf5/package-summary.html...
Generating /usr/src/RPM/BUILD/log4j-1_2_17/target/site/apidocs/org/apache/log4j/lf5/package-tree.html...
Generating /usr/src/RPM/BUILD/log4j-1_2_17/target/site/apidocs/org/apache/log4j/lf5/util/package-frame.html...
Generating /usr/src/RPM/BUILD/log4j-1_2_17/target/site/apidocs/org/apache/log4j/lf5/util/package-summary.html...
Generating /usr/src/RPM/BUILD/log4j-1_2_17/target/site/apidocs/org/apache/log4j/lf5/util/package-tree.html...
Generating /usr/src/RPM/BUILD/log4j-1_2_17/target/site/apidocs/org/apache/log4j/lf5/viewer/package-frame.html...
Generating /usr/src/RPM/BUILD/log4j-1_2_17/target/site/apidocs/org/apache/log4j/lf5/viewer/package-summary.html...
Generating /usr/src/RPM/BUILD/log4j-1_2_17/target/site/apidocs/org/apache/log4j/lf5/viewer/package-tree.html...
Generating /usr/src/RPM/BUILD/log4j-1_2_17/target/site/apidocs/org/apache/log4j/lf5/viewer/categoryexplorer/package-frame.html...
Generating /usr/src/RPM/BUILD/log4j-1_2_17/target/site/apidocs/org/apache/log4j/lf5/viewer/categoryexplorer/package-summary.html...
Generating /usr/src/RPM/BUILD/log4j-1_2_17/target/site/apidocs/org/apache/log4j/lf5/viewer/categoryexplorer/package-tree.html...
Generating /usr/src/RPM/BUILD/log4j-1_2_17/target/site/apidocs/org/apache/log4j/lf5/viewer/configure/package-frame.html...
Generating /usr/src/RPM/BUILD/log4j-1_2_17/target/site/apidocs/org/apache/log4j/lf5/viewer/configure/package-summary.html...
Generating /usr/src/RPM/BUILD/log4j-1_2_17/target/site/apidocs/org/apache/log4j/lf5/viewer/configure/package-tree.html...
Generating /usr/src/RPM/BUILD/log4j-1_2_17/target/site/apidocs/org/apache/log4j/net/package-frame.html...
Generating /usr/src/RPM/BUILD/log4j-1_2_17/target/site/apidocs/org/apache/log4j/net/package-summary.html...
Generating /usr/src/RPM/BUILD/log4j-1_2_17/target/site/apidocs/org/apache/log4j/net/package-tree.html...
Generating /usr/src/RPM/BUILD/log4j-1_2_17/target/site/apidocs/org/apache/log4j/or/package-frame.html...
Generating /usr/src/RPM/BUILD/log4j-1_2_17/target/site/apidocs/org/apache/log4j/or/package-summary.html...
Generating /usr/src/RPM/BUILD/log4j-1_2_17/target/site/apidocs/org/apache/log4j/or/package-tree.html...
Generating /usr/src/RPM/BUILD/log4j-1_2_17/target/site/apidocs/org/apache/log4j/or/jms/package-frame.html...
Generating /usr/src/RPM/BUILD/log4j-1_2_17/target/site/apidocs/org/apache/log4j/or/jms/package-summary.html...
Generating /usr/src/RPM/BUILD/log4j-1_2_17/target/site/apidocs/org/apache/log4j/or/jms/package-tree.html...
Generating /usr/src/RPM/BUILD/log4j-1_2_17/target/site/apidocs/org/apache/log4j/or/sax/package-frame.html...
Generating /usr/src/RPM/BUILD/log4j-1_2_17/target/site/apidocs/org/apache/log4j/or/sax/package-summary.html...
Generating /usr/src/RPM/BUILD/log4j-1_2_17/target/site/apidocs/org/apache/log4j/or/sax/package-tree.html...
Generating /usr/src/RPM/BUILD/log4j-1_2_17/target/site/apidocs/org/apache/log4j/pattern/package-frame.html...
Generating /usr/src/RPM/BUILD/log4j-1_2_17/target/site/apidocs/org/apache/log4j/pattern/package-summary.html...
Generating /usr/src/RPM/BUILD/log4j-1_2_17/target/site/apidocs/org/apache/log4j/pattern/package-tree.html...
Generating /usr/src/RPM/BUILD/log4j-1_2_17/target/site/apidocs/org/apache/log4j/rewrite/package-frame.html...
Generating /usr/src/RPM/BUILD/log4j-1_2_17/target/site/apidocs/org/apache/log4j/rewrite/package-summary.html...
Generating /usr/src/RPM/BUILD/log4j-1_2_17/target/site/apidocs/org/apache/log4j/rewrite/package-tree.html...
Generating /usr/src/RPM/BUILD/log4j-1_2_17/target/site/apidocs/org/apache/log4j/spi/package-frame.html...
Generating /usr/src/RPM/BUILD/log4j-1_2_17/target/site/apidocs/org/apache/log4j/spi/package-summary.html...
Generating /usr/src/RPM/BUILD/log4j-1_2_17/target/site/apidocs/org/apache/log4j/spi/package-tree.html...
Generating /usr/src/RPM/BUILD/log4j-1_2_17/target/site/apidocs/org/apache/log4j/varia/package-frame.html...
Generating /usr/src/RPM/BUILD/log4j-1_2_17/target/site/apidocs/org/apache/log4j/varia/package-summary.html...
Generating /usr/src/RPM/BUILD/log4j-1_2_17/target/site/apidocs/org/apache/log4j/varia/package-tree.html...
Generating /usr/src/RPM/BUILD/log4j-1_2_17/target/site/apidocs/org/apache/log4j/xml/package-frame.html...
Generating /usr/src/RPM/BUILD/log4j-1_2_17/target/site/apidocs/org/apache/log4j/xml/package-summary.html...
Copying file /usr/src/RPM/BUILD/log4j-1_2_17/src/main/javadoc/org/apache/log4j/xml/doc-files/log4j.dtd to directory /usr/src/RPM/BUILD/log4j-1_2_17/target/site/apidocs/org/apache/log4j/xml/doc-files...
Generating /usr/src/RPM/BUILD/log4j-1_2_17/target/site/apidocs/org/apache/log4j/xml/package-tree.html...
Generating /usr/src/RPM/BUILD/log4j-1_2_17/target/site/apidocs/org/apache/log4j/xml/examples/package-frame.html...
Generating /usr/src/RPM/BUILD/log4j-1_2_17/target/site/apidocs/org/apache/log4j/xml/examples/package-summary.html...
Copying file /usr/src/RPM/BUILD/log4j-1_2_17/src/main/javadoc/org/apache/log4j/xml/examples/doc-files/sample5.xml to directory /usr/src/RPM/BUILD/log4j-1_2_17/target/site/apidocs/org/apache/log4j/xml/examples/doc-files...
Copying file /usr/src/RPM/BUILD/log4j-1_2_17/src/main/javadoc/org/apache/log4j/xml/examples/doc-files/sample4.xml to directory /usr/src/RPM/BUILD/log4j-1_2_17/target/site/apidocs/org/apache/log4j/xml/examples/doc-files...
Copying file /usr/src/RPM/BUILD/log4j-1_2_17/src/main/javadoc/org/apache/log4j/xml/examples/doc-files/sample3.xml to directory /usr/src/RPM/BUILD/log4j-1_2_17/target/site/apidocs/org/apache/log4j/xml/examples/doc-files...
Copying file /usr/src/RPM/BUILD/log4j-1_2_17/src/main/javadoc/org/apache/log4j/xml/examples/doc-files/sample2.xml to directory /usr/src/RPM/BUILD/log4j-1_2_17/target/site/apidocs/org/apache/log4j/xml/examples/doc-files...
Copying file /usr/src/RPM/BUILD/log4j-1_2_17/src/main/javadoc/org/apache/log4j/xml/examples/doc-files/sample1.xml to directory /usr/src/RPM/BUILD/log4j-1_2_17/target/site/apidocs/org/apache/log4j/xml/examples/doc-files...
Copying file /usr/src/RPM/BUILD/log4j-1_2_17/src/main/javadoc/org/apache/log4j/xml/examples/doc-files/XMLSample.java to directory /usr/src/RPM/BUILD/log4j-1_2_17/target/site/apidocs/org/apache/log4j/xml/examples/doc-files...
Generating /usr/src/RPM/BUILD/log4j-1_2_17/target/site/apidocs/org/apache/log4j/xml/examples/package-tree.html...
Generating /usr/src/RPM/BUILD/log4j-1_2_17/target/site/apidocs/constant-values.html...
Generating /usr/src/RPM/BUILD/log4j-1_2_17/target/site/apidocs/serialized-form.html...
Generating /usr/src/RPM/BUILD/log4j-1_2_17/target/site/apidocs/org/apache/log4j/class-use/Appender.html...
Generating /usr/src/RPM/BUILD/log4j-1_2_17/target/site/apidocs/org/apache/log4j/class-use/AppenderSkeleton.html...
Generating /usr/src/RPM/BUILD/log4j-1_2_17/target/site/apidocs/org/apache/log4j/class-use/AsyncAppender.html...
Generating /usr/src/RPM/BUILD/log4j-1_2_17/target/site/apidocs/org/apache/log4j/class-use/BasicConfigurator.html...
Generating /usr/src/RPM/BUILD/log4j-1_2_17/target/site/apidocs/org/apache/log4j/class-use/Category.html...
Generating /usr/src/RPM/BUILD/log4j-1_2_17/target/site/apidocs/org/apache/log4j/class-use/ConsoleAppender.html...
Generating /usr/src/RPM/BUILD/log4j-1_2_17/target/site/apidocs/org/apache/log4j/class-use/DailyRollingFileAppender.html...
Generating /usr/src/RPM/BUILD/log4j-1_2_17/target/site/apidocs/org/apache/log4j/class-use/DefaultThrowableRenderer.html...
Generating /usr/src/RPM/BUILD/log4j-1_2_17/target/site/apidocs/org/apache/log4j/class-use/EnhancedPatternLayout.html...
Generating /usr/src/RPM/BUILD/log4j-1_2_17/target/site/apidocs/org/apache/log4j/class-use/EnhancedThrowableRenderer.html...
Generating /usr/src/RPM/BUILD/log4j-1_2_17/target/site/apidocs/org/apache/log4j/class-use/FileAppender.html...
Generating /usr/src/RPM/BUILD/log4j-1_2_17/target/site/apidocs/org/apache/log4j/class-use/HTMLLayout.html...
Generating /usr/src/RPM/BUILD/log4j-1_2_17/target/site/apidocs/org/apache/log4j/class-use/Hierarchy.html...
Generating /usr/src/RPM/BUILD/log4j-1_2_17/target/site/apidocs/org/apache/log4j/class-use/Layout.html...
Generating /usr/src/RPM/BUILD/log4j-1_2_17/target/site/apidocs/org/apache/log4j/class-use/Level.html...
Generating /usr/src/RPM/BUILD/log4j-1_2_17/target/site/apidocs/org/apache/log4j/class-use/LogMF.html...
Generating /usr/src/RPM/BUILD/log4j-1_2_17/target/site/apidocs/org/apache/log4j/class-use/LogManager.html...
Generating /usr/src/RPM/BUILD/log4j-1_2_17/target/site/apidocs/org/apache/log4j/class-use/LogSF.html...
Generating /usr/src/RPM/BUILD/log4j-1_2_17/target/site/apidocs/org/apache/log4j/class-use/LogXF.html...
Generating /usr/src/RPM/BUILD/log4j-1_2_17/target/site/apidocs/org/apache/log4j/class-use/Logger.html...
Generating /usr/src/RPM/BUILD/log4j-1_2_17/target/site/apidocs/org/apache/log4j/class-use/MDC.html...
Generating /usr/src/RPM/BUILD/log4j-1_2_17/target/site/apidocs/org/apache/log4j/class-use/NDC.html...
Generating /usr/src/RPM/BUILD/log4j-1_2_17/target/site/apidocs/org/apache/log4j/class-use/PatternLayout.html...
Generating /usr/src/RPM/BUILD/log4j-1_2_17/target/site/apidocs/org/apache/log4j/class-use/Priority.html...
Generating /usr/src/RPM/BUILD/log4j-1_2_17/target/site/apidocs/org/apache/log4j/class-use/PropertyConfigurator.html...
Generating /usr/src/RPM/BUILD/log4j-1_2_17/target/site/apidocs/org/apache/log4j/class-use/RollingFileAppender.html...
Generating /usr/src/RPM/BUILD/log4j-1_2_17/target/site/apidocs/org/apache/log4j/class-use/SimpleLayout.html...
Generating /usr/src/RPM/BUILD/log4j-1_2_17/target/site/apidocs/org/apache/log4j/class-use/TTCCLayout.html...
Generating /usr/src/RPM/BUILD/log4j-1_2_17/target/site/apidocs/org/apache/log4j/class-use/WriterAppender.html...
Generating /usr/src/RPM/BUILD/log4j-1_2_17/target/site/apidocs/org/apache/log4j/class-use/FilteredObjectInputStream.html...
Generating /usr/src/RPM/BUILD/log4j-1_2_17/target/site/apidocs/org/apache/log4j/xml/class-use/DOMConfigurator.html...
Generating /usr/src/RPM/BUILD/log4j-1_2_17/target/site/apidocs/org/apache/log4j/xml/class-use/Log4jEntityResolver.html...
Generating /usr/src/RPM/BUILD/log4j-1_2_17/target/site/apidocs/org/apache/log4j/xml/class-use/SAXErrorHandler.html...
Generating /usr/src/RPM/BUILD/log4j-1_2_17/target/site/apidocs/org/apache/log4j/xml/class-use/UnrecognizedElementHandler.html...
Generating /usr/src/RPM/BUILD/log4j-1_2_17/target/site/apidocs/org/apache/log4j/xml/class-use/XMLLayout.html...
Generating /usr/src/RPM/BUILD/log4j-1_2_17/target/site/apidocs/org/apache/log4j/varia/class-use/DenyAllFilter.html...
Generating /usr/src/RPM/BUILD/log4j-1_2_17/target/site/apidocs/org/apache/log4j/varia/class-use/ExternallyRolledFileAppender.html...
Generating /usr/src/RPM/BUILD/log4j-1_2_17/target/site/apidocs/org/apache/log4j/varia/class-use/FallbackErrorHandler.html...
Generating /usr/src/RPM/BUILD/log4j-1_2_17/target/site/apidocs/org/apache/log4j/varia/class-use/LevelMatchFilter.html...
Generating /usr/src/RPM/BUILD/log4j-1_2_17/target/site/apidocs/org/apache/log4j/varia/class-use/LevelRangeFilter.html...
Generating /usr/src/RPM/BUILD/log4j-1_2_17/target/site/apidocs/org/apache/log4j/varia/class-use/NullAppender.html...
Generating /usr/src/RPM/BUILD/log4j-1_2_17/target/site/apidocs/org/apache/log4j/varia/class-use/ReloadingPropertyConfigurator.html...
Generating /usr/src/RPM/BUILD/log4j-1_2_17/target/site/apidocs/org/apache/log4j/varia/class-use/Roller.html...
Generating /usr/src/RPM/BUILD/log4j-1_2_17/target/site/apidocs/org/apache/log4j/varia/class-use/StringMatchFilter.html...
Generating /usr/src/RPM/BUILD/log4j-1_2_17/target/site/apidocs/org/apache/log4j/spi/class-use/AppenderAttachable.html...
Generating /usr/src/RPM/BUILD/log4j-1_2_17/target/site/apidocs/org/apache/log4j/spi/class-use/Configurator.html...
Generating /usr/src/RPM/BUILD/log4j-1_2_17/target/site/apidocs/org/apache/log4j/spi/class-use/DefaultRepositorySelector.html...
Generating /usr/src/RPM/BUILD/log4j-1_2_17/target/site/apidocs/org/apache/log4j/spi/class-use/ErrorCode.html...
Generating /usr/src/RPM/BUILD/log4j-1_2_17/target/site/apidocs/org/apache/log4j/spi/class-use/ErrorHandler.html...
Generating /usr/src/RPM/BUILD/log4j-1_2_17/target/site/apidocs/org/apache/log4j/spi/class-use/Filter.html...
Generating /usr/src/RPM/BUILD/log4j-1_2_17/target/site/apidocs/org/apache/log4j/spi/class-use/HierarchyEventListener.html...
Generating /usr/src/RPM/BUILD/log4j-1_2_17/target/site/apidocs/org/apache/log4j/spi/class-use/LocationInfo.html...
Generating /usr/src/RPM/BUILD/log4j-1_2_17/target/site/apidocs/org/apache/log4j/spi/class-use/LoggerFactory.html...
Generating /usr/src/RPM/BUILD/log4j-1_2_17/target/site/apidocs/org/apache/log4j/spi/class-use/LoggerRepository.html...
Generating /usr/src/RPM/BUILD/log4j-1_2_17/target/site/apidocs/org/apache/log4j/spi/class-use/LoggingEvent.html...
Generating /usr/src/RPM/BUILD/log4j-1_2_17/target/site/apidocs/org/apache/log4j/spi/class-use/NOPLogger.html...
Generating /usr/src/RPM/BUILD/log4j-1_2_17/target/site/apidocs/org/apache/log4j/spi/class-use/NOPLoggerRepository.html...
Generating /usr/src/RPM/BUILD/log4j-1_2_17/target/site/apidocs/org/apache/log4j/spi/class-use/OptionHandler.html...
Generating /usr/src/RPM/BUILD/log4j-1_2_17/target/site/apidocs/org/apache/log4j/spi/class-use/RendererSupport.html...
Generating /usr/src/RPM/BUILD/log4j-1_2_17/target/site/apidocs/org/apache/log4j/spi/class-use/RepositorySelector.html...
Generating /usr/src/RPM/BUILD/log4j-1_2_17/target/site/apidocs/org/apache/log4j/spi/class-use/RootCategory.html...
Generating /usr/src/RPM/BUILD/log4j-1_2_17/target/site/apidocs/org/apache/log4j/spi/class-use/RootLogger.html...
Generating /usr/src/RPM/BUILD/log4j-1_2_17/target/site/apidocs/org/apache/log4j/spi/class-use/ThrowableInformation.html...
Generating /usr/src/RPM/BUILD/log4j-1_2_17/target/site/apidocs/org/apache/log4j/spi/class-use/ThrowableRenderer.html...
Generating /usr/src/RPM/BUILD/log4j-1_2_17/target/site/apidocs/org/apache/log4j/spi/class-use/ThrowableRendererSupport.html...
Generating /usr/src/RPM/BUILD/log4j-1_2_17/target/site/apidocs/org/apache/log4j/spi/class-use/TriggeringEventEvaluator.html...
Generating /usr/src/RPM/BUILD/log4j-1_2_17/target/site/apidocs/org/apache/log4j/rewrite/class-use/MapRewritePolicy.html...
Generating /usr/src/RPM/BUILD/log4j-1_2_17/target/site/apidocs/org/apache/log4j/rewrite/class-use/PropertyRewritePolicy.html...
Generating /usr/src/RPM/BUILD/log4j-1_2_17/target/site/apidocs/org/apache/log4j/rewrite/class-use/ReflectionRewritePolicy.html...
Generating /usr/src/RPM/BUILD/log4j-1_2_17/target/site/apidocs/org/apache/log4j/rewrite/class-use/RewriteAppender.html...
Generating /usr/src/RPM/BUILD/log4j-1_2_17/target/site/apidocs/org/apache/log4j/rewrite/class-use/RewritePolicy.html...
Generating /usr/src/RPM/BUILD/log4j-1_2_17/target/site/apidocs/org/apache/log4j/pattern/class-use/BridgePatternConverter.html...
Generating /usr/src/RPM/BUILD/log4j-1_2_17/target/site/apidocs/org/apache/log4j/pattern/class-use/BridgePatternParser.html...
Generating /usr/src/RPM/BUILD/log4j-1_2_17/target/site/apidocs/org/apache/log4j/pattern/class-use/CachedDateFormat.html...
Generating /usr/src/RPM/BUILD/log4j-1_2_17/target/site/apidocs/org/apache/log4j/pattern/class-use/ClassNamePatternConverter.html...
Generating /usr/src/RPM/BUILD/log4j-1_2_17/target/site/apidocs/org/apache/log4j/pattern/class-use/DatePatternConverter.html...
Generating /usr/src/RPM/BUILD/log4j-1_2_17/target/site/apidocs/org/apache/log4j/pattern/class-use/FileDatePatternConverter.html...
Generating /usr/src/RPM/BUILD/log4j-1_2_17/target/site/apidocs/org/apache/log4j/pattern/class-use/FileLocationPatternConverter.html...
Generating /usr/src/RPM/BUILD/log4j-1_2_17/target/site/apidocs/org/apache/log4j/pattern/class-use/FormattingInfo.html...
Generating /usr/src/RPM/BUILD/log4j-1_2_17/target/site/apidocs/org/apache/log4j/pattern/class-use/FullLocationPatternConverter.html...
Generating /usr/src/RPM/BUILD/log4j-1_2_17/target/site/apidocs/org/apache/log4j/pattern/class-use/IntegerPatternConverter.html...
Generating /usr/src/RPM/BUILD/log4j-1_2_17/target/site/apidocs/org/apache/log4j/pattern/class-use/LevelPatternConverter.html...
Generating /usr/src/RPM/BUILD/log4j-1_2_17/target/site/apidocs/org/apache/log4j/pattern/class-use/LineLocationPatternConverter.html...
Generating /usr/src/RPM/BUILD/log4j-1_2_17/target/site/apidocs/org/apache/log4j/pattern/class-use/LineSeparatorPatternConverter.html...
Generating /usr/src/RPM/BUILD/log4j-1_2_17/target/site/apidocs/org/apache/log4j/pattern/class-use/LiteralPatternConverter.html...
Generating /usr/src/RPM/BUILD/log4j-1_2_17/target/site/apidocs/org/apache/log4j/pattern/class-use/LogEvent.html...
Generating /usr/src/RPM/BUILD/log4j-1_2_17/target/site/apidocs/org/apache/log4j/pattern/class-use/LoggerPatternConverter.html...
Generating /usr/src/RPM/BUILD/log4j-1_2_17/target/site/apidocs/org/apache/log4j/pattern/class-use/LoggingEventPatternConverter.html...
Generating /usr/src/RPM/BUILD/log4j-1_2_17/target/site/apidocs/org/apache/log4j/pattern/class-use/MessagePatternConverter.html...
Generating /usr/src/RPM/BUILD/log4j-1_2_17/target/site/apidocs/org/apache/log4j/pattern/class-use/MethodLocationPatternConverter.html...
Generating /usr/src/RPM/BUILD/log4j-1_2_17/target/site/apidocs/org/apache/log4j/pattern/class-use/NDCPatternConverter.html...
Generating /usr/src/RPM/BUILD/log4j-1_2_17/target/site/apidocs/org/apache/log4j/pattern/class-use/NameAbbreviator.html...
Generating /usr/src/RPM/BUILD/log4j-1_2_17/target/site/apidocs/org/apache/log4j/pattern/class-use/NamePatternConverter.html...
Generating /usr/src/RPM/BUILD/log4j-1_2_17/target/site/apidocs/org/apache/log4j/pattern/class-use/PatternConverter.html...
Generating /usr/src/RPM/BUILD/log4j-1_2_17/target/site/apidocs/org/apache/log4j/pattern/class-use/PatternParser.html...
Generating /usr/src/RPM/BUILD/log4j-1_2_17/target/site/apidocs/org/apache/log4j/pattern/class-use/PropertiesPatternConverter.html...
Generating /usr/src/RPM/BUILD/log4j-1_2_17/target/site/apidocs/org/apache/log4j/pattern/class-use/RelativeTimePatternConverter.html...
Generating /usr/src/RPM/BUILD/log4j-1_2_17/target/site/apidocs/org/apache/log4j/pattern/class-use/SequenceNumberPatternConverter.html...
Generating /usr/src/RPM/BUILD/log4j-1_2_17/target/site/apidocs/org/apache/log4j/pattern/class-use/ThreadPatternConverter.html...
Generating /usr/src/RPM/BUILD/log4j-1_2_17/target/site/apidocs/org/apache/log4j/pattern/class-use/ThrowableInformationPatternConverter.html...
Generating /usr/src/RPM/BUILD/log4j-1_2_17/target/site/apidocs/org/apache/log4j/or/sax/class-use/AttributesRenderer.html...
Generating /usr/src/RPM/BUILD/log4j-1_2_17/target/site/apidocs/org/apache/log4j/or/jms/class-use/MessageRenderer.html...
Generating /usr/src/RPM/BUILD/log4j-1_2_17/target/site/apidocs/org/apache/log4j/or/class-use/ObjectRenderer.html...
Generating /usr/src/RPM/BUILD/log4j-1_2_17/target/site/apidocs/org/apache/log4j/or/class-use/RendererMap.html...
Generating /usr/src/RPM/BUILD/log4j-1_2_17/target/site/apidocs/org/apache/log4j/or/class-use/ThreadGroupRenderer.html...
Generating /usr/src/RPM/BUILD/log4j-1_2_17/target/site/apidocs/org/apache/log4j/net/class-use/JMSAppender.html...
Generating /usr/src/RPM/BUILD/log4j-1_2_17/target/site/apidocs/org/apache/log4j/net/class-use/JMSSink.html...
Generating /usr/src/RPM/BUILD/log4j-1_2_17/target/site/apidocs/org/apache/log4j/net/class-use/SMTPAppender.html...
Generating /usr/src/RPM/BUILD/log4j-1_2_17/target/site/apidocs/org/apache/log4j/net/class-use/SimpleSocketServer.html...
Generating /usr/src/RPM/BUILD/log4j-1_2_17/target/site/apidocs/org/apache/log4j/net/class-use/SocketAppender.html...
Generating /usr/src/RPM/BUILD/log4j-1_2_17/target/site/apidocs/org/apache/log4j/net/class-use/SocketHubAppender.html...
Generating /usr/src/RPM/BUILD/log4j-1_2_17/target/site/apidocs/org/apache/log4j/net/class-use/SocketServer.html...
Generating /usr/src/RPM/BUILD/log4j-1_2_17/target/site/apidocs/org/apache/log4j/net/class-use/SyslogAppender.html...
Generating /usr/src/RPM/BUILD/log4j-1_2_17/target/site/apidocs/org/apache/log4j/net/class-use/TelnetAppender.html...
Generating /usr/src/RPM/BUILD/log4j-1_2_17/target/site/apidocs/org/apache/log4j/net/class-use/TelnetAppender.SocketHandler.html...
Generating /usr/src/RPM/BUILD/log4j-1_2_17/target/site/apidocs/org/apache/log4j/net/class-use/ZeroConfSupport.html...
Generating /usr/src/RPM/BUILD/log4j-1_2_17/target/site/apidocs/org/apache/log4j/net/class-use/SocketNode.html...
Generating /usr/src/RPM/BUILD/log4j-1_2_17/target/site/apidocs/org/apache/log4j/lf5/viewer/configure/class-use/ConfigurationManager.html...
Generating /usr/src/RPM/BUILD/log4j-1_2_17/target/site/apidocs/org/apache/log4j/lf5/viewer/configure/class-use/MRUFileManager.html...
Generating /usr/src/RPM/BUILD/log4j-1_2_17/target/site/apidocs/org/apache/log4j/lf5/viewer/categoryexplorer/class-use/CategoryAbstractCellEditor.html...
Generating /usr/src/RPM/BUILD/log4j-1_2_17/target/site/apidocs/org/apache/log4j/lf5/viewer/categoryexplorer/class-use/CategoryElement.html...
Generating /usr/src/RPM/BUILD/log4j-1_2_17/target/site/apidocs/org/apache/log4j/lf5/viewer/categoryexplorer/class-use/CategoryExplorerLogRecordFilter.html...
Generating /usr/src/RPM/BUILD/log4j-1_2_17/target/site/apidocs/org/apache/log4j/lf5/viewer/categoryexplorer/class-use/CategoryExplorerModel.html...
Generating /usr/src/RPM/BUILD/log4j-1_2_17/target/site/apidocs/org/apache/log4j/lf5/viewer/categoryexplorer/class-use/CategoryExplorerTree.html...
Generating /usr/src/RPM/BUILD/log4j-1_2_17/target/site/apidocs/org/apache/log4j/lf5/viewer/categoryexplorer/class-use/CategoryImmediateEditor.html...
Generating /usr/src/RPM/BUILD/log4j-1_2_17/target/site/apidocs/org/apache/log4j/lf5/viewer/categoryexplorer/class-use/CategoryNode.html...
Generating /usr/src/RPM/BUILD/log4j-1_2_17/target/site/apidocs/org/apache/log4j/lf5/viewer/categoryexplorer/class-use/CategoryNodeEditor.html...
Generating /usr/src/RPM/BUILD/log4j-1_2_17/target/site/apidocs/org/apache/log4j/lf5/viewer/categoryexplorer/class-use/CategoryNodeEditorRenderer.html...
Generating /usr/src/RPM/BUILD/log4j-1_2_17/target/site/apidocs/org/apache/log4j/lf5/viewer/categoryexplorer/class-use/CategoryNodeRenderer.html...
Generating /usr/src/RPM/BUILD/log4j-1_2_17/target/site/apidocs/org/apache/log4j/lf5/viewer/categoryexplorer/class-use/CategoryPath.html...
Generating /usr/src/RPM/BUILD/log4j-1_2_17/target/site/apidocs/org/apache/log4j/lf5/viewer/categoryexplorer/class-use/TreeModelAdapter.html...
Generating /usr/src/RPM/BUILD/log4j-1_2_17/target/site/apidocs/org/apache/log4j/lf5/viewer/class-use/FilteredLogTableModel.html...
Generating /usr/src/RPM/BUILD/log4j-1_2_17/target/site/apidocs/org/apache/log4j/lf5/viewer/class-use/LF5SwingUtils.html...
Generating /usr/src/RPM/BUILD/log4j-1_2_17/target/site/apidocs/org/apache/log4j/lf5/viewer/class-use/LogBrokerMonitor.html...
Generating /usr/src/RPM/BUILD/log4j-1_2_17/target/site/apidocs/org/apache/log4j/lf5/viewer/class-use/LogFactor5Dialog.html...
Generating /usr/src/RPM/BUILD/log4j-1_2_17/target/site/apidocs/org/apache/log4j/lf5/viewer/class-use/LogFactor5ErrorDialog.html...
Generating /usr/src/RPM/BUILD/log4j-1_2_17/target/site/apidocs/org/apache/log4j/lf5/viewer/class-use/LogFactor5InputDialog.html...
Generating /usr/src/RPM/BUILD/log4j-1_2_17/target/site/apidocs/org/apache/log4j/lf5/viewer/class-use/LogFactor5LoadingDialog.html...
Generating /usr/src/RPM/BUILD/log4j-1_2_17/target/site/apidocs/org/apache/log4j/lf5/viewer/class-use/LogTable.html...
Generating /usr/src/RPM/BUILD/log4j-1_2_17/target/site/apidocs/org/apache/log4j/lf5/viewer/class-use/LogTableColumn.html...
Generating /usr/src/RPM/BUILD/log4j-1_2_17/target/site/apidocs/org/apache/log4j/lf5/viewer/class-use/LogTableColumnFormatException.html...
Generating /usr/src/RPM/BUILD/log4j-1_2_17/target/site/apidocs/org/apache/log4j/lf5/viewer/class-use/LogTableModel.html...
Generating /usr/src/RPM/BUILD/log4j-1_2_17/target/site/apidocs/org/apache/log4j/lf5/viewer/class-use/LogTableRowRenderer.html...
Generating /usr/src/RPM/BUILD/log4j-1_2_17/target/site/apidocs/org/apache/log4j/lf5/viewer/class-use/TrackingAdjustmentListener.html...
Generating /usr/src/RPM/BUILD/log4j-1_2_17/target/site/apidocs/org/apache/log4j/lf5/util/class-use/AdapterLogRecord.html...
Generating /usr/src/RPM/BUILD/log4j-1_2_17/target/site/apidocs/org/apache/log4j/lf5/util/class-use/DateFormatManager.html...
Generating /usr/src/RPM/BUILD/log4j-1_2_17/target/site/apidocs/org/apache/log4j/lf5/util/class-use/LogFileParser.html...
Generating /usr/src/RPM/BUILD/log4j-1_2_17/target/site/apidocs/org/apache/log4j/lf5/util/class-use/LogMonitorAdapter.html...
Generating /usr/src/RPM/BUILD/log4j-1_2_17/target/site/apidocs/org/apache/log4j/lf5/util/class-use/Resource.html...
Generating /usr/src/RPM/BUILD/log4j-1_2_17/target/site/apidocs/org/apache/log4j/lf5/util/class-use/ResourceUtils.html...
Generating /usr/src/RPM/BUILD/log4j-1_2_17/target/site/apidocs/org/apache/log4j/lf5/util/class-use/StreamUtils.html...
Generating /usr/src/RPM/BUILD/log4j-1_2_17/target/site/apidocs/org/apache/log4j/lf5/class-use/AppenderFinalizer.html...
Generating /usr/src/RPM/BUILD/log4j-1_2_17/target/site/apidocs/org/apache/log4j/lf5/class-use/DefaultLF5Configurator.html...
Generating /usr/src/RPM/BUILD/log4j-1_2_17/target/site/apidocs/org/apache/log4j/lf5/class-use/LF5Appender.html...
Generating /usr/src/RPM/BUILD/log4j-1_2_17/target/site/apidocs/org/apache/log4j/lf5/class-use/Log4JLogRecord.html...
Generating /usr/src/RPM/BUILD/log4j-1_2_17/target/site/apidocs/org/apache/log4j/lf5/class-use/LogLevel.html...
Generating /usr/src/RPM/BUILD/log4j-1_2_17/target/site/apidocs/org/apache/log4j/lf5/class-use/LogLevelFormatException.html...
Generating /usr/src/RPM/BUILD/log4j-1_2_17/target/site/apidocs/org/apache/log4j/lf5/class-use/LogRecord.html...
Generating /usr/src/RPM/BUILD/log4j-1_2_17/target/site/apidocs/org/apache/log4j/lf5/class-use/LogRecordFilter.html...
Generating /usr/src/RPM/BUILD/log4j-1_2_17/target/site/apidocs/org/apache/log4j/lf5/class-use/PassingLogRecordFilter.html...
Generating /usr/src/RPM/BUILD/log4j-1_2_17/target/site/apidocs/org/apache/log4j/lf5/class-use/StartLogFactor5.html...
Generating /usr/src/RPM/BUILD/log4j-1_2_17/target/site/apidocs/org/apache/log4j/jmx/class-use/AbstractDynamicMBean.html...
Generating /usr/src/RPM/BUILD/log4j-1_2_17/target/site/apidocs/org/apache/log4j/jmx/class-use/Agent.html...
Generating /usr/src/RPM/BUILD/log4j-1_2_17/target/site/apidocs/org/apache/log4j/jmx/class-use/AppenderDynamicMBean.html...
Generating /usr/src/RPM/BUILD/log4j-1_2_17/target/site/apidocs/org/apache/log4j/jmx/class-use/HierarchyDynamicMBean.html...
Generating /usr/src/RPM/BUILD/log4j-1_2_17/target/site/apidocs/org/apache/log4j/jmx/class-use/LayoutDynamicMBean.html...
Generating /usr/src/RPM/BUILD/log4j-1_2_17/target/site/apidocs/org/apache/log4j/jmx/class-use/LoggerDynamicMBean.html...
Generating /usr/src/RPM/BUILD/log4j-1_2_17/target/site/apidocs/org/apache/log4j/jdbc/class-use/JDBCAppender.html...
Generating /usr/src/RPM/BUILD/log4j-1_2_17/target/site/apidocs/org/apache/log4j/helpers/class-use/AbsoluteTimeDateFormat.html...
Generating /usr/src/RPM/BUILD/log4j-1_2_17/target/site/apidocs/org/apache/log4j/helpers/class-use/AppenderAttachableImpl.html...
Generating /usr/src/RPM/BUILD/log4j-1_2_17/target/site/apidocs/org/apache/log4j/helpers/class-use/BoundedFIFO.html...
Generating /usr/src/RPM/BUILD/log4j-1_2_17/target/site/apidocs/org/apache/log4j/helpers/class-use/CountingQuietWriter.html...
Generating /usr/src/RPM/BUILD/log4j-1_2_17/target/site/apidocs/org/apache/log4j/helpers/class-use/CyclicBuffer.html...
Generating /usr/src/RPM/BUILD/log4j-1_2_17/target/site/apidocs/org/apache/log4j/helpers/class-use/DateLayout.html...
Generating /usr/src/RPM/BUILD/log4j-1_2_17/target/site/apidocs/org/apache/log4j/helpers/class-use/DateTimeDateFormat.html...
Generating /usr/src/RPM/BUILD/log4j-1_2_17/target/site/apidocs/org/apache/log4j/helpers/class-use/FileWatchdog.html...
Generating /usr/src/RPM/BUILD/log4j-1_2_17/target/site/apidocs/org/apache/log4j/helpers/class-use/FormattingInfo.html...
Generating /usr/src/RPM/BUILD/log4j-1_2_17/target/site/apidocs/org/apache/log4j/helpers/class-use/ISO8601DateFormat.html...
Generating /usr/src/RPM/BUILD/log4j-1_2_17/target/site/apidocs/org/apache/log4j/helpers/class-use/Loader.html...
Generating /usr/src/RPM/BUILD/log4j-1_2_17/target/site/apidocs/org/apache/log4j/helpers/class-use/LogLog.html...
Generating /usr/src/RPM/BUILD/log4j-1_2_17/target/site/apidocs/org/apache/log4j/helpers/class-use/MDCKeySetExtractor.html...
Generating /usr/src/RPM/BUILD/log4j-1_2_17/target/site/apidocs/org/apache/log4j/helpers/class-use/NullEnumeration.html...
Generating /usr/src/RPM/BUILD/log4j-1_2_17/target/site/apidocs/org/apache/log4j/helpers/class-use/OnlyOnceErrorHandler.html...
Generating /usr/src/RPM/BUILD/log4j-1_2_17/target/site/apidocs/org/apache/log4j/helpers/class-use/OptionConverter.html...
Generating /usr/src/RPM/BUILD/log4j-1_2_17/target/site/apidocs/org/apache/log4j/helpers/class-use/PatternConverter.html...
Generating /usr/src/RPM/BUILD/log4j-1_2_17/target/site/apidocs/org/apache/log4j/helpers/class-use/PatternParser.html...
Generating /usr/src/RPM/BUILD/log4j-1_2_17/target/site/apidocs/org/apache/log4j/helpers/class-use/QuietWriter.html...
Generating /usr/src/RPM/BUILD/log4j-1_2_17/target/site/apidocs/org/apache/log4j/helpers/class-use/RelativeTimeDateFormat.html...
Generating /usr/src/RPM/BUILD/log4j-1_2_17/target/site/apidocs/org/apache/log4j/helpers/class-use/SyslogQuietWriter.html...
Generating /usr/src/RPM/BUILD/log4j-1_2_17/target/site/apidocs/org/apache/log4j/helpers/class-use/SyslogWriter.html...
Generating /usr/src/RPM/BUILD/log4j-1_2_17/target/site/apidocs/org/apache/log4j/helpers/class-use/ThreadLocalMap.html...
Generating /usr/src/RPM/BUILD/log4j-1_2_17/target/site/apidocs/org/apache/log4j/helpers/class-use/Transform.html...
Generating /usr/src/RPM/BUILD/log4j-1_2_17/target/site/apidocs/org/apache/log4j/helpers/class-use/UtilLoggingLevel.html...
Generating /usr/src/RPM/BUILD/log4j-1_2_17/target/site/apidocs/org/apache/log4j/config/class-use/PropertyGetter.html...
Generating /usr/src/RPM/BUILD/log4j-1_2_17/target/site/apidocs/org/apache/log4j/config/class-use/PropertyGetter.PropertyCallback.html...
Generating /usr/src/RPM/BUILD/log4j-1_2_17/target/site/apidocs/org/apache/log4j/config/class-use/PropertyPrinter.html...
Generating /usr/src/RPM/BUILD/log4j-1_2_17/target/site/apidocs/org/apache/log4j/config/class-use/PropertySetter.html...
Generating /usr/src/RPM/BUILD/log4j-1_2_17/target/site/apidocs/org/apache/log4j/config/class-use/PropertySetterException.html...
Generating /usr/src/RPM/BUILD/log4j-1_2_17/target/site/apidocs/org/apache/log4j/chainsaw/class-use/Main.html...
Generating /usr/src/RPM/BUILD/log4j-1_2_17/target/site/apidocs/org/apache/log4j/xml/examples/class-use/XMLSample.html...
Generating /usr/src/RPM/BUILD/log4j-1_2_17/target/site/apidocs/org/apache/log4j/package-use.html...
Generating /usr/src/RPM/BUILD/log4j-1_2_17/target/site/apidocs/org/apache/log4j/chainsaw/package-use.html...
Generating /usr/src/RPM/BUILD/log4j-1_2_17/target/site/apidocs/org/apache/log4j/config/package-use.html...
Generating /usr/src/RPM/BUILD/log4j-1_2_17/target/site/apidocs/org/apache/log4j/helpers/package-use.html...
Generating /usr/src/RPM/BUILD/log4j-1_2_17/target/site/apidocs/org/apache/log4j/jdbc/package-use.html...
Generating /usr/src/RPM/BUILD/log4j-1_2_17/target/site/apidocs/org/apache/log4j/jmx/package-use.html...
Generating /usr/src/RPM/BUILD/log4j-1_2_17/target/site/apidocs/org/apache/log4j/lf5/package-use.html...
Generating /usr/src/RPM/BUILD/log4j-1_2_17/target/site/apidocs/org/apache/log4j/lf5/util/package-use.html...
Generating /usr/src/RPM/BUILD/log4j-1_2_17/target/site/apidocs/org/apache/log4j/lf5/viewer/package-use.html...
Generating /usr/src/RPM/BUILD/log4j-1_2_17/target/site/apidocs/org/apache/log4j/lf5/viewer/categoryexplorer/package-use.html...
Generating /usr/src/RPM/BUILD/log4j-1_2_17/target/site/apidocs/org/apache/log4j/lf5/viewer/configure/package-use.html...
Generating /usr/src/RPM/BUILD/log4j-1_2_17/target/site/apidocs/org/apache/log4j/net/package-use.html...
Generating /usr/src/RPM/BUILD/log4j-1_2_17/target/site/apidocs/org/apache/log4j/or/package-use.html...
Generating /usr/src/RPM/BUILD/log4j-1_2_17/target/site/apidocs/org/apache/log4j/or/jms/package-use.html...
Generating /usr/src/RPM/BUILD/log4j-1_2_17/target/site/apidocs/org/apache/log4j/or/sax/package-use.html...
Generating /usr/src/RPM/BUILD/log4j-1_2_17/target/site/apidocs/org/apache/log4j/pattern/package-use.html...
Generating /usr/src/RPM/BUILD/log4j-1_2_17/target/site/apidocs/org/apache/log4j/rewrite/package-use.html...
Generating /usr/src/RPM/BUILD/log4j-1_2_17/target/site/apidocs/org/apache/log4j/spi/package-use.html...
Generating /usr/src/RPM/BUILD/log4j-1_2_17/target/site/apidocs/org/apache/log4j/varia/package-use.html...
Generating /usr/src/RPM/BUILD/log4j-1_2_17/target/site/apidocs/org/apache/log4j/xml/package-use.html...
Generating /usr/src/RPM/BUILD/log4j-1_2_17/target/site/apidocs/org/apache/log4j/xml/examples/package-use.html...
Building index for all the packages and classes...
Generating /usr/src/RPM/BUILD/log4j-1_2_17/target/site/apidocs/overview-tree.html...
Generating /usr/src/RPM/BUILD/log4j-1_2_17/target/site/apidocs/index-all.html...
Generating /usr/src/RPM/BUILD/log4j-1_2_17/target/site/apidocs/deprecated-list.html...
Building index for all classes...
Generating /usr/src/RPM/BUILD/log4j-1_2_17/target/site/apidocs/allclasses-frame.html...
Generating /usr/src/RPM/BUILD/log4j-1_2_17/target/site/apidocs/allclasses-noframe.html...
Generating /usr/src/RPM/BUILD/log4j-1_2_17/target/site/apidocs/index.html...
Generating /usr/src/RPM/BUILD/log4j-1_2_17/target/site/apidocs/overview-summary.html...
Generating /usr/src/RPM/BUILD/log4j-1_2_17/target/site/apidocs/help-doc.html...
[INFO]
[INFO] --- xmvn-mojo:3.0.0:builddep (default-cli) @ log4j ---
[INFO] ------------------------------------------------------------------------
[INFO] BUILD SUCCESS
[INFO] ------------------------------------------------------------------------
[INFO] Total time: 01:48 min
[INFO] Finished at: 2020-01-26T13:22:35Z
[INFO] ------------------------------------------------------------------------
-----BEGIN MAVEN BUILD DEPENDENCIES-----
H4sIAAAAAAACA8WUMW/DIBCF9/wK6h1c746jNpOHTlGlbhE2F0qEDwuMZf/7QtK07uJEbtSO3Hu8
706HyDdDo0kP1imD6yRjjwkBrI1QKNfJ644+7bZlmWyKVf5AKXn2SgsioAUUwabAEQkIlncgSDWS
t5ceCaXBPfUUK0K+C2M8hoK0xrelKIyVjLe8fgd2AK2GPL0oZx+3nTrwuguFhveAtPIoNNBWe6kw
Tyd65KQ/QTdxT7nsHOiu8rlz0FR6/McOsLMef80/8p4PAa30LDHKy0c0M9kndXH3HlU3E/6p32E5
EqxB1RjmWqjntnMx0mPj9hnL9vHCXVoIG5/hBpWiCTluOSxm1CY8LFVdIX25/mSuG9Y4OcXf5gPI
2XKW1AQAAA==
-----END MAVEN BUILD DEPENDENCIES-----
+ exit 0
Executing(%install): /bin/sh -e /usr/src/tmp/rpm-tmp.49645
+ umask 022
+ /bin/mkdir -p /usr/src/RPM/BUILD
+ cd /usr/src/RPM/BUILD
+ /bin/chmod -Rf u+rwX -- /usr/src/tmp/log4j12-buildroot
+ :
+ /bin/rm -rf -- /usr/src/tmp/log4j12-buildroot
+ cd log4j-1_2_17
+ xmvn-install -X -R .xmvn-reactor -n log4j12 -d /usr/src/tmp/log4j12-buildroot
DEBUG: Skipping configuration file /usr/src/RPM/BUILD/log4j-1_2_17/.xmvn/configuration.xml: no such file
DEBUG: Environmental variable $XDG_CONFIG_HOME is unset or empty, using default value: /usr/src/.config
DEBUG: Skipping configuration directory /usr/src/.config/xmvn/config.d: no such directory
DEBUG: Skipping configuration file /usr/src/.config/xmvn/configuration.xml: no such file
DEBUG: Environmental variable $XDG_DATA_HOME is unset or empty, using default value: /usr/src/.local/share
DEBUG: Skipping configuration directory /usr/src/.local/share/xmvn/config.d: no such directory
DEBUG: Skipping configuration file /usr/src/.local/share/xmvn/configuration.xml: no such file
DEBUG: Environmental variable $XDG_CONFIG_DIRS is unset or empty, using default value: /etc/xdg
DEBUG: Skipping configuration directory /etc/xdg/xmvn/config.d: no such directory
DEBUG: Skipping configuration file /etc/xdg/xmvn/configuration.xml: no such file
DEBUG: Environmental variable $XDG_DATA_DIRS is unset or empty, using default value: /usr/local/share:/usr/share
DEBUG: Skipping configuration directory /usr/local/share/xmvn/config.d: no such directory
DEBUG: Skipping configuration file /usr/local/share/xmvn/configuration.xml: no such file
DEBUG: Skipping configuration directory /usr/share/xmvn/config.d: no such directory
DEBUG: XMvn configuration files used:
DEBUG: * /usr/src/RPM/BUILD/log4j-1_2_17/.xmvn/config.d/javapackages-config-00001.xml
DEBUG: * /usr/src/RPM/BUILD/log4j-1_2_17/.xmvn/config.d/javapackages-config-00002.xml
DEBUG: * /usr/share/xmvn/configuration.xml
[DEBUG] Reading installation plan
[TRACE] Building reactor structure
[DEBUG] Creating effective packaging rules for each artifact
[DEBUG] Effective packaging rule for artifact log4j:log4j:jar:1.2.17 is:
log4j
log4j
1.2.17
jar
log4j
log4j12
1.2.17
1.2.16
1.2.15
1.2.14
1.2.13
1.2.12
12
false
[DEBUG] Effective packaging rule for artifact log4j:log4j:pom:1.2.17 is:
log4j
log4j
1.2.17
pom
log4j
log4j12
1.2.17
1.2.16
1.2.15
1.2.14
1.2.13
1.2.12
12
false
[DEBUG] Choosing target package for each artifact
[DEBUG] Artifact log4j:log4j:jar:1.2.17 will be installed into main package
[DEBUG] Artifact log4j:log4j:pom:1.2.17 will be installed into main package
[DEBUG] Generating skipped artifact metadata
[DEBUG] Skipped artifacts are:
[DEBUG] Assigning installer for each installable artifact
[DEBUG] No XMvn Installer plugin found for packaging type bundle
[DEBUG] Installing artifacts
[DEBUG] Installing log4j:log4j:jar:1.2.17 using org.fedoraproject.xmvn.tools.install.impl.DefaultArtifactInstaller
[TRACE] Native code not found inside /usr/src/RPM/BUILD/log4j-1_2_17/target/log4j-1.2.17.jar
[TRACE] Trying to inject manifest to log4j:log4j:jar:1.2.17
[TRACE] Injected field JavaPackages-GroupId: log4j
[TRACE] Injected field JavaPackages-ArtifactId: log4j
[TRACE] Not injecting field JavaPackages-Extension (it has default value "jar")
[TRACE] Not injecting field JavaPackages-Classifier (it has default value "")
[TRACE] Injected field JavaPackages-Version: 1.2.17
[TRACE] Manifest injected successfully
[INFO] Installing artifact log4j:log4j:jar:1.2.17
[DEBUG] Installing log4j:log4j:pom:1.2.17 using org.fedoraproject.xmvn.tools.install.impl.DefaultArtifactInstaller
[DEBUG] I/O exception caught when trying to determine whether JAR uses native code: /usr/src/RPM/BUILD/log4j-1_2_17/pom.xml
java.util.zip.ZipException: archive is not a ZIP archive
at org.apache.commons.compress.archivers.zip.ZipFile.positionAtEndOfCentralDirectoryRecord(ZipFile.java:956)
at org.apache.commons.compress.archivers.zip.ZipFile.positionAtCentralDirectory(ZipFile.java:881)
at org.apache.commons.compress.archivers.zip.ZipFile.populateFromCentralDirectory(ZipFile.java:619)
at org.apache.commons.compress.archivers.zip.ZipFile.(ZipFile.java:294)
at org.apache.commons.compress.archivers.zip.ZipFile.(ZipFile.java:217)
at org.apache.commons.compress.archivers.zip.ZipFile.(ZipFile.java:200)
at org.apache.commons.compress.archivers.zip.ZipFile.(ZipFile.java:161)
at org.fedoraproject.xmvn.tools.install.JarUtils.usesNativeCode(JarUtils.java:131)
at org.fedoraproject.xmvn.tools.install.impl.DefaultArtifactInstaller.install(DefaultArtifactInstaller.java:81)
at org.fedoraproject.xmvn.tools.install.impl.DefaultInstaller.installArtifact(DefaultInstaller.java:223)
at org.fedoraproject.xmvn.tools.install.impl.DefaultInstaller.install(DefaultInstaller.java:335)
at org.fedoraproject.xmvn.tools.install.cli.InstallerCli.run(InstallerCli.java:57)
at org.fedoraproject.xmvn.tools.install.cli.InstallerCli.main(InstallerCli.java:82)
[DEBUG] I/O exception caught when trying to determine whether JAR contains native code: /usr/src/RPM/BUILD/log4j-1_2_17/pom.xml
java.util.zip.ZipException: archive is not a ZIP archive
at org.apache.commons.compress.archivers.zip.ZipFile.positionAtEndOfCentralDirectoryRecord(ZipFile.java:956)
at org.apache.commons.compress.archivers.zip.ZipFile.positionAtCentralDirectory(ZipFile.java:881)
at org.apache.commons.compress.archivers.zip.ZipFile.populateFromCentralDirectory(ZipFile.java:619)
at org.apache.commons.compress.archivers.zip.ZipFile.(ZipFile.java:294)
at org.apache.commons.compress.archivers.zip.ZipFile.(ZipFile.java:217)
at org.apache.commons.compress.archivers.zip.ZipFile.(ZipFile.java:200)
at org.apache.commons.compress.archivers.zip.ZipFile.(ZipFile.java:161)
at org.fedoraproject.xmvn.tools.install.JarUtils.containsNativeCode(JarUtils.java:71)
at org.fedoraproject.xmvn.tools.install.impl.DefaultArtifactInstaller.install(DefaultArtifactInstaller.java:81)
at org.fedoraproject.xmvn.tools.install.impl.DefaultInstaller.installArtifact(DefaultInstaller.java:223)
at org.fedoraproject.xmvn.tools.install.impl.DefaultInstaller.install(DefaultInstaller.java:335)
at org.fedoraproject.xmvn.tools.install.cli.InstallerCli.run(InstallerCli.java:57)
at org.fedoraproject.xmvn.tools.install.cli.InstallerCli.main(InstallerCli.java:82)
[TRACE] Trying to inject manifest to log4j:log4j:pom:1.2.17
[DEBUG] I/O exception caught when trying to read JAR: /usr/src/RPM/BUILD/log4j-1_2_17/pom.xml
[INFO] Installing artifact log4j:log4j:pom:1.2.17
[DEBUG] Running post-installation hooks
[DEBUG] Resolving artifact dependencies...
DEBUG: Trying to resolve artifact javax.mail:mail:jar:1.6.3
DEBUG: Adding metadata from file /usr/share/maven-metadata/ant-contrib.xml
DEBUG: Added metadata for sourceforge:ant-contrib:xml:1.0b3
DEBUG: Added metadata for sourceforge:ant-contrib:jar:1.0b3
DEBUG: Adding metadata from file /usr/share/maven-metadata/ant-junit.xml
DEBUG: Added metadata for org.apache.ant:ant-junit:pom:1.10.3
DEBUG: Added metadata for org.apache.ant:ant-junit:jar:1.10.3
DEBUG: Added metadata for org.apache.ant:ant-junit4:pom:1.10.3
DEBUG: Added metadata for org.apache.ant:ant-junit4:jar:1.10.3
DEBUG: Adding metadata from file /usr/share/maven-metadata/ant-lib.xml
DEBUG: Added metadata for org.apache.ant:ant-bootstrap:jar:1.10.3
DEBUG: Added metadata for org.apache.ant:ant-launcher:pom:1.10.3
DEBUG: Added metadata for org.apache.ant:ant-launcher:jar:1.10.3
DEBUG: Added metadata for org.apache.ant:ant:pom:1.10.3
DEBUG: Added metadata for org.apache.ant:ant:jar:1.10.3
DEBUG: Added metadata for org.apache.ant:ant-parent:pom:1.10.3
DEBUG: Adding metadata from file /usr/share/maven-metadata/antlr.xml
DEBUG: Added metadata for antlr:antlr:pom:2.7.7
DEBUG: Added metadata for antlr:antlr:jar:2.7.7
DEBUG: Adding metadata from file /usr/share/maven-metadata/aopalliance.xml
DEBUG: Added metadata for aopalliance:aopalliance:pom:1.0
DEBUG: Added metadata for aopalliance:aopalliance:jar:1.0
DEBUG: Adding metadata from file /usr/share/maven-metadata/apache-commons-cli.xml
DEBUG: Added metadata for commons-cli:commons-cli:jar:1.4
DEBUG: Added metadata for commons-cli:commons-cli:pom:1.4
DEBUG: Adding metadata from file /usr/share/maven-metadata/apache-commons-codec.xml
DEBUG: Added metadata for commons-codec:commons-codec:jar:1.11
DEBUG: Added metadata for commons-codec:commons-codec:pom:1.11
DEBUG: Adding metadata from file /usr/share/maven-metadata/apache-commons-collections.xml
DEBUG: Added metadata for commons-collections:commons-collections:jar:3.2.2
DEBUG: Added metadata for commons-collections:commons-collections:pom:3.2.2
DEBUG: Adding metadata from file /usr/share/maven-metadata/apache-commons-compress.xml
DEBUG: Added metadata for org.apache.commons:commons-compress:jar:1.16.1
DEBUG: Added metadata for org.apache.commons:commons-compress:pom:1.16.1
DEBUG: Adding metadata from file /usr/share/maven-metadata/apache-commons-configuration.xml
DEBUG: Added metadata for commons-configuration:commons-configuration:jar:1.10
DEBUG: Added metadata for commons-configuration:commons-configuration:pom:1.10
DEBUG: Adding metadata from file /usr/share/maven-metadata/apache-commons-httpclient.xml
DEBUG: Added metadata for commons-httpclient:commons-httpclient:pom:3.1
DEBUG: Added metadata for commons-httpclient:commons-httpclient:jar:3.1
DEBUG: Adding metadata from file /usr/share/maven-metadata/apache-commons-io.xml
DEBUG: Added metadata for commons-io:commons-io:jar:2.6
DEBUG: Added metadata for commons-io:commons-io:pom:2.6
DEBUG: Adding metadata from file /usr/share/maven-metadata/apache-commons-lang.xml
DEBUG: Added metadata for commons-lang:commons-lang:jar:2.6
DEBUG: Added metadata for commons-lang:commons-lang:pom:2.6
DEBUG: Adding metadata from file /usr/share/maven-metadata/apache-commons-lang3.xml
DEBUG: Added metadata for org.apache.commons:commons-lang3:jar:3.7
DEBUG: Added metadata for org.apache.commons:commons-lang3:pom:3.7
DEBUG: Adding metadata from file /usr/share/maven-metadata/apache-commons-logging.xml
DEBUG: Added metadata for commons-logging:commons-logging:jar:1.2
DEBUG: Added metadata for commons-logging:commons-logging:pom:1.2
DEBUG: Added metadata for commons-logging:commons-logging-api:pom:1.1
DEBUG: Added metadata for commons-logging:commons-logging-api:jar:1.1
DEBUG: Added metadata for commons-logging:commons-logging-adapters:jar:1.2
DEBUG: Adding metadata from file /usr/share/maven-metadata/apache-ivy.xml
DEBUG: Added metadata for org.apache.ivy:ivy:jar:2.4.0-local-2018060119
DEBUG: Added metadata for org.apache.ivy:ivy:pom:2.4.0-local-2018060119
DEBUG: Added metadata for org.apache.ivy:ivy:xml:2.4.0-local-2018060119
DEBUG: Adding metadata from file /usr/share/maven-metadata/aqute-bnd-bndlib.xml
DEBUG: Added metadata for biz.aQute.bnd:aQute.libg:jar:3.5.0
DEBUG: Added metadata for biz.aQute.bnd:aQute.libg:pom:3.5.0
DEBUG: Added metadata for biz.aQute.bnd:biz.aQute.bnd.annotation:jar:3.5.0
DEBUG: Added metadata for biz.aQute.bnd:biz.aQute.bnd.annotation:pom:3.5.0
DEBUG: Added metadata for biz.aQute.bnd:biz.aQute.bndlib:jar:3.5.0
DEBUG: Added metadata for biz.aQute.bnd:biz.aQute.bndlib:pom:3.5.0
DEBUG: Adding metadata from file /usr/share/maven-metadata/atinject.xml
DEBUG: Added metadata for javax.inject:javax.inject:pom:1
DEBUG: Added metadata for javax.inject:javax.inject:jar:1
DEBUG: Adding metadata from file /usr/share/maven-metadata/avalon-framework.xml
DEBUG: Added metadata for avalon-framework:avalon-framework-api:jar:4.3
DEBUG: Added metadata for avalon-framework:avalon-framework-api:pom:4.3
DEBUG: Added metadata for avalon-framework:avalon-framework-impl:jar:4.3
DEBUG: Added metadata for avalon-framework:avalon-framework-impl:pom:4.3
DEBUG: Adding metadata from file /usr/share/maven-metadata/avalon-logkit.xml
DEBUG: Added metadata for avalon-logkit:avalon-logkit:jar:2.1
DEBUG: Added metadata for avalon-logkit:avalon-logkit:pom:2.1
DEBUG: Adding metadata from file /usr/share/maven-metadata/batik-css.xml
DEBUG: Added metadata for org.apache.xmlgraphics:batik-css:jar:1.10
DEBUG: Added metadata for org.apache.xmlgraphics:batik-css:pom:1.10
DEBUG: Adding metadata from file /usr/share/maven-metadata/batik.xml
DEBUG: Added metadata for org.apache.xmlgraphics:batik:pom:1.10
DEBUG: Added metadata for org.apache.xmlgraphics:batik-constants:jar:1.10
DEBUG: Added metadata for org.apache.xmlgraphics:batik-constants:pom:1.10
DEBUG: Added metadata for org.apache.xmlgraphics:batik-i18n:jar:1.10
DEBUG: Added metadata for org.apache.xmlgraphics:batik-i18n:pom:1.10
DEBUG: Added metadata for org.apache.xmlgraphics:batik-util:jar:1.10
DEBUG: Added metadata for org.apache.xmlgraphics:batik-util:pom:1.10
DEBUG: Added metadata for org.apache.xmlgraphics:batik-awt-util:jar:1.10
DEBUG: Added metadata for org.apache.xmlgraphics:batik-awt-util:pom:1.10
DEBUG: Added metadata for org.apache.xmlgraphics:batik-ext:jar:1.10
DEBUG: Added metadata for org.apache.xmlgraphics:batik-ext:pom:1.10
DEBUG: Added metadata for org.apache.xmlgraphics:batik-xml:jar:1.10
DEBUG: Added metadata for org.apache.xmlgraphics:batik-xml:pom:1.10
DEBUG: Added metadata for org.apache.xmlgraphics:batik-dom:jar:1.10
DEBUG: Added metadata for org.apache.xmlgraphics:batik-dom:pom:1.10
DEBUG: Added metadata for org.apache.xmlgraphics:batik-parser:jar:1.10
DEBUG: Added metadata for org.apache.xmlgraphics:batik-parser:pom:1.10
DEBUG: Added metadata for org.apache.xmlgraphics:batik-svg-dom:jar:1.10
DEBUG: Added metadata for org.apache.xmlgraphics:batik-svg-dom:pom:1.10
DEBUG: Added metadata for org.apache.xmlgraphics:batik-anim:jar:1.10
DEBUG: Added metadata for org.apache.xmlgraphics:batik-anim:pom:1.10
DEBUG: Added metadata for org.apache.xmlgraphics:batik-gvt:jar:1.10
DEBUG: Added metadata for org.apache.xmlgraphics:batik-gvt:pom:1.10
DEBUG: Added metadata for org.apache.xmlgraphics:batik-script:jar:1.10
DEBUG: Added metadata for org.apache.xmlgraphics:batik-script:pom:1.10
DEBUG: Added metadata for org.apache.xmlgraphics:batik-bridge:jar:1.10
DEBUG: Added metadata for org.apache.xmlgraphics:batik-bridge:pom:1.10
DEBUG: Added metadata for org.apache.xmlgraphics:batik-svggen:jar:1.10
DEBUG: Added metadata for org.apache.xmlgraphics:batik-svggen:pom:1.10
DEBUG: Added metadata for org.apache.xmlgraphics:batik-transcoder:jar:1.10
DEBUG: Added metadata for org.apache.xmlgraphics:batik-transcoder:pom:1.10
DEBUG: Added metadata for org.apache.xmlgraphics:batik-codec:jar:1.10
DEBUG: Added metadata for org.apache.xmlgraphics:batik-codec:pom:1.10
DEBUG: Added metadata for org.apache.xmlgraphics:batik-extension:jar:1.10
DEBUG: Added metadata for org.apache.xmlgraphics:batik-extension:pom:1.10
DEBUG: Added metadata for org.apache.xmlgraphics:batik-gui-util:jar:1.10
DEBUG: Added metadata for org.apache.xmlgraphics:batik-gui-util:pom:1.10
DEBUG: Added metadata for org.apache.xmlgraphics:batik-svgrasterizer:jar:1.10
DEBUG: Added metadata for org.apache.xmlgraphics:batik-svgrasterizer:pom:1.10
DEBUG: Added metadata for org.apache.xmlgraphics:batik-swing:jar:1.10
DEBUG: Added metadata for org.apache.xmlgraphics:batik-swing:pom:1.10
DEBUG: Added metadata for org.apache.xmlgraphics:batik-svgbrowser:jar:1.10
DEBUG: Added metadata for org.apache.xmlgraphics:batik-svgbrowser:pom:1.10
DEBUG: Added metadata for org.apache.xmlgraphics:batik-all:pom:1.10
DEBUG: Added metadata for org.apache.xmlgraphics:batik-all:jar:1.10
DEBUG: Adding metadata from file /usr/share/maven-metadata/beust-jcommander.xml
DEBUG: Added metadata for com.beust:jcommander:jar:1.71
DEBUG: Added metadata for com.beust:jcommander:pom:1.71
DEBUG: Adding metadata from file /usr/share/maven-metadata/cdi-api.xml
DEBUG: Added metadata for javax.enterprise:cdi-api:jar:1.2
DEBUG: Added metadata for javax.enterprise:cdi-api:pom:1.2
DEBUG: Adding metadata from file /usr/share/maven-metadata/dain-snappy.xml
DEBUG: Added metadata for org.iq80.snappy:snappy:jar:0.4
DEBUG: Added metadata for org.iq80.snappy:snappy:pom:0.4
DEBUG: Adding metadata from file /usr/share/maven-metadata/extra166y.xml
DEBUG: Added metadata for org.codehaus.jsr166-mirror:extra166y:pom:1.7.0
DEBUG: Added metadata for org.codehaus.jsr166-mirror:extra166y:jar:1.7.0
DEBUG: Adding metadata from file /usr/share/maven-metadata/felix-bundlerepository.xml
DEBUG: Added metadata for org.apache.felix:org.apache.felix.bundlerepository:jar:2.0.10
DEBUG: Added metadata for org.apache.felix:org.apache.felix.bundlerepository:pom:2.0.10
DEBUG: Adding metadata from file /usr/share/maven-metadata/felix-utils.xml
DEBUG: Added metadata for org.apache.felix:org.apache.felix.utils:jar:1.10.4
DEBUG: Added metadata for org.apache.felix:org.apache.felix.utils:pom:1.10.4
DEBUG: Adding metadata from file /usr/share/maven-metadata/fop.xml
DEBUG: Added metadata for org.apache.xmlgraphics:fop:jar:2.0
DEBUG: Added metadata for org.apache.xmlgraphics:fop:pom:2.0
DEBUG: Adding metadata from file /usr/share/maven-metadata/fusesource-pom.xml
DEBUG: Added metadata for org.fusesource:fusesource-pom:pom:1.11
DEBUG: Adding metadata from file /usr/share/maven-metadata/geronimo-annotation.xml
DEBUG: Added metadata for org.apache.geronimo.specs:geronimo-annotation_1.3_spec:jar:1.0
DEBUG: Added metadata for org.apache.geronimo.specs:geronimo-annotation_1.3_spec:pom:1.0
DEBUG: Adding metadata from file /usr/share/maven-metadata/geronimo-jms.xml
DEBUG: Added metadata for org.apache.geronimo.specs:geronimo-jms_1.1_spec:jar:1.1.1
DEBUG: Added metadata for org.apache.geronimo.specs:geronimo-jms_1.1_spec:pom:1.1.1
DEBUG: Adding metadata from file /usr/share/maven-metadata/glassfish-el-javax.el-api.xml
DEBUG: Added metadata for javax.el:javax.el-api:jar:3.0.1-b08
DEBUG: Added metadata for javax.el:javax.el-api:pom:3.0.1-b08
DEBUG: Adding metadata from file /usr/share/maven-metadata/google-guice-guice.xml
DEBUG: Added metadata for com.google.inject:guice:jar:4.1.0
DEBUG: Added metadata for com.google.inject:guice:pom:4.1.0
DEBUG: Added metadata for com.google.inject:guice:jar:no_aop:4.1.0
DEBUG: Adding metadata from file /usr/share/maven-metadata/gpars.xml
DEBUG: Added metadata for org.codehaus.gpars:gpars:jar:1.2.1
DEBUG: Adding metadata from file /usr/share/maven-metadata/groovy-all.xml
DEBUG: Added metadata for org.codehaus.groovy:groovy-all:pom:2.4.8
DEBUG: Added metadata for org.codehaus.groovy:groovy-all:jar:2.4.8
DEBUG: Adding metadata from file /usr/share/maven-metadata/groovy.xml
DEBUG: Added metadata for org.codehaus.groovy:groovy:jar:2.4.8
DEBUG: Adding metadata from file /usr/share/maven-metadata/guava20-guava.xml
DEBUG: Added metadata for com.google.guava:guava-parent:pom:20.0
DEBUG: Added metadata for com.google.guava:guava:jar:20.0
DEBUG: Added metadata for com.google.guava:guava:pom:20.0
DEBUG: Adding metadata from file /usr/share/maven-metadata/hamcrest-core.xml
DEBUG: Added metadata for org.hamcrest:hamcrest-parent:pom:1.3
DEBUG: Added metadata for org.hamcrest:hamcrest-core:pom:1.3
DEBUG: Added metadata for org.hamcrest:hamcrest-core:jar:1.3
DEBUG: Adding metadata from file /usr/share/maven-metadata/hawtjni-runtime.xml
DEBUG: Added metadata for org.fusesource.hawtjni:hawtjni-runtime:jar:1.16
DEBUG: Added metadata for org.fusesource.hawtjni:hawtjni-runtime:pom:1.16
DEBUG: Adding metadata from file /usr/share/maven-metadata/httpcomponents-client.xml
DEBUG: Added metadata for org.apache.httpcomponents:httpcomponents-client:pom:4.5.5
DEBUG: Added metadata for org.apache.httpcomponents:httpclient:jar:4.5.5
DEBUG: Added metadata for org.apache.httpcomponents:httpclient:pom:4.5.5
DEBUG: Added metadata for org.apache.httpcomponents:httpmime:jar:4.5.5
DEBUG: Added metadata for org.apache.httpcomponents:httpmime:pom:4.5.5
DEBUG: Added metadata for org.apache.httpcomponents:fluent-hc:jar:4.5.5
DEBUG: Added metadata for org.apache.httpcomponents:fluent-hc:pom:4.5.5
DEBUG: Adding metadata from file /usr/share/maven-metadata/httpcomponents-core.xml
DEBUG: Added metadata for org.apache.httpcomponents:httpcomponents-core:pom:4.4.9
DEBUG: Added metadata for org.apache.httpcomponents:httpcore:jar:4.4.9
DEBUG: Added metadata for org.apache.httpcomponents:httpcore:pom:4.4.9
DEBUG: Added metadata for org.apache.httpcomponents:httpcore-nio:jar:4.4.9
DEBUG: Added metadata for org.apache.httpcomponents:httpcore-nio:pom:4.4.9
DEBUG: Adding metadata from file /usr/share/maven-metadata/jai-imageio-core.xml
DEBUG: Added metadata for net.java.dev.jai-imageio:jai-imageio-core:jar:1.2
DEBUG: Adding metadata from file /usr/share/maven-metadata/jakarta-oro.xml
DEBUG: Added metadata for oro:oro:pom:2.0.8
DEBUG: Added metadata for oro:oro:jar:2.0.8
DEBUG: Adding metadata from file /usr/share/maven-metadata/jansi-native.xml
DEBUG: Added metadata for org.fusesource.jansi:jansi-native:jar:1.7
DEBUG: Added metadata for org.fusesource.jansi:jansi-native:pom:1.7
DEBUG: Adding metadata from file /usr/share/maven-metadata/jansi.xml
DEBUG: Added metadata for org.fusesource.jansi:jansi-project:pom:1.17
DEBUG: Added metadata for org.fusesource.jansi:jansi:jar:1.17
DEBUG: Added metadata for org.fusesource.jansi:jansi:pom:1.17
DEBUG: Adding metadata from file /usr/share/maven-metadata/javamail.xml
DEBUG: Added metadata for com.sun.mail:all:pom:1.5.2
DEBUG: Added metadata for com.sun.mail:javax.mail:jar:1.5.2
DEBUG: Added metadata for com.sun.mail:javax.mail:pom:1.5.2
DEBUG: Added metadata for com.sun.mail:smtp:jar:1.5.2
DEBUG: Added metadata for com.sun.mail:smtp:pom:1.5.2
DEBUG: Added metadata for com.sun.mail:mailapi:jar:1.5.2
DEBUG: Added metadata for com.sun.mail:mailapi:pom:1.5.2
DEBUG: Added metadata for javax.mail:javax.mail-api:jar:1.5.2
DEBUG: Added metadata for javax.mail:javax.mail-api:pom:1.5.2
DEBUG: Added metadata for com.sun.mail:imap:jar:1.5.2
DEBUG: Added metadata for com.sun.mail:imap:pom:1.5.2
DEBUG: Added metadata for com.sun.mail:gimap:jar:1.5.2
DEBUG: Added metadata for com.sun.mail:gimap:pom:1.5.2
DEBUG: Added metadata for com.sun.mail:pop3:jar:1.5.2
DEBUG: Added metadata for com.sun.mail:pop3:pom:1.5.2
DEBUG: Added metadata for com.sun.mail:dsn:jar:1.5.2
DEBUG: Added metadata for com.sun.mail:dsn:pom:1.5.2
DEBUG: Adding metadata from file /usr/share/maven-metadata/javapackages-metadata.xml
DEBUG: Added metadata for com.sun:tools:jar:SYSTEM
DEBUG: Added metadata for sun.jdk:jconsole:jar:SYSTEM
DEBUG: Adding metadata from file /usr/share/maven-metadata/jboss-interceptors-1.2-api.xml
DEBUG: Added metadata for org.jboss.spec.javax.interceptor:jboss-interceptors-api_1.2_spec:jar:1.0.0.Final
DEBUG: Added metadata for org.jboss.spec.javax.interceptor:jboss-interceptors-api_1.2_spec:pom:1.0.0.Final
DEBUG: Adding metadata from file /usr/share/maven-metadata/jcsp.xml
DEBUG: Added metadata for org.codehaus.jcsp:jcsp:jar:1.1-rc5
DEBUG: Added metadata for org.codehaus.jcsp:jcsp:pom:1.1-rc5
DEBUG: Adding metadata from file /usr/share/maven-metadata/jsoup.xml
DEBUG: Added metadata for org.jsoup:jsoup:jar:1.11.3
DEBUG: Added metadata for org.jsoup:jsoup:pom:1.11.3
DEBUG: Adding metadata from file /usr/share/maven-metadata/junit.xml
DEBUG: Added metadata for junit:junit:jar:4.12
DEBUG: Added metadata for junit:junit:pom:4.12
DEBUG: Adding metadata from file /usr/share/maven-metadata/jzlib.xml
DEBUG: Added metadata for com.jcraft:jzlib:jar:1.1.3
DEBUG: Added metadata for com.jcraft:jzlib:pom:1.1.3
DEBUG: Adding metadata from file /usr/share/maven-metadata/kxml.xml
DEBUG: Added metadata for net.sf.kxml:kxml2:pom:2.3.0
DEBUG: Added metadata for net.sf.kxml:kxml2:jar:2.3.0
DEBUG: Added metadata for net.sf.kxml:kxml2-min:pom:2.3.0
DEBUG: Added metadata for net.sf.kxml:kxml2-min:jar:2.3.0
DEBUG: Adding metadata from file /usr/share/maven-metadata/log4j12.xml
DEBUG: Added metadata for log4j:log4j:jar:1.2.17
DEBUG: Added metadata for log4j:log4j:pom:1.2.17
DEBUG: Adding metadata from file /usr/share/maven-metadata/maven-antrun-plugin.xml
DEBUG: Added metadata for org.apache.maven.plugins:maven-antrun-plugin:jar:1.8
DEBUG: Added metadata for org.apache.maven.plugins:maven-antrun-plugin:pom:1.8
DEBUG: Adding metadata from file /usr/share/maven-metadata/maven-archiver.xml
DEBUG: Added metadata for org.apache.maven:maven-archiver:jar:3.2.0
DEBUG: Added metadata for org.apache.maven:maven-archiver:pom:3.2.0
DEBUG: Adding metadata from file /usr/share/maven-metadata/maven-artifact-transfer.xml
DEBUG: Added metadata for org.apache.maven.shared:maven-artifact-transfer:jar:0.9.0
DEBUG: Added metadata for org.apache.maven.shared:maven-artifact-transfer:pom:0.9.0
DEBUG: Adding metadata from file /usr/share/maven-metadata/maven-assembly-plugin.xml
DEBUG: Added metadata for org.apache.maven.plugins:maven-assembly-plugin:jar:3.1.0
DEBUG: Added metadata for org.apache.maven.plugins:maven-assembly-plugin:pom:3.1.0
DEBUG: Adding metadata from file /usr/share/maven-metadata/maven-common-artifact-filters.xml
DEBUG: Added metadata for org.apache.maven.shared:maven-common-artifact-filters:jar:3.0.1
DEBUG: Added metadata for org.apache.maven.shared:maven-common-artifact-filters:pom:3.0.1
DEBUG: Adding metadata from file /usr/share/maven-metadata/maven-compiler-plugin.xml
DEBUG: Added metadata for org.apache.maven.plugins:maven-compiler-plugin:jar:3.7.0
DEBUG: Added metadata for org.apache.maven.plugins:maven-compiler-plugin:pom:3.7.0
DEBUG: Adding metadata from file /usr/share/maven-metadata/maven-dependency-tree.xml
DEBUG: Added metadata for org.apache.maven.shared:maven-dependency-tree:jar:3.0
DEBUG: Added metadata for org.apache.maven.shared:maven-dependency-tree:pom:3.0
DEBUG: Adding metadata from file /usr/share/maven-metadata/maven-doxia-doxia-core.xml
DEBUG: Added metadata for org.apache.maven.doxia:doxia-core:jar:1.7
DEBUG: Added metadata for org.apache.maven.doxia:doxia-core:pom:1.7
DEBUG: Adding metadata from file /usr/share/maven-metadata/maven-doxia-doxia-logging-api.xml
DEBUG: Added metadata for org.apache.maven.doxia:doxia-logging-api:jar:1.7
DEBUG: Added metadata for org.apache.maven.doxia:doxia-logging-api:pom:1.7
DEBUG: Adding metadata from file /usr/share/maven-metadata/maven-doxia-doxia-module-apt.xml
DEBUG: Added metadata for org.apache.maven.doxia:doxia-module-apt:jar:1.7
DEBUG: Added metadata for org.apache.maven.doxia:doxia-module-apt:pom:1.7
DEBUG: Adding metadata from file /usr/share/maven-metadata/maven-doxia-doxia-module-fml.xml
DEBUG: Added metadata for org.apache.maven.doxia:doxia-module-fml:jar:1.7
DEBUG: Added metadata for org.apache.maven.doxia:doxia-module-fml:pom:1.7
DEBUG: Adding metadata from file /usr/share/maven-metadata/maven-doxia-doxia-module-fo.xml
DEBUG: Added metadata for org.apache.maven.doxia:doxia-module-fo:jar:1.7
DEBUG: Added metadata for org.apache.maven.doxia:doxia-module-fo:pom:1.7
DEBUG: Adding metadata from file /usr/share/maven-metadata/maven-doxia-doxia-module-markdown.xml
DEBUG: Added metadata for org.apache.maven.doxia:doxia-module-markdown:jar:1.7
DEBUG: Added metadata for org.apache.maven.doxia:doxia-module-markdown:pom:1.7
DEBUG: Adding metadata from file /usr/share/maven-metadata/maven-doxia-doxia-module-xdoc.xml
DEBUG: Added metadata for org.apache.maven.doxia:doxia-module-xdoc:jar:1.7
DEBUG: Added metadata for org.apache.maven.doxia:doxia-module-xdoc:pom:1.7
DEBUG: Adding metadata from file /usr/share/maven-metadata/maven-doxia-doxia-module-xhtml.xml
DEBUG: Added metadata for org.apache.maven.doxia:doxia-module-xhtml:jar:1.7
DEBUG: Added metadata for org.apache.maven.doxia:doxia-module-xhtml:pom:1.7
DEBUG: Adding metadata from file /usr/share/maven-metadata/maven-doxia-doxia-sink-api.xml
DEBUG: Added metadata for org.apache.maven.doxia:doxia-sink-api:jar:1.7
DEBUG: Added metadata for org.apache.maven.doxia:doxia-sink-api:pom:1.7
DEBUG: Adding metadata from file /usr/share/maven-metadata/maven-doxia-sitetools.xml
DEBUG: Added metadata for org.apache.maven.doxia:doxia-sitetools:pom:1.7.5
DEBUG: Added metadata for org.apache.maven.doxia:doxia-decoration-model:jar:1.7.5
DEBUG: Added metadata for org.apache.maven.doxia:doxia-decoration-model:pom:1.7.5
DEBUG: Added metadata for org.apache.maven.doxia:doxia-skin-model:jar:1.7.5
DEBUG: Added metadata for org.apache.maven.doxia:doxia-skin-model:pom:1.7.5
DEBUG: Added metadata for org.apache.maven.doxia:doxia-integration-tools:jar:1.7.5
DEBUG: Added metadata for org.apache.maven.doxia:doxia-integration-tools:pom:1.7.5
DEBUG: Added metadata for org.apache.maven.doxia:doxia-site-renderer:jar:1.7.5
DEBUG: Added metadata for org.apache.maven.doxia:doxia-site-renderer:pom:1.7.5
DEBUG: Added metadata for org.apache.maven.doxia:doxia-doc-renderer:jar:1.7.5
DEBUG: Added metadata for org.apache.maven.doxia:doxia-doc-renderer:pom:1.7.5
DEBUG: Adding metadata from file /usr/share/maven-metadata/maven-file-management.xml
DEBUG: Added metadata for org.apache.maven.shared:file-management:jar:3.0.0
DEBUG: Added metadata for org.apache.maven.shared:file-management:pom:3.0.0
DEBUG: Adding metadata from file /usr/share/maven-metadata/maven-filtering.xml
DEBUG: Added metadata for org.apache.maven.shared:maven-filtering:jar:3.1.1
DEBUG: Added metadata for org.apache.maven.shared:maven-filtering:pom:3.1.1
DEBUG: Adding metadata from file /usr/share/maven-metadata/maven-invoker.xml
DEBUG: Added metadata for org.apache.maven.shared:maven-invoker:jar:2.2
DEBUG: Added metadata for org.apache.maven.shared:maven-invoker:pom:2.2
DEBUG: Adding metadata from file /usr/share/maven-metadata/maven-jar-plugin.xml
DEBUG: Added metadata for org.apache.maven.plugins:maven-jar-plugin:jar:3.1.0
DEBUG: Added metadata for org.apache.maven.plugins:maven-jar-plugin:pom:3.1.0
DEBUG: Adding metadata from file /usr/share/maven-metadata/maven-javadoc-plugin.xml
DEBUG: Added metadata for org.apache.maven.plugins:maven-javadoc-plugin:jar:3.0.0
DEBUG: Added metadata for org.apache.maven.plugins:maven-javadoc-plugin:pom:3.0.0
DEBUG: Adding metadata from file /usr/share/maven-metadata/maven-plugin-bundle.xml
DEBUG: Added metadata for org.apache.felix:maven-bundle-plugin:jar:3.5.0
DEBUG: Added metadata for org.apache.felix:maven-bundle-plugin:pom:3.5.0
DEBUG: Adding metadata from file /usr/share/maven-metadata/maven-plugin-tools-maven-plugin-annotations.xml
DEBUG: Added metadata for org.apache.maven.plugin-tools:maven-plugin-annotations:jar:3.5.1
DEBUG: Added metadata for org.apache.maven.plugin-tools:maven-plugin-annotations:pom:3.5.1
DEBUG: Adding metadata from file /usr/share/maven-metadata/maven-reporting-api.xml
DEBUG: Added metadata for org.apache.maven.reporting:maven-reporting-api:jar:3.0
DEBUG: Added metadata for org.apache.maven.reporting:maven-reporting-api:pom:3.0
DEBUG: Adding metadata from file /usr/share/maven-metadata/maven-reporting-impl.xml
DEBUG: Added metadata for org.apache.maven.reporting:maven-reporting-impl:jar:3.0.0
DEBUG: Added metadata for org.apache.maven.reporting:maven-reporting-impl:pom:3.0.0
DEBUG: Adding metadata from file /usr/share/maven-metadata/maven-resolver-maven-resolver-api.xml
DEBUG: Added metadata for org.apache.maven.resolver:maven-resolver-api:jar:1.1.1
DEBUG: Added metadata for org.apache.maven.resolver:maven-resolver-api:pom:1.1.1
DEBUG: Adding metadata from file /usr/share/maven-metadata/maven-resolver-maven-resolver-connector-basic.xml
DEBUG: Added metadata for org.apache.maven.resolver:maven-resolver-connector-basic:jar:1.1.1
DEBUG: Added metadata for org.apache.maven.resolver:maven-resolver-connector-basic:pom:1.1.1
DEBUG: Adding metadata from file /usr/share/maven-metadata/maven-resolver-maven-resolver-impl.xml
DEBUG: Added metadata for org.apache.maven.resolver:maven-resolver-impl:jar:1.1.1
DEBUG: Added metadata for org.apache.maven.resolver:maven-resolver-impl:pom:1.1.1
DEBUG: Adding metadata from file /usr/share/maven-metadata/maven-resolver-maven-resolver-spi.xml
DEBUG: Added metadata for org.apache.maven.resolver:maven-resolver-spi:jar:1.1.1
DEBUG: Added metadata for org.apache.maven.resolver:maven-resolver-spi:pom:1.1.1
DEBUG: Adding metadata from file /usr/share/maven-metadata/maven-resolver-maven-resolver-transport-wagon.xml
DEBUG: Added metadata for org.apache.maven.resolver:maven-resolver-transport-wagon:jar:1.1.1
DEBUG: Added metadata for org.apache.maven.resolver:maven-resolver-transport-wagon:pom:1.1.1
DEBUG: Adding metadata from file /usr/share/maven-metadata/maven-resolver-maven-resolver-util.xml
DEBUG: Added metadata for org.apache.maven.resolver:maven-resolver-util:jar:1.1.1
DEBUG: Added metadata for org.apache.maven.resolver:maven-resolver-util:pom:1.1.1
DEBUG: Adding metadata from file /usr/share/maven-metadata/maven-resources-plugin.xml
DEBUG: Added metadata for org.apache.maven.plugins:maven-resources-plugin:jar:3.1.0
DEBUG: Added metadata for org.apache.maven.plugins:maven-resources-plugin:pom:3.1.0
DEBUG: Adding metadata from file /usr/share/maven-metadata/maven-shared-incremental.xml
DEBUG: Added metadata for org.apache.maven.shared:maven-shared-incremental:jar:1.1
DEBUG: Added metadata for org.apache.maven.shared:maven-shared-incremental:pom:1.1
DEBUG: Adding metadata from file /usr/share/maven-metadata/maven-shared-io.xml
DEBUG: Added metadata for org.apache.maven.shared:maven-shared-io:jar:3.0.0
DEBUG: Added metadata for org.apache.maven.shared:maven-shared-io:pom:3.0.0
DEBUG: Adding metadata from file /usr/share/maven-metadata/maven-shared-utils.xml
DEBUG: Added metadata for org.apache.maven.shared:maven-shared-utils:jar:3.2.1
DEBUG: Added metadata for org.apache.maven.shared:maven-shared-utils:pom:3.2.1
DEBUG: Adding metadata from file /usr/share/maven-metadata/maven-surefire-junit.xml
DEBUG: Added metadata for org.apache.maven.surefire:common-junit3:jar:2.21.0
DEBUG: Added metadata for org.apache.maven.surefire:common-junit3:pom:2.21.0
DEBUG: Added metadata for org.apache.maven.surefire:common-junit4:jar:2.21.0
DEBUG: Added metadata for org.apache.maven.surefire:common-junit4:pom:2.21.0
DEBUG: Added metadata for org.apache.maven.surefire:common-junit48:jar:2.21.0
DEBUG: Added metadata for org.apache.maven.surefire:common-junit48:pom:2.21.0
DEBUG: Added metadata for org.apache.maven.surefire:surefire-junit3:jar:2.21.0
DEBUG: Added metadata for org.apache.maven.surefire:surefire-junit3:pom:2.21.0
DEBUG: Added metadata for org.apache.maven.surefire:surefire-junit4:jar:2.21.0
DEBUG: Added metadata for org.apache.maven.surefire:surefire-junit4:pom:2.21.0
DEBUG: Added metadata for org.apache.maven.surefire:surefire-junit47:jar:2.21.0
DEBUG: Added metadata for org.apache.maven.surefire:surefire-junit47:pom:2.21.0
DEBUG: Adding metadata from file /usr/share/maven-metadata/maven-surefire-surefire-plugin.xml
DEBUG: Added metadata for org.apache.maven.plugins:maven-surefire-plugin:jar:2.21.0
DEBUG: Added metadata for org.apache.maven.plugins:maven-surefire-plugin:pom:2.21.0
DEBUG: Adding metadata from file /usr/share/maven-metadata/maven-surefire-testng.xml
DEBUG: Added metadata for org.apache.maven.surefire:surefire-testng-utils:jar:2.21.0
DEBUG: Added metadata for org.apache.maven.surefire:surefire-testng-utils:pom:2.21.0
DEBUG: Added metadata for org.apache.maven.surefire:surefire-testng:jar:2.21.0
DEBUG: Added metadata for org.apache.maven.surefire:surefire-testng:pom:2.21.0
DEBUG: Adding metadata from file /usr/share/maven-metadata/maven-surefire.xml
DEBUG: Added metadata for org.apache.maven.surefire:surefire:pom:2.21.0
DEBUG: Added metadata for org.apache.maven.surefire:surefire-logger-api:jar:2.21.0
DEBUG: Added metadata for org.apache.maven.surefire:surefire-logger-api:pom:2.21.0
DEBUG: Added metadata for org.apache.maven.surefire:surefire-api:jar:2.21.0
DEBUG: Added metadata for org.apache.maven.surefire:surefire-api:pom:2.21.0
DEBUG: Added metadata for org.apache.maven.surefire:surefire-booter:jar:2.21.0
DEBUG: Added metadata for org.apache.maven.surefire:surefire-booter:pom:2.21.0
DEBUG: Added metadata for org.apache.maven.surefire:surefire-grouper:jar:2.21.0
DEBUG: Added metadata for org.apache.maven.surefire:surefire-grouper:pom:2.21.0
DEBUG: Added metadata for org.apache.maven.surefire:surefire-providers:pom:2.21.0
DEBUG: Added metadata for org.apache.maven.surefire:common-java5:jar:2.21.0
DEBUG: Added metadata for org.apache.maven.surefire:common-java5:pom:2.21.0
DEBUG: Added metadata for org.apache.maven.surefire:maven-surefire-common:jar:2.21.0
DEBUG: Added metadata for org.apache.maven.surefire:maven-surefire-common:pom:2.21.0
DEBUG: Added metadata for org.apache.maven.surefire:surefire-its:jar:2.21.0
DEBUG: Added metadata for org.apache.maven.surefire:surefire-its:pom:2.21.0
DEBUG: Adding metadata from file /usr/share/maven-metadata/maven-verifier.xml
DEBUG: Added metadata for org.apache.maven.shared:maven-verifier:jar:1.6
DEBUG: Added metadata for org.apache.maven.shared:maven-verifier:pom:1.6
DEBUG: Adding metadata from file /usr/share/maven-metadata/maven-wagon-wagon-file.xml
DEBUG: Added metadata for org.apache.maven.wagon:wagon-file:jar:3.0.0
DEBUG: Added metadata for org.apache.maven.wagon:wagon-file:pom:3.0.0
DEBUG: Adding metadata from file /usr/share/maven-metadata/maven-wagon-wagon-http-shared.xml
DEBUG: Added metadata for org.apache.maven.wagon:wagon-http-shared:jar:3.0.0
DEBUG: Added metadata for org.apache.maven.wagon:wagon-http-shared:pom:3.0.0
DEBUG: Adding metadata from file /usr/share/maven-metadata/maven-wagon-wagon-http.xml
DEBUG: Added metadata for org.apache.maven.wagon:wagon-http:jar:3.0.0
DEBUG: Added metadata for org.apache.maven.wagon:wagon-http:pom:3.0.0
DEBUG: Adding metadata from file /usr/share/maven-metadata/maven-wagon-wagon-provider-api.xml
DEBUG: Added metadata for org.apache.maven.wagon:wagon-provider-api:jar:3.0.0
DEBUG: Added metadata for org.apache.maven.wagon:wagon-provider-api:pom:3.0.0
DEBUG: Adding metadata from file /usr/share/maven-metadata/maven.xml
DEBUG: Added metadata for org.apache.maven:maven:pom:3.5.3
DEBUG: Added metadata for org.apache.maven:maven-model:jar:3.5.3
DEBUG: Added metadata for org.apache.maven:maven-model:pom:3.5.3
DEBUG: Added metadata for org.apache.maven:maven-artifact:jar:3.5.3
DEBUG: Added metadata for org.apache.maven:maven-artifact:pom:3.5.3
DEBUG: Added metadata for org.apache.maven:maven-plugin-api:jar:3.5.3
DEBUG: Added metadata for org.apache.maven:maven-plugin-api:pom:3.5.3
DEBUG: Added metadata for org.apache.maven:maven-builder-support:jar:3.5.3
DEBUG: Added metadata for org.apache.maven:maven-builder-support:pom:3.5.3
DEBUG: Added metadata for org.apache.maven:maven-model-builder:jar:3.5.3
DEBUG: Added metadata for org.apache.maven:maven-model-builder:pom:3.5.3
DEBUG: Added metadata for org.apache.maven:maven-settings:jar:3.5.3
DEBUG: Added metadata for org.apache.maven:maven-settings:pom:3.5.3
DEBUG: Added metadata for org.apache.maven:maven-settings-builder:jar:3.5.3
DEBUG: Added metadata for org.apache.maven:maven-settings-builder:pom:3.5.3
DEBUG: Added metadata for org.apache.maven:maven-repository-metadata:jar:3.5.3
DEBUG: Added metadata for org.apache.maven:maven-repository-metadata:pom:3.5.3
DEBUG: Added metadata for org.apache.maven:maven-resolver-provider:jar:3.5.3
DEBUG: Added metadata for org.apache.maven:maven-resolver-provider:pom:3.5.3
DEBUG: Added metadata for org.apache.maven:maven-core:jar:3.5.3
DEBUG: Added metadata for org.apache.maven:maven-core:pom:3.5.3
DEBUG: Added metadata for org.apache.maven:maven-slf4j-provider:jar:3.5.3
DEBUG: Added metadata for org.apache.maven:maven-slf4j-provider:pom:3.5.3
DEBUG: Added metadata for org.apache.maven:maven-embedder:jar:3.5.3
DEBUG: Added metadata for org.apache.maven:maven-embedder:pom:3.5.3
DEBUG: Added metadata for org.apache.maven:maven-compat:jar:3.5.3
DEBUG: Added metadata for org.apache.maven:maven-compat:pom:3.5.3
DEBUG: Adding metadata from file /usr/share/maven-metadata/maven2-maven-artifact-manager.xml
DEBUG: Added metadata for org.apache.maven:maven-artifact-manager:jar:2.2.1
DEBUG: Added metadata for org.apache.maven:maven-artifact-manager:pom:2.2.1
DEBUG: Adding metadata from file /usr/share/maven-metadata/maven2-maven-artifact.xml
DEBUG: Added metadata for org.apache.maven:maven-artifact:jar:2.2.1
DEBUG: Added metadata for org.apache.maven:maven-artifact:pom:2.2.1
DEBUG: Adding metadata from file /usr/share/maven-metadata/maven2-maven-model.xml
DEBUG: Added metadata for org.apache.maven:maven-model:jar:2.2.1
DEBUG: Added metadata for org.apache.maven:maven-model:pom:2.2.1
DEBUG: Adding metadata from file /usr/share/maven-metadata/maven2-maven-plugin-registry.xml
DEBUG: Added metadata for org.apache.maven:maven-plugin-registry:jar:2.2.1
DEBUG: Added metadata for org.apache.maven:maven-plugin-registry:pom:2.2.1
DEBUG: Adding metadata from file /usr/share/maven-metadata/maven2-maven-profile.xml
DEBUG: Added metadata for org.apache.maven:maven-profile:jar:2.2.1
DEBUG: Added metadata for org.apache.maven:maven-profile:pom:2.2.1
DEBUG: Adding metadata from file /usr/share/maven-metadata/maven2-maven-project.xml
DEBUG: Added metadata for org.apache.maven:maven-project:jar:2.2.1
DEBUG: Added metadata for org.apache.maven:maven-project:pom:2.2.1
DEBUG: Adding metadata from file /usr/share/maven-metadata/maven2-maven-settings.xml
DEBUG: Added metadata for org.apache.maven:maven-settings:jar:2.2.1
DEBUG: Added metadata for org.apache.maven:maven-settings:pom:2.2.1
DEBUG: Adding metadata from file /usr/share/maven-metadata/multiverse.xml
DEBUG: Added metadata for org.multiverse:multiverse:pom:0.7.0
DEBUG: Added metadata for org.multiverse:multiverse-core:jar:0.7.0
DEBUG: Added metadata for org.multiverse:multiverse-core:pom:0.7.0
DEBUG: Adding metadata from file /usr/share/maven-metadata/netty3.xml
DEBUG: Added metadata for io.netty:netty:jar:3.10.6.Final
DEBUG: Added metadata for io.netty:netty:pom:3.10.6.Final
DEBUG: Adding metadata from file /usr/share/maven-metadata/objectweb-asm.xml
DEBUG: Added metadata for org.ow2.asm:asm:jar:6.1.1
DEBUG: Added metadata for org.ow2.asm:asm:pom:6.1.1
DEBUG: Added metadata for org.ow2.asm:asm-tree:jar:6.1.1
DEBUG: Added metadata for org.ow2.asm:asm-tree:pom:6.1.1
DEBUG: Added metadata for org.ow2.asm:asm-analysis:jar:6.1.1
DEBUG: Added metadata for org.ow2.asm:asm-analysis:pom:6.1.1
DEBUG: Added metadata for org.ow2.asm:asm-util:jar:6.1.1
DEBUG: Added metadata for org.ow2.asm:asm-util:pom:6.1.1
DEBUG: Added metadata for org.ow2.asm:asm-commons:jar:6.1.1
DEBUG: Added metadata for org.ow2.asm:asm-commons:pom:6.1.1
DEBUG: Added metadata for org.ow2.asm:asm-xml:jar:6.1.1
DEBUG: Added metadata for org.ow2.asm:asm-xml:pom:6.1.1
DEBUG: Added metadata for org.ow2.asm:asm-all:jar:6.1.1
DEBUG: Added metadata for org.ow2.asm:asm-all:pom:6.1.1
DEBUG: Adding metadata from file /usr/share/maven-metadata/objenesis.xml
DEBUG: Added metadata for org.objenesis:objenesis-parent:pom:2.6
DEBUG: Added metadata for org.objenesis:objenesis:jar:2.6
DEBUG: Added metadata for org.objenesis:objenesis:pom:2.6
DEBUG: Added metadata for org.objenesis:objenesis-tck:jar:2.6
DEBUG: Added metadata for org.objenesis:objenesis-tck:pom:2.6
DEBUG: Adding metadata from file /usr/share/maven-metadata/osgi-annotation.xml
DEBUG: Added metadata for org.osgi:osgi.annotation:jar:6.0.0
DEBUG: Added metadata for org.osgi:osgi.annotation:pom:6.0.0
DEBUG: Adding metadata from file /usr/share/maven-metadata/osgi-compendium.xml
DEBUG: Added metadata for org.osgi:osgi.cmpn:jar:6.0.0
DEBUG: Added metadata for org.osgi:osgi.cmpn:pom:6.0.0
DEBUG: Adding metadata from file /usr/share/maven-metadata/osgi-core.xml
DEBUG: Added metadata for org.osgi:osgi.core:jar:6.0.0
DEBUG: Added metadata for org.osgi:osgi.core:pom:6.0.0
DEBUG: Adding metadata from file /usr/share/maven-metadata/parboiled.xml
DEBUG: Added metadata for org.parboiled:parboiled-core:jar:1.1.6
DEBUG: Added metadata for org.parboiled:parboiled-core:pom:1.1.6
DEBUG: Added metadata for org.parboiled:parboiled-java:jar:1.1.6
DEBUG: Added metadata for org.parboiled:parboiled-java:pom:1.1.6
DEBUG: Adding metadata from file /usr/share/maven-metadata/pdfbox-fontbox.xml
DEBUG: Added metadata for org.apache.pdfbox:fontbox:jar:1.8.13
DEBUG: Added metadata for org.apache.pdfbox:fontbox:pom:1.8.13
DEBUG: Adding metadata from file /usr/share/maven-metadata/pegdown.xml
DEBUG: Added metadata for org.pegdown:pegdown:jar:1.4.2
DEBUG: Added metadata for org.pegdown:pegdown:pom:1.4.2
DEBUG: Adding metadata from file /usr/share/maven-metadata/plexus-archiver.xml
DEBUG: Added metadata for org.codehaus.plexus:plexus-archiver:jar:3.6.0
DEBUG: Added metadata for org.codehaus.plexus:plexus-archiver:pom:3.6.0
DEBUG: Adding metadata from file /usr/share/maven-metadata/plexus-build-api.xml
DEBUG: Added metadata for org.sonatype.plexus:plexus-build-api:jar:0.0.7
DEBUG: Added metadata for org.sonatype.plexus:plexus-build-api:pom:0.0.7
DEBUG: Adding metadata from file /usr/share/maven-metadata/plexus-cipher.xml
DEBUG: Added metadata for org.sonatype.plexus:plexus-cipher:jar:1.7
DEBUG: Added metadata for org.sonatype.plexus:plexus-cipher:pom:1.7
DEBUG: Adding metadata from file /usr/share/maven-metadata/plexus-classworlds.xml
DEBUG: Added metadata for org.codehaus.plexus:plexus-classworlds:jar:2.5.2
DEBUG: Added metadata for org.codehaus.plexus:plexus-classworlds:pom:2.5.2
DEBUG: Adding metadata from file /usr/share/maven-metadata/plexus-compiler.xml
DEBUG: Added metadata for org.codehaus.plexus:plexus-compiler-api:jar:2.8.2
DEBUG: Added metadata for org.codehaus.plexus:plexus-compiler-api:pom:2.8.2
DEBUG: Added metadata for org.codehaus.plexus:plexus-compiler-manager:jar:2.8.2
DEBUG: Added metadata for org.codehaus.plexus:plexus-compiler-manager:pom:2.8.2
DEBUG: Added metadata for org.codehaus.plexus:plexus-compiler-javac:jar:2.8.2
DEBUG: Added metadata for org.codehaus.plexus:plexus-compiler-javac:pom:2.8.2
DEBUG: Added metadata for org.codehaus.plexus:plexus-compiler-j2objc:jar:2.8.2
DEBUG: Added metadata for org.codehaus.plexus:plexus-compiler-j2objc:pom:2.8.2
DEBUG: Adding metadata from file /usr/share/maven-metadata/plexus-component-api.xml
DEBUG: Added metadata for org.codehaus.plexus:plexus-component-api:jar:1.0-alpha-15
DEBUG: Added metadata for org.codehaus.plexus:plexus-component-api:pom:1.0-alpha-15
DEBUG: Adding metadata from file /usr/share/maven-metadata/plexus-containers-plexus-component-annotations.xml
DEBUG: Added metadata for org.codehaus.plexus:plexus-component-annotations:jar:1.7.1
DEBUG: Added metadata for org.codehaus.plexus:plexus-component-annotations:pom:1.7.1
DEBUG: Adding metadata from file /usr/share/maven-metadata/plexus-containers-plexus-container-default.xml
DEBUG: Added metadata for org.codehaus.plexus:plexus-container-default:jar:1.7.1
DEBUG: Added metadata for org.codehaus.plexus:plexus-container-default:pom:1.7.1
DEBUG: Adding metadata from file /usr/share/maven-metadata/plexus-i18n.xml
DEBUG: Added metadata for org.codehaus.plexus:plexus-i18n:jar:1.0-beta-10
DEBUG: Added metadata for org.codehaus.plexus:plexus-i18n:pom:1.0-beta-10
DEBUG: Adding metadata from file /usr/share/maven-metadata/plexus-interactivity-plexus-interactivity-api.xml
DEBUG: Added metadata for org.codehaus.plexus:plexus-interactivity-api:jar:1.0-alpha-6
DEBUG: Added metadata for org.codehaus.plexus:plexus-interactivity-api:pom:1.0-alpha-6
DEBUG: Adding metadata from file /usr/share/maven-metadata/plexus-interpolation.xml
DEBUG: Added metadata for org.codehaus.plexus:plexus-interpolation:jar:1.22
DEBUG: Added metadata for org.codehaus.plexus:plexus-interpolation:pom:1.22
DEBUG: Adding metadata from file /usr/share/maven-metadata/plexus-io.xml
DEBUG: Added metadata for org.codehaus.plexus:plexus-io:jar:3.0.0
DEBUG: Added metadata for org.codehaus.plexus:plexus-io:pom:3.0.0
DEBUG: Adding metadata from file /usr/share/maven-metadata/plexus-languages.xml
DEBUG: Added metadata for org.codehaus.plexus:plexus-languages:pom:0.9.3
DEBUG: Added metadata for org.codehaus.plexus:plexus-java:jar:0.9.3
DEBUG: Added metadata for org.codehaus.plexus:plexus-java:pom:0.9.3
DEBUG: Adding metadata from file /usr/share/maven-metadata/plexus-sec-dispatcher.xml
DEBUG: Added metadata for org.sonatype.plexus:plexus-sec-dispatcher:jar:1.4
DEBUG: Added metadata for org.sonatype.plexus:plexus-sec-dispatcher:pom:1.4
DEBUG: Adding metadata from file /usr/share/maven-metadata/plexus-utils.xml
DEBUG: Added metadata for org.codehaus.plexus:plexus-utils:jar:3.0.24
DEBUG: Added metadata for org.codehaus.plexus:plexus-utils:pom:3.0.24
DEBUG: Adding metadata from file /usr/share/maven-metadata/plexus-velocity.xml
DEBUG: Added metadata for org.codehaus.plexus:plexus-velocity:jar:1.2
DEBUG: Added metadata for org.codehaus.plexus:plexus-velocity:pom:1.2
DEBUG: Adding metadata from file /usr/share/maven-metadata/qdox.xml
DEBUG: Added metadata for com.thoughtworks.qdox:qdox:jar:2.0-M7
DEBUG: Added metadata for com.thoughtworks.qdox:qdox:pom:2.0-M7
DEBUG: Adding metadata from file /usr/share/maven-metadata/sisu-inject.xml
DEBUG: Added metadata for org.eclipse.sisu:org.eclipse.sisu.inject:jar:0.3.3
DEBUG: Added metadata for org.eclipse.sisu:org.eclipse.sisu.inject:pom:0.3.3
DEBUG: Adding metadata from file /usr/share/maven-metadata/sisu-plexus.xml
DEBUG: Added metadata for org.eclipse.sisu:org.eclipse.sisu.plexus:jar:0.3.3
DEBUG: Added metadata for org.eclipse.sisu:org.eclipse.sisu.plexus:pom:0.3.3
DEBUG: Adding metadata from file /usr/share/maven-metadata/slf4j-jcl-over-slf4j.xml
DEBUG: Added metadata for org.slf4j:jcl-over-slf4j:jar:1.7.25
DEBUG: Added metadata for org.slf4j:jcl-over-slf4j:pom:1.7.25
DEBUG: Adding metadata from file /usr/share/maven-metadata/slf4j.xml
DEBUG: Added metadata for org.slf4j:slf4j-api:jar:1.7.25
DEBUG: Added metadata for org.slf4j:slf4j-api:pom:1.7.25
DEBUG: Added metadata for org.slf4j:slf4j-simple:jar:1.7.25
DEBUG: Added metadata for org.slf4j:slf4j-simple:pom:1.7.25
DEBUG: Added metadata for org.slf4j:slf4j-nop:jar:1.7.25
DEBUG: Added metadata for org.slf4j:slf4j-nop:pom:1.7.25
DEBUG: Adding metadata from file /usr/share/maven-metadata/velocity.xml
DEBUG: Added metadata for org.apache.velocity:velocity:pom:1.7
DEBUG: Added metadata for org.apache.velocity:velocity:jar:1.7
DEBUG: Adding metadata from file /usr/share/maven-metadata/xalan-j2.xml
DEBUG: Added metadata for xalan:xalan:pom:2.7.1
DEBUG: Added metadata for xalan:xalan:jar:2.7.1
DEBUG: Added metadata for xalan:serializer:pom:2.7.1
DEBUG: Added metadata for xalan:serializer:jar:2.7.1
DEBUG: Adding metadata from file /usr/share/maven-metadata/xbean.xml
DEBUG: Added metadata for org.apache.xbean:xbean:pom:4.8
DEBUG: Added metadata for org.apache.xbean:xbean-classpath:jar:4.8
DEBUG: Added metadata for org.apache.xbean:xbean-classpath:pom:4.8
DEBUG: Added metadata for org.apache.xbean:xbean-bundleutils:jar:4.8
DEBUG: Added metadata for org.apache.xbean:xbean-bundleutils:pom:4.8
DEBUG: Added metadata for org.apache.xbean:xbean-asm-util:jar:4.8
DEBUG: Added metadata for org.apache.xbean:xbean-asm-util:pom:4.8
DEBUG: Added metadata for org.apache.xbean:xbean-finder:jar:4.8
DEBUG: Added metadata for org.apache.xbean:xbean-finder:pom:4.8
DEBUG: Added metadata for org.apache.xbean:xbean-naming:jar:4.8
DEBUG: Added metadata for org.apache.xbean:xbean-naming:pom:4.8
DEBUG: Added metadata for org.apache.xbean:xbean-reflect:jar:4.8
DEBUG: Added metadata for org.apache.xbean:xbean-reflect:pom:4.8
DEBUG: Added metadata for org.apache.xbean:xbean-telnet:jar:4.8
DEBUG: Added metadata for org.apache.xbean:xbean-telnet:pom:4.8
DEBUG: Adding metadata from file /usr/share/maven-metadata/xerces-j2.xml
DEBUG: Added metadata for xerces:xercesImpl:pom:2.11.0
DEBUG: Added metadata for xerces:xercesImpl:jar:2.11.0
DEBUG: Adding metadata from file /usr/share/maven-metadata/xml-commons-apis.xml
DEBUG: Added metadata for xml-apis:xml-apis:pom:2.0.2
DEBUG: Added metadata for xml-apis:xml-apis:jar:2.0.2
DEBUG: Added metadata for xml-apis:xml-apis-ext:pom:1.3.04
DEBUG: Added metadata for xml-apis:xml-apis-ext:jar:1.3.04
DEBUG: Adding metadata from file /usr/share/maven-metadata/xml-commons-resolver.xml
DEBUG: Added metadata for xml-resolver:xml-resolver:pom:1.2
DEBUG: Added metadata for xml-resolver:xml-resolver:jar:1.2
DEBUG: Adding metadata from file /usr/share/maven-metadata/xmlgraphics-commons.xml
DEBUG: Added metadata for org.apache.xmlgraphics:xmlgraphics-commons:jar:2.2
DEBUG: Added metadata for org.apache.xmlgraphics:xmlgraphics-commons:pom:2.2
DEBUG: Adding metadata from file /usr/share/maven-metadata/xmlunit.xml
DEBUG: Added metadata for xmlunit:xmlunit:pom:1.0
DEBUG: Added metadata for xmlunit:xmlunit:jar:1.0
DEBUG: Adding metadata from file /usr/share/maven-metadata/xmvn-xmvn-api.xml
DEBUG: Added metadata for org.fedoraproject.xmvn:xmvn-api:jar:3.0.0
DEBUG: Added metadata for org.fedoraproject.xmvn:xmvn-api:pom:3.0.0
DEBUG: Adding metadata from file /usr/share/maven-metadata/xmvn-xmvn-connector-aether.xml
DEBUG: Added metadata for org.fedoraproject.xmvn:xmvn-connector-aether:jar:3.0.0
DEBUG: Added metadata for org.fedoraproject.xmvn:xmvn-connector-aether:pom:3.0.0
DEBUG: Adding metadata from file /usr/share/maven-metadata/xmvn-xmvn-core.xml
DEBUG: Added metadata for org.fedoraproject.xmvn:xmvn-core:jar:3.0.0
DEBUG: Added metadata for org.fedoraproject.xmvn:xmvn-core:pom:3.0.0
DEBUG: Adding metadata from file /usr/share/maven-metadata/xmvn-xmvn-install.xml
DEBUG: Added metadata for org.fedoraproject.xmvn:xmvn-install:jar:3.0.0
DEBUG: Added metadata for org.fedoraproject.xmvn:xmvn-install:pom:3.0.0
DEBUG: Adding metadata from file /usr/share/maven-metadata/xmvn-xmvn-mojo.xml
DEBUG: Added metadata for org.fedoraproject.xmvn:xmvn-mojo:jar:3.0.0
DEBUG: Added metadata for org.fedoraproject.xmvn:xmvn-mojo:pom:3.0.0
DEBUG: Adding metadata from file /usr/share/maven-metadata/xmvn-xmvn-resolve.xml
DEBUG: Added metadata for org.fedoraproject.xmvn:xmvn-resolve:jar:3.0.0
DEBUG: Added metadata for org.fedoraproject.xmvn:xmvn-resolve:pom:3.0.0
DEBUG: Adding metadata from file /usr/share/maven-metadata/xmvn-xmvn-subst.xml
DEBUG: Added metadata for org.fedoraproject.xmvn:xmvn-subst:jar:3.0.0
DEBUG: Added metadata for org.fedoraproject.xmvn:xmvn-subst:pom:3.0.0
DEBUG: Adding metadata from file /usr/share/maven-metadata/xpp3-minimal.xml
DEBUG: Added metadata for xpp3:xpp3_min:pom:1.1.4c
DEBUG: Added metadata for xpp3:xpp3_min:jar:1.1.4c
DEBUG: Adding metadata from file /usr/share/maven-metadata/xpp3.xml
DEBUG: Added metadata for xpp3:xpp3:pom:1.1.4c
DEBUG: Added metadata for xpp3:xpp3:jar:1.1.4c
DEBUG: Added metadata for xpp3:xpp3_xpath:pom:1.1.4c
DEBUG: Added metadata for xpp3:xpp3_xpath:jar:1.1.4c
DEBUG: Adding metadata from file /usr/share/maven-metadata/xstream.xml
DEBUG: Added metadata for com.thoughtworks.xstream:xstream:jar:1.4.9
DEBUG: Added metadata for com.thoughtworks.xstream:xstream:pom:1.4.9
DEBUG: Adding metadata from file /usr/share/maven-metadata/xz-java.xml
DEBUG: Added metadata for org.tukaani:xz:pom:1.8
DEBUG: Added metadata for org.tukaani:xz:jar:1.8
DEBUG: Artifact javax.mail:mail:jar:1.6.3 was resolved to /usr/share/java/javamail/javax.mail.jar
DEBUG: Trying to resolve artifact org.apache.geronimo.specs:geronimo-jms_1.1_spec:jar:1.0
DEBUG: Artifact org.apache.geronimo.specs:geronimo-jms_1.1_spec:jar:1.0 was resolved to /usr/share/java/geronimo-jms.jar
DEBUG: Trying to resolve artifact javax.mail:mail:jar:1.6.3
DEBUG: Artifact javax.mail:mail:jar:1.6.3 was resolved to /usr/share/java/javamail/javax.mail.jar
DEBUG: Trying to resolve artifact org.apache.geronimo.specs:geronimo-jms_1.1_spec:jar:1.0
DEBUG: Artifact org.apache.geronimo.specs:geronimo-jms_1.1_spec:jar:1.0 was resolved to /usr/share/java/geronimo-jms.jar
[DEBUG] Installing packages into buildroot: /usr/src/tmp/log4j12-buildroot
[DEBUG] Installing main package
[DEBUG] Writing file descriptor .mfiles
[INFO] Installation successful
+ jdir=target/site/apidocs
+ '[' -d .xmvn/apidocs ']'
+ jdir=.xmvn/apidocs
+ /bin/mkdir -p /usr/src/tmp/log4j12-buildroot/usr/share/license
+ '[' -d .xmvn/apidocs ']'
+ install -dm755 /usr/src/tmp/log4j12-buildroot/usr/share/javadoc/log4j12
+ cp -pr .xmvn/apidocs/allclasses-frame.html .xmvn/apidocs/allclasses-noframe.html .xmvn/apidocs/constant-values.html .xmvn/apidocs/deprecated-list.html .xmvn/apidocs/help-doc.html .xmvn/apidocs/index-all.html .xmvn/apidocs/index.html .xmvn/apidocs/org .xmvn/apidocs/overview-frame.html .xmvn/apidocs/overview-summary.html .xmvn/apidocs/overview-tree.html .xmvn/apidocs/package-list .xmvn/apidocs/script.js .xmvn/apidocs/serialized-form.html .xmvn/apidocs/stylesheet.css /usr/src/tmp/log4j12-buildroot/usr/share/javadoc/log4j12
+ echo /usr/share/javadoc/log4j12
+ ln -s log4j-1.2.17.jar /usr/src/tmp/log4j12-buildroot/usr/share/java/log4j-1.jar
+ install -pD -T -m 644 src/main/javadoc/org/apache/log4j/xml/doc-files/log4j.dtd /usr/src/tmp/log4j12-buildroot/usr/share/sgml/log4j/log4j.dtd
+ install -pD -T -m 644 /usr/src/RPM/SOURCES/log4j.catalog /usr/src/tmp/log4j12-buildroot/usr/share/sgml/log4j/catalog
+ /usr/lib/rpm/brp-alt
Cleaning files in /usr/src/tmp/log4j12-buildroot (auto)
Verifying and fixing files in /usr/src/tmp/log4j12-buildroot (binconfig,pkgconfig,libtool,desktop)
Checking contents of files in /usr/src/tmp/log4j12-buildroot/ (default)
Compressing files in /usr/src/tmp/log4j12-buildroot (auto)
Verifying ELF objects in /usr/src/tmp/log4j12-buildroot (arch=normal,fhs=normal,lfs=relaxed,lint=relaxed,rpath=normal,stack=normal,textrel=normal,unresolved=normal)
Hardlinking identical .pyc and .pyo files
Processing files: log4j12-1.2.17-alt1_23jpp8
Executing(%doc): /bin/sh -e /usr/src/tmp/rpm-tmp.88873
+ umask 022
+ /bin/mkdir -p /usr/src/RPM/BUILD
+ cd /usr/src/RPM/BUILD
+ cd log4j-1_2_17
+ DOCDIR=/usr/src/tmp/log4j12-buildroot/usr/share/doc/log4j12-1.2.17
+ export DOCDIR
+ rm -rf /usr/src/tmp/log4j12-buildroot/usr/share/doc/log4j12-1.2.17
+ /bin/mkdir -p /usr/src/tmp/log4j12-buildroot/usr/share/doc/log4j12-1.2.17
+ cp -prL --no-dereference LICENSE NOTICE /usr/src/tmp/log4j12-buildroot/usr/share/doc/log4j12-1.2.17
+ chmod -R go-w /usr/src/tmp/log4j12-buildroot/usr/share/doc/log4j12-1.2.17
+ chmod -R a+rX /usr/src/tmp/log4j12-buildroot/usr/share/doc/log4j12-1.2.17
+ exit 0
Finding Provides (using /usr/lib/rpm/find-provides)
Executing: /bin/sh -e /usr/src/tmp/rpm-tmp.ccqvlX
find-provides: running scripts (alternatives,debuginfo,lib,maven,osgi-fc,pam,perl,pkgconfig,python,shell)
[INFO maven.prov] input: ['/usr/src/tmp/log4j12-buildroot/usr/share/maven-metadata/log4j12.xml']
[INFO maven.prov] mvn(log4j:log4j:pom:12) = 1.2.17
mvn(log4j:log4j:pom:1.2.16) = 1.2.17
mvn(log4j:log4j:pom:1.2.14) = 1.2.17
mvn(log4j:log4j:pom:1.2.13) = 1.2.17
mvn(log4j:log4j:pom:1.2.12) = 1.2.17
mvn(log4j:log4j:pom:1.2.17) = 1.2.17
mvn(log4j:log4j:pom:1.2.15) = 1.2.17, mvn(log4j:log4j:12) = 1.2.17
mvn(log4j:log4j:1.2.16) = 1.2.17
mvn(log4j:log4j:1.2.14) = 1.2.17
mvn(log4j:log4j:1.2.13) = 1.2.17
mvn(log4j:log4j:1.2.12) = 1.2.17
mvn(log4j:log4j:1.2.17) = 1.2.17
mvn(log4j:log4j:1.2.15) = 1.2.17
[INFO osgi.prov] input: ['/usr/src/tmp/log4j12-buildroot/usr/share/java/log4j-1.2.17.jar', '/usr/src/tmp/log4j12-buildroot/usr/share/java/log4j-1.jar', '/usr/src/tmp/log4j12-buildroot/usr/share/java/log4j12-1.2.17.jar']
[INFO osgi.prov] osgi(org.apache.log4j) = 1.2.17
Finding Requires (using /usr/lib/rpm/find-requires)
Executing: /bin/sh -e /usr/src/tmp/rpm-tmp.tgbE9Z
find-requires: running scripts (cpp,debuginfo,files,javadoc,lib,maven,osgi-fc,pam,perl,pkgconfig,pkgconfiglib,python,rpmlib,shebang,shell,static,symlinks)
[INFO maven.req] input: ['/usr/src/tmp/log4j12-buildroot/usr/share/maven-metadata/log4j12.xml']
[INFO maven.req] javapackages-tools
[INFO osgi.req] input: ['/usr/src/tmp/log4j12-buildroot/usr/share/java/log4j-1.2.17.jar', '/usr/src/tmp/log4j12-buildroot/usr/share/java/log4j-1.jar', '/usr/src/tmp/log4j12-buildroot/usr/share/java/log4j12-1.2.17.jar']
Finding Requires(post) (using /usr/lib/rpm/find-scriptlet-requires)
Executing: /bin/sh -e /usr/src/tmp/rpm-tmp.UiOVE8
Finding Requires(preun) (using /usr/lib/rpm/find-scriptlet-requires)
Executing: /bin/sh -e /usr/src/tmp/rpm-tmp.GYdF3w
Finding Requires(postun) (using /usr/lib/rpm/find-scriptlet-requires)
Executing: /bin/sh -e /usr/src/tmp/rpm-tmp.JbYYac
Provides: mvn(log4j:log4j:1.2.12) = 1.2.17, mvn(log4j:log4j:1.2.13) = 1.2.17, mvn(log4j:log4j:1.2.14) = 1.2.17, mvn(log4j:log4j:1.2.15) = 1.2.17, mvn(log4j:log4j:1.2.16) = 1.2.17, mvn(log4j:log4j:1.2.17) = 1.2.17, mvn(log4j:log4j:12) = 1.2.17, mvn(log4j:log4j:pom:1.2.12) = 1.2.17, mvn(log4j:log4j:pom:1.2.13) = 1.2.17, mvn(log4j:log4j:pom:1.2.14) = 1.2.17, mvn(log4j:log4j:pom:1.2.15) = 1.2.17, mvn(log4j:log4j:pom:1.2.16) = 1.2.17, mvn(log4j:log4j:pom:1.2.17) = 1.2.17, mvn(log4j:log4j:pom:12) = 1.2.17, osgi(org.apache.log4j) = 1.2.17
Requires: javapackages-tools
Requires(interp): /bin/sh
Requires(post): /bin/sh, /usr/bin/xmlcatalog, /usr/bin/install-catalog
Requires(preun): /bin/sh, /usr/bin/xmlcatalog
Requires(postun): /bin/sh, /usr/bin/install-catalog
Obsoletes: log4j <= 0:1.2.17-14
Processing files: log4j12-javadoc-1.2.17-alt1_23jpp8
Executing(%doc): /bin/sh -e /usr/src/tmp/rpm-tmp.19872
+ umask 022
+ /bin/mkdir -p /usr/src/RPM/BUILD
+ cd /usr/src/RPM/BUILD
+ cd log4j-1_2_17
+ DOCDIR=/usr/src/tmp/log4j12-buildroot/usr/share/doc/log4j12-javadoc-1.2.17
+ export DOCDIR
+ rm -rf /usr/src/tmp/log4j12-buildroot/usr/share/doc/log4j12-javadoc-1.2.17
+ /bin/mkdir -p /usr/src/tmp/log4j12-buildroot/usr/share/doc/log4j12-javadoc-1.2.17
+ cp -prL --no-dereference LICENSE NOTICE /usr/src/tmp/log4j12-buildroot/usr/share/doc/log4j12-javadoc-1.2.17
+ chmod -R go-w /usr/src/tmp/log4j12-buildroot/usr/share/doc/log4j12-javadoc-1.2.17
+ chmod -R a+rX /usr/src/tmp/log4j12-buildroot/usr/share/doc/log4j12-javadoc-1.2.17
+ exit 0
Finding Provides (using /usr/lib/rpm/find-provides)
Executing: /bin/sh -e /usr/src/tmp/rpm-tmp.yURUeg
find-provides: running scripts (alternatives,debuginfo,lib,maven,osgi-fc,pam,perl,pkgconfig,python,shell)
Finding Requires (using /usr/lib/rpm/find-requires)
Executing: /bin/sh -e /usr/src/tmp/rpm-tmp.QMGvwy
find-requires: running scripts (cpp,debuginfo,files,javadoc,lib,maven,osgi-fc,pam,perl,pkgconfig,pkgconfiglib,python,rpmlib,shebang,shell,static,symlinks)
Requires: javapackages-tools
Wrote: /usr/src/RPM/RPMS/noarch/log4j12-1.2.17-alt1_23jpp8.noarch.rpm
Wrote: /usr/src/RPM/RPMS/noarch/log4j12-javadoc-1.2.17-alt1_23jpp8.noarch.rpm
72.68user 2.55system 2:08.17elapsed 58%CPU (0avgtext+0avgdata 427436maxresident)k
0inputs+0outputs (0major+535776minor)pagefaults 0swaps
103.27user 8.29system 2:52.35elapsed 64%CPU (0avgtext+0avgdata 427436maxresident)k
0inputs+0outputs (0major+1219204minor)pagefaults 0swaps