<86>Apr 21 02:10:47 userdel[53819]: delete user 'rooter'
<86>Apr 21 02:10:47 userdel[53819]: removed group 'rooter' owned by 'rooter'
<86>Apr 21 02:10:47 userdel[53819]: removed shadow group 'rooter' owned by 'rooter'
<86>Apr 21 02:10:47 groupadd[53860]: group added to /etc/group: name=rooter, GID=573
<86>Apr 21 02:10:47 groupadd[53860]: group added to /etc/gshadow: name=rooter
<86>Apr 21 02:10:47 groupadd[53860]: new group: name=rooter, GID=573
<86>Apr 21 02:10:47 useradd[53893]: new user: name=rooter, UID=573, GID=573, home=/root, shell=/bin/bash
<86>Apr 21 02:10:47 userdel[53948]: delete user 'builder'
<86>Apr 21 02:10:47 userdel[53948]: removed group 'builder' owned by 'builder'
<86>Apr 21 02:10:47 userdel[53948]: removed shadow group 'builder' owned by 'builder'
<86>Apr 21 02:10:47 groupadd[53968]: group added to /etc/group: name=builder, GID=574
<86>Apr 21 02:10:47 groupadd[53968]: group added to /etc/gshadow: name=builder
<86>Apr 21 02:10:47 groupadd[53968]: new group: name=builder, GID=574
<86>Apr 21 02:10:47 useradd[54001]: new user: name=builder, UID=574, GID=574, home=/usr/src, shell=/bin/bash
<13>Apr 21 02:10:49 rpmi: libgdbm-1.8.3-alt10 1454943313 installed
<13>Apr 21 02:10:49 rpmi: libexpat-2.2.4-alt0.M80P.1 1503871120 installed
<13>Apr 21 02:10:50 rpmi: perl-devel-1:5.22.3-alt0.M80P.1 1485958065 installed
<13>Apr 21 02:10:50 rpmi: libyaml2-0.1.6-alt1 1397147705 installed
<13>Apr 21 02:10:50 rpmi: libruby-2.5.1-alt0.M80P.1 1525659669 installed
<13>Apr 21 02:10:50 rpmi: gcc-c++-common-1.4.20-alt1 1432315196 installed
<13>Apr 21 02:10:50 rpmi: libstdc++5-devel-5.3.1-alt3.M80P.1 p8+225520.100.3.1 1553688800 installed
<13>Apr 21 02:10:50 rpmi: libtinfo-devel-5.9-alt8 1456756459 installed
<13>Apr 21 02:10:50 rpmi: libncurses-devel-5.9-alt8 1456756459 installed
<13>Apr 21 02:10:50 rpmi: python-modules-curses-2.7.11-alt6.M80P.1 1527682470 installed
<13>Apr 21 02:10:50 rpmi: libverto-0.2.6-alt1_6 1455633234 installed
<13>Apr 21 02:10:50 rpmi: libkeyutils-1.5.10-alt0.M80P.2 p8+216694.100.6.1 1547827915 installed
<13>Apr 21 02:10:50 rpmi: libcom_err-1.42.13-alt2 1449075846 installed
<13>Apr 21 02:10:50 rpmi: ca-certificates-2016.02.25-alt1 1462368370 installed
<13>Apr 21 02:10:50 rpmi: libcrypto10-1.0.2n-alt0.M80P.1 1512766129 installed
<13>Apr 21 02:10:51 rpmi: gcc5-c++-5.3.1-alt3.M80P.1 p8+225520.100.3.1 1553688800 installed
<13>Apr 21 02:10:51 rpmi: libssl10-1.0.2n-alt0.M80P.1 1512766129 installed
<13>Apr 21 02:10:51 rpmi: ruby-stdlibs-2.5.1-alt0.M80P.1 1525659669 installed
<13>Apr 21 02:10:51 rpmi: swig-data-1:3.0.8-alt1 1453777133 installed
<86>Apr 21 02:10:51 groupadd[66533]: group added to /etc/group: name=_keytab, GID=499
<86>Apr 21 02:10:51 groupadd[66533]: group added to /etc/gshadow: name=_keytab
<86>Apr 21 02:10:51 groupadd[66533]: new group: name=_keytab, GID=499
<13>Apr 21 02:10:51 rpmi: libkrb5-1.14.6-alt1.M80P.1 1525355673 installed
<13>Apr 21 02:10:51 rpmi: swig-1:3.0.8-alt1 1453777107 installed
<13>Apr 21 02:10:52 rpmi: python3-base-3.5.4-alt2.M80P.1 1527753911 installed
<13>Apr 21 02:10:52 rpmi: python3-3.5.4-alt2.M80P.1 1527753911 installed
<13>Apr 21 02:10:52 rpmi: python-modules-compiler-2.7.11-alt6.M80P.1 1527682470 installed
<13>Apr 21 02:10:52 rpmi: rpm-build-python3-0.1.10.10-alt1.M80P.1 1530521451 installed
<13>Apr 21 02:10:52 rpmi: libpython3-3.5.4-alt2.M80P.1 1527753911 installed
<13>Apr 21 02:10:53 rpmi: python3-dev-3.5.4-alt2.M80P.1 1527753911 installed
<13>Apr 21 02:10:53 rpmi: python-modules-email-2.7.11-alt6.M80P.1 1527682470 installed
<13>Apr 21 02:10:53 rpmi: python-modules-unittest-2.7.11-alt6.M80P.1 1527682470 installed
<13>Apr 21 02:10:53 rpmi: python-modules-2.7.11-alt6.M80P.1 1527682470 installed
<13>Apr 21 02:10:53 rpmi: python-modules-encodings-2.7.11-alt6.M80P.1 1527682470 installed
<13>Apr 21 02:10:53 rpmi: python-modules-xml-2.7.11-alt6.M80P.1 1527682470 installed
<13>Apr 21 02:10:53 rpmi: python-modules-hotshot-2.7.11-alt6.M80P.1 1527682470 installed
<13>Apr 21 02:10:53 rpmi: python-modules-bsddb-2.7.11-alt6.M80P.1 1527682470 installed
<13>Apr 21 02:10:53 rpmi: python-modules-ctypes-2.7.11-alt6.M80P.1 1527682470 installed
<13>Apr 21 02:10:53 rpmi: python-modules-multiprocessing-2.7.11-alt6.M80P.1 1527682470 installed
<13>Apr 21 02:10:53 rpmi: python-modules-logging-2.7.11-alt6.M80P.1 1527682470 installed
<13>Apr 21 02:10:53 rpmi: python-2.7.11-alt6.M80P.1 1527682470 installed
<13>Apr 21 02:10:53 rpmi: python-dev-2.7.11-alt6.M80P.1 1527682470 installed
Installing tbb-2018-alt0.M80P.1.u1.src.rpm
Building target platforms: x86_64
Building for target x86_64
Executing(%prep): /bin/sh -e /usr/src/tmp/rpm-tmp.1493
+ umask 022
+ /bin/mkdir -p /usr/src/RPM/BUILD
+ cd /usr/src/RPM/BUILD
+ cd /usr/src/RPM/BUILD
+ rm -rf tbb-2018
+ echo 'Source #0 (tbb-2018.tar):'
Source #0 (tbb-2018.tar):
+ /bin/tar -xf /usr/src/RPM/SOURCES/tbb-2018.tar
+ cd tbb-2018
+ /bin/chmod -c -Rf u+rwX,go-w .
+ echo 'Patch #1 (tbb-2018.u1-alt-build.patch):'
Patch #1 (tbb-2018.u1-alt-build.patch):
+ /usr/bin/patch -p1
patching file Makefile
patching file build/Makefile.rml
patching file build/Makefile.tbb
patching file build/Makefile.tbbmalloc
patching file build/linux.gcc.inc
patching file cmake/TBBMakeConfig.cmake
patching file examples/GettingStarted/sub_string_finder/Makefile
patching file examples/concurrent_hash_map/count_strings/Makefile
patching file examples/parallel_for/seismic/Makefile
patching file examples/parallel_for/tachyon/Makefile
patching file examples/parallel_reduce/convex_hull/Makefile
patching file examples/parallel_reduce/primes/Makefile
patching file examples/task/tree_sum/Makefile
patching file examples/task_group/sudoku/Makefile
patching file examples/test_all/fibonacci/Makefile
patching file src/tbb/concurrent_vector.cpp
+ cp -a python python3
+ exit 0
Executing(%build): /bin/sh -e /usr/src/tmp/rpm-tmp.1493
+ umask 022
+ /bin/mkdir -p /usr/src/RPM/BUILD
+ cd /usr/src/RPM/BUILD
+ cd tbb-2018
+ export 'CFLAGS=-pipe -Wall -g -O2'
+ CFLAGS='-pipe -Wall -g -O2'
+ export 'CXXFLAGS=-pipe -Wall -g -O2'
+ CXXFLAGS='-pipe -Wall -g -O2'
+ '[' -n '' ']'
+ NPROCS=8
+ make -j8 stdver=c++14
make: Entering directory `/usr/src/RPM/BUILD/tbb-2018'
Created ./build/linux_intel64_gcc_cc5.3.1_libc2.23_kernel4.19.32_release and ..._debug directories
make -C "./build/linux_intel64_gcc_cc5.3.1_libc2.23_kernel4.19.32_release"  -r -f ../../build/Makefile.tbb cfg=release
make[1]: Entering directory `/usr/src/RPM/BUILD/tbb-2018/build/linux_intel64_gcc_cc5.3.1_libc2.23_kernel4.19.32_release'
../../build/Makefile.tbb:32: CONFIG: cfg=release arch=intel64 compiler=gcc target=linux runtime=cc5.3.1_libc2.23_kernel4.19.32
g++ -g -o concurrent_hash_map.o -g -c -MMD -DDO_ITT_NOTIFY -g -O2 -DUSE_PTHREAD -m64 -mrtm  -fPIC  -D__TBB_BUILD=1 -Wall -Wno-parentheses -Wno-non-virtual-dtor -pipe -Wall -g -O2 -std=c++14  -I../../src -I../../src/rml/include -I../../include ../../src/tbb/concurrent_hash_map.cpp
g++ -g -o concurrent_queue.o -g -c -MMD -DDO_ITT_NOTIFY -g -O2 -DUSE_PTHREAD -m64 -mrtm  -fPIC  -D__TBB_BUILD=1 -Wall -Wno-parentheses -Wno-non-virtual-dtor -pipe -Wall -g -O2 -std=c++14  -I../../src -I../../src/rml/include -I../../include ../../src/tbb/concurrent_queue.cpp
g++ -g -o concurrent_vector.o -g -c -MMD -DDO_ITT_NOTIFY -g -O2 -DUSE_PTHREAD -m64 -mrtm  -fPIC  -D__TBB_BUILD=1 -Wall -Wno-parentheses -Wno-non-virtual-dtor -pipe -Wall -g -O2 -std=c++14  -I../../src -I../../src/rml/include -I../../include ../../src/tbb/concurrent_vector.cpp
g++ -g -o dynamic_link.o -g -c -MMD -DDO_ITT_NOTIFY -g -O2 -DUSE_PTHREAD -m64 -mrtm  -fPIC  -D__TBB_BUILD=1 -Wall -Wno-parentheses -Wno-non-virtual-dtor -pipe -Wall -g -O2 -std=c++14  -I../../src -I../../src/rml/include -I../../include ../../src/tbb/dynamic_link.cpp
g++ -g -o itt_notify.o -g -c -MMD -DDO_ITT_NOTIFY -g -O2 -DUSE_PTHREAD -m64 -mrtm  -fPIC  -D__TBB_BUILD=1 -Wall -Wno-parentheses -Wno-non-virtual-dtor -pipe -Wall -g -O2 -std=c++14  -I../../src -I../../src/rml/include -I../../include ../../src/tbb/itt_notify.cpp
g++ -g -o cache_aligned_allocator.o -g -c -MMD -DDO_ITT_NOTIFY -g -O2 -DUSE_PTHREAD -m64 -mrtm  -fPIC  -D__TBB_BUILD=1 -Wall -Wno-parentheses -Wno-non-virtual-dtor -pipe -Wall -g -O2 -std=c++14  -I../../src -I../../src/rml/include -I../../include ../../src/tbb/cache_aligned_allocator.cpp
g++ -g -o pipeline.o -g -c -MMD -DDO_ITT_NOTIFY -g -O2 -DUSE_PTHREAD -m64 -mrtm  -fPIC  -D__TBB_BUILD=1 -Wall -Wno-parentheses -Wno-non-virtual-dtor -pipe -Wall -g -O2 -std=c++14  -I../../src -I../../src/rml/include -I../../include ../../src/tbb/pipeline.cpp
g++ -g -o queuing_mutex.o -g -c -MMD -DDO_ITT_NOTIFY -g -O2 -DUSE_PTHREAD -m64 -mrtm  -fPIC  -D__TBB_BUILD=1 -Wall -Wno-parentheses -Wno-non-virtual-dtor -pipe -Wall -g -O2 -std=c++14  -I../../src -I../../src/rml/include -I../../include ../../src/tbb/queuing_mutex.cpp
g++ -g -o queuing_rw_mutex.o -g -c -MMD -DDO_ITT_NOTIFY -g -O2 -DUSE_PTHREAD -m64 -mrtm  -fPIC  -D__TBB_BUILD=1 -Wall -Wno-parentheses -Wno-non-virtual-dtor -pipe -Wall -g -O2 -std=c++14  -I../../src -I../../src/rml/include -I../../include ../../src/tbb/queuing_rw_mutex.cpp
g++ -g -o reader_writer_lock.o -g -c -MMD -DDO_ITT_NOTIFY -g -O2 -DUSE_PTHREAD -m64 -mrtm  -fPIC  -D__TBB_BUILD=1 -Wall -Wno-parentheses -Wno-non-virtual-dtor -pipe -Wall -g -O2 -std=c++14  -I../../src -I../../src/rml/include -I../../include ../../src/tbb/reader_writer_lock.cpp
g++ -g -o spin_rw_mutex.o -g -c -MMD -DDO_ITT_NOTIFY -g -O2 -DUSE_PTHREAD -m64 -mrtm  -fPIC  -D__TBB_BUILD=1 -Wall -Wno-parentheses -Wno-non-virtual-dtor -pipe -Wall -g -O2 -std=c++14  -I../../src -I../../src/rml/include -I../../include ../../src/tbb/spin_rw_mutex.cpp
g++ -g -o x86_rtm_rw_mutex.o -g -c -MMD -DDO_ITT_NOTIFY -g -O2 -DUSE_PTHREAD -m64 -mrtm  -fPIC  -D__TBB_BUILD=1 -Wall -Wno-parentheses -Wno-non-virtual-dtor -pipe -Wall -g -O2 -std=c++14  -I../../src -I../../src/rml/include -I../../include ../../src/tbb/x86_rtm_rw_mutex.cpp
g++ -g -o spin_mutex.o -g -c -MMD -DDO_ITT_NOTIFY -g -O2 -DUSE_PTHREAD -m64 -mrtm  -fPIC  -D__TBB_BUILD=1 -Wall -Wno-parentheses -Wno-non-virtual-dtor -pipe -Wall -g -O2 -std=c++14  -I../../src -I../../src/rml/include -I../../include ../../src/tbb/spin_mutex.cpp
g++ -g -o critical_section.o -g -c -MMD -DDO_ITT_NOTIFY -g -O2 -DUSE_PTHREAD -m64 -mrtm  -fPIC  -D__TBB_BUILD=1 -Wall -Wno-parentheses -Wno-non-virtual-dtor -pipe -Wall -g -O2 -std=c++14  -I../../src -I../../src/rml/include -I../../include ../../src/tbb/critical_section.cpp
g++ -g -o mutex.o -g -c -MMD -DDO_ITT_NOTIFY -g -O2 -DUSE_PTHREAD -m64 -mrtm  -fPIC  -D__TBB_BUILD=1 -Wall -Wno-parentheses -Wno-non-virtual-dtor -pipe -Wall -g -O2 -std=c++14  -I../../src -I../../src/rml/include -I../../include ../../src/tbb/mutex.cpp
g++ -g -o recursive_mutex.o -g -c -MMD -DDO_ITT_NOTIFY -g -O2 -DUSE_PTHREAD -m64 -mrtm  -fPIC  -D__TBB_BUILD=1 -Wall -Wno-parentheses -Wno-non-virtual-dtor -pipe -Wall -g -O2 -std=c++14  -I../../src -I../../src/rml/include -I../../include ../../src/tbb/recursive_mutex.cpp
g++ -g -o condition_variable.o -g -c -MMD -DDO_ITT_NOTIFY -g -O2 -DUSE_PTHREAD -m64 -mrtm  -fPIC  -D__TBB_BUILD=1 -Wall -Wno-parentheses -Wno-non-virtual-dtor -pipe -Wall -g -O2 -std=c++14  -I../../src -I../../src/rml/include -I../../include ../../src/tbb/condition_variable.cpp
g++ -g -o tbb_thread.o -g -c -MMD -DDO_ITT_NOTIFY -g -O2 -DUSE_PTHREAD -m64 -mrtm  -fPIC  -D__TBB_BUILD=1 -Wall -Wno-parentheses -Wno-non-virtual-dtor -pipe -Wall -g -O2 -std=c++14  -I../../src -I../../src/rml/include -I../../include ../../src/tbb/tbb_thread.cpp
g++ -g -o concurrent_monitor.o -g -c -MMD -DDO_ITT_NOTIFY -g -O2 -DUSE_PTHREAD -m64 -mrtm  -fPIC  -D__TBB_BUILD=1 -Wall -Wno-parentheses -Wno-non-virtual-dtor -pipe -Wall -g -O2 -std=c++14  -I../../src -I../../src/rml/include -I../../include ../../src/tbb/concurrent_monitor.cpp
g++ -g -o semaphore.o -g -c -MMD -DDO_ITT_NOTIFY -g -O2 -DUSE_PTHREAD -m64 -mrtm  -fPIC  -D__TBB_BUILD=1 -Wall -Wno-parentheses -Wno-non-virtual-dtor -pipe -Wall -g -O2 -std=c++14  -I../../src -I../../src/rml/include -I../../include ../../src/tbb/semaphore.cpp
g++ -g -o private_server.o -g -c -MMD -DDO_ITT_NOTIFY -g -O2 -DUSE_PTHREAD -m64 -mrtm  -fPIC  -D__TBB_BUILD=1 -Wall -Wno-parentheses -Wno-non-virtual-dtor -pipe -Wall -g -O2 -std=c++14  -I../../src -I../../src/rml/include -I../../include ../../src/tbb/private_server.cpp
g++ -g -o rml_tbb.o -g -c -MMD -DDO_ITT_NOTIFY -g -O2 -DUSE_PTHREAD -m64 -mrtm  -fPIC  -D__TBB_BUILD=1 -Wall -Wno-parentheses -Wno-non-virtual-dtor -pipe -Wall -g -O2 -std=c++14  -I../../src -I../../src/rml/include -I../../include ../../src/rml/client/rml_tbb.cpp
sh ../../build/version_info_linux.sh g++ -g -DDO_ITT_NOTIFY -g -O2 -DUSE_PTHREAD -m64 -mrtm  -fPIC  -D__TBB_BUILD=1 -Wall -Wno-parentheses -Wno-non-virtual-dtor -pipe -Wall -g -O2 -std=c++14 -I../../src -I../../src/rml/include -I../../include -I. >version_string.ver
g++ -g -o tbb_misc_ex.o -g -c -MMD -DDO_ITT_NOTIFY -g -O2 -DUSE_PTHREAD -m64 -mrtm  -fPIC  -D__TBB_BUILD=1 -Wall -Wno-parentheses -Wno-non-virtual-dtor -pipe -Wall -g -O2 -std=c++14  -I../../src -I../../src/rml/include -I../../include ../../src/tbb/tbb_misc_ex.cpp
g++ -g -o task.o -g -c -MMD -DDO_ITT_NOTIFY -g -O2 -DUSE_PTHREAD -m64 -mrtm  -fPIC  -D__TBB_BUILD=1 -Wall -Wno-parentheses -Wno-non-virtual-dtor -pipe -Wall -g -O2 -std=c++14  -I../../src -I../../src/rml/include -I../../include ../../src/tbb/task.cpp
g++ -g -o task_group_context.o -g -c -MMD -DDO_ITT_NOTIFY -g -O2 -DUSE_PTHREAD -m64 -mrtm  -fPIC  -D__TBB_BUILD=1 -Wall -Wno-parentheses -Wno-non-virtual-dtor -pipe -Wall -g -O2 -std=c++14  -I../../src -I../../src/rml/include -I../../include ../../src/tbb/task_group_context.cpp
g++ -g -o governor.o -g -c -MMD -DDO_ITT_NOTIFY -g -O2 -DUSE_PTHREAD -m64 -mrtm  -fPIC  -D__TBB_BUILD=1 -Wall -Wno-parentheses -Wno-non-virtual-dtor -pipe -Wall -g -O2 -std=c++14  -I../../src -I../../src/rml/include -I../../include ../../src/tbb/governor.cpp
g++ -g -o market.o -g -c -MMD -DDO_ITT_NOTIFY -g -O2 -DUSE_PTHREAD -m64 -mrtm  -fPIC  -D__TBB_BUILD=1 -Wall -Wno-parentheses -Wno-non-virtual-dtor -pipe -Wall -g -O2 -std=c++14  -I../../src -I../../src/rml/include -I../../include ../../src/tbb/market.cpp
g++ -g -o arena.o -g -c -MMD -DDO_ITT_NOTIFY -g -O2 -DUSE_PTHREAD -m64 -mrtm  -fPIC  -D__TBB_BUILD=1 -Wall -Wno-parentheses -Wno-non-virtual-dtor -pipe -Wall -g -O2 -std=c++14  -I../../src -I../../src/rml/include -I../../include ../../src/tbb/arena.cpp
g++ -g -o scheduler.o -g -c -MMD -DDO_ITT_NOTIFY -g -O2 -DUSE_PTHREAD -m64 -mrtm  -fPIC  -D__TBB_BUILD=1 -Wall -Wno-parentheses -Wno-non-virtual-dtor -pipe -Wall -g -O2 -std=c++14  -I../../src -I../../src/rml/include -I../../include ../../src/tbb/scheduler.cpp
g++ -g -o observer_proxy.o -g -c -MMD -DDO_ITT_NOTIFY -g -O2 -DUSE_PTHREAD -m64 -mrtm  -fPIC  -D__TBB_BUILD=1 -Wall -Wno-parentheses -Wno-non-virtual-dtor -pipe -Wall -g -O2 -std=c++14  -I../../src -I../../src/rml/include -I../../include ../../src/tbb/observer_proxy.cpp
g++ -g -o tbb_statistics.o -g -c -MMD -DDO_ITT_NOTIFY -g -O2 -DUSE_PTHREAD -m64 -mrtm  -fPIC  -D__TBB_BUILD=1 -Wall -Wno-parentheses -Wno-non-virtual-dtor -pipe -Wall -g -O2 -std=c++14  -I../../src -I../../src/rml/include -I../../include ../../src/tbb/tbb_statistics.cpp
g++ -g -o tbb_main.o -g -c -MMD -DDO_ITT_NOTIFY -g -O2 -DUSE_PTHREAD -m64 -mrtm  -fPIC  -D__TBB_BUILD=1 -Wall -Wno-parentheses -Wno-non-virtual-dtor -pipe -Wall -g -O2 -std=c++14  -I../../src -I../../src/rml/include -I../../include ../../src/tbb/tbb_main.cpp
g++ -g -o concurrent_vector_v2.o -g -c -MMD -DDO_ITT_NOTIFY -g -O2 -DUSE_PTHREAD -m64 -mrtm  -fPIC  -D__TBB_BUILD=1 -Wall -Wno-parentheses -Wno-non-virtual-dtor -pipe -Wall -g -O2 -std=c++14  -I../../src -I../../src/rml/include -I../../include ../../src/old/concurrent_vector_v2.cpp
g++ -g -o concurrent_queue_v2.o -g -c -MMD -DDO_ITT_NOTIFY -g -O2 -DUSE_PTHREAD -m64 -mrtm  -fPIC  -D__TBB_BUILD=1 -Wall -Wno-parentheses -Wno-non-virtual-dtor -pipe -Wall -g -O2 -std=c++14  -I../../src -I../../src/rml/include -I../../include ../../src/old/concurrent_queue_v2.cpp
g++ -g -o spin_rw_mutex_v2.o -g -c -MMD -DDO_ITT_NOTIFY -g -O2 -DUSE_PTHREAD -m64 -mrtm  -fPIC  -D__TBB_BUILD=1 -Wall -Wno-parentheses -Wno-non-virtual-dtor -pipe -Wall -g -O2 -std=c++14  -I../../src -I../../src/rml/include -I../../include ../../src/old/spin_rw_mutex_v2.cpp
g++ -g -o task_v2.o -g -c -MMD -DDO_ITT_NOTIFY -g -O2 -DUSE_PTHREAD -m64 -mrtm  -fPIC  -D__TBB_BUILD=1 -Wall -Wno-parentheses -Wno-non-virtual-dtor -pipe -Wall -g -O2 -std=c++14  -I../../src -I../../src/rml/include -I../../include ../../src/old/task_v2.cpp
sh ../../build/generate_tbbvars.sh
echo "INPUT (libtbb.so.2)" > libtbb.so
g++ -g -E -x c++ ../../src/tbb/lin64-tbb-export.def -DDO_ITT_NOTIFY -g -O2 -DUSE_PTHREAD -m64 -mrtm  -fPIC  -D__TBB_BUILD=1 -Wall -Wno-parentheses -Wno-non-virtual-dtor -pipe -Wall -g -O2 -I../../src -I../../src/rml/include -I../../include > tbb.def
g++ -g -o tbb_misc.o -g -c -MMD -DDO_ITT_NOTIFY -g -O2 -DUSE_PTHREAD -m64 -mrtm  -fPIC  -D__TBB_BUILD=1 -Wall -Wno-parentheses -Wno-non-virtual-dtor -pipe -Wall -g -O2 -std=c++14  -I../../src -I../../src/rml/include -I../../include -I. ../../src/tbb/tbb_misc.cpp
g++ -g -fPIC -o libtbb.so.2 concurrent_hash_map.o concurrent_queue.o concurrent_vector.o dynamic_link.o itt_notify.o cache_aligned_allocator.o pipeline.o queuing_mutex.o queuing_rw_mutex.o reader_writer_lock.o spin_rw_mutex.o x86_rtm_rw_mutex.o spin_mutex.o critical_section.o mutex.o recursive_mutex.o condition_variable.o tbb_thread.o concurrent_monitor.o semaphore.o private_server.o rml_tbb.o tbb_misc.o tbb_misc_ex.o task.o task_group_context.o governor.o market.o arena.o scheduler.o observer_proxy.o tbb_statistics.o tbb_main.o concurrent_vector_v2.o concurrent_queue_v2.o spin_rw_mutex_v2.o task_v2.o   -ldl -lpthread -lrt -shared -Wl,-soname=libtbb.so.2 -m64  -Wl,--version-script,tbb.def -lpthread
make[1]: Leaving directory `/usr/src/RPM/BUILD/tbb-2018/build/linux_intel64_gcc_cc5.3.1_libc2.23_kernel4.19.32_release'
make -C "./build/linux_intel64_gcc_cc5.3.1_libc2.23_kernel4.19.32_release"  -r -f ../../build/Makefile.tbbmalloc cfg=release malloc
make[1]: Entering directory `/usr/src/RPM/BUILD/tbb-2018/build/linux_intel64_gcc_cc5.3.1_libc2.23_kernel4.19.32_release'
g++ -g -g -c -MMD -DDO_ITT_NOTIFY -g -O2 -DUSE_PTHREAD -m64 -mrtm   -pipe  -g -O2 -fno-rtti -fno-exceptions -D__TBBMALLOC_BUILD=1  -Wno-parentheses -Wno-non-virtual-dtor -fPIC  -I../../src -I../../src/rml/include -I../../include -I../../src/tbbmalloc -I../../src/tbbmalloc ../../src/tbbmalloc/backend.cpp
g++ -g -g -c -MMD -DDO_ITT_NOTIFY -g -O2 -DUSE_PTHREAD -m64 -mrtm   -pipe  -g -O2 -fno-rtti -fno-exceptions -D__TBBMALLOC_BUILD=1  -Wno-parentheses -Wno-non-virtual-dtor -fPIC  -I../../src -I../../src/rml/include -I../../include -I../../src/tbbmalloc -I../../src/tbbmalloc ../../src/tbbmalloc/large_objects.cpp
g++ -g -g -c -MMD -DDO_ITT_NOTIFY -g -O2 -DUSE_PTHREAD -m64 -mrtm   -pipe  -g -O2 -fno-rtti -fno-exceptions -D__TBBMALLOC_BUILD=1  -Wno-parentheses -Wno-non-virtual-dtor -fPIC  -I../../src -I../../src/rml/include -I../../include -I../../src/tbbmalloc -I../../src/tbbmalloc ../../src/tbbmalloc/backref.cpp
g++ -g -g -c -MMD -DDO_ITT_NOTIFY -g -O2 -DUSE_PTHREAD -m64 -mrtm   -pipe  -g -O2 -fno-rtti -fno-exceptions -D__TBBMALLOC_BUILD=1  -Wno-parentheses -Wno-non-virtual-dtor -fPIC  -I../../src -I../../src/rml/include -I../../include -I../../src/tbbmalloc -I../../src/tbbmalloc ../../src/tbbmalloc/tbbmalloc.cpp
g++ -g -g -c -MMD -DDO_ITT_NOTIFY -g -O2 -DUSE_PTHREAD -m64 -mrtm   -pipe  -g -O2 -fno-rtti -fno-exceptions -D__TBBMALLOC_BUILD=1  -Wno-parentheses -Wno-non-virtual-dtor -fPIC  -o itt_notify_malloc.o -I../../src -I../../src/rml/include -I../../include ../../src/tbb/itt_notify.cpp
g++ -g -g -c -MMD -DDO_ITT_NOTIFY -g -O2 -DUSE_PTHREAD -m64 -mrtm   -pipe  -g -O2 -fno-rtti -fno-exceptions -D__TBBMALLOC_BUILD=1  -Wno-parentheses -Wno-non-virtual-dtor -fPIC  -I../../src -I../../src/rml/include -I../../include -I../../src/tbbmalloc -I../../src/tbbmalloc -I. ../../src/tbbmalloc/frontend.cpp
echo "INPUT (libtbbmalloc.so.2)" > libtbbmalloc.so
g++ -g -E -x c++ ../../src/tbbmalloc/lin64-tbbmalloc-export.def -DDO_ITT_NOTIFY -g -O2 -DUSE_PTHREAD -m64 -mrtm   -pipe  -g -O2 -fno-rtti -fno-exceptions -D__TBBMALLOC_BUILD=1  -Wno-parentheses -Wno-non-virtual-dtor -I../../src -I../../src/rml/include -I../../include > tbbmalloc.def
g++ -g -g -c -MMD -DDO_ITT_NOTIFY -g -O2 -DUSE_PTHREAD -m64 -mrtm  -Wall -pipe -Wall -g -O2  -Wno-parentheses -Wno-non-virtual-dtor -fPIC  -D__TBBMALLOC_BUILD=1 -I../../src -I../../src/rml/include -I../../include -I../../src/tbbmalloc -I../../src/tbbmalloc ../../src/tbbmalloc/proxy.cpp
g++ -g -g -c -MMD -DDO_ITT_NOTIFY -g -O2 -DUSE_PTHREAD -m64 -mrtm  -Wall -pipe -Wall -g -O2  -Wno-parentheses -Wno-non-virtual-dtor -fPIC  -D__TBBMALLOC_BUILD=1 -I../../src -I../../src/rml/include -I../../include -I../../src/tbbmalloc -I../../src/tbbmalloc ../../src/tbbmalloc/tbb_function_replacement.cpp
echo "INPUT (libtbbmalloc_proxy.so.2)" > libtbbmalloc_proxy.so
g++ -g -E -x c++ ../../src/tbbmalloc/lin64-proxy-export.def -DDO_ITT_NOTIFY -g -O2 -DUSE_PTHREAD -m64 -mrtm  -Wall -pipe -Wall -g -O2  -Wno-parentheses -Wno-non-virtual-dtor -I../../src -I../../src/rml/include -I../../include > tbbmallocproxy.def
gcc -g -fPIC -o libtbbmalloc.so.2 backend.o large_objects.o backref.o  tbbmalloc.o  itt_notify_malloc.o frontend.o  -ldl -lpthread -lrt -shared -Wl,-soname=libtbbmalloc.so.2 -m64  -Wl,--version-script,tbbmalloc.def -lpthread
g++ -g -fPIC -o libtbbmalloc_proxy.so.2 proxy.o tbb_function_replacement.o  -ldl -lpthread -lrt libtbbmalloc.so -shared -Wl,-soname=libtbbmalloc_proxy.so.2 -m64  -Wl,--version-script,tbbmallocproxy.def
make[1]: Leaving directory `/usr/src/RPM/BUILD/tbb-2018/build/linux_intel64_gcc_cc5.3.1_libc2.23_kernel4.19.32_release'
make: Leaving directory `/usr/src/RPM/BUILD/tbb-2018'
+ . build/linux_intel64_gcc_cc5.3.1_libc2.23_kernel4.19.32_release/tbbvars.sh
++ export TBBROOT=/usr/src/RPM/BUILD/tbb-2018
++ TBBROOT=/usr/src/RPM/BUILD/tbb-2018
++ tbb_bin=/usr/src/RPM/BUILD/tbb-2018/build/linux_intel64_gcc_cc5.3.1_libc2.23_kernel4.19.32_release
++ '[' -z '' ']'
++ export CPATH=/usr/src/RPM/BUILD/tbb-2018/include
++ CPATH=/usr/src/RPM/BUILD/tbb-2018/include
++ '[' -z '' ']'
++ export LIBRARY_PATH=/usr/src/RPM/BUILD/tbb-2018/build/linux_intel64_gcc_cc5.3.1_libc2.23_kernel4.19.32_release
++ LIBRARY_PATH=/usr/src/RPM/BUILD/tbb-2018/build/linux_intel64_gcc_cc5.3.1_libc2.23_kernel4.19.32_release
++ '[' -z '' ']'
++ export LD_LIBRARY_PATH=/usr/src/RPM/BUILD/tbb-2018/build/linux_intel64_gcc_cc5.3.1_libc2.23_kernel4.19.32_release
++ LD_LIBRARY_PATH=/usr/src/RPM/BUILD/tbb-2018/build/linux_intel64_gcc_cc5.3.1_libc2.23_kernel4.19.32_release
+ pushd python
~/RPM/BUILD/tbb-2018/python ~/RPM/BUILD/tbb-2018
+ CFLAGS='-pipe -Wall -g -O2'
+ export CFLAGS
+ CXXFLAGS='-pipe -Wall -g -O2'
+ export CXXFLAGS
+ FFLAGS='-pipe -Wall -g -O2'
+ export FFLAGS
+ /usr/bin/python setup.py build --debug
Using TBBROOT= /usr/src/RPM/BUILD/tbb-2018
running build
running build_ext
building '_TBB' extension
swigging tbb.i to tbb_wrap.cpp
swig -python -c++ -O -threads -I/usr/src/RPM/BUILD/tbb-2018/include -o tbb_wrap.cpp tbb.i
creating build
creating build/temp.linux-x86_64-2.7
x86_64-alt-linux-gcc -pthread -DNDEBUG -pipe -Wall -g -O3 -pipe -Wall -g -O2 -fPIC -g -I/usr/src/RPM/BUILD/tbb-2018/include -I/usr/include/python2.7 -c tbb_wrap.cpp -o build/temp.linux-x86_64-2.7/tbb_wrap.o -std=c++11 -Wno-unused-variable
creating build/lib.linux-x86_64-2.7
x86_64-alt-linux-g++ -pthread -shared -pipe -Wall -g -O2 -g build/temp.linux-x86_64-2.7/tbb_wrap.o -L/usr/src/RPM/BUILD/tbb-2018/lib/intel64/gcc4.4 -L/usr/src/RPM/BUILD/tbb-2018/lib -L/usr/src/RPM/BUILD/tbb-2018/lib/intel64/vc_mt -ltbb -lpython2.7 -o build/lib.linux-x86_64-2.7/_TBB.so
running build_py
copying TBB.py -> build/lib.linux-x86_64-2.7
+ popd
~/RPM/BUILD/tbb-2018
+ pushd python3
~/RPM/BUILD/tbb-2018/python3 ~/RPM/BUILD/tbb-2018
+ CFLAGS='-pipe -Wall -g -O2'
+ export CFLAGS
+ CXXFLAGS='-pipe -Wall -g -O2'
+ export CXXFLAGS
+ FFLAGS='-pipe -Wall -g -O2'
+ export FFLAGS
+ python3 setup.py build --debug
Using TBBROOT= /usr/src/RPM/BUILD/tbb-2018
running build
running build_ext
building '_TBB' extension
swigging tbb.i to tbb_wrap.cpp
swig -python -c++ -O -threads -I/usr/src/RPM/BUILD/tbb-2018/include -o tbb_wrap.cpp tbb.i
creating build
creating build/temp.linux-x86_64-3.5
x86_64-alt-linux-gcc -pthread -DDYNAMIC_ANNOTATIONS_ENABLED=1 -DNDEBUG -g -fwrapv -O3 -Wall -Wstrict-prototypes -pipe -Wall -g -O2 -fPIC -g -I/usr/src/RPM/BUILD/tbb-2018/include -I/usr/include/python3.5m -c tbb_wrap.cpp -o build/temp.linux-x86_64-3.5/tbb_wrap.o -std=c++11 -Wno-unused-variable
cc1plus: warning: command line option '-Wstrict-prototypes' is valid for C/ObjC but not for C++
creating build/lib.linux-x86_64-3.5
x86_64-alt-linux-g++ -pthread -shared -pipe -Wall -g -O2 -g build/temp.linux-x86_64-3.5/tbb_wrap.o -L/usr/src/RPM/BUILD/tbb-2018/lib/intel64/gcc4.4 -L/usr/src/RPM/BUILD/tbb-2018/lib -L/usr/src/RPM/BUILD/tbb-2018/lib/intel64/vc_mt -ltbb -o build/lib.linux-x86_64-3.5/_TBB.cpython-35m.so
running build_py
copying TBB.py -> build/lib.linux-x86_64-3.5
+ popd
~/RPM/BUILD/tbb-2018
+ exit 0
Executing(%install): /bin/sh -e /usr/src/tmp/rpm-tmp.24827
+ umask 022
+ /bin/mkdir -p /usr/src/RPM/BUILD
+ cd /usr/src/RPM/BUILD
+ /bin/chmod -Rf u+rwX -- /usr/src/tmp/tbb-buildroot
+ :
+ /bin/rm -rf -- /usr/src/tmp/tbb-buildroot
+ cd tbb-2018
+ install -d /usr/src/tmp/tbb-buildroot/usr/lib64
+ install -m644 build/linux_intel64_gcc_cc5.3.1_libc2.23_kernel4.19.32_release/libtbb.so.2 build/linux_intel64_gcc_cc5.3.1_libc2.23_kernel4.19.32_release/libtbbmalloc.so.2 build/linux_intel64_gcc_cc5.3.1_libc2.23_kernel4.19.32_release/libtbbmalloc_proxy.so.2 /usr/src/tmp/tbb-buildroot/usr/lib64
+ pushd /usr/src/tmp/tbb-buildroot/usr/lib64
~/tmp/tbb-buildroot/usr/lib64 ~/RPM/BUILD/tbb-2018
+ for i in '*.so.*'
++ echo libtbb.so.2
++ sed 's|\.1||'
+ devlib=libtbb.so.2
++ echo libtbb.so.2
++ sed 's|\.2||'
+ devlib=libtbb.so
+ ln -s libtbb.so.2 libtbb.so
+ for i in '*.so.*'
++ echo libtbbmalloc.so.2
++ sed 's|\.1||'
+ devlib=libtbbmalloc.so.2
++ echo libtbbmalloc.so.2
++ sed 's|\.2||'
+ devlib=libtbbmalloc.so
+ ln -s libtbbmalloc.so.2 libtbbmalloc.so
+ for i in '*.so.*'
++ echo libtbbmalloc_proxy.so.2
++ sed 's|\.1||'
+ devlib=libtbbmalloc_proxy.so.2
++ echo libtbbmalloc_proxy.so.2
++ sed 's|\.2||'
+ devlib=libtbbmalloc_proxy.so
+ ln -s libtbbmalloc_proxy.so.2 libtbbmalloc_proxy.so
+ popd
~/RPM/BUILD/tbb-2018
+ install -d /usr/src/tmp/tbb-buildroot/usr/include
+ cp -fR include/tbb /usr/src/tmp/tbb-buildroot/usr/include/
+ install -d /usr/src/tmp/tbb-buildroot/usr/share/tbb
+ cp -fR examples /usr/src/tmp/tbb-buildroot/usr/share/tbb/
++ find ./ -name '*.html'
+ for i in '$(find ./ -name '\''*.html'\'')'
+ install -Dm644 ./python3/index.html /usr/src/tmp/tbb-buildroot/usr/share/doc/tbb/./python3/index.html
+ for i in '$(find ./ -name '\''*.html'\'')'
+ install -Dm644 ./src/tbbmalloc/index.html /usr/src/tmp/tbb-buildroot/usr/share/doc/tbb/./src/tbbmalloc/index.html
+ for i in '$(find ./ -name '\''*.html'\'')'
+ install -Dm644 ./src/tbb/index.html /usr/src/tmp/tbb-buildroot/usr/share/doc/tbb/./src/tbb/index.html
+ for i in '$(find ./ -name '\''*.html'\'')'
+ install -Dm644 ./src/rml/server/index.html /usr/src/tmp/tbb-buildroot/usr/share/doc/tbb/./src/rml/server/index.html
+ for i in '$(find ./ -name '\''*.html'\'')'
+ install -Dm644 ./src/rml/index.html /usr/src/tmp/tbb-buildroot/usr/share/doc/tbb/./src/rml/index.html
+ for i in '$(find ./ -name '\''*.html'\'')'
+ install -Dm644 ./src/rml/include/index.html /usr/src/tmp/tbb-buildroot/usr/share/doc/tbb/./src/rml/include/index.html
+ for i in '$(find ./ -name '\''*.html'\'')'
+ install -Dm644 ./src/rml/client/index.html /usr/src/tmp/tbb-buildroot/usr/share/doc/tbb/./src/rml/client/index.html
+ for i in '$(find ./ -name '\''*.html'\'')'
+ install -Dm644 ./src/perf/time_hash_map_fill.html /usr/src/tmp/tbb-buildroot/usr/share/doc/tbb/./src/perf/time_hash_map_fill.html
+ for i in '$(find ./ -name '\''*.html'\'')'
+ install -Dm644 ./src/index.html /usr/src/tmp/tbb-buildroot/usr/share/doc/tbb/./src/index.html
+ for i in '$(find ./ -name '\''*.html'\'')'
+ install -Dm644 ./python/index.html /usr/src/tmp/tbb-buildroot/usr/share/doc/tbb/./python/index.html
+ for i in '$(find ./ -name '\''*.html'\'')'
+ install -Dm644 ./index.html /usr/src/tmp/tbb-buildroot/usr/share/doc/tbb/./index.html
+ for i in '$(find ./ -name '\''*.html'\'')'
+ install -Dm644 ./include/tbb/index.html /usr/src/tmp/tbb-buildroot/usr/share/doc/tbb/./include/tbb/index.html
+ for i in '$(find ./ -name '\''*.html'\'')'
+ install -Dm644 ./include/index.html /usr/src/tmp/tbb-buildroot/usr/share/doc/tbb/./include/index.html
+ for i in '$(find ./ -name '\''*.html'\'')'
+ install -Dm644 ./examples/test_all/index.html /usr/src/tmp/tbb-buildroot/usr/share/doc/tbb/./examples/test_all/index.html
+ for i in '$(find ./ -name '\''*.html'\'')'
+ install -Dm644 ./examples/test_all/fibonacci/readme.html /usr/src/tmp/tbb-buildroot/usr/share/doc/tbb/./examples/test_all/fibonacci/readme.html
+ for i in '$(find ./ -name '\''*.html'\'')'
+ install -Dm644 ./examples/task_group/sudoku/readme.html /usr/src/tmp/tbb-buildroot/usr/share/doc/tbb/./examples/task_group/sudoku/readme.html
+ for i in '$(find ./ -name '\''*.html'\'')'
+ install -Dm644 ./examples/task_group/index.html /usr/src/tmp/tbb-buildroot/usr/share/doc/tbb/./examples/task_group/index.html
+ for i in '$(find ./ -name '\''*.html'\'')'
+ install -Dm644 ./examples/task_arena/index.html /usr/src/tmp/tbb-buildroot/usr/share/doc/tbb/./examples/task_arena/index.html
+ for i in '$(find ./ -name '\''*.html'\'')'
+ install -Dm644 ./examples/task_arena/fractal/readme.html /usr/src/tmp/tbb-buildroot/usr/share/doc/tbb/./examples/task_arena/fractal/readme.html
+ for i in '$(find ./ -name '\''*.html'\'')'
+ install -Dm644 ./examples/task/tree_sum/readme.html /usr/src/tmp/tbb-buildroot/usr/share/doc/tbb/./examples/task/tree_sum/readme.html
+ for i in '$(find ./ -name '\''*.html'\'')'
+ install -Dm644 ./examples/task/index.html /usr/src/tmp/tbb-buildroot/usr/share/doc/tbb/./examples/task/index.html
+ for i in '$(find ./ -name '\''*.html'\'')'
+ install -Dm644 ./examples/pipeline/square/readme.html /usr/src/tmp/tbb-buildroot/usr/share/doc/tbb/./examples/pipeline/square/readme.html
+ for i in '$(find ./ -name '\''*.html'\'')'
+ install -Dm644 ./examples/pipeline/index.html /usr/src/tmp/tbb-buildroot/usr/share/doc/tbb/./examples/pipeline/index.html
+ for i in '$(find ./ -name '\''*.html'\'')'
+ install -Dm644 ./examples/parallel_reduce/primes/readme.html /usr/src/tmp/tbb-buildroot/usr/share/doc/tbb/./examples/parallel_reduce/primes/readme.html
+ for i in '$(find ./ -name '\''*.html'\'')'
+ install -Dm644 ./examples/parallel_reduce/index.html /usr/src/tmp/tbb-buildroot/usr/share/doc/tbb/./examples/parallel_reduce/index.html
+ for i in '$(find ./ -name '\''*.html'\'')'
+ install -Dm644 ./examples/parallel_reduce/convex_hull/readme.html /usr/src/tmp/tbb-buildroot/usr/share/doc/tbb/./examples/parallel_reduce/convex_hull/readme.html
+ for i in '$(find ./ -name '\''*.html'\'')'
+ install -Dm644 ./examples/parallel_for/tachyon/readme.html /usr/src/tmp/tbb-buildroot/usr/share/doc/tbb/./examples/parallel_for/tachyon/readme.html
+ for i in '$(find ./ -name '\''*.html'\'')'
+ install -Dm644 ./examples/parallel_for/seismic/readme.html /usr/src/tmp/tbb-buildroot/usr/share/doc/tbb/./examples/parallel_for/seismic/readme.html
+ for i in '$(find ./ -name '\''*.html'\'')'
+ install -Dm644 ./examples/parallel_for/polygon_overlay/readme.html /usr/src/tmp/tbb-buildroot/usr/share/doc/tbb/./examples/parallel_for/polygon_overlay/readme.html
+ for i in '$(find ./ -name '\''*.html'\'')'
+ install -Dm644 ./examples/parallel_for/index.html /usr/src/tmp/tbb-buildroot/usr/share/doc/tbb/./examples/parallel_for/index.html
+ for i in '$(find ./ -name '\''*.html'\'')'
+ install -Dm644 ./examples/parallel_for/game_of_life/readme.html /usr/src/tmp/tbb-buildroot/usr/share/doc/tbb/./examples/parallel_for/game_of_life/readme.html
+ for i in '$(find ./ -name '\''*.html'\'')'
+ install -Dm644 ./examples/parallel_do/parallel_preorder/readme.html /usr/src/tmp/tbb-buildroot/usr/share/doc/tbb/./examples/parallel_do/parallel_preorder/readme.html
+ for i in '$(find ./ -name '\''*.html'\'')'
+ install -Dm644 ./examples/parallel_do/index.html /usr/src/tmp/tbb-buildroot/usr/share/doc/tbb/./examples/parallel_do/index.html
+ for i in '$(find ./ -name '\''*.html'\'')'
+ install -Dm644 ./examples/index.html /usr/src/tmp/tbb-buildroot/usr/share/doc/tbb/./examples/index.html
+ for i in '$(find ./ -name '\''*.html'\'')'
+ install -Dm644 ./examples/graph/stereo/readme.html /usr/src/tmp/tbb-buildroot/usr/share/doc/tbb/./examples/graph/stereo/readme.html
+ for i in '$(find ./ -name '\''*.html'\'')'
+ install -Dm644 ./examples/graph/som/readme.html /usr/src/tmp/tbb-buildroot/usr/share/doc/tbb/./examples/graph/som/readme.html
+ for i in '$(find ./ -name '\''*.html'\'')'
+ install -Dm644 ./examples/graph/matmult/readme.html /usr/src/tmp/tbb-buildroot/usr/share/doc/tbb/./examples/graph/matmult/readme.html
+ for i in '$(find ./ -name '\''*.html'\'')'
+ install -Dm644 ./examples/graph/logic_sim/readme.html /usr/src/tmp/tbb-buildroot/usr/share/doc/tbb/./examples/graph/logic_sim/readme.html
+ for i in '$(find ./ -name '\''*.html'\'')'
+ install -Dm644 ./examples/graph/index.html /usr/src/tmp/tbb-buildroot/usr/share/doc/tbb/./examples/graph/index.html
+ for i in '$(find ./ -name '\''*.html'\'')'
+ install -Dm644 ./examples/graph/fgbzip2/readme.html /usr/src/tmp/tbb-buildroot/usr/share/doc/tbb/./examples/graph/fgbzip2/readme.html
+ for i in '$(find ./ -name '\''*.html'\'')'
+ install -Dm644 ./examples/graph/dining_philosophers/readme.html /usr/src/tmp/tbb-buildroot/usr/share/doc/tbb/./examples/graph/dining_philosophers/readme.html
+ for i in '$(find ./ -name '\''*.html'\'')'
+ install -Dm644 ./examples/graph/cholesky/readme.html /usr/src/tmp/tbb-buildroot/usr/share/doc/tbb/./examples/graph/cholesky/readme.html
+ for i in '$(find ./ -name '\''*.html'\'')'
+ install -Dm644 ./examples/graph/binpack/readme.html /usr/src/tmp/tbb-buildroot/usr/share/doc/tbb/./examples/graph/binpack/readme.html
+ for i in '$(find ./ -name '\''*.html'\'')'
+ install -Dm644 ./examples/concurrent_priority_queue/shortpath/readme.html /usr/src/tmp/tbb-buildroot/usr/share/doc/tbb/./examples/concurrent_priority_queue/shortpath/readme.html
+ for i in '$(find ./ -name '\''*.html'\'')'
+ install -Dm644 ./examples/concurrent_priority_queue/index.html /usr/src/tmp/tbb-buildroot/usr/share/doc/tbb/./examples/concurrent_priority_queue/index.html
+ for i in '$(find ./ -name '\''*.html'\'')'
+ install -Dm644 ./examples/concurrent_hash_map/index.html /usr/src/tmp/tbb-buildroot/usr/share/doc/tbb/./examples/concurrent_hash_map/index.html
+ for i in '$(find ./ -name '\''*.html'\'')'
+ install -Dm644 ./examples/concurrent_hash_map/count_strings/readme.html /usr/src/tmp/tbb-buildroot/usr/share/doc/tbb/./examples/concurrent_hash_map/count_strings/readme.html
+ for i in '$(find ./ -name '\''*.html'\'')'
+ install -Dm644 ./examples/common/index.html /usr/src/tmp/tbb-buildroot/usr/share/doc/tbb/./examples/common/index.html
+ for i in '$(find ./ -name '\''*.html'\'')'
+ install -Dm644 ./examples/GettingStarted/sub_string_finder/readme.html /usr/src/tmp/tbb-buildroot/usr/share/doc/tbb/./examples/GettingStarted/sub_string_finder/readme.html
+ for i in '$(find ./ -name '\''*.html'\'')'
+ install -Dm644 ./examples/GettingStarted/index.html /usr/src/tmp/tbb-buildroot/usr/share/doc/tbb/./examples/GettingStarted/index.html
+ for i in '$(find ./ -name '\''*.html'\'')'
+ install -Dm644 ./doc/html/pages.html /usr/src/tmp/tbb-buildroot/usr/share/doc/tbb/./doc/html/pages.html
+ for i in '$(find ./ -name '\''*.html'\'')'
+ install -Dm644 ./doc/html/namespaces.html /usr/src/tmp/tbb-buildroot/usr/share/doc/tbb/./doc/html/namespaces.html
+ for i in '$(find ./ -name '\''*.html'\'')'
+ install -Dm644 ./doc/html/namespacemembers_type.html /usr/src/tmp/tbb-buildroot/usr/share/doc/tbb/./doc/html/namespacemembers_type.html
+ for i in '$(find ./ -name '\''*.html'\'')'
+ install -Dm644 ./doc/html/namespacemembers_func.html /usr/src/tmp/tbb-buildroot/usr/share/doc/tbb/./doc/html/namespacemembers_func.html
+ for i in '$(find ./ -name '\''*.html'\'')'
+ install -Dm644 ./doc/html/namespacemembers_eval.html /usr/src/tmp/tbb-buildroot/usr/share/doc/tbb/./doc/html/namespacemembers_eval.html
+ for i in '$(find ./ -name '\''*.html'\'')'
+ install -Dm644 ./doc/html/namespacemembers_enum.html /usr/src/tmp/tbb-buildroot/usr/share/doc/tbb/./doc/html/namespacemembers_enum.html
+ for i in '$(find ./ -name '\''*.html'\'')'
+ install -Dm644 ./doc/html/namespacemembers.html /usr/src/tmp/tbb-buildroot/usr/share/doc/tbb/./doc/html/namespacemembers.html
+ for i in '$(find ./ -name '\''*.html'\'')'
+ install -Dm644 ./doc/html/modules.html /usr/src/tmp/tbb-buildroot/usr/share/doc/tbb/./doc/html/modules.html
+ for i in '$(find ./ -name '\''*.html'\'')'
+ install -Dm644 ./doc/html/index.html /usr/src/tmp/tbb-buildroot/usr/share/doc/tbb/./doc/html/index.html
+ for i in '$(find ./ -name '\''*.html'\'')'
+ install -Dm644 ./doc/html/hierarchy.html /usr/src/tmp/tbb-buildroot/usr/share/doc/tbb/./doc/html/hierarchy.html
+ for i in '$(find ./ -name '\''*.html'\'')'
+ install -Dm644 ./doc/html/globals_func.html /usr/src/tmp/tbb-buildroot/usr/share/doc/tbb/./doc/html/globals_func.html
+ for i in '$(find ./ -name '\''*.html'\'')'
+ install -Dm644 ./doc/html/globals.html /usr/src/tmp/tbb-buildroot/usr/share/doc/tbb/./doc/html/globals.html
+ for i in '$(find ./ -name '\''*.html'\'')'
+ install -Dm644 ./doc/html/functions_vars.html /usr/src/tmp/tbb-buildroot/usr/share/doc/tbb/./doc/html/functions_vars.html
+ for i in '$(find ./ -name '\''*.html'\'')'
+ install -Dm644 ./doc/html/functions_type.html /usr/src/tmp/tbb-buildroot/usr/share/doc/tbb/./doc/html/functions_type.html
+ for i in '$(find ./ -name '\''*.html'\'')'
+ install -Dm644 ./doc/html/functions_rela.html /usr/src/tmp/tbb-buildroot/usr/share/doc/tbb/./doc/html/functions_rela.html
+ for i in '$(find ./ -name '\''*.html'\'')'
+ install -Dm644 ./doc/html/functions_func_0x7e.html /usr/src/tmp/tbb-buildroot/usr/share/doc/tbb/./doc/html/functions_func_0x7e.html
+ for i in '$(find ./ -name '\''*.html'\'')'
+ install -Dm644 ./doc/html/functions_func_0x77.html /usr/src/tmp/tbb-buildroot/usr/share/doc/tbb/./doc/html/functions_func_0x77.html
+ for i in '$(find ./ -name '\''*.html'\'')'
+ install -Dm644 ./doc/html/functions_func_0x75.html /usr/src/tmp/tbb-buildroot/usr/share/doc/tbb/./doc/html/functions_func_0x75.html
+ for i in '$(find ./ -name '\''*.html'\'')'
+ install -Dm644 ./doc/html/functions_func_0x74.html /usr/src/tmp/tbb-buildroot/usr/share/doc/tbb/./doc/html/functions_func_0x74.html
+ for i in '$(find ./ -name '\''*.html'\'')'
+ install -Dm644 ./doc/html/functions_func_0x73.html /usr/src/tmp/tbb-buildroot/usr/share/doc/tbb/./doc/html/functions_func_0x73.html
+ for i in '$(find ./ -name '\''*.html'\'')'
+ install -Dm644 ./doc/html/functions_func_0x72.html /usr/src/tmp/tbb-buildroot/usr/share/doc/tbb/./doc/html/functions_func_0x72.html
+ for i in '$(find ./ -name '\''*.html'\'')'
+ install -Dm644 ./doc/html/functions_func_0x71.html /usr/src/tmp/tbb-buildroot/usr/share/doc/tbb/./doc/html/functions_func_0x71.html
+ for i in '$(find ./ -name '\''*.html'\'')'
+ install -Dm644 ./doc/html/functions_func_0x70.html /usr/src/tmp/tbb-buildroot/usr/share/doc/tbb/./doc/html/functions_func_0x70.html
+ for i in '$(find ./ -name '\''*.html'\'')'
+ install -Dm644 ./doc/html/functions_func_0x6f.html /usr/src/tmp/tbb-buildroot/usr/share/doc/tbb/./doc/html/functions_func_0x6f.html
+ for i in '$(find ./ -name '\''*.html'\'')'
+ install -Dm644 ./doc/html/functions_func_0x6e.html /usr/src/tmp/tbb-buildroot/usr/share/doc/tbb/./doc/html/functions_func_0x6e.html
+ for i in '$(find ./ -name '\''*.html'\'')'
+ install -Dm644 ./doc/html/functions_func_0x6d.html /usr/src/tmp/tbb-buildroot/usr/share/doc/tbb/./doc/html/functions_func_0x6d.html
+ for i in '$(find ./ -name '\''*.html'\'')'
+ install -Dm644 ./doc/html/functions_func_0x6c.html /usr/src/tmp/tbb-buildroot/usr/share/doc/tbb/./doc/html/functions_func_0x6c.html
+ for i in '$(find ./ -name '\''*.html'\'')'
+ install -Dm644 ./doc/html/functions_func_0x6a.html /usr/src/tmp/tbb-buildroot/usr/share/doc/tbb/./doc/html/functions_func_0x6a.html
+ for i in '$(find ./ -name '\''*.html'\'')'
+ install -Dm644 ./doc/html/functions_func_0x69.html /usr/src/tmp/tbb-buildroot/usr/share/doc/tbb/./doc/html/functions_func_0x69.html
+ for i in '$(find ./ -name '\''*.html'\'')'
+ install -Dm644 ./doc/html/functions_func_0x68.html /usr/src/tmp/tbb-buildroot/usr/share/doc/tbb/./doc/html/functions_func_0x68.html
+ for i in '$(find ./ -name '\''*.html'\'')'
+ install -Dm644 ./doc/html/functions_func_0x67.html /usr/src/tmp/tbb-buildroot/usr/share/doc/tbb/./doc/html/functions_func_0x67.html
+ for i in '$(find ./ -name '\''*.html'\'')'
+ install -Dm644 ./doc/html/functions_func_0x66.html /usr/src/tmp/tbb-buildroot/usr/share/doc/tbb/./doc/html/functions_func_0x66.html
+ for i in '$(find ./ -name '\''*.html'\'')'
+ install -Dm644 ./doc/html/functions_func_0x65.html /usr/src/tmp/tbb-buildroot/usr/share/doc/tbb/./doc/html/functions_func_0x65.html
+ for i in '$(find ./ -name '\''*.html'\'')'
+ install -Dm644 ./doc/html/functions_func_0x64.html /usr/src/tmp/tbb-buildroot/usr/share/doc/tbb/./doc/html/functions_func_0x64.html
+ for i in '$(find ./ -name '\''*.html'\'')'
+ install -Dm644 ./doc/html/functions_func_0x63.html /usr/src/tmp/tbb-buildroot/usr/share/doc/tbb/./doc/html/functions_func_0x63.html
+ for i in '$(find ./ -name '\''*.html'\'')'
+ install -Dm644 ./doc/html/functions_func_0x62.html /usr/src/tmp/tbb-buildroot/usr/share/doc/tbb/./doc/html/functions_func_0x62.html
+ for i in '$(find ./ -name '\''*.html'\'')'
+ install -Dm644 ./doc/html/functions_func.html /usr/src/tmp/tbb-buildroot/usr/share/doc/tbb/./doc/html/functions_func.html
+ for i in '$(find ./ -name '\''*.html'\'')'
+ install -Dm644 ./doc/html/functions_eval.html /usr/src/tmp/tbb-buildroot/usr/share/doc/tbb/./doc/html/functions_eval.html
+ for i in '$(find ./ -name '\''*.html'\'')'
+ install -Dm644 ./doc/html/functions_enum.html /usr/src/tmp/tbb-buildroot/usr/share/doc/tbb/./doc/html/functions_enum.html
+ for i in '$(find ./ -name '\''*.html'\'')'
+ install -Dm644 ./doc/html/functions_0x7e.html /usr/src/tmp/tbb-buildroot/usr/share/doc/tbb/./doc/html/functions_0x7e.html
+ for i in '$(find ./ -name '\''*.html'\'')'
+ install -Dm644 ./doc/html/functions_0x77.html /usr/src/tmp/tbb-buildroot/usr/share/doc/tbb/./doc/html/functions_0x77.html
+ for i in '$(find ./ -name '\''*.html'\'')'
+ install -Dm644 ./doc/html/functions_0x76.html /usr/src/tmp/tbb-buildroot/usr/share/doc/tbb/./doc/html/functions_0x76.html
+ for i in '$(find ./ -name '\''*.html'\'')'
+ install -Dm644 ./doc/html/functions_0x75.html /usr/src/tmp/tbb-buildroot/usr/share/doc/tbb/./doc/html/functions_0x75.html
+ for i in '$(find ./ -name '\''*.html'\'')'
+ install -Dm644 ./doc/html/functions_0x74.html /usr/src/tmp/tbb-buildroot/usr/share/doc/tbb/./doc/html/functions_0x74.html
+ for i in '$(find ./ -name '\''*.html'\'')'
+ install -Dm644 ./doc/html/functions_0x73.html /usr/src/tmp/tbb-buildroot/usr/share/doc/tbb/./doc/html/functions_0x73.html
+ for i in '$(find ./ -name '\''*.html'\'')'
+ install -Dm644 ./doc/html/functions_0x72.html /usr/src/tmp/tbb-buildroot/usr/share/doc/tbb/./doc/html/functions_0x72.html
+ for i in '$(find ./ -name '\''*.html'\'')'
+ install -Dm644 ./doc/html/functions_0x71.html /usr/src/tmp/tbb-buildroot/usr/share/doc/tbb/./doc/html/functions_0x71.html
+ for i in '$(find ./ -name '\''*.html'\'')'
+ install -Dm644 ./doc/html/functions_0x70.html /usr/src/tmp/tbb-buildroot/usr/share/doc/tbb/./doc/html/functions_0x70.html
+ for i in '$(find ./ -name '\''*.html'\'')'
+ install -Dm644 ./doc/html/functions_0x6f.html /usr/src/tmp/tbb-buildroot/usr/share/doc/tbb/./doc/html/functions_0x6f.html
+ for i in '$(find ./ -name '\''*.html'\'')'
+ install -Dm644 ./doc/html/functions_0x6e.html /usr/src/tmp/tbb-buildroot/usr/share/doc/tbb/./doc/html/functions_0x6e.html
+ for i in '$(find ./ -name '\''*.html'\'')'
+ install -Dm644 ./doc/html/functions_0x6d.html /usr/src/tmp/tbb-buildroot/usr/share/doc/tbb/./doc/html/functions_0x6d.html
+ for i in '$(find ./ -name '\''*.html'\'')'
+ install -Dm644 ./doc/html/functions_0x6c.html /usr/src/tmp/tbb-buildroot/usr/share/doc/tbb/./doc/html/functions_0x6c.html
+ for i in '$(find ./ -name '\''*.html'\'')'
+ install -Dm644 ./doc/html/functions_0x6a.html /usr/src/tmp/tbb-buildroot/usr/share/doc/tbb/./doc/html/functions_0x6a.html
+ for i in '$(find ./ -name '\''*.html'\'')'
+ install -Dm644 ./doc/html/functions_0x69.html /usr/src/tmp/tbb-buildroot/usr/share/doc/tbb/./doc/html/functions_0x69.html
+ for i in '$(find ./ -name '\''*.html'\'')'
+ install -Dm644 ./doc/html/functions_0x68.html /usr/src/tmp/tbb-buildroot/usr/share/doc/tbb/./doc/html/functions_0x68.html
+ for i in '$(find ./ -name '\''*.html'\'')'
+ install -Dm644 ./doc/html/functions_0x67.html /usr/src/tmp/tbb-buildroot/usr/share/doc/tbb/./doc/html/functions_0x67.html
+ for i in '$(find ./ -name '\''*.html'\'')'
+ install -Dm644 ./doc/html/functions_0x66.html /usr/src/tmp/tbb-buildroot/usr/share/doc/tbb/./doc/html/functions_0x66.html
+ for i in '$(find ./ -name '\''*.html'\'')'
+ install -Dm644 ./doc/html/functions_0x65.html /usr/src/tmp/tbb-buildroot/usr/share/doc/tbb/./doc/html/functions_0x65.html
+ for i in '$(find ./ -name '\''*.html'\'')'
+ install -Dm644 ./doc/html/functions_0x64.html /usr/src/tmp/tbb-buildroot/usr/share/doc/tbb/./doc/html/functions_0x64.html
+ for i in '$(find ./ -name '\''*.html'\'')'
+ install -Dm644 ./doc/html/functions_0x63.html /usr/src/tmp/tbb-buildroot/usr/share/doc/tbb/./doc/html/functions_0x63.html
+ for i in '$(find ./ -name '\''*.html'\'')'
+ install -Dm644 ./doc/html/functions_0x62.html /usr/src/tmp/tbb-buildroot/usr/share/doc/tbb/./doc/html/functions_0x62.html
+ for i in '$(find ./ -name '\''*.html'\'')'
+ install -Dm644 ./doc/html/functions.html /usr/src/tmp/tbb-buildroot/usr/share/doc/tbb/./doc/html/functions.html
+ for i in '$(find ./ -name '\''*.html'\'')'
+ install -Dm644 ./doc/html/files.html /usr/src/tmp/tbb-buildroot/usr/share/doc/tbb/./doc/html/files.html
+ for i in '$(find ./ -name '\''*.html'\'')'
+ install -Dm644 ./doc/html/dir_b9976680b2be72d2d0b8fca1c31202a2.html /usr/src/tmp/tbb-buildroot/usr/share/doc/tbb/./doc/html/dir_b9976680b2be72d2d0b8fca1c31202a2.html
+ for i in '$(find ./ -name '\''*.html'\'')'
+ install -Dm644 ./doc/html/dir_87119f26c7695cbc270003e99bc7f49f.html /usr/src/tmp/tbb-buildroot/usr/share/doc/tbb/./doc/html/dir_87119f26c7695cbc270003e99bc7f49f.html
+ for i in '$(find ./ -name '\''*.html'\'')'
+ install -Dm644 ./doc/html/dir_63fb2cc293d133785b96e521fa051167.html /usr/src/tmp/tbb-buildroot/usr/share/doc/tbb/./doc/html/dir_63fb2cc293d133785b96e521fa051167.html
+ for i in '$(find ./ -name '\''*.html'\'')'
+ install -Dm644 ./doc/html/dir_525f2cc589630bacbdc3bb450847427e.html /usr/src/tmp/tbb-buildroot/usr/share/doc/tbb/./doc/html/dir_525f2cc589630bacbdc3bb450847427e.html
+ for i in '$(find ./ -name '\''*.html'\'')'
+ install -Dm644 ./doc/html/classes.html /usr/src/tmp/tbb-buildroot/usr/share/doc/tbb/./doc/html/classes.html
+ for i in '$(find ./ -name '\''*.html'\'')'
+ install -Dm644 ./doc/html/annotated.html /usr/src/tmp/tbb-buildroot/usr/share/doc/tbb/./doc/html/annotated.html
+ for i in '$(find ./ -name '\''*.html'\'')'
+ install -Dm644 ./doc/html/a00413.html /usr/src/tmp/tbb-buildroot/usr/share/doc/tbb/./doc/html/a00413.html
+ for i in '$(find ./ -name '\''*.html'\'')'
+ install -Dm644 ./doc/html/a00412.html /usr/src/tmp/tbb-buildroot/usr/share/doc/tbb/./doc/html/a00412.html
+ for i in '$(find ./ -name '\''*.html'\'')'
+ install -Dm644 ./doc/html/a00411.html /usr/src/tmp/tbb-buildroot/usr/share/doc/tbb/./doc/html/a00411.html
+ for i in '$(find ./ -name '\''*.html'\'')'
+ install -Dm644 ./doc/html/a00410.html /usr/src/tmp/tbb-buildroot/usr/share/doc/tbb/./doc/html/a00410.html
+ for i in '$(find ./ -name '\''*.html'\'')'
+ install -Dm644 ./doc/html/a00409.html /usr/src/tmp/tbb-buildroot/usr/share/doc/tbb/./doc/html/a00409.html
+ for i in '$(find ./ -name '\''*.html'\'')'
+ install -Dm644 ./doc/html/a00408.html /usr/src/tmp/tbb-buildroot/usr/share/doc/tbb/./doc/html/a00408.html
+ for i in '$(find ./ -name '\''*.html'\'')'
+ install -Dm644 ./doc/html/a00407.html /usr/src/tmp/tbb-buildroot/usr/share/doc/tbb/./doc/html/a00407.html
+ for i in '$(find ./ -name '\''*.html'\'')'
+ install -Dm644 ./doc/html/a00406.html /usr/src/tmp/tbb-buildroot/usr/share/doc/tbb/./doc/html/a00406.html
+ for i in '$(find ./ -name '\''*.html'\'')'
+ install -Dm644 ./doc/html/a00405.html /usr/src/tmp/tbb-buildroot/usr/share/doc/tbb/./doc/html/a00405.html
+ for i in '$(find ./ -name '\''*.html'\'')'
+ install -Dm644 ./doc/html/a00404.html /usr/src/tmp/tbb-buildroot/usr/share/doc/tbb/./doc/html/a00404.html
+ for i in '$(find ./ -name '\''*.html'\'')'
+ install -Dm644 ./doc/html/a00403.html /usr/src/tmp/tbb-buildroot/usr/share/doc/tbb/./doc/html/a00403.html
+ for i in '$(find ./ -name '\''*.html'\'')'
+ install -Dm644 ./doc/html/a00402.html /usr/src/tmp/tbb-buildroot/usr/share/doc/tbb/./doc/html/a00402.html
+ for i in '$(find ./ -name '\''*.html'\'')'
+ install -Dm644 ./doc/html/a00401.html /usr/src/tmp/tbb-buildroot/usr/share/doc/tbb/./doc/html/a00401.html
+ for i in '$(find ./ -name '\''*.html'\'')'
+ install -Dm644 ./doc/html/a00400.html /usr/src/tmp/tbb-buildroot/usr/share/doc/tbb/./doc/html/a00400.html
+ for i in '$(find ./ -name '\''*.html'\'')'
+ install -Dm644 ./doc/html/a00399.html /usr/src/tmp/tbb-buildroot/usr/share/doc/tbb/./doc/html/a00399.html
+ for i in '$(find ./ -name '\''*.html'\'')'
+ install -Dm644 ./doc/html/a00398.html /usr/src/tmp/tbb-buildroot/usr/share/doc/tbb/./doc/html/a00398.html
+ for i in '$(find ./ -name '\''*.html'\'')'
+ install -Dm644 ./doc/html/a00397.html /usr/src/tmp/tbb-buildroot/usr/share/doc/tbb/./doc/html/a00397.html
+ for i in '$(find ./ -name '\''*.html'\'')'
+ install -Dm644 ./doc/html/a00396.html /usr/src/tmp/tbb-buildroot/usr/share/doc/tbb/./doc/html/a00396.html
+ for i in '$(find ./ -name '\''*.html'\'')'
+ install -Dm644 ./doc/html/a00395.html /usr/src/tmp/tbb-buildroot/usr/share/doc/tbb/./doc/html/a00395.html
+ for i in '$(find ./ -name '\''*.html'\'')'
+ install -Dm644 ./doc/html/a00394.html /usr/src/tmp/tbb-buildroot/usr/share/doc/tbb/./doc/html/a00394.html
+ for i in '$(find ./ -name '\''*.html'\'')'
+ install -Dm644 ./doc/html/a00393.html /usr/src/tmp/tbb-buildroot/usr/share/doc/tbb/./doc/html/a00393.html
+ for i in '$(find ./ -name '\''*.html'\'')'
+ install -Dm644 ./doc/html/a00392.html /usr/src/tmp/tbb-buildroot/usr/share/doc/tbb/./doc/html/a00392.html
+ for i in '$(find ./ -name '\''*.html'\'')'
+ install -Dm644 ./doc/html/a00391.html /usr/src/tmp/tbb-buildroot/usr/share/doc/tbb/./doc/html/a00391.html
+ for i in '$(find ./ -name '\''*.html'\'')'
+ install -Dm644 ./doc/html/a00390.html /usr/src/tmp/tbb-buildroot/usr/share/doc/tbb/./doc/html/a00390.html
+ for i in '$(find ./ -name '\''*.html'\'')'
+ install -Dm644 ./doc/html/a00389.html /usr/src/tmp/tbb-buildroot/usr/share/doc/tbb/./doc/html/a00389.html
+ for i in '$(find ./ -name '\''*.html'\'')'
+ install -Dm644 ./doc/html/a00388.html /usr/src/tmp/tbb-buildroot/usr/share/doc/tbb/./doc/html/a00388.html
+ for i in '$(find ./ -name '\''*.html'\'')'
+ install -Dm644 ./doc/html/a00387.html /usr/src/tmp/tbb-buildroot/usr/share/doc/tbb/./doc/html/a00387.html
+ for i in '$(find ./ -name '\''*.html'\'')'
+ install -Dm644 ./doc/html/a00386.html /usr/src/tmp/tbb-buildroot/usr/share/doc/tbb/./doc/html/a00386.html
+ for i in '$(find ./ -name '\''*.html'\'')'
+ install -Dm644 ./doc/html/a00385.html /usr/src/tmp/tbb-buildroot/usr/share/doc/tbb/./doc/html/a00385.html
+ for i in '$(find ./ -name '\''*.html'\'')'
+ install -Dm644 ./doc/html/a00384.html /usr/src/tmp/tbb-buildroot/usr/share/doc/tbb/./doc/html/a00384.html
+ for i in '$(find ./ -name '\''*.html'\'')'
+ install -Dm644 ./doc/html/a00383.html /usr/src/tmp/tbb-buildroot/usr/share/doc/tbb/./doc/html/a00383.html
+ for i in '$(find ./ -name '\''*.html'\'')'
+ install -Dm644 ./doc/html/a00382.html /usr/src/tmp/tbb-buildroot/usr/share/doc/tbb/./doc/html/a00382.html
+ for i in '$(find ./ -name '\''*.html'\'')'
+ install -Dm644 ./doc/html/a00381.html /usr/src/tmp/tbb-buildroot/usr/share/doc/tbb/./doc/html/a00381.html
+ for i in '$(find ./ -name '\''*.html'\'')'
+ install -Dm644 ./doc/html/a00380.html /usr/src/tmp/tbb-buildroot/usr/share/doc/tbb/./doc/html/a00380.html
+ for i in '$(find ./ -name '\''*.html'\'')'
+ install -Dm644 ./doc/html/a00379.html /usr/src/tmp/tbb-buildroot/usr/share/doc/tbb/./doc/html/a00379.html
+ for i in '$(find ./ -name '\''*.html'\'')'
+ install -Dm644 ./doc/html/a00378.html /usr/src/tmp/tbb-buildroot/usr/share/doc/tbb/./doc/html/a00378.html
+ for i in '$(find ./ -name '\''*.html'\'')'
+ install -Dm644 ./doc/html/a00377.html /usr/src/tmp/tbb-buildroot/usr/share/doc/tbb/./doc/html/a00377.html
+ for i in '$(find ./ -name '\''*.html'\'')'
+ install -Dm644 ./doc/html/a00376.html /usr/src/tmp/tbb-buildroot/usr/share/doc/tbb/./doc/html/a00376.html
+ for i in '$(find ./ -name '\''*.html'\'')'
+ install -Dm644 ./doc/html/a00375.html /usr/src/tmp/tbb-buildroot/usr/share/doc/tbb/./doc/html/a00375.html
+ for i in '$(find ./ -name '\''*.html'\'')'
+ install -Dm644 ./doc/html/a00374.html /usr/src/tmp/tbb-buildroot/usr/share/doc/tbb/./doc/html/a00374.html
+ for i in '$(find ./ -name '\''*.html'\'')'
+ install -Dm644 ./doc/html/a00373.html /usr/src/tmp/tbb-buildroot/usr/share/doc/tbb/./doc/html/a00373.html
+ for i in '$(find ./ -name '\''*.html'\'')'
+ install -Dm644 ./doc/html/a00372.html /usr/src/tmp/tbb-buildroot/usr/share/doc/tbb/./doc/html/a00372.html
+ for i in '$(find ./ -name '\''*.html'\'')'
+ install -Dm644 ./doc/html/a00371.html /usr/src/tmp/tbb-buildroot/usr/share/doc/tbb/./doc/html/a00371.html
+ for i in '$(find ./ -name '\''*.html'\'')'
+ install -Dm644 ./doc/html/a00370.html /usr/src/tmp/tbb-buildroot/usr/share/doc/tbb/./doc/html/a00370.html
+ for i in '$(find ./ -name '\''*.html'\'')'
+ install -Dm644 ./doc/html/a00369.html /usr/src/tmp/tbb-buildroot/usr/share/doc/tbb/./doc/html/a00369.html
+ for i in '$(find ./ -name '\''*.html'\'')'
+ install -Dm644 ./doc/html/a00368.html /usr/src/tmp/tbb-buildroot/usr/share/doc/tbb/./doc/html/a00368.html
+ for i in '$(find ./ -name '\''*.html'\'')'
+ install -Dm644 ./doc/html/a00367.html /usr/src/tmp/tbb-buildroot/usr/share/doc/tbb/./doc/html/a00367.html
+ for i in '$(find ./ -name '\''*.html'\'')'
+ install -Dm644 ./doc/html/a00366.html /usr/src/tmp/tbb-buildroot/usr/share/doc/tbb/./doc/html/a00366.html
+ for i in '$(find ./ -name '\''*.html'\'')'
+ install -Dm644 ./doc/html/a00365.html /usr/src/tmp/tbb-buildroot/usr/share/doc/tbb/./doc/html/a00365.html
+ for i in '$(find ./ -name '\''*.html'\'')'
+ install -Dm644 ./doc/html/a00364.html /usr/src/tmp/tbb-buildroot/usr/share/doc/tbb/./doc/html/a00364.html
+ for i in '$(find ./ -name '\''*.html'\'')'
+ install -Dm644 ./doc/html/a00363.html /usr/src/tmp/tbb-buildroot/usr/share/doc/tbb/./doc/html/a00363.html
+ for i in '$(find ./ -name '\''*.html'\'')'
+ install -Dm644 ./doc/html/a00362.html /usr/src/tmp/tbb-buildroot/usr/share/doc/tbb/./doc/html/a00362.html
+ for i in '$(find ./ -name '\''*.html'\'')'
+ install -Dm644 ./doc/html/a00361.html /usr/src/tmp/tbb-buildroot/usr/share/doc/tbb/./doc/html/a00361.html
+ for i in '$(find ./ -name '\''*.html'\'')'
+ install -Dm644 ./doc/html/a00360.html /usr/src/tmp/tbb-buildroot/usr/share/doc/tbb/./doc/html/a00360.html
+ for i in '$(find ./ -name '\''*.html'\'')'
+ install -Dm644 ./doc/html/a00359.html /usr/src/tmp/tbb-buildroot/usr/share/doc/tbb/./doc/html/a00359.html
+ for i in '$(find ./ -name '\''*.html'\'')'
+ install -Dm644 ./doc/html/a00358.html /usr/src/tmp/tbb-buildroot/usr/share/doc/tbb/./doc/html/a00358.html
+ for i in '$(find ./ -name '\''*.html'\'')'
+ install -Dm644 ./doc/html/a00357.html /usr/src/tmp/tbb-buildroot/usr/share/doc/tbb/./doc/html/a00357.html
+ for i in '$(find ./ -name '\''*.html'\'')'
+ install -Dm644 ./doc/html/a00356.html /usr/src/tmp/tbb-buildroot/usr/share/doc/tbb/./doc/html/a00356.html
+ for i in '$(find ./ -name '\''*.html'\'')'
+ install -Dm644 ./doc/html/a00355.html /usr/src/tmp/tbb-buildroot/usr/share/doc/tbb/./doc/html/a00355.html
+ for i in '$(find ./ -name '\''*.html'\'')'
+ install -Dm644 ./doc/html/a00354.html /usr/src/tmp/tbb-buildroot/usr/share/doc/tbb/./doc/html/a00354.html
+ for i in '$(find ./ -name '\''*.html'\'')'
+ install -Dm644 ./doc/html/a00353.html /usr/src/tmp/tbb-buildroot/usr/share/doc/tbb/./doc/html/a00353.html
+ for i in '$(find ./ -name '\''*.html'\'')'
+ install -Dm644 ./doc/html/a00352.html /usr/src/tmp/tbb-buildroot/usr/share/doc/tbb/./doc/html/a00352.html
+ for i in '$(find ./ -name '\''*.html'\'')'
+ install -Dm644 ./doc/html/a00351.html /usr/src/tmp/tbb-buildroot/usr/share/doc/tbb/./doc/html/a00351.html
+ for i in '$(find ./ -name '\''*.html'\'')'
+ install -Dm644 ./doc/html/a00350.html /usr/src/tmp/tbb-buildroot/usr/share/doc/tbb/./doc/html/a00350.html
+ for i in '$(find ./ -name '\''*.html'\'')'
+ install -Dm644 ./doc/html/a00349.html /usr/src/tmp/tbb-buildroot/usr/share/doc/tbb/./doc/html/a00349.html
+ for i in '$(find ./ -name '\''*.html'\'')'
+ install -Dm644 ./doc/html/a00348.html /usr/src/tmp/tbb-buildroot/usr/share/doc/tbb/./doc/html/a00348.html
+ for i in '$(find ./ -name '\''*.html'\'')'
+ install -Dm644 ./doc/html/a00347.html /usr/src/tmp/tbb-buildroot/usr/share/doc/tbb/./doc/html/a00347.html
+ for i in '$(find ./ -name '\''*.html'\'')'
+ install -Dm644 ./doc/html/a00346.html /usr/src/tmp/tbb-buildroot/usr/share/doc/tbb/./doc/html/a00346.html
+ for i in '$(find ./ -name '\''*.html'\'')'
+ install -Dm644 ./doc/html/a00345.html /usr/src/tmp/tbb-buildroot/usr/share/doc/tbb/./doc/html/a00345.html
+ for i in '$(find ./ -name '\''*.html'\'')'
+ install -Dm644 ./doc/html/a00344.html /usr/src/tmp/tbb-buildroot/usr/share/doc/tbb/./doc/html/a00344.html
+ for i in '$(find ./ -name '\''*.html'\'')'
+ install -Dm644 ./doc/html/a00343.html /usr/src/tmp/tbb-buildroot/usr/share/doc/tbb/./doc/html/a00343.html
+ for i in '$(find ./ -name '\''*.html'\'')'
+ install -Dm644 ./doc/html/a00342.html /usr/src/tmp/tbb-buildroot/usr/share/doc/tbb/./doc/html/a00342.html
+ for i in '$(find ./ -name '\''*.html'\'')'
+ install -Dm644 ./doc/html/a00341.html /usr/src/tmp/tbb-buildroot/usr/share/doc/tbb/./doc/html/a00341.html
+ for i in '$(find ./ -name '\''*.html'\'')'
+ install -Dm644 ./doc/html/a00340.html /usr/src/tmp/tbb-buildroot/usr/share/doc/tbb/./doc/html/a00340.html
+ for i in '$(find ./ -name '\''*.html'\'')'
+ install -Dm644 ./doc/html/a00339.html /usr/src/tmp/tbb-buildroot/usr/share/doc/tbb/./doc/html/a00339.html
+ for i in '$(find ./ -name '\''*.html'\'')'
+ install -Dm644 ./doc/html/a00338.html /usr/src/tmp/tbb-buildroot/usr/share/doc/tbb/./doc/html/a00338.html
+ for i in '$(find ./ -name '\''*.html'\'')'
+ install -Dm644 ./doc/html/a00337.html /usr/src/tmp/tbb-buildroot/usr/share/doc/tbb/./doc/html/a00337.html
+ for i in '$(find ./ -name '\''*.html'\'')'
+ install -Dm644 ./doc/html/a00336.html /usr/src/tmp/tbb-buildroot/usr/share/doc/tbb/./doc/html/a00336.html
+ for i in '$(find ./ -name '\''*.html'\'')'
+ install -Dm644 ./doc/html/a00335.html /usr/src/tmp/tbb-buildroot/usr/share/doc/tbb/./doc/html/a00335.html
+ for i in '$(find ./ -name '\''*.html'\'')'
+ install -Dm644 ./doc/html/a00334.html /usr/src/tmp/tbb-buildroot/usr/share/doc/tbb/./doc/html/a00334.html
+ for i in '$(find ./ -name '\''*.html'\'')'
+ install -Dm644 ./doc/html/a00333.html /usr/src/tmp/tbb-buildroot/usr/share/doc/tbb/./doc/html/a00333.html
+ for i in '$(find ./ -name '\''*.html'\'')'
+ install -Dm644 ./doc/html/a00332.html /usr/src/tmp/tbb-buildroot/usr/share/doc/tbb/./doc/html/a00332.html
+ for i in '$(find ./ -name '\''*.html'\'')'
+ install -Dm644 ./doc/html/a00331.html /usr/src/tmp/tbb-buildroot/usr/share/doc/tbb/./doc/html/a00331.html
+ for i in '$(find ./ -name '\''*.html'\'')'
+ install -Dm644 ./doc/html/a00330.html /usr/src/tmp/tbb-buildroot/usr/share/doc/tbb/./doc/html/a00330.html
+ for i in '$(find ./ -name '\''*.html'\'')'
+ install -Dm644 ./doc/html/a00329.html /usr/src/tmp/tbb-buildroot/usr/share/doc/tbb/./doc/html/a00329.html
+ for i in '$(find ./ -name '\''*.html'\'')'
+ install -Dm644 ./doc/html/a00328.html /usr/src/tmp/tbb-buildroot/usr/share/doc/tbb/./doc/html/a00328.html
+ for i in '$(find ./ -name '\''*.html'\'')'
+ install -Dm644 ./doc/html/a00327.html /usr/src/tmp/tbb-buildroot/usr/share/doc/tbb/./doc/html/a00327.html
+ for i in '$(find ./ -name '\''*.html'\'')'
+ install -Dm644 ./doc/html/a00326.html /usr/src/tmp/tbb-buildroot/usr/share/doc/tbb/./doc/html/a00326.html
+ for i in '$(find ./ -name '\''*.html'\'')'
+ install -Dm644 ./doc/html/a00325.html /usr/src/tmp/tbb-buildroot/usr/share/doc/tbb/./doc/html/a00325.html
+ for i in '$(find ./ -name '\''*.html'\'')'
+ install -Dm644 ./doc/html/a00324.html /usr/src/tmp/tbb-buildroot/usr/share/doc/tbb/./doc/html/a00324.html
+ for i in '$(find ./ -name '\''*.html'\'')'
+ install -Dm644 ./doc/html/a00323.html /usr/src/tmp/tbb-buildroot/usr/share/doc/tbb/./doc/html/a00323.html
+ for i in '$(find ./ -name '\''*.html'\'')'
+ install -Dm644 ./doc/html/a00322.html /usr/src/tmp/tbb-buildroot/usr/share/doc/tbb/./doc/html/a00322.html
+ for i in '$(find ./ -name '\''*.html'\'')'
+ install -Dm644 ./doc/html/a00321.html /usr/src/tmp/tbb-buildroot/usr/share/doc/tbb/./doc/html/a00321.html
+ for i in '$(find ./ -name '\''*.html'\'')'
+ install -Dm644 ./doc/html/a00320.html /usr/src/tmp/tbb-buildroot/usr/share/doc/tbb/./doc/html/a00320.html
+ for i in '$(find ./ -name '\''*.html'\'')'
+ install -Dm644 ./doc/html/a00319.html /usr/src/tmp/tbb-buildroot/usr/share/doc/tbb/./doc/html/a00319.html
+ for i in '$(find ./ -name '\''*.html'\'')'
+ install -Dm644 ./doc/html/a00318.html /usr/src/tmp/tbb-buildroot/usr/share/doc/tbb/./doc/html/a00318.html
+ for i in '$(find ./ -name '\''*.html'\'')'
+ install -Dm644 ./doc/html/a00317.html /usr/src/tmp/tbb-buildroot/usr/share/doc/tbb/./doc/html/a00317.html
+ for i in '$(find ./ -name '\''*.html'\'')'
+ install -Dm644 ./doc/html/a00316.html /usr/src/tmp/tbb-buildroot/usr/share/doc/tbb/./doc/html/a00316.html
+ for i in '$(find ./ -name '\''*.html'\'')'
+ install -Dm644 ./doc/html/a00315.html /usr/src/tmp/tbb-buildroot/usr/share/doc/tbb/./doc/html/a00315.html
+ for i in '$(find ./ -name '\''*.html'\'')'
+ install -Dm644 ./doc/html/a00314.html /usr/src/tmp/tbb-buildroot/usr/share/doc/tbb/./doc/html/a00314.html
+ for i in '$(find ./ -name '\''*.html'\'')'
+ install -Dm644 ./doc/html/a00313.html /usr/src/tmp/tbb-buildroot/usr/share/doc/tbb/./doc/html/a00313.html
+ for i in '$(find ./ -name '\''*.html'\'')'
+ install -Dm644 ./doc/html/a00312.html /usr/src/tmp/tbb-buildroot/usr/share/doc/tbb/./doc/html/a00312.html
+ for i in '$(find ./ -name '\''*.html'\'')'
+ install -Dm644 ./doc/html/a00311.html /usr/src/tmp/tbb-buildroot/usr/share/doc/tbb/./doc/html/a00311.html
+ for i in '$(find ./ -name '\''*.html'\'')'
+ install -Dm644 ./doc/html/a00310.html /usr/src/tmp/tbb-buildroot/usr/share/doc/tbb/./doc/html/a00310.html
+ for i in '$(find ./ -name '\''*.html'\'')'
+ install -Dm644 ./doc/html/a00309.html /usr/src/tmp/tbb-buildroot/usr/share/doc/tbb/./doc/html/a00309.html
+ for i in '$(find ./ -name '\''*.html'\'')'
+ install -Dm644 ./doc/html/a00308.html /usr/src/tmp/tbb-buildroot/usr/share/doc/tbb/./doc/html/a00308.html
+ for i in '$(find ./ -name '\''*.html'\'')'
+ install -Dm644 ./doc/html/a00307.html /usr/src/tmp/tbb-buildroot/usr/share/doc/tbb/./doc/html/a00307.html
+ for i in '$(find ./ -name '\''*.html'\'')'
+ install -Dm644 ./doc/html/a00306.html /usr/src/tmp/tbb-buildroot/usr/share/doc/tbb/./doc/html/a00306.html
+ for i in '$(find ./ -name '\''*.html'\'')'
+ install -Dm644 ./doc/html/a00305.html /usr/src/tmp/tbb-buildroot/usr/share/doc/tbb/./doc/html/a00305.html
+ for i in '$(find ./ -name '\''*.html'\'')'
+ install -Dm644 ./doc/html/a00304.html /usr/src/tmp/tbb-buildroot/usr/share/doc/tbb/./doc/html/a00304.html
+ for i in '$(find ./ -name '\''*.html'\'')'
+ install -Dm644 ./doc/html/a00303.html /usr/src/tmp/tbb-buildroot/usr/share/doc/tbb/./doc/html/a00303.html
+ for i in '$(find ./ -name '\''*.html'\'')'
+ install -Dm644 ./doc/html/a00302.html /usr/src/tmp/tbb-buildroot/usr/share/doc/tbb/./doc/html/a00302.html
+ for i in '$(find ./ -name '\''*.html'\'')'
+ install -Dm644 ./doc/html/a00301.html /usr/src/tmp/tbb-buildroot/usr/share/doc/tbb/./doc/html/a00301.html
+ for i in '$(find ./ -name '\''*.html'\'')'
+ install -Dm644 ./doc/html/a00300.html /usr/src/tmp/tbb-buildroot/usr/share/doc/tbb/./doc/html/a00300.html
+ for i in '$(find ./ -name '\''*.html'\'')'
+ install -Dm644 ./doc/html/a00299.html /usr/src/tmp/tbb-buildroot/usr/share/doc/tbb/./doc/html/a00299.html
+ for i in '$(find ./ -name '\''*.html'\'')'
+ install -Dm644 ./doc/html/a00298.html /usr/src/tmp/tbb-buildroot/usr/share/doc/tbb/./doc/html/a00298.html
+ for i in '$(find ./ -name '\''*.html'\'')'
+ install -Dm644 ./doc/html/a00297.html /usr/src/tmp/tbb-buildroot/usr/share/doc/tbb/./doc/html/a00297.html
+ for i in '$(find ./ -name '\''*.html'\'')'
+ install -Dm644 ./doc/html/a00296.html /usr/src/tmp/tbb-buildroot/usr/share/doc/tbb/./doc/html/a00296.html
+ for i in '$(find ./ -name '\''*.html'\'')'
+ install -Dm644 ./doc/html/a00295.html /usr/src/tmp/tbb-buildroot/usr/share/doc/tbb/./doc/html/a00295.html
+ for i in '$(find ./ -name '\''*.html'\'')'
+ install -Dm644 ./doc/html/a00294.html /usr/src/tmp/tbb-buildroot/usr/share/doc/tbb/./doc/html/a00294.html
+ for i in '$(find ./ -name '\''*.html'\'')'
+ install -Dm644 ./doc/html/a00293.html /usr/src/tmp/tbb-buildroot/usr/share/doc/tbb/./doc/html/a00293.html
+ for i in '$(find ./ -name '\''*.html'\'')'
+ install -Dm644 ./doc/html/a00292.html /usr/src/tmp/tbb-buildroot/usr/share/doc/tbb/./doc/html/a00292.html
+ for i in '$(find ./ -name '\''*.html'\'')'
+ install -Dm644 ./doc/html/a00291.html /usr/src/tmp/tbb-buildroot/usr/share/doc/tbb/./doc/html/a00291.html
+ for i in '$(find ./ -name '\''*.html'\'')'
+ install -Dm644 ./doc/html/a00290.html /usr/src/tmp/tbb-buildroot/usr/share/doc/tbb/./doc/html/a00290.html
+ for i in '$(find ./ -name '\''*.html'\'')'
+ install -Dm644 ./doc/html/a00289.html /usr/src/tmp/tbb-buildroot/usr/share/doc/tbb/./doc/html/a00289.html
+ for i in '$(find ./ -name '\''*.html'\'')'
+ install -Dm644 ./doc/html/a00288.html /usr/src/tmp/tbb-buildroot/usr/share/doc/tbb/./doc/html/a00288.html
+ for i in '$(find ./ -name '\''*.html'\'')'
+ install -Dm644 ./doc/html/a00287.html /usr/src/tmp/tbb-buildroot/usr/share/doc/tbb/./doc/html/a00287.html
+ for i in '$(find ./ -name '\''*.html'\'')'
+ install -Dm644 ./doc/html/a00286.html /usr/src/tmp/tbb-buildroot/usr/share/doc/tbb/./doc/html/a00286.html
+ for i in '$(find ./ -name '\''*.html'\'')'
+ install -Dm644 ./doc/html/a00285.html /usr/src/tmp/tbb-buildroot/usr/share/doc/tbb/./doc/html/a00285.html
+ for i in '$(find ./ -name '\''*.html'\'')'
+ install -Dm644 ./doc/html/a00284.html /usr/src/tmp/tbb-buildroot/usr/share/doc/tbb/./doc/html/a00284.html
+ for i in '$(find ./ -name '\''*.html'\'')'
+ install -Dm644 ./doc/html/a00283.html /usr/src/tmp/tbb-buildroot/usr/share/doc/tbb/./doc/html/a00283.html
+ for i in '$(find ./ -name '\''*.html'\'')'
+ install -Dm644 ./doc/html/a00282.html /usr/src/tmp/tbb-buildroot/usr/share/doc/tbb/./doc/html/a00282.html
+ for i in '$(find ./ -name '\''*.html'\'')'
+ install -Dm644 ./doc/html/a00281.html /usr/src/tmp/tbb-buildroot/usr/share/doc/tbb/./doc/html/a00281.html
+ for i in '$(find ./ -name '\''*.html'\'')'
+ install -Dm644 ./doc/html/a00280.html /usr/src/tmp/tbb-buildroot/usr/share/doc/tbb/./doc/html/a00280.html
+ for i in '$(find ./ -name '\''*.html'\'')'
+ install -Dm644 ./doc/html/a00279.html /usr/src/tmp/tbb-buildroot/usr/share/doc/tbb/./doc/html/a00279.html
+ for i in '$(find ./ -name '\''*.html'\'')'
+ install -Dm644 ./doc/html/a00278.html /usr/src/tmp/tbb-buildroot/usr/share/doc/tbb/./doc/html/a00278.html
+ for i in '$(find ./ -name '\''*.html'\'')'
+ install -Dm644 ./doc/html/a00277.html /usr/src/tmp/tbb-buildroot/usr/share/doc/tbb/./doc/html/a00277.html
+ for i in '$(find ./ -name '\''*.html'\'')'
+ install -Dm644 ./doc/html/a00276.html /usr/src/tmp/tbb-buildroot/usr/share/doc/tbb/./doc/html/a00276.html
+ for i in '$(find ./ -name '\''*.html'\'')'
+ install -Dm644 ./doc/html/a00275.html /usr/src/tmp/tbb-buildroot/usr/share/doc/tbb/./doc/html/a00275.html
+ for i in '$(find ./ -name '\''*.html'\'')'
+ install -Dm644 ./doc/html/a00274.html /usr/src/tmp/tbb-buildroot/usr/share/doc/tbb/./doc/html/a00274.html
+ for i in '$(find ./ -name '\''*.html'\'')'
+ install -Dm644 ./doc/html/a00273.html /usr/src/tmp/tbb-buildroot/usr/share/doc/tbb/./doc/html/a00273.html
+ for i in '$(find ./ -name '\''*.html'\'')'
+ install -Dm644 ./doc/html/a00272.html /usr/src/tmp/tbb-buildroot/usr/share/doc/tbb/./doc/html/a00272.html
+ for i in '$(find ./ -name '\''*.html'\'')'
+ install -Dm644 ./doc/html/a00271.html /usr/src/tmp/tbb-buildroot/usr/share/doc/tbb/./doc/html/a00271.html
+ for i in '$(find ./ -name '\''*.html'\'')'
+ install -Dm644 ./doc/html/a00270.html /usr/src/tmp/tbb-buildroot/usr/share/doc/tbb/./doc/html/a00270.html
+ for i in '$(find ./ -name '\''*.html'\'')'
+ install -Dm644 ./doc/html/a00269.html /usr/src/tmp/tbb-buildroot/usr/share/doc/tbb/./doc/html/a00269.html
+ for i in '$(find ./ -name '\''*.html'\'')'
+ install -Dm644 ./doc/html/a00268.html /usr/src/tmp/tbb-buildroot/usr/share/doc/tbb/./doc/html/a00268.html
+ for i in '$(find ./ -name '\''*.html'\'')'
+ install -Dm644 ./doc/html/a00267.html /usr/src/tmp/tbb-buildroot/usr/share/doc/tbb/./doc/html/a00267.html
+ for i in '$(find ./ -name '\''*.html'\'')'
+ install -Dm644 ./doc/html/a00266.html /usr/src/tmp/tbb-buildroot/usr/share/doc/tbb/./doc/html/a00266.html
+ for i in '$(find ./ -name '\''*.html'\'')'
+ install -Dm644 ./doc/html/a00265.html /usr/src/tmp/tbb-buildroot/usr/share/doc/tbb/./doc/html/a00265.html
+ for i in '$(find ./ -name '\''*.html'\'')'
+ install -Dm644 ./doc/html/a00264.html /usr/src/tmp/tbb-buildroot/usr/share/doc/tbb/./doc/html/a00264.html
+ for i in '$(find ./ -name '\''*.html'\'')'
+ install -Dm644 ./doc/html/a00262.html /usr/src/tmp/tbb-buildroot/usr/share/doc/tbb/./doc/html/a00262.html
+ for i in '$(find ./ -name '\''*.html'\'')'
+ install -Dm644 ./doc/html/a00261.html /usr/src/tmp/tbb-buildroot/usr/share/doc/tbb/./doc/html/a00261.html
+ for i in '$(find ./ -name '\''*.html'\'')'
+ install -Dm644 ./doc/html/a00260.html /usr/src/tmp/tbb-buildroot/usr/share/doc/tbb/./doc/html/a00260.html
+ for i in '$(find ./ -name '\''*.html'\'')'
+ install -Dm644 ./doc/html/a00259.html /usr/src/tmp/tbb-buildroot/usr/share/doc/tbb/./doc/html/a00259.html
+ for i in '$(find ./ -name '\''*.html'\'')'
+ install -Dm644 ./doc/html/a00258.html /usr/src/tmp/tbb-buildroot/usr/share/doc/tbb/./doc/html/a00258.html
+ for i in '$(find ./ -name '\''*.html'\'')'
+ install -Dm644 ./doc/html/a00257.html /usr/src/tmp/tbb-buildroot/usr/share/doc/tbb/./doc/html/a00257.html
+ for i in '$(find ./ -name '\''*.html'\'')'
+ install -Dm644 ./doc/html/a00237.html /usr/src/tmp/tbb-buildroot/usr/share/doc/tbb/./doc/html/a00237.html
+ for i in '$(find ./ -name '\''*.html'\'')'
+ install -Dm644 ./doc/html/a00234.html /usr/src/tmp/tbb-buildroot/usr/share/doc/tbb/./doc/html/a00234.html
+ for i in '$(find ./ -name '\''*.html'\'')'
+ install -Dm644 ./doc/html/a00215.html /usr/src/tmp/tbb-buildroot/usr/share/doc/tbb/./doc/html/a00215.html
+ for i in '$(find ./ -name '\''*.html'\'')'
+ install -Dm644 ./doc/html/a00196.html /usr/src/tmp/tbb-buildroot/usr/share/doc/tbb/./doc/html/a00196.html
+ for i in '$(find ./ -name '\''*.html'\'')'
+ install -Dm644 ./doc/html/a00191.html /usr/src/tmp/tbb-buildroot/usr/share/doc/tbb/./doc/html/a00191.html
+ for i in '$(find ./ -name '\''*.html'\'')'
+ install -Dm644 ./doc/html/a00173.html /usr/src/tmp/tbb-buildroot/usr/share/doc/tbb/./doc/html/a00173.html
+ for i in '$(find ./ -name '\''*.html'\'')'
+ install -Dm644 ./doc/html/a00172.html /usr/src/tmp/tbb-buildroot/usr/share/doc/tbb/./doc/html/a00172.html
+ for i in '$(find ./ -name '\''*.html'\'')'
+ install -Dm644 ./doc/html/a00171.html /usr/src/tmp/tbb-buildroot/usr/share/doc/tbb/./doc/html/a00171.html
+ for i in '$(find ./ -name '\''*.html'\'')'
+ install -Dm644 ./doc/html/a00170.html /usr/src/tmp/tbb-buildroot/usr/share/doc/tbb/./doc/html/a00170.html
+ for i in '$(find ./ -name '\''*.html'\'')'
+ install -Dm644 ./doc/html/a00169.html /usr/src/tmp/tbb-buildroot/usr/share/doc/tbb/./doc/html/a00169.html
+ for i in '$(find ./ -name '\''*.html'\'')'
+ install -Dm644 ./doc/html/a00168.html /usr/src/tmp/tbb-buildroot/usr/share/doc/tbb/./doc/html/a00168.html
+ for i in '$(find ./ -name '\''*.html'\'')'
+ install -Dm644 ./doc/html/a00167.html /usr/src/tmp/tbb-buildroot/usr/share/doc/tbb/./doc/html/a00167.html
+ for i in '$(find ./ -name '\''*.html'\'')'
+ install -Dm644 ./doc/html/a00166.html /usr/src/tmp/tbb-buildroot/usr/share/doc/tbb/./doc/html/a00166.html
+ for i in '$(find ./ -name '\''*.html'\'')'
+ install -Dm644 ./doc/html/a00165.html /usr/src/tmp/tbb-buildroot/usr/share/doc/tbb/./doc/html/a00165.html
+ for i in '$(find ./ -name '\''*.html'\'')'
+ install -Dm644 ./doc/html/a00164.html /usr/src/tmp/tbb-buildroot/usr/share/doc/tbb/./doc/html/a00164.html
+ for i in '$(find ./ -name '\''*.html'\'')'
+ install -Dm644 ./doc/html/a00163.html /usr/src/tmp/tbb-buildroot/usr/share/doc/tbb/./doc/html/a00163.html
+ for i in '$(find ./ -name '\''*.html'\'')'
+ install -Dm644 ./doc/html/a00162.html /usr/src/tmp/tbb-buildroot/usr/share/doc/tbb/./doc/html/a00162.html
+ for i in '$(find ./ -name '\''*.html'\'')'
+ install -Dm644 ./doc/html/a00161.html /usr/src/tmp/tbb-buildroot/usr/share/doc/tbb/./doc/html/a00161.html
+ for i in '$(find ./ -name '\''*.html'\'')'
+ install -Dm644 ./doc/html/a00160.html /usr/src/tmp/tbb-buildroot/usr/share/doc/tbb/./doc/html/a00160.html
+ for i in '$(find ./ -name '\''*.html'\'')'
+ install -Dm644 ./doc/html/a00159.html /usr/src/tmp/tbb-buildroot/usr/share/doc/tbb/./doc/html/a00159.html
+ for i in '$(find ./ -name '\''*.html'\'')'
+ install -Dm644 ./doc/html/a00158.html /usr/src/tmp/tbb-buildroot/usr/share/doc/tbb/./doc/html/a00158.html
+ for i in '$(find ./ -name '\''*.html'\'')'
+ install -Dm644 ./doc/html/a00157.html /usr/src/tmp/tbb-buildroot/usr/share/doc/tbb/./doc/html/a00157.html
+ for i in '$(find ./ -name '\''*.html'\'')'
+ install -Dm644 ./doc/html/a00156.html /usr/src/tmp/tbb-buildroot/usr/share/doc/tbb/./doc/html/a00156.html
+ for i in '$(find ./ -name '\''*.html'\'')'
+ install -Dm644 ./doc/html/a00155.html /usr/src/tmp/tbb-buildroot/usr/share/doc/tbb/./doc/html/a00155.html
+ for i in '$(find ./ -name '\''*.html'\'')'
+ install -Dm644 ./doc/html/a00154.html /usr/src/tmp/tbb-buildroot/usr/share/doc/tbb/./doc/html/a00154.html
+ for i in '$(find ./ -name '\''*.html'\'')'
+ install -Dm644 ./doc/html/a00153.html /usr/src/tmp/tbb-buildroot/usr/share/doc/tbb/./doc/html/a00153.html
+ for i in '$(find ./ -name '\''*.html'\'')'
+ install -Dm644 ./doc/html/a00152.html /usr/src/tmp/tbb-buildroot/usr/share/doc/tbb/./doc/html/a00152.html
+ for i in '$(find ./ -name '\''*.html'\'')'
+ install -Dm644 ./doc/html/a00151.html /usr/src/tmp/tbb-buildroot/usr/share/doc/tbb/./doc/html/a00151.html
+ for i in '$(find ./ -name '\''*.html'\'')'
+ install -Dm644 ./doc/html/a00150.html /usr/src/tmp/tbb-buildroot/usr/share/doc/tbb/./doc/html/a00150.html
+ for i in '$(find ./ -name '\''*.html'\'')'
+ install -Dm644 ./doc/html/a00149.html /usr/src/tmp/tbb-buildroot/usr/share/doc/tbb/./doc/html/a00149.html
+ for i in '$(find ./ -name '\''*.html'\'')'
+ install -Dm644 ./doc/html/a00148.html /usr/src/tmp/tbb-buildroot/usr/share/doc/tbb/./doc/html/a00148.html
+ for i in '$(find ./ -name '\''*.html'\'')'
+ install -Dm644 ./doc/html/a00147.html /usr/src/tmp/tbb-buildroot/usr/share/doc/tbb/./doc/html/a00147.html
+ for i in '$(find ./ -name '\''*.html'\'')'
+ install -Dm644 ./doc/html/a00146.html /usr/src/tmp/tbb-buildroot/usr/share/doc/tbb/./doc/html/a00146.html
+ for i in '$(find ./ -name '\''*.html'\'')'
+ install -Dm644 ./doc/html/a00145.html /usr/src/tmp/tbb-buildroot/usr/share/doc/tbb/./doc/html/a00145.html
+ for i in '$(find ./ -name '\''*.html'\'')'
+ install -Dm644 ./doc/html/a00144.html /usr/src/tmp/tbb-buildroot/usr/share/doc/tbb/./doc/html/a00144.html
+ for i in '$(find ./ -name '\''*.html'\'')'
+ install -Dm644 ./doc/html/a00143.html /usr/src/tmp/tbb-buildroot/usr/share/doc/tbb/./doc/html/a00143.html
+ for i in '$(find ./ -name '\''*.html'\'')'
+ install -Dm644 ./doc/html/a00142.html /usr/src/tmp/tbb-buildroot/usr/share/doc/tbb/./doc/html/a00142.html
+ for i in '$(find ./ -name '\''*.html'\'')'
+ install -Dm644 ./doc/html/a00141.html /usr/src/tmp/tbb-buildroot/usr/share/doc/tbb/./doc/html/a00141.html
+ for i in '$(find ./ -name '\''*.html'\'')'
+ install -Dm644 ./doc/html/a00140.html /usr/src/tmp/tbb-buildroot/usr/share/doc/tbb/./doc/html/a00140.html
+ for i in '$(find ./ -name '\''*.html'\'')'
+ install -Dm644 ./doc/html/a00139.html /usr/src/tmp/tbb-buildroot/usr/share/doc/tbb/./doc/html/a00139.html
+ for i in '$(find ./ -name '\''*.html'\'')'
+ install -Dm644 ./doc/html/a00138.html /usr/src/tmp/tbb-buildroot/usr/share/doc/tbb/./doc/html/a00138.html
+ for i in '$(find ./ -name '\''*.html'\'')'
+ install -Dm644 ./doc/html/a00137.html /usr/src/tmp/tbb-buildroot/usr/share/doc/tbb/./doc/html/a00137.html
+ for i in '$(find ./ -name '\''*.html'\'')'
+ install -Dm644 ./doc/html/a00136.html /usr/src/tmp/tbb-buildroot/usr/share/doc/tbb/./doc/html/a00136.html
+ for i in '$(find ./ -name '\''*.html'\'')'
+ install -Dm644 ./doc/html/a00135.html /usr/src/tmp/tbb-buildroot/usr/share/doc/tbb/./doc/html/a00135.html
+ for i in '$(find ./ -name '\''*.html'\'')'
+ install -Dm644 ./doc/html/a00134.html /usr/src/tmp/tbb-buildroot/usr/share/doc/tbb/./doc/html/a00134.html
+ for i in '$(find ./ -name '\''*.html'\'')'
+ install -Dm644 ./doc/html/a00133.html /usr/src/tmp/tbb-buildroot/usr/share/doc/tbb/./doc/html/a00133.html
+ for i in '$(find ./ -name '\''*.html'\'')'
+ install -Dm644 ./doc/html/a00132.html /usr/src/tmp/tbb-buildroot/usr/share/doc/tbb/./doc/html/a00132.html
+ for i in '$(find ./ -name '\''*.html'\'')'
+ install -Dm644 ./doc/html/a00131.html /usr/src/tmp/tbb-buildroot/usr/share/doc/tbb/./doc/html/a00131.html
+ for i in '$(find ./ -name '\''*.html'\'')'
+ install -Dm644 ./doc/html/a00130.html /usr/src/tmp/tbb-buildroot/usr/share/doc/tbb/./doc/html/a00130.html
+ for i in '$(find ./ -name '\''*.html'\'')'
+ install -Dm644 ./doc/html/a00129.html /usr/src/tmp/tbb-buildroot/usr/share/doc/tbb/./doc/html/a00129.html
+ for i in '$(find ./ -name '\''*.html'\'')'
+ install -Dm644 ./doc/html/a00128.html /usr/src/tmp/tbb-buildroot/usr/share/doc/tbb/./doc/html/a00128.html
+ for i in '$(find ./ -name '\''*.html'\'')'
+ install -Dm644 ./doc/html/a00127.html /usr/src/tmp/tbb-buildroot/usr/share/doc/tbb/./doc/html/a00127.html
+ for i in '$(find ./ -name '\''*.html'\'')'
+ install -Dm644 ./doc/html/a00126.html /usr/src/tmp/tbb-buildroot/usr/share/doc/tbb/./doc/html/a00126.html
+ for i in '$(find ./ -name '\''*.html'\'')'
+ install -Dm644 ./doc/html/a00125.html /usr/src/tmp/tbb-buildroot/usr/share/doc/tbb/./doc/html/a00125.html
+ for i in '$(find ./ -name '\''*.html'\'')'
+ install -Dm644 ./doc/html/a00124.html /usr/src/tmp/tbb-buildroot/usr/share/doc/tbb/./doc/html/a00124.html
+ for i in '$(find ./ -name '\''*.html'\'')'
+ install -Dm644 ./doc/html/a00123.html /usr/src/tmp/tbb-buildroot/usr/share/doc/tbb/./doc/html/a00123.html
+ for i in '$(find ./ -name '\''*.html'\'')'
+ install -Dm644 ./doc/html/a00122.html /usr/src/tmp/tbb-buildroot/usr/share/doc/tbb/./doc/html/a00122.html
+ for i in '$(find ./ -name '\''*.html'\'')'
+ install -Dm644 ./doc/html/a00121.html /usr/src/tmp/tbb-buildroot/usr/share/doc/tbb/./doc/html/a00121.html
+ for i in '$(find ./ -name '\''*.html'\'')'
+ install -Dm644 ./doc/html/a00120.html /usr/src/tmp/tbb-buildroot/usr/share/doc/tbb/./doc/html/a00120.html
+ for i in '$(find ./ -name '\''*.html'\'')'
+ install -Dm644 ./doc/html/a00119.html /usr/src/tmp/tbb-buildroot/usr/share/doc/tbb/./doc/html/a00119.html
+ for i in '$(find ./ -name '\''*.html'\'')'
+ install -Dm644 ./doc/html/a00118.html /usr/src/tmp/tbb-buildroot/usr/share/doc/tbb/./doc/html/a00118.html
+ for i in '$(find ./ -name '\''*.html'\'')'
+ install -Dm644 ./doc/html/a00117.html /usr/src/tmp/tbb-buildroot/usr/share/doc/tbb/./doc/html/a00117.html
+ for i in '$(find ./ -name '\''*.html'\'')'
+ install -Dm644 ./doc/html/a00116.html /usr/src/tmp/tbb-buildroot/usr/share/doc/tbb/./doc/html/a00116.html
+ for i in '$(find ./ -name '\''*.html'\'')'
+ install -Dm644 ./doc/html/a00115.html /usr/src/tmp/tbb-buildroot/usr/share/doc/tbb/./doc/html/a00115.html
+ for i in '$(find ./ -name '\''*.html'\'')'
+ install -Dm644 ./doc/html/a00114.html /usr/src/tmp/tbb-buildroot/usr/share/doc/tbb/./doc/html/a00114.html
+ for i in '$(find ./ -name '\''*.html'\'')'
+ install -Dm644 ./doc/html/a00113.html /usr/src/tmp/tbb-buildroot/usr/share/doc/tbb/./doc/html/a00113.html
+ for i in '$(find ./ -name '\''*.html'\'')'
+ install -Dm644 ./doc/html/a00112.html /usr/src/tmp/tbb-buildroot/usr/share/doc/tbb/./doc/html/a00112.html
+ for i in '$(find ./ -name '\''*.html'\'')'
+ install -Dm644 ./doc/html/a00111.html /usr/src/tmp/tbb-buildroot/usr/share/doc/tbb/./doc/html/a00111.html
+ for i in '$(find ./ -name '\''*.html'\'')'
+ install -Dm644 ./doc/html/a00110.html /usr/src/tmp/tbb-buildroot/usr/share/doc/tbb/./doc/html/a00110.html
+ for i in '$(find ./ -name '\''*.html'\'')'
+ install -Dm644 ./doc/html/a00109.html /usr/src/tmp/tbb-buildroot/usr/share/doc/tbb/./doc/html/a00109.html
+ for i in '$(find ./ -name '\''*.html'\'')'
+ install -Dm644 ./doc/html/a00108.html /usr/src/tmp/tbb-buildroot/usr/share/doc/tbb/./doc/html/a00108.html
+ for i in '$(find ./ -name '\''*.html'\'')'
+ install -Dm644 ./doc/html/a00107.html /usr/src/tmp/tbb-buildroot/usr/share/doc/tbb/./doc/html/a00107.html
+ for i in '$(find ./ -name '\''*.html'\'')'
+ install -Dm644 ./doc/html/a00106.html /usr/src/tmp/tbb-buildroot/usr/share/doc/tbb/./doc/html/a00106.html
+ for i in '$(find ./ -name '\''*.html'\'')'
+ install -Dm644 ./doc/html/a00105.html /usr/src/tmp/tbb-buildroot/usr/share/doc/tbb/./doc/html/a00105.html
+ for i in '$(find ./ -name '\''*.html'\'')'
+ install -Dm644 ./doc/html/a00104.html /usr/src/tmp/tbb-buildroot/usr/share/doc/tbb/./doc/html/a00104.html
+ for i in '$(find ./ -name '\''*.html'\'')'
+ install -Dm644 ./doc/html/a00103.html /usr/src/tmp/tbb-buildroot/usr/share/doc/tbb/./doc/html/a00103.html
+ for i in '$(find ./ -name '\''*.html'\'')'
+ install -Dm644 ./doc/html/a00102.html /usr/src/tmp/tbb-buildroot/usr/share/doc/tbb/./doc/html/a00102.html
+ for i in '$(find ./ -name '\''*.html'\'')'
+ install -Dm644 ./doc/html/a00101.html /usr/src/tmp/tbb-buildroot/usr/share/doc/tbb/./doc/html/a00101.html
+ for i in '$(find ./ -name '\''*.html'\'')'
+ install -Dm644 ./doc/html/a00100.html /usr/src/tmp/tbb-buildroot/usr/share/doc/tbb/./doc/html/a00100.html
+ for i in '$(find ./ -name '\''*.html'\'')'
+ install -Dm644 ./doc/html/a00099.html /usr/src/tmp/tbb-buildroot/usr/share/doc/tbb/./doc/html/a00099.html
+ for i in '$(find ./ -name '\''*.html'\'')'
+ install -Dm644 ./doc/html/a00098.html /usr/src/tmp/tbb-buildroot/usr/share/doc/tbb/./doc/html/a00098.html
+ for i in '$(find ./ -name '\''*.html'\'')'
+ install -Dm644 ./doc/html/a00097.html /usr/src/tmp/tbb-buildroot/usr/share/doc/tbb/./doc/html/a00097.html
+ for i in '$(find ./ -name '\''*.html'\'')'
+ install -Dm644 ./doc/html/a00096.html /usr/src/tmp/tbb-buildroot/usr/share/doc/tbb/./doc/html/a00096.html
+ for i in '$(find ./ -name '\''*.html'\'')'
+ install -Dm644 ./doc/html/a00095.html /usr/src/tmp/tbb-buildroot/usr/share/doc/tbb/./doc/html/a00095.html
+ for i in '$(find ./ -name '\''*.html'\'')'
+ install -Dm644 ./doc/html/a00094.html /usr/src/tmp/tbb-buildroot/usr/share/doc/tbb/./doc/html/a00094.html
+ for i in '$(find ./ -name '\''*.html'\'')'
+ install -Dm644 ./doc/html/a00093.html /usr/src/tmp/tbb-buildroot/usr/share/doc/tbb/./doc/html/a00093.html
+ for i in '$(find ./ -name '\''*.html'\'')'
+ install -Dm644 ./doc/html/a00092.html /usr/src/tmp/tbb-buildroot/usr/share/doc/tbb/./doc/html/a00092.html
+ for i in '$(find ./ -name '\''*.html'\'')'
+ install -Dm644 ./doc/html/a00091.html /usr/src/tmp/tbb-buildroot/usr/share/doc/tbb/./doc/html/a00091.html
+ for i in '$(find ./ -name '\''*.html'\'')'
+ install -Dm644 ./doc/html/a00090.html /usr/src/tmp/tbb-buildroot/usr/share/doc/tbb/./doc/html/a00090.html
+ for i in '$(find ./ -name '\''*.html'\'')'
+ install -Dm644 ./doc/html/a00089.html /usr/src/tmp/tbb-buildroot/usr/share/doc/tbb/./doc/html/a00089.html
+ for i in '$(find ./ -name '\''*.html'\'')'
+ install -Dm644 ./doc/html/a00088.html /usr/src/tmp/tbb-buildroot/usr/share/doc/tbb/./doc/html/a00088.html
+ for i in '$(find ./ -name '\''*.html'\'')'
+ install -Dm644 ./doc/html/a00087.html /usr/src/tmp/tbb-buildroot/usr/share/doc/tbb/./doc/html/a00087.html
+ for i in '$(find ./ -name '\''*.html'\'')'
+ install -Dm644 ./doc/html/a00086.html /usr/src/tmp/tbb-buildroot/usr/share/doc/tbb/./doc/html/a00086.html
+ for i in '$(find ./ -name '\''*.html'\'')'
+ install -Dm644 ./doc/html/a00085.html /usr/src/tmp/tbb-buildroot/usr/share/doc/tbb/./doc/html/a00085.html
+ for i in '$(find ./ -name '\''*.html'\'')'
+ install -Dm644 ./doc/html/a00084.html /usr/src/tmp/tbb-buildroot/usr/share/doc/tbb/./doc/html/a00084.html
+ for i in '$(find ./ -name '\''*.html'\'')'
+ install -Dm644 ./doc/html/a00083.html /usr/src/tmp/tbb-buildroot/usr/share/doc/tbb/./doc/html/a00083.html
+ for i in '$(find ./ -name '\''*.html'\'')'
+ install -Dm644 ./doc/html/a00082.html /usr/src/tmp/tbb-buildroot/usr/share/doc/tbb/./doc/html/a00082.html
+ for i in '$(find ./ -name '\''*.html'\'')'
+ install -Dm644 ./doc/html/a00081.html /usr/src/tmp/tbb-buildroot/usr/share/doc/tbb/./doc/html/a00081.html
+ for i in '$(find ./ -name '\''*.html'\'')'
+ install -Dm644 ./doc/html/a00080.html /usr/src/tmp/tbb-buildroot/usr/share/doc/tbb/./doc/html/a00080.html
+ for i in '$(find ./ -name '\''*.html'\'')'
+ install -Dm644 ./doc/html/a00079.html /usr/src/tmp/tbb-buildroot/usr/share/doc/tbb/./doc/html/a00079.html
+ for i in '$(find ./ -name '\''*.html'\'')'
+ install -Dm644 ./doc/html/a00078.html /usr/src/tmp/tbb-buildroot/usr/share/doc/tbb/./doc/html/a00078.html
+ for i in '$(find ./ -name '\''*.html'\'')'
+ install -Dm644 ./doc/html/a00077.html /usr/src/tmp/tbb-buildroot/usr/share/doc/tbb/./doc/html/a00077.html
+ for i in '$(find ./ -name '\''*.html'\'')'
+ install -Dm644 ./doc/html/a00076.html /usr/src/tmp/tbb-buildroot/usr/share/doc/tbb/./doc/html/a00076.html
+ for i in '$(find ./ -name '\''*.html'\'')'
+ install -Dm644 ./doc/html/a00075.html /usr/src/tmp/tbb-buildroot/usr/share/doc/tbb/./doc/html/a00075.html
+ for i in '$(find ./ -name '\''*.html'\'')'
+ install -Dm644 ./doc/html/a00074.html /usr/src/tmp/tbb-buildroot/usr/share/doc/tbb/./doc/html/a00074.html
+ for i in '$(find ./ -name '\''*.html'\'')'
+ install -Dm644 ./doc/html/a00073.html /usr/src/tmp/tbb-buildroot/usr/share/doc/tbb/./doc/html/a00073.html
+ for i in '$(find ./ -name '\''*.html'\'')'
+ install -Dm644 ./doc/html/a00072.html /usr/src/tmp/tbb-buildroot/usr/share/doc/tbb/./doc/html/a00072.html
+ for i in '$(find ./ -name '\''*.html'\'')'
+ install -Dm644 ./doc/html/a00071.html /usr/src/tmp/tbb-buildroot/usr/share/doc/tbb/./doc/html/a00071.html
+ for i in '$(find ./ -name '\''*.html'\'')'
+ install -Dm644 ./doc/html/a00070.html /usr/src/tmp/tbb-buildroot/usr/share/doc/tbb/./doc/html/a00070.html
+ for i in '$(find ./ -name '\''*.html'\'')'
+ install -Dm644 ./doc/html/a00069.html /usr/src/tmp/tbb-buildroot/usr/share/doc/tbb/./doc/html/a00069.html
+ for i in '$(find ./ -name '\''*.html'\'')'
+ install -Dm644 ./doc/html/a00068.html /usr/src/tmp/tbb-buildroot/usr/share/doc/tbb/./doc/html/a00068.html
+ for i in '$(find ./ -name '\''*.html'\'')'
+ install -Dm644 ./doc/html/a00067.html /usr/src/tmp/tbb-buildroot/usr/share/doc/tbb/./doc/html/a00067.html
+ for i in '$(find ./ -name '\''*.html'\'')'
+ install -Dm644 ./doc/html/a00066.html /usr/src/tmp/tbb-buildroot/usr/share/doc/tbb/./doc/html/a00066.html
+ for i in '$(find ./ -name '\''*.html'\'')'
+ install -Dm644 ./doc/html/a00065.html /usr/src/tmp/tbb-buildroot/usr/share/doc/tbb/./doc/html/a00065.html
+ for i in '$(find ./ -name '\''*.html'\'')'
+ install -Dm644 ./doc/html/a00064.html /usr/src/tmp/tbb-buildroot/usr/share/doc/tbb/./doc/html/a00064.html
+ for i in '$(find ./ -name '\''*.html'\'')'
+ install -Dm644 ./doc/html/a00063.html /usr/src/tmp/tbb-buildroot/usr/share/doc/tbb/./doc/html/a00063.html
+ for i in '$(find ./ -name '\''*.html'\'')'
+ install -Dm644 ./doc/html/a00062.html /usr/src/tmp/tbb-buildroot/usr/share/doc/tbb/./doc/html/a00062.html
+ for i in '$(find ./ -name '\''*.html'\'')'
+ install -Dm644 ./doc/html/a00061.html /usr/src/tmp/tbb-buildroot/usr/share/doc/tbb/./doc/html/a00061.html
+ for i in '$(find ./ -name '\''*.html'\'')'
+ install -Dm644 ./doc/html/a00060.html /usr/src/tmp/tbb-buildroot/usr/share/doc/tbb/./doc/html/a00060.html
+ for i in '$(find ./ -name '\''*.html'\'')'
+ install -Dm644 ./doc/html/a00059.html /usr/src/tmp/tbb-buildroot/usr/share/doc/tbb/./doc/html/a00059.html
+ for i in '$(find ./ -name '\''*.html'\'')'
+ install -Dm644 ./doc/html/a00058.html /usr/src/tmp/tbb-buildroot/usr/share/doc/tbb/./doc/html/a00058.html
+ for i in '$(find ./ -name '\''*.html'\'')'
+ install -Dm644 ./doc/html/a00057.html /usr/src/tmp/tbb-buildroot/usr/share/doc/tbb/./doc/html/a00057.html
+ for i in '$(find ./ -name '\''*.html'\'')'
+ install -Dm644 ./doc/html/a00056.html /usr/src/tmp/tbb-buildroot/usr/share/doc/tbb/./doc/html/a00056.html
+ for i in '$(find ./ -name '\''*.html'\'')'
+ install -Dm644 ./doc/html/a00055.html /usr/src/tmp/tbb-buildroot/usr/share/doc/tbb/./doc/html/a00055.html
+ for i in '$(find ./ -name '\''*.html'\'')'
+ install -Dm644 ./doc/html/a00054.html /usr/src/tmp/tbb-buildroot/usr/share/doc/tbb/./doc/html/a00054.html
+ for i in '$(find ./ -name '\''*.html'\'')'
+ install -Dm644 ./doc/html/a00053.html /usr/src/tmp/tbb-buildroot/usr/share/doc/tbb/./doc/html/a00053.html
+ for i in '$(find ./ -name '\''*.html'\'')'
+ install -Dm644 ./doc/html/a00052.html /usr/src/tmp/tbb-buildroot/usr/share/doc/tbb/./doc/html/a00052.html
+ for i in '$(find ./ -name '\''*.html'\'')'
+ install -Dm644 ./doc/html/a00051.html /usr/src/tmp/tbb-buildroot/usr/share/doc/tbb/./doc/html/a00051.html
+ for i in '$(find ./ -name '\''*.html'\'')'
+ install -Dm644 ./doc/html/a00050.html /usr/src/tmp/tbb-buildroot/usr/share/doc/tbb/./doc/html/a00050.html
+ for i in '$(find ./ -name '\''*.html'\'')'
+ install -Dm644 ./doc/html/a00049.html /usr/src/tmp/tbb-buildroot/usr/share/doc/tbb/./doc/html/a00049.html
+ for i in '$(find ./ -name '\''*.html'\'')'
+ install -Dm644 ./doc/html/a00048.html /usr/src/tmp/tbb-buildroot/usr/share/doc/tbb/./doc/html/a00048.html
+ for i in '$(find ./ -name '\''*.html'\'')'
+ install -Dm644 ./doc/html/a00047.html /usr/src/tmp/tbb-buildroot/usr/share/doc/tbb/./doc/html/a00047.html
+ for i in '$(find ./ -name '\''*.html'\'')'
+ install -Dm644 ./doc/html/a00046.html /usr/src/tmp/tbb-buildroot/usr/share/doc/tbb/./doc/html/a00046.html
+ for i in '$(find ./ -name '\''*.html'\'')'
+ install -Dm644 ./doc/html/a00045.html /usr/src/tmp/tbb-buildroot/usr/share/doc/tbb/./doc/html/a00045.html
+ for i in '$(find ./ -name '\''*.html'\'')'
+ install -Dm644 ./doc/html/a00044.html /usr/src/tmp/tbb-buildroot/usr/share/doc/tbb/./doc/html/a00044.html
+ for i in '$(find ./ -name '\''*.html'\'')'
+ install -Dm644 ./doc/html/a00043.html /usr/src/tmp/tbb-buildroot/usr/share/doc/tbb/./doc/html/a00043.html
+ for i in '$(find ./ -name '\''*.html'\'')'
+ install -Dm644 ./doc/html/a00042.html /usr/src/tmp/tbb-buildroot/usr/share/doc/tbb/./doc/html/a00042.html
+ for i in '$(find ./ -name '\''*.html'\'')'
+ install -Dm644 ./doc/html/a00041.html /usr/src/tmp/tbb-buildroot/usr/share/doc/tbb/./doc/html/a00041.html
+ for i in '$(find ./ -name '\''*.html'\'')'
+ install -Dm644 ./doc/html/a00040.html /usr/src/tmp/tbb-buildroot/usr/share/doc/tbb/./doc/html/a00040.html
+ for i in '$(find ./ -name '\''*.html'\'')'
+ install -Dm644 ./doc/html/a00039.html /usr/src/tmp/tbb-buildroot/usr/share/doc/tbb/./doc/html/a00039.html
+ for i in '$(find ./ -name '\''*.html'\'')'
+ install -Dm644 ./doc/html/a00038.html /usr/src/tmp/tbb-buildroot/usr/share/doc/tbb/./doc/html/a00038.html
+ for i in '$(find ./ -name '\''*.html'\'')'
+ install -Dm644 ./doc/html/a00037.html /usr/src/tmp/tbb-buildroot/usr/share/doc/tbb/./doc/html/a00037.html
+ for i in '$(find ./ -name '\''*.html'\'')'
+ install -Dm644 ./doc/html/a00036.html /usr/src/tmp/tbb-buildroot/usr/share/doc/tbb/./doc/html/a00036.html
+ for i in '$(find ./ -name '\''*.html'\'')'
+ install -Dm644 ./doc/html/a00035.html /usr/src/tmp/tbb-buildroot/usr/share/doc/tbb/./doc/html/a00035.html
+ for i in '$(find ./ -name '\''*.html'\'')'
+ install -Dm644 ./doc/html/a00034.html /usr/src/tmp/tbb-buildroot/usr/share/doc/tbb/./doc/html/a00034.html
+ for i in '$(find ./ -name '\''*.html'\'')'
+ install -Dm644 ./doc/html/a00033.html /usr/src/tmp/tbb-buildroot/usr/share/doc/tbb/./doc/html/a00033.html
+ for i in '$(find ./ -name '\''*.html'\'')'
+ install -Dm644 ./doc/html/a00032.html /usr/src/tmp/tbb-buildroot/usr/share/doc/tbb/./doc/html/a00032.html
+ for i in '$(find ./ -name '\''*.html'\'')'
+ install -Dm644 ./doc/html/a00031.html /usr/src/tmp/tbb-buildroot/usr/share/doc/tbb/./doc/html/a00031.html
+ for i in '$(find ./ -name '\''*.html'\'')'
+ install -Dm644 ./doc/html/a00030.html /usr/src/tmp/tbb-buildroot/usr/share/doc/tbb/./doc/html/a00030.html
+ for i in '$(find ./ -name '\''*.html'\'')'
+ install -Dm644 ./doc/html/a00029.html /usr/src/tmp/tbb-buildroot/usr/share/doc/tbb/./doc/html/a00029.html
+ for i in '$(find ./ -name '\''*.html'\'')'
+ install -Dm644 ./doc/html/a00028.html /usr/src/tmp/tbb-buildroot/usr/share/doc/tbb/./doc/html/a00028.html
+ for i in '$(find ./ -name '\''*.html'\'')'
+ install -Dm644 ./doc/html/a00027.html /usr/src/tmp/tbb-buildroot/usr/share/doc/tbb/./doc/html/a00027.html
+ for i in '$(find ./ -name '\''*.html'\'')'
+ install -Dm644 ./doc/html/a00026.html /usr/src/tmp/tbb-buildroot/usr/share/doc/tbb/./doc/html/a00026.html
+ for i in '$(find ./ -name '\''*.html'\'')'
+ install -Dm644 ./doc/html/a00025.html /usr/src/tmp/tbb-buildroot/usr/share/doc/tbb/./doc/html/a00025.html
+ for i in '$(find ./ -name '\''*.html'\'')'
+ install -Dm644 ./doc/html/a00024.html /usr/src/tmp/tbb-buildroot/usr/share/doc/tbb/./doc/html/a00024.html
+ for i in '$(find ./ -name '\''*.html'\'')'
+ install -Dm644 ./doc/html/a00023.html /usr/src/tmp/tbb-buildroot/usr/share/doc/tbb/./doc/html/a00023.html
+ for i in '$(find ./ -name '\''*.html'\'')'
+ install -Dm644 ./doc/html/a00022.html /usr/src/tmp/tbb-buildroot/usr/share/doc/tbb/./doc/html/a00022.html
+ for i in '$(find ./ -name '\''*.html'\'')'
+ install -Dm644 ./doc/html/a00021.html /usr/src/tmp/tbb-buildroot/usr/share/doc/tbb/./doc/html/a00021.html
+ for i in '$(find ./ -name '\''*.html'\'')'
+ install -Dm644 ./doc/html/a00020.html /usr/src/tmp/tbb-buildroot/usr/share/doc/tbb/./doc/html/a00020.html
+ for i in '$(find ./ -name '\''*.html'\'')'
+ install -Dm644 ./doc/html/a00019.html /usr/src/tmp/tbb-buildroot/usr/share/doc/tbb/./doc/html/a00019.html
+ for i in '$(find ./ -name '\''*.html'\'')'
+ install -Dm644 ./doc/html/a00018.html /usr/src/tmp/tbb-buildroot/usr/share/doc/tbb/./doc/html/a00018.html
+ for i in '$(find ./ -name '\''*.html'\'')'
+ install -Dm644 ./doc/html/a00017.html /usr/src/tmp/tbb-buildroot/usr/share/doc/tbb/./doc/html/a00017.html
+ for i in '$(find ./ -name '\''*.html'\'')'
+ install -Dm644 ./doc/html/a00016.html /usr/src/tmp/tbb-buildroot/usr/share/doc/tbb/./doc/html/a00016.html
+ for i in '$(find ./ -name '\''*.html'\'')'
+ install -Dm644 ./doc/html/a00015.html /usr/src/tmp/tbb-buildroot/usr/share/doc/tbb/./doc/html/a00015.html
+ for i in '$(find ./ -name '\''*.html'\'')'
+ install -Dm644 ./doc/html/a00014.html /usr/src/tmp/tbb-buildroot/usr/share/doc/tbb/./doc/html/a00014.html
+ for i in '$(find ./ -name '\''*.html'\'')'
+ install -Dm644 ./doc/html/a00013.html /usr/src/tmp/tbb-buildroot/usr/share/doc/tbb/./doc/html/a00013.html
+ for i in '$(find ./ -name '\''*.html'\'')'
+ install -Dm644 ./doc/html/a00012.html /usr/src/tmp/tbb-buildroot/usr/share/doc/tbb/./doc/html/a00012.html
+ for i in '$(find ./ -name '\''*.html'\'')'
+ install -Dm644 ./doc/html/a00011.html /usr/src/tmp/tbb-buildroot/usr/share/doc/tbb/./doc/html/a00011.html
+ for i in '$(find ./ -name '\''*.html'\'')'
+ install -Dm644 ./doc/html/a00010.html /usr/src/tmp/tbb-buildroot/usr/share/doc/tbb/./doc/html/a00010.html
+ for i in '$(find ./ -name '\''*.html'\'')'
+ install -Dm644 ./doc/html/a00009.html /usr/src/tmp/tbb-buildroot/usr/share/doc/tbb/./doc/html/a00009.html
+ for i in '$(find ./ -name '\''*.html'\'')'
+ install -Dm644 ./doc/html/a00008.html /usr/src/tmp/tbb-buildroot/usr/share/doc/tbb/./doc/html/a00008.html
+ for i in '$(find ./ -name '\''*.html'\'')'
+ install -Dm644 ./doc/html/a00007.html /usr/src/tmp/tbb-buildroot/usr/share/doc/tbb/./doc/html/a00007.html
+ for i in '$(find ./ -name '\''*.html'\'')'
+ install -Dm644 ./doc/html/a00006.html /usr/src/tmp/tbb-buildroot/usr/share/doc/tbb/./doc/html/a00006.html
+ for i in '$(find ./ -name '\''*.html'\'')'
+ install -Dm644 ./doc/html/a00005.html /usr/src/tmp/tbb-buildroot/usr/share/doc/tbb/./doc/html/a00005.html
+ for i in '$(find ./ -name '\''*.html'\'')'
+ install -Dm644 ./doc/html/a00004.html /usr/src/tmp/tbb-buildroot/usr/share/doc/tbb/./doc/html/a00004.html
+ for i in '$(find ./ -name '\''*.html'\'')'
+ install -Dm644 ./doc/html/a00003.html /usr/src/tmp/tbb-buildroot/usr/share/doc/tbb/./doc/html/a00003.html
+ for i in '$(find ./ -name '\''*.html'\'')'
+ install -Dm644 ./doc/html/a00002.html /usr/src/tmp/tbb-buildroot/usr/share/doc/tbb/./doc/html/a00002.html
+ for i in '$(find ./ -name '\''*.html'\'')'
+ install -Dm644 ./doc/html/a00001.html /usr/src/tmp/tbb-buildroot/usr/share/doc/tbb/./doc/html/a00001.html
+ for i in '$(find ./ -name '\''*.html'\'')'
+ install -Dm644 ./build/vs2013/index.html /usr/src/tmp/tbb-buildroot/usr/share/doc/tbb/./build/vs2013/index.html
+ for i in '$(find ./ -name '\''*.html'\'')'
+ install -Dm644 ./build/index.html /usr/src/tmp/tbb-buildroot/usr/share/doc/tbb/./build/index.html
+ pushd /usr/src/tmp/tbb-buildroot/usr/share/doc/tbb
~/tmp/tbb-buildroot/usr/share/doc/tbb ~/RPM/BUILD/tbb-2018
+ rm -fr examples
+ rm -fr python
+ rm -fr python3
+ popd
~/RPM/BUILD/tbb-2018
+ install -p -m644 CHANGES LICENSE README README.md /usr/src/tmp/tbb-buildroot/usr/share/doc/tbb
+ . build/linux_intel64_gcc_cc5.3.1_libc2.23_kernel4.19.32_release/tbbvars.sh
++ export TBBROOT=/usr/src/RPM/BUILD/tbb-2018
++ TBBROOT=/usr/src/RPM/BUILD/tbb-2018
++ tbb_bin=/usr/src/RPM/BUILD/tbb-2018/build/linux_intel64_gcc_cc5.3.1_libc2.23_kernel4.19.32_release
++ '[' -z '' ']'
++ export CPATH=/usr/src/RPM/BUILD/tbb-2018/include
++ CPATH=/usr/src/RPM/BUILD/tbb-2018/include
++ '[' -z '' ']'
++ export LIBRARY_PATH=/usr/src/RPM/BUILD/tbb-2018/build/linux_intel64_gcc_cc5.3.1_libc2.23_kernel4.19.32_release
++ LIBRARY_PATH=/usr/src/RPM/BUILD/tbb-2018/build/linux_intel64_gcc_cc5.3.1_libc2.23_kernel4.19.32_release
++ '[' -z '' ']'
++ export LD_LIBRARY_PATH=/usr/src/RPM/BUILD/tbb-2018/build/linux_intel64_gcc_cc5.3.1_libc2.23_kernel4.19.32_release
++ LD_LIBRARY_PATH=/usr/src/RPM/BUILD/tbb-2018/build/linux_intel64_gcc_cc5.3.1_libc2.23_kernel4.19.32_release
+ pushd python
~/RPM/BUILD/tbb-2018/python ~/RPM/BUILD/tbb-2018
+ /usr/bin/python setup.py install --skip-build --root=/usr/src/tmp/tbb-buildroot --force
Using TBBROOT= /usr/src/RPM/BUILD/tbb-2018
running install
running install_lib
creating /usr/src/tmp/tbb-buildroot/usr/lib64/python2.7
creating /usr/src/tmp/tbb-buildroot/usr/lib64/python2.7/site-packages
copying build/lib.linux-x86_64-2.7/TBB.py -> /usr/src/tmp/tbb-buildroot/usr/lib64/python2.7/site-packages
copying build/lib.linux-x86_64-2.7/_TBB.so -> /usr/src/tmp/tbb-buildroot/usr/lib64/python2.7/site-packages
byte-compiling /usr/src/tmp/tbb-buildroot/usr/lib64/python2.7/site-packages/TBB.py to TBB.pyc
running install_egg_info
Writing /usr/src/tmp/tbb-buildroot/usr/lib64/python2.7/site-packages/TBB-0.1-py2.7.egg-info
+ popd
~/RPM/BUILD/tbb-2018
+ pushd python3
~/RPM/BUILD/tbb-2018/python3 ~/RPM/BUILD/tbb-2018
+ python3 setup.py install --skip-build --root=/usr/src/tmp/tbb-buildroot --force
Using TBBROOT= /usr/src/RPM/BUILD/tbb-2018
running install
running install_lib
creating /usr/src/tmp/tbb-buildroot/usr/lib64/python3
creating /usr/src/tmp/tbb-buildroot/usr/lib64/python3/site-packages
copying build/lib.linux-x86_64-3.5/TBB.py -> /usr/src/tmp/tbb-buildroot/usr/lib64/python3/site-packages
copying build/lib.linux-x86_64-3.5/_TBB.cpython-35m.so -> /usr/src/tmp/tbb-buildroot/usr/lib64/python3/site-packages
byte-compiling /usr/src/tmp/tbb-buildroot/usr/lib64/python3/site-packages/TBB.py to TBB.cpython-35.pyc
running install_egg_info
Writing /usr/src/tmp/tbb-buildroot/usr/lib64/python3/site-packages/TBB-0.1-py3.5.egg-info
+ popd
~/RPM/BUILD/tbb-2018
+ /usr/lib/rpm/brp-alt
Cleaning files in /usr/src/tmp/tbb-buildroot (auto)
mode of './usr/lib64/python3/site-packages/_TBB.cpython-35m.so' changed from 0755 (rwxr-xr-x) to 0644 (rw-r--r--)
mode of './usr/lib64/python2.7/site-packages/_TBB.so' changed from 0755 (rwxr-xr-x) to 0644 (rw-r--r--)
Verifying and fixing files in /usr/src/tmp/tbb-buildroot (binconfig,pkgconfig,libtool,desktop)
Compressing files in /usr/src/tmp/tbb-buildroot (auto)
Adjusting library links in /usr/src/tmp/tbb-buildroot
./usr/lib64:
	libtbb.so.2 -> libtbb.so.2
	libtbbmalloc.so.2 -> libtbbmalloc.so.2
	libtbbmalloc_proxy.so.2 -> libtbbmalloc_proxy.so.2
Verifying ELF objects in /usr/src/tmp/tbb-buildroot (arch=normal,fhs=normal,lfs=relaxed,lint=relaxed,rpath=normal,stack=normal,textrel=normal,unresolved=normal)
Bytecompiling python modules in /usr/src/tmp/tbb-buildroot using /usr/bin/python
unlink /usr/src/tmp/tbb-buildroot/usr/lib64/python2.7/site-packages/TBB.pyc
compile /usr/src/tmp/tbb-buildroot/usr/lib64/python2.7/site-packages/TBB.py
Bytecompiling python modules with optimization in /usr/src/tmp/tbb-buildroot using /usr/bin/python -O
compile /usr/src/tmp/tbb-buildroot/usr/lib64/python2.7/site-packages/TBB.py
Bytecompiling python3 modules in /usr/src/tmp/tbb-buildroot using python3
unlink /usr/src/tmp/tbb-buildroot/usr/lib64/python3/site-packages/__pycache__/TBB.cpython-35.pyc
compile /usr/src/tmp/tbb-buildroot/usr/lib64/python3/site-packages/TBB.py
Can't list '/usr/src/tmp/tbb-buildroot/usr/lib/python3/site-packages'
Bytecompiling python3 modules with optimization in /usr/src/tmp/tbb-buildroot using python3 -O
Can't list '/usr/src/tmp/tbb-buildroot/usr/lib/python3/site-packages'
compile /usr/src/tmp/tbb-buildroot/usr/lib64/python3/site-packages/TBB.py
Bytecompiling python3 modules with optimization-2 in /usr/src/tmp/tbb-buildroot using python3 -OO
compile /usr/src/tmp/tbb-buildroot/usr/lib64/python3/site-packages/TBB.py
Can't list '/usr/src/tmp/tbb-buildroot/usr/lib/python3/site-packages'
Hardlinking identical .pyc and .opt-?.pyc files
Hardlinking identical .pyc and .pyo files
Processing files: libtbb-2018-alt0.M80P.1.u1
Finding Provides (using /usr/lib/rpm/find-provides)
Executing: /bin/sh -e /usr/src/tmp/rpm-tmp.4jx16C
find-provides: running scripts (alternatives,debuginfo,lib,pam,perl,pkgconfig,python,python3,shell)
lib.prov: /usr/src/tmp/tbb-buildroot/usr/lib64/libtbb.so.2: 288 symbols, 19 bpp
lib.prov: /usr/src/tmp/tbb-buildroot/usr/lib64/libtbbmalloc.so.2: 27 symbols, 15 bpp
lib.prov: /usr/src/tmp/tbb-buildroot/usr/lib64/libtbbmalloc_proxy.so.2: 28 symbols, 15 bpp
Finding Requires (using /usr/lib/rpm/find-requires)
Executing: /bin/sh -e /usr/src/tmp/rpm-tmp.K8C3xU
find-requires: running scripts (cpp,debuginfo,files,lib,pam,perl,pkgconfig,pkgconfiglib,python,python3,rpmlib,shebang,shell,static,symlinks)
Provides: libtbb.so.2()(64bit) = set:mdzER6fPDXlGHaFNMtsJbuj2eNxlGsGzA1PJ6QpKqgK8l9F0fOD0Zh6bZHZ8uVxOk9yr4JypYcRfCEfjhOhapwsQN9ZIzRvPlMS7zjcBgJ4ATQZwRsA9WHKthA4qluBWbysCzxvv3RwR2Yf4sSdZCyBgT4R0E7ZqkV7lZb8u7cDD7vPs6uwYrvpPViKVvkmshG2gyOKVhdj0OkM4cukV16ZFJ6vl9pIIYAbPyY39WuzjQZFPxhG5LrhSWcZkO53ZpYqKmXF1Ao1QZHeI6hXHiFkGt64sIbbBcrjR3ofg9gPWfFT0dQP3aC9c2QPuFjqz1Zdw30cAnAL2350vWWyZ6C8okS1nTbHPtKZsPSEcTnVi47Ax5yMA9rww1V508vGNVfMH0qhWC9VibJF4SZDhpuko0ZGIu2cL4aoJBVZITQ7Iht0ybndnnLcQwZCl0LOC4kpc9Xapj9rjjMa2fyKBRZlRzbQBeukDFFpLJtYa9l4esyMZ99xs9j4e7i4oBqGtXfYwG2guNS2J90d5WIns09VWkPIpQGJd9Atqn0lFjfwK10aPEjyz5ZsJZDUW5z7K39wlBxMHkgJ4ZtfRcWZp2i0oC1, libtbbmalloc.so.2()(64bit) = set:idrUzWeb53XnW4LKJQ4rZuCaKpcjRlaSQmrF1qehfjmiOUDZ7nOdfK70, libtbbmalloc_proxy.so.2()(64bit) = set:idNBsmCXVDrwba3Ov4pRqBlgbshtgeEEOAvUPDWvBDTGvANuALVPhaby0
Requires: libc.so.6(GLIBC_2.14)(64bit), libc.so.6(GLIBC_2.2.5)(64bit), libc.so.6(GLIBC_2.3.4)(64bit), libc.so.6(GLIBC_2.4)(64bit), libdl.so.2(GLIBC_2.2.5)(64bit), libgcc_s.so.1(GCC_3.0)(64bit), libpthread.so.0(GLIBC_2.2.5)(64bit), libstdc++.so.6(CXXABI_1.3)(64bit), libstdc++.so.6(CXXABI_1.3.3)(64bit), libstdc++.so.6(CXXABI_1.3.8)(64bit), libstdc++.so.6(CXXABI_1.3.9)(64bit), libstdc++.so.6(GLIBCXX_3.4)(64bit), libstdc++.so.6(GLIBCXX_3.4.21)(64bit), rtld(GNU_HASH)
Finding debuginfo files (using /usr/lib/rpm/find-debuginfo-files)
Executing: /bin/sh -e /usr/src/tmp/rpm-tmp.AkIFdf
Creating libtbb-debuginfo package
Processing files: tbb-devel-2018-alt0.M80P.1.u1
Finding Provides (using /usr/lib/rpm/find-provides)
Executing: /bin/sh -e /usr/src/tmp/rpm-tmp.O2J05C
find-provides: running scripts (alternatives,debuginfo,lib,pam,perl,pkgconfig,python,python3,shell)
Finding Requires (using /usr/lib/rpm/find-requires)
Executing: /bin/sh -e /usr/src/tmp/rpm-tmp.Cr2333
find-requires: running scripts (cpp,debuginfo,files,lib,pam,perl,pkgconfig,pkgconfiglib,python,python3,rpmlib,shebang,shell,static,symlinks)
In file included from /usr/src/tmp/tbb-buildroot/usr/include/tbb/tbb_stddef.h:95:0,
                 from /usr/src/tmp/tbb-buildroot/usr/include/tbb/aligned_space.h:24,
                 from /usr/src/tmp/tbb-buildroot/usr/include/tbb/tbb.h:35:
/usr/src/tmp/tbb-buildroot/usr/include/tbb/tbb_config.h:40:23: fatal error: cstddef: No such file or directory
compilation terminated.
cpp.req: /usr/src/tmp/tbb-buildroot/usr/include/tbb/tbb.h: cpp failed, trying c++ mode
/usr/src/tmp/tbb-buildroot/usr/include/tbb/aggregator.h:25:2: error: #error Set TBB_PREVIEW_AGGREGATOR before including aggregator.h
 #error Set TBB_PREVIEW_AGGREGATOR before including aggregator.h
  ^
cpp.req: WARNING: /usr/src/tmp/tbb-buildroot/usr/include/tbb/aggregator.h: cpp failed
/usr/src/tmp/tbb-buildroot/usr/include/tbb/memory_pool.h:25:2: error: #error Set TBB_PREVIEW_MEMORY_POOL to include memory_pool.h
 #error Set TBB_PREVIEW_MEMORY_POOL to include memory_pool.h
  ^
cpp.req: WARNING: /usr/src/tmp/tbb-buildroot/usr/include/tbb/memory_pool.h: cpp failed
/usr/src/tmp/tbb-buildroot/usr/include/tbb/global_control.h:25:2: error: #error Set TBB_PREVIEW_GLOBAL_CONTROL before including global_control.h
 #error Set TBB_PREVIEW_GLOBAL_CONTROL before including global_control.h
  ^
cpp.req: WARNING: /usr/src/tmp/tbb-buildroot/usr/include/tbb/global_control.h: cpp failed
/usr/src/tmp/tbb-buildroot/usr/include/tbb/runtime_loader.h:25:6: error: #error Set TBB_PREVIEW_RUNTIME_LOADER to include runtime_loader.h
     #error Set TBB_PREVIEW_RUNTIME_LOADER to include runtime_loader.h
      ^
cpp.req: WARNING: /usr/src/tmp/tbb-buildroot/usr/include/tbb/runtime_loader.h: cpp failed
/usr/src/tmp/tbb-buildroot/usr/include/tbb/concurrent_lru_cache.h:25:6: error: #error Set TBB_PREVIEW_CONCURRENT_LRU_CACHE to include concurrent_lru_cache.h
     #error Set TBB_PREVIEW_CONCURRENT_LRU_CACHE to include concurrent_lru_cache.h
      ^
cpp.req: WARNING: /usr/src/tmp/tbb-buildroot/usr/include/tbb/concurrent_lru_cache.h: cpp failed
/usr/src/tmp/tbb-buildroot/usr/include/tbb/machine/mac_ppc.h:22:2: error: #error Do not #include this internal file directly; use public TBB headers instead.
 #error Do not #include this internal file directly; use public TBB headers instead.
  ^
cpp.req: WARNING: /usr/src/tmp/tbb-buildroot/usr/include/tbb/machine/mac_ppc.h: cpp failed
/usr/src/tmp/tbb-buildroot/usr/include/tbb/machine/gcc_armv7.h:26:2: error: #error Do not include this file directly; include tbb_machine.h instead
 #error Do not include this file directly; include tbb_machine.h instead
  ^
/usr/src/tmp/tbb-buildroot/usr/include/tbb/machine/gcc_armv7.h:31:2: error: #error compilation requires an ARMv7-a architecture.
 #error compilation requires an ARMv7-a architecture.
  ^
cpp.req: WARNING: /usr/src/tmp/tbb-buildroot/usr/include/tbb/machine/gcc_armv7.h: cpp failed
/usr/src/tmp/tbb-buildroot/usr/include/tbb/machine/ibm_aix51.h:24:2: error: #error Do not #include this internal file directly; use public TBB headers instead.
 #error Do not #include this internal file directly; use public TBB headers instead.
  ^
cpp.req: WARNING: /usr/src/tmp/tbb-buildroot/usr/include/tbb/machine/ibm_aix51.h: cpp failed
/usr/src/tmp/tbb-buildroot/usr/include/tbb/machine/linux_ia32.h:22:2: error: #error Do not #include this internal file directly; use public TBB headers instead.
 #error Do not #include this internal file directly; use public TBB headers instead.
  ^
In file included from /usr/src/tmp/tbb-buildroot/usr/include/tbb/machine/gcc_ia32_common.h:110:0,
                 from /usr/src/tmp/tbb-buildroot/usr/include/tbb/machine/linux_ia32.h:28:
/usr/src/tmp/tbb-buildroot/usr/include/tbb/machine/gcc_itsx.h:22:2: error: #error Do not #include this internal file directly; use public TBB headers instead.
 #error Do not #include this internal file directly; use public TBB headers instead.
  ^
cpp.req: WARNING: /usr/src/tmp/tbb-buildroot/usr/include/tbb/machine/linux_ia32.h: cpp failed
/usr/src/tmp/tbb-buildroot/usr/include/tbb/machine/linux_ia64.h:22:2: error: #error Do not #include this internal file directly; use public TBB headers instead.
 #error Do not #include this internal file directly; use public TBB headers instead.
  ^
/usr/src/tmp/tbb-buildroot/usr/include/tbb/machine/linux_ia64.h:28:24: fatal error: ia64intrin.h: No such file or directory
compilation terminated.
cpp.req: WARNING: /usr/src/tmp/tbb-buildroot/usr/include/tbb/machine/linux_ia64.h: cpp failed
/usr/src/tmp/tbb-buildroot/usr/include/tbb/machine/mic_common.h:25:2: error: #error Do not #include this internal file directly; use public TBB headers instead.
 #error Do not #include this internal file directly; use public TBB headers instead.
  ^
/usr/src/tmp/tbb-buildroot/usr/include/tbb/machine/mic_common.h:29:6: error: #error mic_common.h should be included only when building for Intel(R) Many Integrated Core Architecture
     #error mic_common.h should be included only when building for Intel(R) Many Integrated Core Architecture
      ^
cpp.req: WARNING: /usr/src/tmp/tbb-buildroot/usr/include/tbb/machine/mic_common.h: cpp failed
/usr/src/tmp/tbb-buildroot/usr/include/tbb/machine/msvc_armv7.h:22:2: error: #error Do not #include this internal file directly; use public TBB headers instead.
 #error Do not #include this internal file directly; use public TBB headers instead.
  ^
/usr/src/tmp/tbb-buildroot/usr/include/tbb/machine/msvc_armv7.h:27:20: fatal error: intrin.h: No such file or directory
compilation terminated.
cpp.req: WARNING: /usr/src/tmp/tbb-buildroot/usr/include/tbb/machine/msvc_armv7.h: cpp failed
/usr/src/tmp/tbb-buildroot/usr/include/tbb/machine/gcc_generic.h:22:2: error: #error Do not #include this internal file directly; use public TBB headers instead.
 #error Do not #include this internal file directly; use public TBB headers instead.
  ^
cpp.req: WARNING: /usr/src/tmp/tbb-buildroot/usr/include/tbb/machine/gcc_generic.h: cpp failed
/usr/src/tmp/tbb-buildroot/usr/include/tbb/machine/icc_generic.h:22:2: error: #error Do not #include this internal file directly; use public TBB headers instead.
 #error Do not #include this internal file directly; use public TBB headers instead.
  ^
/usr/src/tmp/tbb-buildroot/usr/include/tbb/machine/icc_generic.h:26:6: error: #error "Intel C++ Compiler of at least 12.0 version is needed to use ICC intrinsics port"
     #error "Intel C++ Compiler of at least 12.0 version is needed to use ICC intrinsics port"
      ^
In file included from /usr/src/tmp/tbb-buildroot/usr/include/tbb/machine/gcc_ia32_common.h:110:0,
                 from /usr/src/tmp/tbb-buildroot/usr/include/tbb/machine/icc_generic.h:35:
/usr/src/tmp/tbb-buildroot/usr/include/tbb/machine/gcc_itsx.h:22:2: error: #error Do not #include this internal file directly; use public TBB headers instead.
 #error Do not #include this internal file directly; use public TBB headers instead.
  ^
cpp.req: WARNING: /usr/src/tmp/tbb-buildroot/usr/include/tbb/machine/icc_generic.h: cpp failed
/usr/src/tmp/tbb-buildroot/usr/include/tbb/machine/sunos_sparc.h:23:2: error: #error Do not #include this internal file directly; use public TBB headers instead.
 #error Do not #include this internal file directly; use public TBB headers instead.
  ^
cpp.req: WARNING: /usr/src/tmp/tbb-buildroot/usr/include/tbb/machine/sunos_sparc.h: cpp failed
/usr/src/tmp/tbb-buildroot/usr/include/tbb/machine/windows_api.h:66:2: error: #error tbb/machine/windows_api.h should only be used for Windows based platforms
 #error tbb/machine/windows_api.h should only be used for Windows based platforms
  ^
cpp.req: WARNING: /usr/src/tmp/tbb-buildroot/usr/include/tbb/machine/windows_api.h: cpp failed
/usr/src/tmp/tbb-buildroot/usr/include/tbb/machine/macos_common.h:22:2: error: #error Do not #include this internal file directly; use public TBB headers instead.
 #error Do not #include this internal file directly; use public TBB headers instead.
  ^
/usr/src/tmp/tbb-buildroot/usr/include/tbb/machine/macos_common.h:53:30: fatal error: libkern/OSAtomic.h: No such file or directory
compilation terminated.
cpp.req: WARNING: /usr/src/tmp/tbb-buildroot/usr/include/tbb/machine/macos_common.h: cpp failed
/usr/src/tmp/tbb-buildroot/usr/include/tbb/machine/windows_ia32.h:22:2: error: #error Do not #include this internal file directly; use public TBB headers instead.
 #error Do not #include this internal file directly; use public TBB headers instead.
  ^
In file included from /usr/src/tmp/tbb-buildroot/usr/include/tbb/machine/windows_ia32.h:33:0:
/usr/src/tmp/tbb-buildroot/usr/include/tbb/machine/msvc_ia32_common.h:22:2: error: #error Do not #include this internal file directly; use public TBB headers instead.
 #error Do not #include this internal file directly; use public TBB headers instead.
  ^
/usr/src/tmp/tbb-buildroot/usr/include/tbb/machine/msvc_ia32_common.h:27:20: fatal error: intrin.h: No such file or directory
compilation terminated.
cpp.req: WARNING: /usr/src/tmp/tbb-buildroot/usr/include/tbb/machine/windows_ia32.h: cpp failed
/usr/src/tmp/tbb-buildroot/usr/include/tbb/machine/windows_intel64.h:22:2: error: #error Do not #include this internal file directly; use public TBB headers instead.
 #error Do not #include this internal file directly; use public TBB headers instead.
  ^
In file included from /usr/src/tmp/tbb-buildroot/usr/include/tbb/machine/windows_intel64.h:30:0:
/usr/src/tmp/tbb-buildroot/usr/include/tbb/machine/msvc_ia32_common.h:22:2: error: #error Do not #include this internal file directly; use public TBB headers instead.
 #error Do not #include this internal file directly; use public TBB headers instead.
  ^
/usr/src/tmp/tbb-buildroot/usr/include/tbb/machine/msvc_ia32_common.h:27:20: fatal error: intrin.h: No such file or directory
compilation terminated.
cpp.req: WARNING: /usr/src/tmp/tbb-buildroot/usr/include/tbb/machine/windows_intel64.h: cpp failed
/usr/src/tmp/tbb-buildroot/usr/include/tbb/machine/msvc_ia32_common.h:22:2: error: #error Do not #include this internal file directly; use public TBB headers instead.
 #error Do not #include this internal file directly; use public TBB headers instead.
  ^
/usr/src/tmp/tbb-buildroot/usr/include/tbb/machine/msvc_ia32_common.h:27:20: fatal error: intrin.h: No such file or directory
compilation terminated.
cpp.req: WARNING: /usr/src/tmp/tbb-buildroot/usr/include/tbb/machine/msvc_ia32_common.h: cpp failed
/usr/src/tmp/tbb-buildroot/usr/include/tbb/internal/_tbb_windef.h:22:2: error: #error Do not #include this internal file directly; use public TBB headers instead.
 #error Do not #include this internal file directly; use public TBB headers instead.
  ^
/usr/src/tmp/tbb-buildroot/usr/include/tbb/internal/_tbb_windef.h:32:2: error: #error TBB requires linkage with multithreaded C/C++ runtime library. Choose multithreaded DLL runtime in project settings, or use /MD[d] compiler switch.
 #error TBB requires linkage with multithreaded C/C++ runtime library. \
  ^
cpp.req: WARNING: /usr/src/tmp/tbb-buildroot/usr/include/tbb/internal/_tbb_windef.h: cpp failed
/usr/src/tmp/tbb-buildroot/usr/include/tbb/internal/_flow_graph_async_msg_impl.h:25:2: error: #error Do not #include this internal file directly; use public TBB headers instead.
 #error Do not #include this internal file directly; use public TBB headers instead.
  ^
cpp.req: WARNING: /usr/src/tmp/tbb-buildroot/usr/include/tbb/internal/_flow_graph_async_msg_impl.h: cpp failed
/usr/src/tmp/tbb-buildroot/usr/include/tbb/internal/_flow_graph_streaming_node.h:25:2: error: #error Do not #include this internal file directly; use public TBB headers instead.
 #error Do not #include this internal file directly; use public TBB headers instead.
  ^
cpp.req: WARNING: /usr/src/tmp/tbb-buildroot/usr/include/tbb/internal/_flow_graph_streaming_node.h: cpp failed
Provides: libtbb-devel = 2018-alt0.M80P.1.u1, tbb-headers = 2018-alt0.M80P.1.u1
Requires: libtbb = 2018-alt0.M80P.1.u1, /usr/lib64/libtbb.so.2, /usr/lib64/libtbbmalloc.so.2, /usr/lib64/libtbbmalloc_proxy.so.2
Conflicts: libtbb-devel < 2018-alt0.M80P.1.u1, tbb-headers < 2018-alt0.M80P.1.u1
Obsoletes: libtbb-devel, tbb-headers
Finding debuginfo files (using /usr/lib/rpm/find-debuginfo-files)
Executing: /bin/sh -e /usr/src/tmp/rpm-tmp.moLVJA
Processing files: tbb-docs-2018-alt0.M80P.1.u1
Finding Provides (using /usr/lib/rpm/find-provides)
Executing: /bin/sh -e /usr/src/tmp/rpm-tmp.SLJhwa
find-provides: running scripts (alternatives,debuginfo,lib,pam,perl,pkgconfig,python,python3,shell)
Finding Requires (using /usr/lib/rpm/find-requires)
Executing: /bin/sh -e /usr/src/tmp/rpm-tmp.WuuohN
find-requires: running scripts (cpp,debuginfo,files,lib,pam,perl,pkgconfig,pkgconfiglib,python,python3,rpmlib,shebang,shell,static,symlinks)
Processing files: tbb-examples-2018-alt0.M80P.1.u1
Finding Provides (using /usr/lib/rpm/find-provides)
Executing: /bin/sh -e /usr/src/tmp/rpm-tmp.WTfJ3s
find-provides: running scripts (alternatives,debuginfo,lib,pam,perl,pkgconfig,python,python3,shell)
Finding Requires (using /usr/lib/rpm/find-requires)
Executing: /bin/sh -e /usr/src/tmp/rpm-tmp.gFZwZb
find-requires: running scripts (cpp,debuginfo,files,lib,pam,perl,pkgconfig,pkgconfiglib,python,python3,rpmlib,shebang,shell,static,symlinks)
Requires: libtbb = 2018-alt0.M80P.1.u1
Finding debuginfo files (using /usr/lib/rpm/find-debuginfo-files)
Executing: /bin/sh -e /usr/src/tmp/rpm-tmp.Ey2d0X
Processing files: python-module-tbb-2018-alt0.M80P.1.u1
Executing(%doc): /bin/sh -e /usr/src/tmp/rpm-tmp.60135
+ umask 022
+ /bin/mkdir -p /usr/src/RPM/BUILD
+ cd /usr/src/RPM/BUILD
+ cd tbb-2018
+ DOCDIR=/usr/src/tmp/tbb-buildroot/usr/share/doc/python-module-tbb-2018
+ export DOCDIR
+ rm -rf /usr/src/tmp/tbb-buildroot/usr/share/doc/python-module-tbb-2018
+ /bin/mkdir -p /usr/src/tmp/tbb-buildroot/usr/share/doc/python-module-tbb-2018
+ cp -prL python/index.html /usr/src/tmp/tbb-buildroot/usr/share/doc/python-module-tbb-2018
+ chmod -R go-w /usr/src/tmp/tbb-buildroot/usr/share/doc/python-module-tbb-2018
+ chmod -R a+rX /usr/src/tmp/tbb-buildroot/usr/share/doc/python-module-tbb-2018
+ exit 0
Finding Provides (using /usr/lib/rpm/find-provides)
Executing: /bin/sh -e /usr/src/tmp/rpm-tmp.cjidNN
find-provides: running scripts (alternatives,debuginfo,lib,pam,perl,pkgconfig,python,python3,shell)
Finding Requires (using /usr/lib/rpm/find-requires)
Executing: /bin/sh -e /usr/src/tmp/rpm-tmp.A6HBRG
find-requires: running scripts (cpp,debuginfo,files,lib,pam,perl,pkgconfig,pkgconfiglib,python,python3,rpmlib,shebang,shell,static,symlinks)
python.req: /usr/src/tmp/tbb-buildroot/usr/lib64/python2.7/site-packages/TBB.py: skipping sys
/usr/lib/rpm/python.req.py: /usr/src/tmp/tbb-buildroot/usr/lib64/python2.7/site-packages/TBB.py: line=68 IGNORE (for REQ=slight and deep=8) module=new
/usr/lib/rpm/python.req.py: /usr/src/tmp/tbb-buildroot/usr/lib64/python2.7/site-packages/TBB.py: line=71 IGNORE (for REQ=slight and deep=12) module=os
/usr/lib/rpm/python.req.py: /usr/src/tmp/tbb-buildroot/usr/lib64/python2.7/site-packages/TBB.py: line=72 IGNORE (for REQ=slight and deep=12) module=imp
/usr/lib/rpm/python.req.py: /usr/src/tmp/tbb-buildroot/usr/lib64/python2.7/site-packages/TBB.py: line=77 IGNORE (for REQ=slight and deep=16) module=_TBB
/usr/lib/rpm/python.req.py: /usr/src/tmp/tbb-buildroot/usr/lib64/python2.7/site-packages/TBB.py: line=88 IGNORE (for REQ=slight and deep=8) module=_TBB
python.req: /usr/src/tmp/tbb-buildroot/usr/lib64/python2.7/site-packages/TBB.py: skipping sys
/usr/lib/rpm/python.req.py: /usr/src/tmp/tbb-buildroot/usr/lib64/python2.7/site-packages/TBB.py: line=866 IGNORE (for REQ=slight and deep=8) module=time
/usr/lib/rpm/python.req.py: /usr/src/tmp/tbb-buildroot/usr/lib64/python2.7/site-packages/TBB.py: line=1018 IGNORE (for REQ=slight and deep=11) module=os
/usr/lib/rpm/python.req.py: /usr/src/tmp/tbb-buildroot/usr/lib64/python2.7/site-packages/TBB.py: line=1029 IGNORE (for REQ=slight and deep=11) module=os
/usr/lib/rpm/python.req.py: /usr/src/tmp/tbb-buildroot/usr/lib64/python2.7/site-packages/TBB.py: line=1047 IGNORE (for REQ=slight and deep=12) module=runpy
Provides: python2.7(TBB), python2.7(_TBB)
Requires: /usr/lib64/python2.7/site-packages, libc.so.6(GLIBC_2.14)(64bit), libc.so.6(GLIBC_2.2.5)(64bit), libc.so.6(GLIBC_2.3.4)(64bit), libc.so.6(GLIBC_2.4)(64bit), libgcc_s.so.1(GCC_3.0)(64bit), libpython2.7.so.1.0()(64bit) >= set:ohlglTJXFsaw7FxlD2bTzJH8iViy3L0xbziZHzMS0tvkzcuvVJ2k77bGCujDOaWnot6GykjA56SLYDpm8gwviSVivExC6v718H1pDjR81MlWmE97K4as2oQEutRWpec0l9mDV9n3ciwAeGM7mHLlgjX9Jod81uw7neG0TRUoGpm5DbCU1JYLiSroQ, libstdc++.so.6(CXXABI_1.3)(64bit), libstdc++.so.6(GLIBCXX_3.4)(64bit), libtbb.so.2()(64bit) >= set:mhyOGyryPIcNGuLXb9AOGrXfwHFekwvrUZuuvkrDATeAXktmjBZmTe0qN8eo4, python-modules, rtld(GNU_HASH)
Requires(rpmlib): rpmlib(SetVersions)
Finding debuginfo files (using /usr/lib/rpm/find-debuginfo-files)
Executing: /bin/sh -e /usr/src/tmp/rpm-tmp.YjpQbD
Creating python-module-tbb-debuginfo package
Processing files: python3-module-tbb-2018-alt0.M80P.1.u1
Executing(%doc): /bin/sh -e /usr/src/tmp/rpm-tmp.51557
+ umask 022
+ /bin/mkdir -p /usr/src/RPM/BUILD
+ cd /usr/src/RPM/BUILD
+ cd tbb-2018
+ DOCDIR=/usr/src/tmp/tbb-buildroot/usr/share/doc/python3-module-tbb-2018
+ export DOCDIR
+ rm -rf /usr/src/tmp/tbb-buildroot/usr/share/doc/python3-module-tbb-2018
+ /bin/mkdir -p /usr/src/tmp/tbb-buildroot/usr/share/doc/python3-module-tbb-2018
+ cp -prL python3/index.html /usr/src/tmp/tbb-buildroot/usr/share/doc/python3-module-tbb-2018
+ chmod -R go-w /usr/src/tmp/tbb-buildroot/usr/share/doc/python3-module-tbb-2018
+ chmod -R a+rX /usr/src/tmp/tbb-buildroot/usr/share/doc/python3-module-tbb-2018
+ exit 0
Finding Provides (using /usr/lib/rpm/find-provides)
Executing: /bin/sh -e /usr/src/tmp/rpm-tmp.8HTfaD
find-provides: running scripts (alternatives,debuginfo,lib,pam,perl,pkgconfig,python,python3,shell)
Finding Requires (using /usr/lib/rpm/find-requires)
Executing: /bin/sh -e /usr/src/tmp/rpm-tmp.oJ25hG
find-requires: running scripts (cpp,debuginfo,files,lib,pam,perl,pkgconfig,pkgconfiglib,python,python3,rpmlib,shebang,shell,static,symlinks)
python3.req: /usr/src/tmp/tbb-buildroot/usr/lib64/python3/site-packages/TBB.py: skipping sys
/usr/lib/rpm/python3.req.py: /usr/src/tmp/tbb-buildroot/usr/lib64/python3/site-packages/TBB.py: line=68 IGNORE (for REQ=slight and deep=8) module=new
/usr/lib/rpm/python3.req.py: /usr/src/tmp/tbb-buildroot/usr/lib64/python3/site-packages/TBB.py: line=71 IGNORE (for REQ=slight and deep=12) module=os
/usr/lib/rpm/python3.req.py: /usr/src/tmp/tbb-buildroot/usr/lib64/python3/site-packages/TBB.py: line=72 IGNORE (for REQ=slight and deep=12) module=imp
/usr/lib/rpm/python3.req.py: /usr/src/tmp/tbb-buildroot/usr/lib64/python3/site-packages/TBB.py: line=77 IGNORE (for REQ=slight and deep=16) module=_TBB
/usr/lib/rpm/python3.req.py: /usr/src/tmp/tbb-buildroot/usr/lib64/python3/site-packages/TBB.py: line=88 IGNORE (for REQ=slight and deep=8) module=_TBB
python3.req: /usr/src/tmp/tbb-buildroot/usr/lib64/python3/site-packages/TBB.py: skipping sys
/usr/lib/rpm/python3.req.py: /usr/src/tmp/tbb-buildroot/usr/lib64/python3/site-packages/TBB.py: line=866 IGNORE (for REQ=slight and deep=8) module=time
/usr/lib/rpm/python3.req.py: /usr/src/tmp/tbb-buildroot/usr/lib64/python3/site-packages/TBB.py: line=1018 IGNORE (for REQ=slight and deep=11) module=os
/usr/lib/rpm/python3.req.py: /usr/src/tmp/tbb-buildroot/usr/lib64/python3/site-packages/TBB.py: line=1021 IGNORE (for REQ=slight and deep=12) module=multiprocessing.pool
/usr/lib/rpm/python3.req.py: /usr/src/tmp/tbb-buildroot/usr/lib64/python3/site-packages/TBB.py: line=1021 IGNORE (for REQ=slight and deep=13) module=multiprocessing.pool
/usr/lib/rpm/python3.req.py: /usr/src/tmp/tbb-buildroot/usr/lib64/python3/site-packages/TBB.py: line=1021 IGNORE (for REQ=slight and deep=14) module=multiprocessing.pool
/usr/lib/rpm/python3.req.py: /usr/src/tmp/tbb-buildroot/usr/lib64/python3/site-packages/TBB.py: line=1021 IGNORE (for REQ=slight and deep=15) module=multiprocessing.pool
/usr/lib/rpm/python3.req.py: /usr/src/tmp/tbb-buildroot/usr/lib64/python3/site-packages/TBB.py: line=1021 IGNORE (for REQ=slight and deep=16) module=multiprocessing.pool
/usr/lib/rpm/python3.req.py: /usr/src/tmp/tbb-buildroot/usr/lib64/python3/site-packages/TBB.py: line=1021 IGNORE (for REQ=slight and deep=17) module=multiprocessing.pool
/usr/lib/rpm/python3.req.py: /usr/src/tmp/tbb-buildroot/usr/lib64/python3/site-packages/TBB.py: line=1021 IGNORE (for REQ=slight and deep=18) module=multiprocessing.pool
/usr/lib/rpm/python3.req.py: /usr/src/tmp/tbb-buildroot/usr/lib64/python3/site-packages/TBB.py: line=1021 IGNORE (for REQ=slight and deep=19) module=multiprocessing.pool
/usr/lib/rpm/python3.req.py: /usr/src/tmp/tbb-buildroot/usr/lib64/python3/site-packages/TBB.py: line=1021 IGNORE (for REQ=slight and deep=20) module=multiprocessing.pool
/usr/lib/rpm/python3.req.py: /usr/src/tmp/tbb-buildroot/usr/lib64/python3/site-packages/TBB.py: line=1021 IGNORE (for REQ=slight and deep=21) module=multiprocessing.pool
/usr/lib/rpm/python3.req.py: /usr/src/tmp/tbb-buildroot/usr/lib64/python3/site-packages/TBB.py: line=1021 IGNORE (for REQ=slight and deep=22) module=multiprocessing.pool
/usr/lib/rpm/python3.req.py: /usr/src/tmp/tbb-buildroot/usr/lib64/python3/site-packages/TBB.py: line=1021 IGNORE (for REQ=slight and deep=23) module=multiprocessing.pool
/usr/lib/rpm/python3.req.py: /usr/src/tmp/tbb-buildroot/usr/lib64/python3/site-packages/TBB.py: line=1021 IGNORE (for REQ=slight and deep=24) module=multiprocessing.pool
/usr/lib/rpm/python3.req.py: /usr/src/tmp/tbb-buildroot/usr/lib64/python3/site-packages/TBB.py: line=1021 IGNORE (for REQ=slight and deep=25) module=multiprocessing.pool
/usr/lib/rpm/python3.req.py: /usr/src/tmp/tbb-buildroot/usr/lib64/python3/site-packages/TBB.py: line=1021 IGNORE (for REQ=slight and deep=26) module=multiprocessing.pool
/usr/lib/rpm/python3.req.py: /usr/src/tmp/tbb-buildroot/usr/lib64/python3/site-packages/TBB.py: line=1029 IGNORE (for REQ=slight and deep=11) module=os
/usr/lib/rpm/python3.req.py: /usr/src/tmp/tbb-buildroot/usr/lib64/python3/site-packages/TBB.py: line=1047 IGNORE (for REQ=slight and deep=12) module=runpy
Provides: python3(TBB), python3(_TBB), python3.3(TBB), python3.3(_TBB)
Requires: /usr/lib64/python3/site-packages, libc.so.6(GLIBC_2.14)(64bit), libc.so.6(GLIBC_2.2.5)(64bit), libc.so.6(GLIBC_2.3.4)(64bit), libc.so.6(GLIBC_2.4)(64bit), libgcc_s.so.1(GCC_3.0)(64bit), libstdc++.so.6(CXXABI_1.3)(64bit), libstdc++.so.6(GLIBCXX_3.4)(64bit), libtbb.so.2()(64bit) >= set:mhyOGyryPIcNGuLXb9AOGrXfwHFekwvrUZuuvkrDATeAXktmjBZmTe0qN8eo4, python3(__future__) < 0, python3(threading) < 0, python3(traceback) < 0, python3.5-ABI(64bit), rtld(GNU_HASH)
Requires(rpmlib): rpmlib(SetVersions)
Finding debuginfo files (using /usr/lib/rpm/find-debuginfo-files)
Executing: /bin/sh -e /usr/src/tmp/rpm-tmp.IgN9mP
Creating python3-module-tbb-debuginfo package
Processing files: libtbb-debuginfo-2018-alt0.M80P.1.u1
Finding Provides (using /usr/lib/rpm/find-provides)
Executing: /bin/sh -e /usr/src/tmp/rpm-tmp.S6xTs1
find-provides: running scripts (debuginfo)
Finding Requires (using /usr/lib/rpm/find-requires)
Executing: /bin/sh -e /usr/src/tmp/rpm-tmp.G5q4zg
find-requires: running scripts (debuginfo)
Provides: debug64(libtbb.so.2), debug64(libtbbmalloc.so.2), debug64(libtbbmalloc_proxy.so.2)
Requires: libtbb = 2018-alt0.M80P.1.u1, debug64(libc.so.6), debug64(libdl.so.2), debug64(libgcc_s.so.1), debug64(libpthread.so.0), debug64(libstdc++.so.6)
Processing files: python-module-tbb-debuginfo-2018-alt0.M80P.1.u1
Finding Provides (using /usr/lib/rpm/find-provides)
Executing: /bin/sh -e /usr/src/tmp/rpm-tmp.GwlKPy
find-provides: running scripts (debuginfo)
Finding Requires (using /usr/lib/rpm/find-requires)
Executing: /bin/sh -e /usr/src/tmp/rpm-tmp.GzJe2T
find-requires: running scripts (debuginfo)
Requires: python-module-tbb = 2018-alt0.M80P.1.u1, debug64(libc.so.6), debug64(libgcc_s.so.1), debug64(libpython2.7.so.1.0), debug64(libstdc++.so.6), debug64(libtbb.so.2)
Processing files: python3-module-tbb-debuginfo-2018-alt0.M80P.1.u1
Finding Provides (using /usr/lib/rpm/find-provides)
Executing: /bin/sh -e /usr/src/tmp/rpm-tmp.IVE6bi
find-provides: running scripts (debuginfo)
Finding Requires (using /usr/lib/rpm/find-requires)
Executing: /bin/sh -e /usr/src/tmp/rpm-tmp.Uug3iJ
find-requires: running scripts (debuginfo)
Requires: python3-module-tbb = 2018-alt0.M80P.1.u1, debug64(libc.so.6), debug64(libgcc_s.so.1), debug64(libstdc++.so.6), debug64(libtbb.so.2)
Adding to python-module-tbb a strict dependency on libtbb
Adding to python3-module-tbb a strict dependency on libtbb
Adding to python-module-tbb-debuginfo a strict dependency on libtbb-debuginfo
Adding to python3-module-tbb-debuginfo a strict dependency on libtbb-debuginfo
Removing from python-module-tbb-debuginfo 24 sources provided by libtbb-debuginfo
also prunning dir /usr/src/debug/tbb-2018/include/tbb/machine
Removing from python3-module-tbb-debuginfo 24 sources provided by libtbb-debuginfo
also prunning dir /usr/src/debug/tbb-2018/include/tbb/machine
Removing 3 extra deps from tbb-devel due to dependency on libtbb
Removing 1 extra deps from python-module-tbb due to dependency on libtbb
Removing 2 extra deps from python3-module-tbb due to dependency on libtbb
Removing 1 extra deps from python-module-tbb-debuginfo due to dependency on libtbb-debuginfo
Removing 1 extra deps from python3-module-tbb-debuginfo due to dependency on libtbb-debuginfo
Removing 8 extra deps from python-module-tbb due to repentancy on libtbb
Removing 8 extra deps from python3-module-tbb due to repentancy on libtbb
Removing 3 extra deps from python-module-tbb-debuginfo due to repentancy on libtbb-debuginfo
Removing 3 extra deps from python3-module-tbb-debuginfo due to repentancy on libtbb-debuginfo
Wrote: /usr/src/RPM/RPMS/x86_64/libtbb-2018-alt0.M80P.1.u1.x86_64.rpm
Wrote: /usr/src/RPM/RPMS/x86_64/tbb-devel-2018-alt0.M80P.1.u1.x86_64.rpm
Wrote: /usr/src/RPM/RPMS/noarch/tbb-docs-2018-alt0.M80P.1.u1.noarch.rpm
Wrote: /usr/src/RPM/RPMS/x86_64/tbb-examples-2018-alt0.M80P.1.u1.x86_64.rpm
Wrote: /usr/src/RPM/RPMS/x86_64/python-module-tbb-2018-alt0.M80P.1.u1.x86_64.rpm
Wrote: /usr/src/RPM/RPMS/x86_64/python3-module-tbb-2018-alt0.M80P.1.u1.x86_64.rpm
Wrote: /usr/src/RPM/RPMS/x86_64/libtbb-debuginfo-2018-alt0.M80P.1.u1.x86_64.rpm
Wrote: /usr/src/RPM/RPMS/x86_64/python-module-tbb-debuginfo-2018-alt0.M80P.1.u1.x86_64.rpm
Wrote: /usr/src/RPM/RPMS/x86_64/python3-module-tbb-debuginfo-2018-alt0.M80P.1.u1.x86_64.rpm
38.96user 5.74system 0:47.98elapsed 93%CPU (0avgtext+0avgdata 266628maxresident)k
0inputs+0outputs (0major+2714702minor)pagefaults 0swaps
45.73user 8.23system 0:59.36elapsed 90%CPU (0avgtext+0avgdata 266628maxresident)k
0inputs+0outputs (0major+3157655minor)pagefaults 0swaps