<86>Oct 23 02:44:59 userdel[1609911]: delete user 'rooter'
<86>Oct 23 02:44:59 userdel[1609911]: removed group 'rooter' owned by 'rooter'
<86>Oct 23 02:44:59 userdel[1609911]: removed shadow group 'rooter' owned by 'rooter'
<86>Oct 23 02:44:59 groupadd[1609966]: group added to /etc/group: name=rooter, GID=1853
<86>Oct 23 02:44:59 groupadd[1609966]: group added to /etc/gshadow: name=rooter
<86>Oct 23 02:44:59 groupadd[1609966]: new group: name=rooter, GID=1853
<86>Oct 23 02:44:59 useradd[1610005]: new user: name=rooter, UID=1853, GID=1853, home=/root, shell=/bin/bash, from=none
<86>Oct 23 02:44:59 userdel[1610082]: delete user 'builder'
<86>Oct 23 02:44:59 userdel[1610082]: removed group 'builder' owned by 'builder'
<86>Oct 23 02:44:59 userdel[1610082]: removed shadow group 'builder' owned by 'builder'
<86>Oct 23 02:44:59 groupadd[1610143]: group added to /etc/group: name=builder, GID=1854
<86>Oct 23 02:44:59 groupadd[1610143]: group added to /etc/gshadow: name=builder
<86>Oct 23 02:44:59 groupadd[1610143]: new group: name=builder, GID=1854
<86>Oct 23 02:44:59 useradd[1610190]: new user: name=builder, UID=1854, GID=1854, home=/usr/src, shell=/bin/bash, from=none
/usr/src/in/srpm/wv2-0.4.2-alt3.src.rpm: The use of such a license name is ambiguous: GPL
warning: Macro %Kbuild not found
warning: Macro %Kinstall not found
<13>Oct 23 02:45:02 rpmi: libidn2-2.3.4-alt1 sisyphus+309023.100.1.1 1666791084 installed
<13>Oct 23 02:45:02 rpmi: libnettle8-3.9.1-alt1 sisyphus+322548.100.1.2 1686176879 installed
<13>Oct 23 02:45:02 rpmi: libjpeg-2:2.1.2-alt1.2 sisyphus+300827.100.2.1 1653916633 installed
<13>Oct 23 02:45:02 rpmi: libexpat-2.5.0-alt1 sisyphus+309227.100.1.1 1667075764 installed
<13>Oct 23 02:45:02 rpmi: libp11-kit-1:0.24.1-alt2 sisyphus+324666.100.1.1 1689083439 installed
<13>Oct 23 02:45:02 rpmi: libtasn1-4.19.0-alt3 sisyphus+327816.100.1.1 1692802615 installed
<13>Oct 23 02:45:02 rpmi: libhogweed6-3.9.1-alt1 sisyphus+322548.100.1.2 1686176879 installed
<13>Oct 23 02:45:02 rpmi: libgnutls30-3.8.1-alt2 sisyphus+326772.40.3.1 1692114175 installed
<13>Oct 23 02:45:02 rpmi: libngtcp2.13-0.16.0-alt1 sisyphus+323677.40.3.1 1687690555 installed
<13>Oct 23 02:45:02 rpmi: libngtcp2_crypto_gnutls5-0.16.0-alt1 sisyphus+323677.40.3.1 1687690555 installed
<13>Oct 23 02:45:02 rpmi: libxml2-devel-1:2.10.4-alt1 sisyphus+311250.4140.175.1 1685628991 installed
<13>Oct 23 02:45:02 rpmi: libwebp7-1.3.2-alt1 sisyphus+329541.100.1.1 1694676223 installed
<13>Oct 23 02:45:02 rpmi: libpng16-1.6.40-alt1 sisyphus+323732.100.1.1 1687771851 installed
<13>Oct 23 02:45:02 rpmi: desktop-file-utils-0.26-alt6 sisyphus+331944.100.1.3 1697550026 installed
<13>Oct 23 02:45:02 rpmi: shared-mime-info-2.3-alt1 sisyphus+331248.100.1.1 1696723928 installed
<13>Oct 23 02:45:02 rpmi: libgdk-pixbuf-locales-2.42.10-alt1 sisyphus+308991.100.1.1 1666721198 installed
<13>Oct 23 02:45:02 rpmi: libdeflate-1.19-alt1 sisyphus+329822.100.2.2 1695269327 installed
<13>Oct 23 02:45:02 rpmi: libtiff5-4.4.0-alt4 sisyphus+322581.100.1.2 1686180089 installed
<13>Oct 23 02:45:02 rpmi: rpm-macros-kde-common-devel-14.12.1-alt1 1422279175 installed
<13>Oct 23 02:45:02 rpmi: strace-6.5-alt1 sisyphus+328505.100.1.1 1693605974 installed
<13>Oct 23 02:45:02 rpmi: gsettings-desktop-schemas-data-45.0-alt1 sisyphus+325066.400.6.2 1695203930 installed
<13>Oct 23 02:45:02 rpmi: libgio-2.78.0-alt1 sisyphus+329802.100.1.1 1694991222 installed
<13>Oct 23 02:45:02 rpmi: gsettings-desktop-schemas-45.0-alt1 sisyphus+325066.400.6.2 1695203930 installed
<13>Oct 23 02:45:02 rpmi: libgdk-pixbuf-2.42.10-alt1 sisyphus+308991.100.1.1 1666721198 installed
<13>Oct 23 02:45:02 rpmi: libgsf-1.14.50-alt1 sisyphus+303646.100.1.1 1657778096 installed
<13>Oct 23 02:45:02 rpmi: libmpdec3-2.5.1-alt3 sisyphus+314490.500.5.1 1675432004 installed
<13>Oct 23 02:45:02 rpmi: libgdbm-1.8.3-alt10 sisyphus+278100.1600.1.1 1626058413 installed
<13>Oct 23 02:45:02 rpmi: libb2-0.98.1-alt1_1 sisyphus+291614.100.1.1 1638962877 installed
<13>Oct 23 02:45:02 rpmi: xml-utils-1:2.10.4-alt1 sisyphus+311250.4140.175.1 1685628991 installed
<13>Oct 23 02:45:02 rpmi: rpm-build-gir-0.7.3-alt3.1 sisyphus+319393.100.1.1 1682538783 installed
<13>Oct 23 02:45:02 rpmi: gcc-c++-common-1.4.27-alt1 sisyphus+278099.1300.1.1 1626028636 installed
<13>Oct 23 02:45:03 rpmi: libstdc++13-devel-13.2.1-alt2 sisyphus+327572.100.1.1 1692472816 installed
<13>Oct 23 02:45:04 rpmi: gcc13-c++-13.2.1-alt2 sisyphus+327572.100.1.1 1692472816 installed
<13>Oct 23 02:45:04 rpmi: ed-1:0.2-alt10 sisyphus+278100.1100.1.1 1626056843 installed
<13>Oct 23 02:45:04 rpmi: rpm-utils-0.10.4-alt1 sisyphus+301046.100.1.1 1654119060 installed
<13>Oct 23 02:45:04 rpmi: rpm-macros-cmake-3.27.7-alt1 sisyphus+331245.40.2.1 1697877617 installed
<13>Oct 23 02:45:04 rpmi: cmake-modules-3.27.7-alt1 sisyphus+331245.40.2.1 1697877617 installed
<13>Oct 23 02:45:04 rpmi: libuv-1.46.0-alt1 sisyphus+326001.100.1.1 1690655254 installed
<13>Oct 23 02:45:04 rpmi: librhash-1.3.5-alt3 sisyphus+286141.40.2.1 1632982456 installed
<13>Oct 23 02:45:04 rpmi: libjsoncpp24-1.9.4-alt2 sisyphus+286441.100.1.1 1633444232 installed
<13>Oct 23 02:45:04 rpmi: publicsuffix-list-dafsa-20230701-alt1 sisyphus+324303.100.1.1 1688561153 installed
<13>Oct 23 02:45:04 rpmi: libpsl-0.21.2-alt1 sisyphus+312536.100.1.1 1672131178 installed
<13>Oct 23 02:45:04 rpmi: libnghttp3.7-0.12.0-alt1 sisyphus+323677.20.3.1 1687690506 installed
<13>Oct 23 02:45:04 rpmi: libnghttp2-1.57.0-alt1 sisyphus+331457.200.2.1 1697011702 installed
<13>Oct 23 02:45:04 rpmi: openldap-common-2.6.6-alt1 sisyphus+330946.100.2.1 1696432854 installed
<13>Oct 23 02:45:04 rpmi: libntlm-1.5-alt1 sisyphus+278100.3300.1.1 1626058899 installed
<13>Oct 23 02:45:04 rpmi: libidn-1.37-alt2 sisyphus+300849.100.1.1 1653769687 installed
<13>Oct 23 02:45:04 rpmi: libverto-0.3.2-alt1_1 sisyphus+321176.2200.10.2 1684803947 installed
<13>Oct 23 02:45:04 rpmi: liblmdb-0.9.31-alt1 sisyphus+330946.40.2.1 1696431544 installed
<13>Oct 23 02:45:04 rpmi: libkeyutils-1.6.3-alt1 sisyphus+266061.100.1.1 1612919566 installed
<13>Oct 23 02:45:04 rpmi: libcom_err-1.46.4.0.5.4cda-alt1 sisyphus+283826.100.1.1 1629975345 installed
<13>Oct 23 02:45:04 rpmi: libbrotlicommon-1.1.0-alt1 sisyphus+328501.100.1.1 1693598419 installed
<13>Oct 23 02:45:04 rpmi: libbrotlidec-1.1.0-alt1 sisyphus+328501.100.1.1 1693598419 installed
<13>Oct 23 02:45:04 rpmi: rpm-macros-alternatives-0.5.2-alt2 sisyphus+315270.200.2.1 1676457367 installed
<13>Oct 23 02:45:04 rpmi: alternatives-0.5.2-alt2 sisyphus+315270.200.2.1 1676457367 installed
<13>Oct 23 02:45:04 rpmi: ca-certificates-2023.07.31-alt1 sisyphus+326137.200.1.1 1690809798 installed
<13>Oct 23 02:45:04 rpmi: ca-trust-0.1.4-alt1 sisyphus+308690.100.1.1 1666182992 installed
<13>Oct 23 02:45:04 rpmi: p11-kit-trust-1:0.24.1-alt2 sisyphus+324666.100.1.1 1689083439 installed
<13>Oct 23 02:45:04 rpmi: libcrypto3-3.1.3-alt1 sisyphus+329935.40.3.2 1695159002 installed
<13>Oct 23 02:45:04 rpmi: libssl3-3.1.3-alt1 sisyphus+329935.40.3.2 1695159002 installed
<86>Oct 23 02:45:04 groupadd[1639587]: group added to /etc/group: name=_keytab, GID=999
<86>Oct 23 02:45:04 groupadd[1639587]: group added to /etc/gshadow: name=_keytab
<86>Oct 23 02:45:04 groupadd[1639587]: new group: name=_keytab, GID=999
<13>Oct 23 02:45:04 rpmi: libkrb5-1.21.2-alt1 sisyphus+327265.100.1.1 1692185462 installed
<13>Oct 23 02:45:04 rpmi: python3-3.11.6-alt1 sisyphus+331220.100.1.1 1696667994 installed
<13>Oct 23 02:45:05 rpmi: python3-base-3.11.6-alt1 sisyphus+331220.100.1.1 1696667994 installed
<13>Oct 23 02:45:05 rpmi: glib2-devel-2.78.0-alt1 sisyphus+329802.100.1.1 1694991222 installed
<13>Oct 23 02:45:05 rpmi: libgio-devel-2.78.0-alt1 sisyphus+329802.100.1.1 1694991222 installed
<13>Oct 23 02:45:05 rpmi: libgsasl-1.8.0-alt3 sisyphus+275307.100.1.2 1624478543 installed
<86>Oct 23 02:45:05 groupadd[1646954]: group added to /etc/group: name=sasl, GID=998
<86>Oct 23 02:45:05 groupadd[1646954]: group added to /etc/gshadow: name=sasl
<86>Oct 23 02:45:05 groupadd[1646954]: new group: name=sasl, GID=998
<13>Oct 23 02:45:05 rpmi: libsasl2-3-2.1.27-alt2.2 sisyphus+324359.6000.12.1 1689392001 installed
<13>Oct 23 02:45:05 rpmi: libldap2-2.6.6-alt1 sisyphus+330946.100.2.1 1696432854 installed
<13>Oct 23 02:45:05 rpmi: libarchive13-3.6.1-alt2 sisyphus+324359.1300.6.1 1689326379 installed
<13>Oct 23 02:45:05 rpmi: libssh2-1.11.0-alt1 sisyphus+327652.100.1.1 1692636577 installed
<13>Oct 23 02:45:05 rpmi: libcurl-8.4.0-alt1 sisyphus+331441.100.1.1 1697006819 installed
<13>Oct 23 02:45:06 rpmi: cmake-3.27.7-alt1 sisyphus+331245.40.2.1 1697877617 installed
<13>Oct 23 02:45:06 rpmi: libgsf-devel-1.14.50-alt1 sisyphus+303646.100.1.1 1657778096 installed
<13>Oct 23 02:45:06 rpmi: kde-common-devel-14.12.1-alt1 1422279175 installed
<13>Oct 23 02:45:06 rpmi: gcc-c++-13-alt1 sisyphus+323337.300.1.1 1687267966 installed
<13>Oct 23 02:45:06 rpmi: libstdc++-devel-13-alt1 sisyphus+323337.300.1.1 1687267966 installed
<13>Oct 23 02:45:06 rpmi: zlib-devel-1.2.13-alt1 sisyphus+309409.200.2.1 1667402043 installed
Building target platforms: x86_64
Building for target x86_64
Wrote: /usr/src/in/nosrpm/wv2-0.4.2-alt3.nosrc.rpm (w1.gzdio)
Installing wv2-0.4.2-alt3.src.rpm
Building target platforms: x86_64
Building for target x86_64
Executing(%prep): /bin/sh -e /usr/src/tmp/rpm-tmp.48289
+ umask 022
+ /bin/mkdir -p /usr/src/RPM/BUILD
+ cd /usr/src/RPM/BUILD
+ cd /usr/src/RPM/BUILD
+ rm -rf wv2-0.4.2
+ echo 'Source #0 (wv2-0.4.2.tar.bz2):'
Source #0 (wv2-0.4.2.tar.bz2):
+ /bin/bzip2 -dc /usr/src/RPM/SOURCES/wv2-0.4.2.tar.bz2
+ /bin/tar -xf -
+ cd wv2-0.4.2
+ /bin/chmod -c -Rf u+rwX,go-w .
+ echo 'Patch #1 (wv2-0.4.2-alt-glib2.32.patch):'
Patch #1 (wv2-0.4.2-alt-glib2.32.patch):
+ /usr/bin/patch -p1
patching file src/olestream.h
+ exit 0
Executing(%build): /bin/sh -e /usr/src/tmp/rpm-tmp.48289
+ umask 022
+ /bin/mkdir -p /usr/src/RPM/BUILD
+ cd /usr/src/RPM/BUILD
+ cd wv2-0.4.2
+ export 'CFLAGS=-pipe -frecord-gcc-switches -Wall -g -O2 -flto=auto -I/usr/include/libxml2'
+ CFLAGS='-pipe -frecord-gcc-switches -Wall -g -O2 -flto=auto -I/usr/include/libxml2'
+ __kde_build
+ mkdir -p BUILD-x86_64-alt-linux
+ __kde4_cmake -DINCLUDE_INSTALL_DIR=/usr/include -DSOUND_INSTALL_DIR=/usr/share/sounds -DAUTOSTART_INSTALL_DIR=/etc/xdg/autostart -DXDG_DIRECTORY_INSTALL_DIR=/usr/share/desktop-directories -DXDG_APPS_INSTALL_DIR=/usr/share/applications
+ export PATH=/usr/lib/kde4/bin:/usr/src/bin:/bin:/usr/bin:/usr/X11R6/bin:/usr/games
+ PATH=/usr/lib/kde4/bin:/usr/src/bin:/bin:/usr/bin:/usr/X11R6/bin:/usr/games
+ pushd BUILD-x86_64-alt-linux
~/RPM/BUILD/wv2-0.4.2/BUILD-x86_64-alt-linux ~/RPM/BUILD/wv2-0.4.2
+ cmake .. -DCMAKE_SKIP_RPATH:BOOL=yes -DCMAKE_BUILD_TYPE=Release '-DCMAKE_C_FLAGS:STRING=-pipe -frecord-gcc-switches -Wall -g -O2 -flto=auto -I/usr/include/libxml2' '-DCMAKE_CXX_FLAGS:STRING=-pipe -frecord-gcc-switches -Wall -g -O2 -flto=auto -I/usr/include/libxml2' '-DCMAKE_EXE_LINKER_FLAGS:STRING=-L/usr/lib64/kde4link -L/usr/lib64/kde4/devel' '-DCMAKE_MODULE_LINKER_FLAGS:STRING=-L/usr/lib64/kde4link -L/usr/lib64/kde4/devel' '-DCMAKE_SHARED_LINKER_FLAGS:STRING=-L/usr/lib64/kde4link -L/usr/lib64/kde4/devel' '-DCMAKE_LIBRARY_PATH:LIST=/usr/lib64/kde4/devel;/usr/lib64/kde4link;/usr/lib64;/lib64' -DLIB_DESTINATION=lib64 -DLIB_SUFFIX=64 -DCMAKE_INSTALL_PREFIX=/usr -DBIN_INSTALL_DIR=/usr/bin -DSBIN_INSTALL_DIR=/usr/sbin -DICON_INSTALL_DIR=/usr/share/icons -DXDG_APPS_INSTALL_DIR=/usr/share/applications/kde4 -DXDG_DIRECTORY_INSTALL_DIR=/usr/share/desktop-directories -DLIB_INSTALL_DIR=/usr/lib64 -DLIBEXEC_INSTALL_DIR=/usr/lib64/kde4/libexec -DINCLUDE_INSTALL_DIR=/usr/include/kde4 -DKDE4_INCLUDE_INSTALL_DIR=/usr/include/kde4 -DSYSCONF_INSTALL_DIR=/etc -DDATA_INSTALL_DIR=/usr/share/kde4/apps -DCONFIG_INSTALL_DIR=/usr/share/kde4/config -DKCFG_INSTALL_DIR=/usr/share/kde4/config.kcfg -DHTML_INSTALL_DIR=/usr/share/kde4/doc/HTML -DAPPLNK_INSTALL_DIR=/usr/share/applnk -DLOCALE_INSTALL_DIR=/usr/share/kde4/locale -DSERVICES_INSTALL_DIR=/usr/share/kde4/services -DSERVICETYPES_INSTALL_DIR=/usr/share/kde4/servicetypes -DKCONF_UPDATE_INSTALL_DIR=/usr/share/kde4/apps/kconf_update -DXDG_MIME_INSTALL_DIR=/usr/share/mime/packages -DAUTOSTART_INSTALL_DIR=/usr/share/kde4/autostart -DSOUND_INSTALL_DIR=/usr/share/kde4/sounds -DTEMPLATES_INSTALL_DIR=/usr/share/kde4/templates -DWALLPAPER_INSTALL_DIR=/usr/share/wallpapers -DDBUS_INTERFACES_INSTALL_DIR=/usr/share/dbus-1/interfaces -DDBUS_SERVICES_INSTALL_DIR=/usr/share/dbus-1/services -DDBUS_SYSTEM_SERVICES_INSTALL_DIR=/usr/share/dbus-1/system-services -DMAN_INSTALL_DIR=/usr/share/man -DINFO_INSTALL_DIR=/usr/share/info -DINSTALL_PYTHON_FILES_IN_PYTHON_PREFIX:BOOL=yes -DINCLUDE_INSTALL_DIR=/usr/include -DSOUND_INSTALL_DIR=/usr/share/sounds -DAUTOSTART_INSTALL_DIR=/etc/xdg/autostart -DXDG_DIRECTORY_INSTALL_DIR=/usr/share/desktop-directories -DXDG_APPS_INSTALL_DIR=/usr/share/applications
CMake Warning (dev) at CMakeLists.txt:1 (PROJECT):
  cmake_minimum_required() should be called prior to this top-level project()
  call.  Please see the cmake-commands(7) manual for usage documentation of
  both commands.
This warning is for project developers.  Use -Wno-dev to suppress it.

-- The C compiler identification is GNU 13.2.1
-- The CXX compiler identification is GNU 13.2.1
-- Detecting C compiler ABI info
-- Detecting C compiler ABI info - done
-- Check for working C compiler: /usr/bin/cc - skipped
-- Detecting C compile features
-- Detecting C compile features - done
-- Detecting CXX compiler ABI info
-- Detecting CXX compiler ABI info - done
-- Check for working CXX compiler: /usr/bin/c++ - skipped
-- Detecting CXX compile features
-- Detecting CXX compile features - done
CMake Deprecation Warning at CMakeLists.txt:3 (cmake_minimum_required):
  Compatibility with CMake < 3.5 will be removed from a future version of
  CMake.

  Update the VERSION argument <min> value or use a ...<max> suffix to tell
  CMake that the project does not need compatibility with older versions.


-- WARNING: you are using the obsolete 'PKGCONFIG' macro, use FindPkgConfig
-- Found GLIB2: /usr/lib64/libglib-2.0.so  
-- Found PkgConfig: /usr/bin/pkg-config (found version "0.29.2") 
-- Checking for module 'libgsf-1'
--   Found libgsf-1, version 1.14.50
Package libpcre2-8 was not found in the pkg-config search path.
Perhaps you should add the directory containing `libpcre2-8.pc'
to the PKG_CONFIG_PATH environment variable
Package 'libpcre2-8', required by 'glib-2.0', not found
Package libpcre2-8 was not found in the pkg-config search path.
Perhaps you should add the directory containing `libpcre2-8.pc'
to the PKG_CONFIG_PATH environment variable
Package 'libpcre2-8', required by 'glib-2.0', not found
Package libpcre2-8 was not found in the pkg-config search path.
Perhaps you should add the directory containing `libpcre2-8.pc'
to the PKG_CONFIG_PATH environment variable
Package 'libpcre2-8', required by 'glib-2.0', not found
Package libpcre2-8 was not found in the pkg-config search path.
Perhaps you should add the directory containing `libpcre2-8.pc'
to the PKG_CONFIG_PATH environment variable
Package 'libpcre2-8', required by 'glib-2.0', not found
-- Found LIBGSF: /usr/lib64/libgsf-1.so  
-- Performing Test ICONV_SECOND_ARGUMENT_IS_CONST
-- Performing Test ICONV_SECOND_ARGUMENT_IS_CONST - Failed
-- Found Iconv: /usr/lib64/libc.so
-- Found ZLIB: /usr/lib64/libz.so (found version "1.2.13")  
-- Looking for sys/iconv.h
-- Looking for sys/iconv.h - not found
-- Looking for dlfcn.h
-- Looking for dlfcn.h - found
-- Looking for strings.h
-- Looking for strings.h - found
-- Looking for string.h
-- Looking for string.h - found
-- Looking for math.h
-- Looking for math.h - found
-- Looking for float.h
-- Looking for float.h - found
-- Looking for ieeefp.h
-- Looking for ieeefp.h - not found
-- Looking for errno.h
-- Looking for errno.h - found
-- Looking for inttypes.h
-- Looking for inttypes.h - found
-- Looking for memory.h
-- Looking for memory.h - found
-- Looking for stdlib.h
-- Looking for stdlib.h - found
-- Looking for unistd.h
-- Looking for unistd.h - found
-- Looking for stdint.h
-- Looking for stdint.h - found
-- Looking for sys/types.h
-- Looking for sys/types.h - found
-- Looking for sys/stat.h
-- Looking for sys/stat.h - found
-- Looking for stddef.h
-- Looking for stddef.h - found
-- Check size of char
-- Check size of char - done
-- Check size of short
-- Check size of short - done
-- Check size of long
-- Check size of long - done
-- Check size of int
-- Check size of int - done
-- Check size of void *
-- Check size of void * - done
-- Looking for isinf
-- Looking for isinf - found
-- Looking for isnan
-- Looking for isnan - found
-- Looking for finite
-- Looking for finite - found
-- Looking for _finite
-- Looking for _finite - not found
-- Looking for inflate
-- Looking for inflate - found
CMake Warning (dev) at cmake/MacroCreateLibtoolFile.cmake:12 (GET_TARGET_PROPERTY):
  Policy CMP0026 is not set: Disallow use of the LOCATION target property.
  Run "cmake --help-policy CMP0026" for policy details.  Use the cmake_policy
  command to set the policy and suppress this warning.

  The LOCATION property should not be read from target "wv2".  Use the target
  name directly with add_custom_command, or use the generator expression
  $<TARGET_FILE>, as appropriate.

Call Stack (most recent call first):
  src/CMakeLists.txt:106 (CREATE_LIBTOOL_FILE)
This warning is for project developers.  Use -Wno-dev to suppress it.

-- Configuring done (3.4s)
-- Generating done (0.0s)
CMake Warning:
  Manually-specified variables were not used by the project:

    APPLNK_INSTALL_DIR
    AUTOSTART_INSTALL_DIR
    BIN_INSTALL_DIR
    CMAKE_MODULE_LINKER_FLAGS
    CONFIG_INSTALL_DIR
    DATA_INSTALL_DIR
    DBUS_INTERFACES_INSTALL_DIR
    DBUS_SERVICES_INSTALL_DIR
    DBUS_SYSTEM_SERVICES_INSTALL_DIR
    HTML_INSTALL_DIR
    ICON_INSTALL_DIR
    INCLUDE_INSTALL_DIR
    INFO_INSTALL_DIR
    INSTALL_PYTHON_FILES_IN_PYTHON_PREFIX
    KCFG_INSTALL_DIR
    KCONF_UPDATE_INSTALL_DIR
    KDE4_INCLUDE_INSTALL_DIR
    LIBEXEC_INSTALL_DIR
    LIB_DESTINATION
    LIB_INSTALL_DIR
    LOCALE_INSTALL_DIR
    MAN_INSTALL_DIR
    SBIN_INSTALL_DIR
    SERVICES_INSTALL_DIR
    SERVICETYPES_INSTALL_DIR
    SOUND_INSTALL_DIR
    SYSCONF_INSTALL_DIR
    TEMPLATES_INSTALL_DIR
    WALLPAPER_INSTALL_DIR
    XDG_APPS_INSTALL_DIR
    XDG_MIME_INSTALL_DIR


-- Build files have been written to: /usr/src/RPM/BUILD/wv2-0.4.2/BUILD-x86_64-alt-linux
+ popd
~/RPM/BUILD/wv2-0.4.2
+ __kde4_make
+ pushd BUILD-x86_64-alt-linux
~/RPM/BUILD/wv2-0.4.2/BUILD-x86_64-alt-linux ~/RPM/BUILD/wv2-0.4.2
+ make -j16
make[2]: Entering directory '/usr/src/RPM/BUILD/wv2-0.4.2/BUILD-x86_64-alt-linux'
[ 24%] Building CXX object src/CMakeFiles/wv2.dir/global.cpp.o
make[2]: Leaving directory '/usr/src/RPM/BUILD/wv2-0.4.2/BUILD-x86_64-alt-linux'
make[2]: Entering directory '/usr/src/RPM/BUILD/wv2-0.4.2/BUILD-x86_64-alt-linux'
[ 43%] Building CXX object src/CMakeFiles/wv2.dir/ustring.cpp.o
/usr/src/RPM/BUILD/wv2-0.4.2/src/ustring.cpp: In function 'bool wvWare::isNegInf(double)':
/usr/src/RPM/BUILD/wv2-0.4.2/src/ustring.cpp:93:20: warning: comparison of constant '-1' with boolean expression is always false [-Wbool-compare]
   93 |   return (isinf(d) == -1);
      |           ~~~~~~~~~^~~~~
make[2]: Leaving directory '/usr/src/RPM/BUILD/wv2-0.4.2/BUILD-x86_64-alt-linux'
make[2]: Entering directory '/usr/src/RPM/BUILD/wv2-0.4.2/BUILD-x86_64-alt-linux'
[ 37%] Building CXX object src/CMakeFiles/wv2.dir/textconverter.cpp.o
make[2]: Leaving directory '/usr/src/RPM/BUILD/wv2-0.4.2/BUILD-x86_64-alt-linux'
make[2]: Entering directory '/usr/src/RPM/BUILD/wv2-0.4.2/BUILD-x86_64-alt-linux'
[ 32%] Building CXX object src/CMakeFiles/wv2.dir/parser97.cpp.o
In file included from /usr/src/RPM/BUILD/wv2-0.4.2/src/word97_generated.h:33,
                 from /usr/src/RPM/BUILD/wv2-0.4.2/src/parser9x.h:23,
                 from /usr/src/RPM/BUILD/wv2-0.4.2/src/parser97.h:22,
                 from /usr/src/RPM/BUILD/wv2-0.4.2/src/parser97.cpp:19:
/usr/src/RPM/BUILD/wv2-0.4.2/src/utilities.h:28:51: warning: 'template<class _Arg, class _Result> struct std::unary_function' is deprecated [-Wdeprecated-declarations]
   28 |     template<class T> struct Delete : public std::unary_function<T*, void>
      |                                                   ^~~~~~~~~~~~~~
In file included from /usr/include/c++/13/functional:49,
                 from /usr/src/RPM/BUILD/wv2-0.4.2/src/utilities.h:23:
/usr/include/c++/13/bits/stl_function.h:117:12: note: declared here
  117 |     struct unary_function
      |            ^~~~~~~~~~~~~~
make[2]: Leaving directory '/usr/src/RPM/BUILD/wv2-0.4.2/BUILD-x86_64-alt-linux'
make[2]: Entering directory '/usr/src/RPM/BUILD/wv2-0.4.2/BUILD-x86_64-alt-linux'
[ 21%] Building CXX object src/CMakeFiles/wv2.dir/convert.cpp.o
In file included from /usr/src/RPM/BUILD/wv2-0.4.2/src/word95_generated.h:33,
                 from /usr/src/RPM/BUILD/wv2-0.4.2/src/convert.h:31,
                 from /usr/src/RPM/BUILD/wv2-0.4.2/src/convert.cpp:29:
/usr/src/RPM/BUILD/wv2-0.4.2/src/utilities.h:28:51: warning: 'template<class _Arg, class _Result> struct std::unary_function' is deprecated [-Wdeprecated-declarations]
   28 |     template<class T> struct Delete : public std::unary_function<T*, void>
      |                                                   ^~~~~~~~~~~~~~
In file included from /usr/include/c++/13/functional:49,
                 from /usr/src/RPM/BUILD/wv2-0.4.2/src/utilities.h:23:
/usr/include/c++/13/bits/stl_function.h:117:12: note: declared here
  117 |     struct unary_function
      |            ^~~~~~~~~~~~~~
make[2]: Leaving directory '/usr/src/RPM/BUILD/wv2-0.4.2/BUILD-x86_64-alt-linux'
make[2]: Entering directory '/usr/src/RPM/BUILD/wv2-0.4.2/BUILD-x86_64-alt-linux'
[ 27%] Building CXX object src/CMakeFiles/wv2.dir/parser.cpp.o
make[2]: Leaving directory '/usr/src/RPM/BUILD/wv2-0.4.2/BUILD-x86_64-alt-linux'
make[2]: Entering directory '/usr/src/RPM/BUILD/wv2-0.4.2/BUILD-x86_64-alt-linux'
[ 48%] Building CXX object src/CMakeFiles/wv2.dir/handlers.cpp.o
In file included from /usr/src/RPM/BUILD/wv2-0.4.2/src/word97_generated.h:33,
                 from /usr/src/RPM/BUILD/wv2-0.4.2/src/parser9x.h:23,
                 from /usr/src/RPM/BUILD/wv2-0.4.2/src/handlers.cpp:20:
/usr/src/RPM/BUILD/wv2-0.4.2/src/utilities.h:28:51: warning: 'template<class _Arg, class _Result> struct std::unary_function' is deprecated [-Wdeprecated-declarations]
   28 |     template<class T> struct Delete : public std::unary_function<T*, void>
      |                                                   ^~~~~~~~~~~~~~
In file included from /usr/include/c++/13/bits/refwrap.h:39,
                 from /usr/include/c++/13/vector:68,
                 from /usr/src/RPM/BUILD/wv2-0.4.2/src/handlers.h:22,
                 from /usr/src/RPM/BUILD/wv2-0.4.2/src/handlers.cpp:19:
/usr/include/c++/13/bits/stl_function.h:117:12: note: declared here
  117 |     struct unary_function
      |            ^~~~~~~~~~~~~~
make[2]: Leaving directory '/usr/src/RPM/BUILD/wv2-0.4.2/BUILD-x86_64-alt-linux'
make[2]: Entering directory '/usr/src/RPM/BUILD/wv2-0.4.2/BUILD-x86_64-alt-linux'
[  2%] Building CXX object src/CMakeFiles/wv2.dir/olestorage.cpp.o
make[2]: Leaving directory '/usr/src/RPM/BUILD/wv2-0.4.2/BUILD-x86_64-alt-linux'
make[2]: Entering directory '/usr/src/RPM/BUILD/wv2-0.4.2/BUILD-x86_64-alt-linux'
[ 13%] Building CXX object src/CMakeFiles/wv2.dir/word95_helper.cpp.o
In file included from /usr/src/RPM/BUILD/wv2-0.4.2/src/word95_generated.h:33,
                 from /usr/src/RPM/BUILD/wv2-0.4.2/src/word95_helper.cpp:21:
/usr/src/RPM/BUILD/wv2-0.4.2/src/utilities.h:28:51: warning: 'template<class _Arg, class _Result> struct std::unary_function' is deprecated [-Wdeprecated-declarations]
   28 |     template<class T> struct Delete : public std::unary_function<T*, void>
      |                                                   ^~~~~~~~~~~~~~
In file included from /usr/include/c++/13/functional:49,
                 from /usr/src/RPM/BUILD/wv2-0.4.2/src/utilities.h:23:
/usr/include/c++/13/bits/stl_function.h:117:12: note: declared here
  117 |     struct unary_function
      |            ^~~~~~~~~~~~~~
make[2]: Leaving directory '/usr/src/RPM/BUILD/wv2-0.4.2/BUILD-x86_64-alt-linux'
make[2]: Entering directory '/usr/src/RPM/BUILD/wv2-0.4.2/BUILD-x86_64-alt-linux'
[  8%] Building CXX object src/CMakeFiles/wv2.dir/olestream.cpp.o
/usr/src/RPM/BUILD/wv2-0.4.2/src/olestream.cpp: In member function 'virtual wvWare::OLEStreamReader* wvWare::OLEStreamReader::inflate(int) const':
/usr/src/RPM/BUILD/wv2-0.4.2/src/olestream.cpp:107:24: warning: comparison of integer expressions of different signedness: 'int' and 'guint' {aka 'unsigned int'} [-Wsign-compare]
  107 |     for ( int i = 0; i < gbArray->len; i++ ) {
      |                      ~~^~~~~~~~~~~~~~
make[2]: Leaving directory '/usr/src/RPM/BUILD/wv2-0.4.2/BUILD-x86_64-alt-linux'
make[2]: Entering directory '/usr/src/RPM/BUILD/wv2-0.4.2/BUILD-x86_64-alt-linux'
[ 18%] Building CXX object src/CMakeFiles/wv2.dir/word_helper.cpp.o
make[2]: Leaving directory '/usr/src/RPM/BUILD/wv2-0.4.2/BUILD-x86_64-alt-linux'
make[2]: Entering directory '/usr/src/RPM/BUILD/wv2-0.4.2/BUILD-x86_64-alt-linux'
[ 70%] Building CXX object src/CMakeFiles/wv2.dir/functor.cpp.o
make[2]: Leaving directory '/usr/src/RPM/BUILD/wv2-0.4.2/BUILD-x86_64-alt-linux'
make[2]: Entering directory '/usr/src/RPM/BUILD/wv2-0.4.2/BUILD-x86_64-alt-linux'
[ 40%] Building CXX object src/CMakeFiles/wv2.dir/parserfactory.cpp.o
In file included from /usr/src/RPM/BUILD/wv2-0.4.2/src/word97_generated.h:33,
                 from /usr/src/RPM/BUILD/wv2-0.4.2/src/parser9x.h:23,
                 from /usr/src/RPM/BUILD/wv2-0.4.2/src/parser95.h:22,
                 from /usr/src/RPM/BUILD/wv2-0.4.2/src/parserfactory.cpp:20:
/usr/src/RPM/BUILD/wv2-0.4.2/src/utilities.h:28:51: warning: 'template<class _Arg, class _Result> struct std::unary_function' is deprecated [-Wdeprecated-declarations]
   28 |     template<class T> struct Delete : public std::unary_function<T*, void>
      |                                                   ^~~~~~~~~~~~~~
In file included from /usr/include/c++/13/string:49,
                 from /usr/src/RPM/BUILD/wv2-0.4.2/src/parserfactory.h:22,
                 from /usr/src/RPM/BUILD/wv2-0.4.2/src/parserfactory.cpp:19:
/usr/include/c++/13/bits/stl_function.h:117:12: note: declared here
  117 |     struct unary_function
      |            ^~~~~~~~~~~~~~
/usr/src/RPM/BUILD/wv2-0.4.2/src/parserfactory.cpp: In static member function 'static wvWare::SharedPtr<wvWare::Parser> wvWare::ParserFactory::createParser(const std::string&)':
/usr/src/RPM/BUILD/wv2-0.4.2/src/parserfactory.cpp:117:14: warning: ignoring return value of 'size_t fread(void*, size_t, size_t, FILE*)' declared with attribute 'warn_unused_result' [-Wunused-result]
  117 |         fread( buffer, 1, 4, file );
      |         ~~~~~^~~~~~~~~~~~~~~~~~~~~~
make[2]: Leaving directory '/usr/src/RPM/BUILD/wv2-0.4.2/BUILD-x86_64-alt-linux'
make[2]: Entering directory '/usr/src/RPM/BUILD/wv2-0.4.2/BUILD-x86_64-alt-linux'
[ 35%] Building CXX object src/CMakeFiles/wv2.dir/parser95.cpp.o
In file included from /usr/src/RPM/BUILD/wv2-0.4.2/src/word97_generated.h:33,
                 from /usr/src/RPM/BUILD/wv2-0.4.2/src/parser9x.h:23,
                 from /usr/src/RPM/BUILD/wv2-0.4.2/src/parser95.h:22,
                 from /usr/src/RPM/BUILD/wv2-0.4.2/src/parser95.cpp:19:
/usr/src/RPM/BUILD/wv2-0.4.2/src/utilities.h:28:51: warning: 'template<class _Arg, class _Result> struct std::unary_function' is deprecated [-Wdeprecated-declarations]
   28 |     template<class T> struct Delete : public std::unary_function<T*, void>
      |                                                   ^~~~~~~~~~~~~~
In file included from /usr/include/c++/13/functional:49,
                 from /usr/src/RPM/BUILD/wv2-0.4.2/src/utilities.h:23:
/usr/include/c++/13/bits/stl_function.h:117:12: note: declared here
  117 |     struct unary_function
      |            ^~~~~~~~~~~~~~
make[2]: Leaving directory '/usr/src/RPM/BUILD/wv2-0.4.2/BUILD-x86_64-alt-linux'
make[2]: Entering directory '/usr/src/RPM/BUILD/wv2-0.4.2/BUILD-x86_64-alt-linux'
[ 67%] Building CXX object src/CMakeFiles/wv2.dir/headers97.cpp.o
make[2]: Leaving directory '/usr/src/RPM/BUILD/wv2-0.4.2/BUILD-x86_64-alt-linux'
make[2]: Entering directory '/usr/src/RPM/BUILD/wv2-0.4.2/BUILD-x86_64-alt-linux'
[ 59%] Building CXX object src/CMakeFiles/wv2.dir/paragraphproperties.cpp.o
In file included from /usr/src/RPM/BUILD/wv2-0.4.2/src/word97_generated.h:33,
                 from /usr/src/RPM/BUILD/wv2-0.4.2/src/paragraphproperties.h:22,
                 from /usr/src/RPM/BUILD/wv2-0.4.2/src/paragraphproperties.cpp:19:
/usr/src/RPM/BUILD/wv2-0.4.2/src/utilities.h:28:51: warning: 'template<class _Arg, class _Result> struct std::unary_function' is deprecated [-Wdeprecated-declarations]
   28 |     template<class T> struct Delete : public std::unary_function<T*, void>
      |                                                   ^~~~~~~~~~~~~~
In file included from /usr/include/c++/13/functional:49,
                 from /usr/src/RPM/BUILD/wv2-0.4.2/src/utilities.h:23:
/usr/include/c++/13/bits/stl_function.h:117:12: note: declared here
  117 |     struct unary_function
      |            ^~~~~~~~~~~~~~
make[2]: Leaving directory '/usr/src/RPM/BUILD/wv2-0.4.2/BUILD-x86_64-alt-linux'
make[2]: Entering directory '/usr/src/RPM/BUILD/wv2-0.4.2/BUILD-x86_64-alt-linux'
[ 86%] Building C object src/CMakeFiles/wv2.dir/crc32.c.o
make[2]: Leaving directory '/usr/src/RPM/BUILD/wv2-0.4.2/BUILD-x86_64-alt-linux'
make[2]: Entering directory '/usr/src/RPM/BUILD/wv2-0.4.2/BUILD-x86_64-alt-linux'
[ 45%] Building CXX object src/CMakeFiles/wv2.dir/styles.cpp.o
/usr/src/RPM/BUILD/wv2-0.4.2/src/styles.cpp:242:2: warning: #warning "Couldn't generate writing code for STD::xstzName" [-Wcpp]
  242 | #warning "Couldn't generate writing code for STD::xstzName"
      |  ^~~~~~~
/usr/src/RPM/BUILD/wv2-0.4.2/src/styles.cpp:246:2: warning: #warning "Couldn't generate writing code for STD::grupx" [-Wcpp]
  246 | #warning "Couldn't generate writing code for STD::grupx"
      |  ^~~~~~~
In file included from /usr/src/RPM/BUILD/wv2-0.4.2/src/word97_generated.h:33,
                 from /usr/src/RPM/BUILD/wv2-0.4.2/src/styles.h:22,
                 from /usr/src/RPM/BUILD/wv2-0.4.2/src/styles.cpp:19:
/usr/src/RPM/BUILD/wv2-0.4.2/src/utilities.h:28:51: warning: 'template<class _Arg, class _Result> struct std::unary_function' is deprecated [-Wdeprecated-declarations]
   28 |     template<class T> struct Delete : public std::unary_function<T*, void>
      |                                                   ^~~~~~~~~~~~~~
In file included from /usr/include/c++/13/functional:49,
                 from /usr/src/RPM/BUILD/wv2-0.4.2/src/utilities.h:23:
/usr/include/c++/13/bits/stl_function.h:117:12: note: declared here
  117 |     struct unary_function
      |            ^~~~~~~~~~~~~~
make[2]: Leaving directory '/usr/src/RPM/BUILD/wv2-0.4.2/BUILD-x86_64-alt-linux'
make[2]: Entering directory '/usr/src/RPM/BUILD/wv2-0.4.2/BUILD-x86_64-alt-linux'
[ 64%] Building CXX object src/CMakeFiles/wv2.dir/headers95.cpp.o
make[2]: Leaving directory '/usr/src/RPM/BUILD/wv2-0.4.2/BUILD-x86_64-alt-linux'
make[2]: Entering directory '/usr/src/RPM/BUILD/wv2-0.4.2/BUILD-x86_64-alt-linux'
[ 32%] Building CXX object src/CMakeFiles/wv2.dir/parser9x.cpp.o
In file included from /usr/src/RPM/BUILD/wv2-0.4.2/src/word97_generated.h:33,
                 from /usr/src/RPM/BUILD/wv2-0.4.2/src/parser9x.h:23,
                 from /usr/src/RPM/BUILD/wv2-0.4.2/src/parser9x.cpp:19:
/usr/src/RPM/BUILD/wv2-0.4.2/src/utilities.h:28:51: warning: 'template<class _Arg, class _Result> struct std::unary_function' is deprecated [-Wdeprecated-declarations]
   28 |     template<class T> struct Delete : public std::unary_function<T*, void>
      |                                                   ^~~~~~~~~~~~~~
In file included from /usr/include/c++/13/functional:49,
                 from /usr/src/RPM/BUILD/wv2-0.4.2/src/utilities.h:23:
/usr/include/c++/13/bits/stl_function.h:117:12: note: declared here
  117 |     struct unary_function
      |            ^~~~~~~~~~~~~~
/usr/src/RPM/BUILD/wv2-0.4.2/src/parser9x.cpp: In member function 'void wvWare::Parser9x::parsePictureEscher(const wvWare::PictureData&, wvWare::OLEStreamReader*, int, int)':
/usr/src/RPM/BUILD/wv2-0.4.2/src/parser9x.cpp:1037:25: warning: unused variable 'err' [-Wunused-variable]
 1037 |                     int err = z.Decompress( *stream, &outBuffer );
      |                         ^~~
make[2]: Leaving directory '/usr/src/RPM/BUILD/wv2-0.4.2/BUILD-x86_64-alt-linux'
make[2]: Entering directory '/usr/src/RPM/BUILD/wv2-0.4.2/BUILD-x86_64-alt-linux'
[ 94%] Building CXX object src/CMakeFiles/wv2.dir/wv2version.cpp.o
make[2]: Leaving directory '/usr/src/RPM/BUILD/wv2-0.4.2/BUILD-x86_64-alt-linux'
make[2]: Entering directory '/usr/src/RPM/BUILD/wv2-0.4.2/BUILD-x86_64-alt-linux'
[ 75%] Building CXX object src/CMakeFiles/wv2.dir/functordata.cpp.o
In file included from /usr/src/RPM/BUILD/wv2-0.4.2/src/word97_generated.h:33,
                 from /usr/src/RPM/BUILD/wv2-0.4.2/src/functordata.cpp:20:
/usr/src/RPM/BUILD/wv2-0.4.2/src/utilities.h:28:51: warning: 'template<class _Arg, class _Result> struct std::unary_function' is deprecated [-Wdeprecated-declarations]
   28 |     template<class T> struct Delete : public std::unary_function<T*, void>
      |                                                   ^~~~~~~~~~~~~~
In file included from /usr/include/c++/13/functional:49,
                 from /usr/src/RPM/BUILD/wv2-0.4.2/src/utilities.h:23:
/usr/include/c++/13/bits/stl_function.h:117:12: note: declared here
  117 |     struct unary_function
      |            ^~~~~~~~~~~~~~
make[2]: Leaving directory '/usr/src/RPM/BUILD/wv2-0.4.2/BUILD-x86_64-alt-linux'
make[2]: Entering directory '/usr/src/RPM/BUILD/wv2-0.4.2/BUILD-x86_64-alt-linux'
[ 54%] Building CXX object src/CMakeFiles/wv2.dir/fonts.cpp.o
In file included from /usr/src/RPM/BUILD/wv2-0.4.2/src/word97_generated.h:33,
                 from /usr/src/RPM/BUILD/wv2-0.4.2/src/fonts.cpp:21:
/usr/src/RPM/BUILD/wv2-0.4.2/src/utilities.h:28:51: warning: 'template<class _Arg, class _Result> struct std::unary_function' is deprecated [-Wdeprecated-declarations]
   28 |     template<class T> struct Delete : public std::unary_function<T*, void>
      |                                                   ^~~~~~~~~~~~~~
In file included from /usr/include/c++/13/bits/refwrap.h:39,
                 from /usr/include/c++/13/vector:68,
                 from /usr/src/RPM/BUILD/wv2-0.4.2/src/fonts.h:23,
                 from /usr/src/RPM/BUILD/wv2-0.4.2/src/fonts.cpp:19:
/usr/include/c++/13/bits/stl_function.h:117:12: note: declared here
  117 |     struct unary_function
      |            ^~~~~~~~~~~~~~
make[2]: Leaving directory '/usr/src/RPM/BUILD/wv2-0.4.2/BUILD-x86_64-alt-linux'
make[2]: Entering directory '/usr/src/RPM/BUILD/wv2-0.4.2/BUILD-x86_64-alt-linux'
[ 10%] Building CXX object src/CMakeFiles/wv2.dir/word97_helper.cpp.o
In file included from /usr/src/RPM/BUILD/wv2-0.4.2/src/word97_generated.h:33,
                 from /usr/src/RPM/BUILD/wv2-0.4.2/src/word97_helper.cpp:21:
/usr/src/RPM/BUILD/wv2-0.4.2/src/utilities.h:28:51: warning: 'template<class _Arg, class _Result> struct std::unary_function' is deprecated [-Wdeprecated-declarations]
   28 |     template<class T> struct Delete : public std::unary_function<T*, void>
      |                                                   ^~~~~~~~~~~~~~
In file included from /usr/include/c++/13/functional:49,
                 from /usr/src/RPM/BUILD/wv2-0.4.2/src/utilities.h:23:
/usr/include/c++/13/bits/stl_function.h:117:12: note: declared here
  117 |     struct unary_function
      |            ^~~~~~~~~~~~~~
/usr/src/RPM/BUILD/wv2-0.4.2/src/word97_helper.cpp:680:33: warning: 'template<class _Arg1, class _Arg2, class _Result> struct std::binary_function' is deprecated [-Wdeprecated-declarations]
  680 |     struct InZone : public std::binary_function<TabDescriptor, Zone, bool>
      |                                 ^~~~~~~~~~~~~~~
/usr/include/c++/13/bits/stl_function.h:131:12: note: declared here
  131 |     struct binary_function
      |            ^~~~~~~~~~~~~~~
/usr/src/RPM/BUILD/wv2-0.4.2/src/word97_helper.cpp: In member function 'wvWare::S16 wvWare::Word97::PAP::applyPAPSPRM(const wvWare::U8*, const wvWare::Style*, const wvWare::StyleSheet*, wvWare::OLEStreamReader*, wvWare::WordVersion)':
/usr/src/RPM/BUILD/wv2-0.4.2/src/word97_helper.cpp:849:81: warning: 'std::binder2nd<_Operation> std::bind2nd(const _Operation&, const _Tp&) [with _Operation = wvWare::Word97::{anonymous}::InZone; _Tp = wvWare::Word97::{anonymous}::Zone]' is deprecated: use 'std::bind' instead [-Wdeprecated-declarations]
  849 |                 newEnd = std::remove_if ( rgdxaTab.begin(), newEnd, std::bind2nd( InZone(), Zone( myPtr, i, itbdDelMax ) ) );
      |                                                                     ~~~~~~~~~~~~^~~~~~~~~~~~~~~~~~~~~~~~~~~~~~~~~~~~~~~~~~
In file included from /usr/include/c++/13/bits/stl_function.h:1438:
/usr/include/c++/13/backward/binders.h:172:5: note: declared here
  172 |     bind2nd(const _Operation& __fn, const _Tp& __x)
      |     ^~~~~~~
/usr/src/RPM/BUILD/wv2-0.4.2/src/word97_helper.cpp: In member function 'wvWare::S16 wvWare::Word97::TAP::applyTAPSPRM(const wvWare::U8*, const wvWare::Style*, const wvWare::StyleSheet*, wvWare::OLEStreamReader*, wvWare::WordVersion)':
/usr/src/RPM/BUILD/wv2-0.4.2/src/word97_helper.cpp:1913:102: warning: 'std::binder1st<_Operation> std::bind1st(const _Operation&, const _Tp&) [with _Operation = plus<short int>; _Tp = short int]' is deprecated: use 'std::bind' instead [-Wdeprecated-declarations]
 1913 |             std::transform( rgdxaCenter.begin(), rgdxaCenter.end(), rgdxaCenter.begin(), std::bind1st( std::plus<S16>(), dxaNew ) );
      |                                                                                          ~~~~~~~~~~~~^~~~~~~~~~~~~~~~~~~~~~~~~~~~
/usr/include/c++/13/backward/binders.h:136:5: note: declared here
  136 |     bind1st(const _Operation& __fn, const _Tp& __x)
      |     ^~~~~~~
/usr/src/RPM/BUILD/wv2-0.4.2/src/word97_helper.cpp:2108:84: warning: 'std::binder1st<_Operation> std::bind1st(const _Operation&, const _Tp&) [with _Operation = plus<short int>; _Tp = int]' is deprecated: use 'std::bind' instead [-Wdeprecated-declarations]
 2108 |                                 rgdxaCenter.begin() + itcInsert + ctc, std::bind1st( std::plus<S16>(), ctc * dxaCol ) );
      |                                                                        ~~~~~~~~~~~~^~~~~~~~~~~~~~~~~~~~~~~~~~~~~~~~~~
/usr/include/c++/13/backward/binders.h:136:5: note: declared here
  136 |     bind1st(const _Operation& __fn, const _Tp& __x)
      |     ^~~~~~~
/usr/src/RPM/BUILD/wv2-0.4.2/src/word97_helper.cpp:2141:73: warning: 'std::binder2nd<_Operation> std::bind2nd(const _Operation&, const _Tp&) [with _Operation = minus<short int>; _Tp = short int]' is deprecated: use 'std::bind' instead [-Wdeprecated-declarations]
 2141 |                             rgdxaCenter.begin() + itcFirst, std::bind2nd( std::minus<S16>(), shift ) );
      |                                                             ~~~~~~~~~~~~^~~~~~~~~~~~~~~~~~~~~~~~~~~~
/usr/include/c++/13/backward/binders.h:172:5: note: declared here
  172 |     bind2nd(const _Operation& __fn, const _Tp& __x)
      |     ^~~~~~~
/usr/src/RPM/BUILD/wv2-0.4.2/src/word97_helper.cpp:2269:40: warning: comparison of integer expressions of different signedness: 'int' and 'std::vector<wvWare::Word97::TC>::size_type' {aka 'long unsigned int'} [-Wsign-compare]
 2269 |             for (int i=0 ; i < 64 && i < rgtc.size(); ++i ) {
      |                                      ~~^~~~~~~~~~~~~
/usr/src/RPM/BUILD/wv2-0.4.2/src/word97_helper.cpp:2278:40: warning: comparison of integer expressions of different signedness: 'int' and 'std::vector<wvWare::Word97::TC>::size_type' {aka 'long unsigned int'} [-Wsign-compare]
 2278 |             for (int i=0 ; i < 64 && i < rgtc.size(); ++i ) {
      |                                      ~~^~~~~~~~~~~~~
/usr/src/RPM/BUILD/wv2-0.4.2/src/word97_helper.cpp:2287:40: warning: comparison of integer expressions of different signedness: 'int' and 'std::vector<wvWare::Word97::TC>::size_type' {aka 'long unsigned int'} [-Wsign-compare]
 2287 |             for (int i=0 ; i < 64 && i < rgtc.size(); ++i ) {
      |                                      ~~^~~~~~~~~~~~~
/usr/src/RPM/BUILD/wv2-0.4.2/src/word97_helper.cpp:2296:40: warning: comparison of integer expressions of different signedness: 'int' and 'std::vector<wvWare::Word97::TC>::size_type' {aka 'long unsigned int'} [-Wsign-compare]
 2296 |             for (int i=0 ; i < 64 && i < rgtc.size(); ++i ) {
      |                                      ~~^~~~~~~~~~~~~
make[2]: Leaving directory '/usr/src/RPM/BUILD/wv2-0.4.2/BUILD-x86_64-alt-linux'
make[2]: Entering directory '/usr/src/RPM/BUILD/wv2-0.4.2/BUILD-x86_64-alt-linux'
[ 83%] Building CXX object src/CMakeFiles/wv2.dir/utilities.cpp.o
In file included from /usr/src/RPM/BUILD/wv2-0.4.2/src/utilities.cpp:19:
/usr/src/RPM/BUILD/wv2-0.4.2/src/utilities.h:28:51: warning: 'template<class _Arg, class _Result> struct std::unary_function' is deprecated [-Wdeprecated-declarations]
   28 |     template<class T> struct Delete : public std::unary_function<T*, void>
      |                                                   ^~~~~~~~~~~~~~
In file included from /usr/include/c++/13/functional:49,
                 from /usr/src/RPM/BUILD/wv2-0.4.2/src/utilities.h:23:
/usr/include/c++/13/bits/stl_function.h:117:12: note: declared here
  117 |     struct unary_function
      |            ^~~~~~~~~~~~~~
make[2]: Leaving directory '/usr/src/RPM/BUILD/wv2-0.4.2/BUILD-x86_64-alt-linux'
make[2]: Entering directory '/usr/src/RPM/BUILD/wv2-0.4.2/BUILD-x86_64-alt-linux'
[ 62%] Building CXX object src/CMakeFiles/wv2.dir/headers.cpp.o
make[2]: Leaving directory '/usr/src/RPM/BUILD/wv2-0.4.2/BUILD-x86_64-alt-linux'
make[2]: Entering directory '/usr/src/RPM/BUILD/wv2-0.4.2/BUILD-x86_64-alt-linux'
[ 16%] Building CXX object src/CMakeFiles/wv2.dir/word95_generated.cpp.o
/usr/src/RPM/BUILD/wv2-0.4.2/src/word95_generated.cpp:1285:2: warning: #warning "Couldn't generate reading code for DPPOLYLINE::rgpta" [-Wcpp]
 1285 | #warning "Couldn't generate reading code for DPPOLYLINE::rgpta"
      |  ^~~~~~~
/usr/src/RPM/BUILD/wv2-0.4.2/src/word95_generated.cpp:1329:2: warning: #warning "Couldn't generate writing code for DPPOLYLINE::rgpta" [-Wcpp]
 1329 | #warning "Couldn't generate writing code for DPPOLYLINE::rgpta"
      |  ^~~~~~~
/usr/src/RPM/BUILD/wv2-0.4.2/src/word95_generated.cpp:1373:2: warning: #warning "Can't compare DPPOLYLINE::rgpta items" [-Wcpp]
 1373 | #warning "Can't compare DPPOLYLINE::rgpta items"
      |  ^~~~~~~
/usr/src/RPM/BUILD/wv2-0.4.2/src/word95_generated.cpp:6858:2: warning: #warning "Couldn't generate reading code for SEPX::grpprl" [-Wcpp]
 6858 | #warning "Couldn't generate reading code for SEPX::grpprl"
      |  ^~~~~~~
/usr/src/RPM/BUILD/wv2-0.4.2/src/word95_generated.cpp:6874:2: warning: #warning "Couldn't generate writing code for SEPX::grpprl" [-Wcpp]
 6874 | #warning "Couldn't generate writing code for SEPX::grpprl"
      |  ^~~~~~~
/usr/src/RPM/BUILD/wv2-0.4.2/src/word95_generated.cpp:6895:2: warning: #warning "Can't compare SEPX::grpprl items" [-Wcpp]
 6895 | #warning "Can't compare SEPX::grpprl items"
      |  ^~~~~~~
In file included from /usr/src/RPM/BUILD/wv2-0.4.2/src/word95_generated.h:33,
                 from /usr/src/RPM/BUILD/wv2-0.4.2/src/word95_generated.cpp:29:
/usr/src/RPM/BUILD/wv2-0.4.2/src/utilities.h:28:51: warning: 'template<class _Arg, class _Result> struct std::unary_function' is deprecated [-Wdeprecated-declarations]
   28 |     template<class T> struct Delete : public std::unary_function<T*, void>
      |                                                   ^~~~~~~~~~~~~~
In file included from /usr/include/c++/13/functional:49,
                 from /usr/src/RPM/BUILD/wv2-0.4.2/src/utilities.h:23:
/usr/include/c++/13/bits/stl_function.h:117:12: note: declared here
  117 |     struct unary_function
      |            ^~~~~~~~~~~~~~
make[2]: Leaving directory '/usr/src/RPM/BUILD/wv2-0.4.2/BUILD-x86_64-alt-linux'
make[2]: Entering directory '/usr/src/RPM/BUILD/wv2-0.4.2/BUILD-x86_64-alt-linux'
[ 78%] Building CXX object src/CMakeFiles/wv2.dir/associatedstrings.cpp.o
make[2]: Leaving directory '/usr/src/RPM/BUILD/wv2-0.4.2/BUILD-x86_64-alt-linux'
make[2]: Entering directory '/usr/src/RPM/BUILD/wv2-0.4.2/BUILD-x86_64-alt-linux'
[ 89%] Building CXX object src/CMakeFiles/wv2.dir/wvlog.cpp.o
make[2]: Leaving directory '/usr/src/RPM/BUILD/wv2-0.4.2/BUILD-x86_64-alt-linux'
make[2]: Entering directory '/usr/src/RPM/BUILD/wv2-0.4.2/BUILD-x86_64-alt-linux'
[ 51%] Building CXX object src/CMakeFiles/wv2.dir/properties97.cpp.o
In file included from /usr/src/RPM/BUILD/wv2-0.4.2/src/word97_generated.h:33,
                 from /usr/src/RPM/BUILD/wv2-0.4.2/src/properties97.h:24,
                 from /usr/src/RPM/BUILD/wv2-0.4.2/src/properties97.cpp:19:
/usr/src/RPM/BUILD/wv2-0.4.2/src/utilities.h:28:51: warning: 'template<class _Arg, class _Result> struct std::unary_function' is deprecated [-Wdeprecated-declarations]
   28 |     template<class T> struct Delete : public std::unary_function<T*, void>
      |                                                   ^~~~~~~~~~~~~~
In file included from /usr/include/c++/13/string:49,
                 from /usr/src/RPM/BUILD/wv2-0.4.2/src/olestorage.h:22,
                 from /usr/src/RPM/BUILD/wv2-0.4.2/src/olestream.h:22,
                 from /usr/src/RPM/BUILD/wv2-0.4.2/src/word_helper.h:22,
                 from /usr/src/RPM/BUILD/wv2-0.4.2/src/properties97.h:23:
/usr/include/c++/13/bits/stl_function.h:117:12: note: declared here
  117 |     struct unary_function
      |            ^~~~~~~~~~~~~~
make[2]: Leaving directory '/usr/src/RPM/BUILD/wv2-0.4.2/BUILD-x86_64-alt-linux'
make[2]: Entering directory '/usr/src/RPM/BUILD/wv2-0.4.2/BUILD-x86_64-alt-linux'
[  5%] Building CXX object src/CMakeFiles/wv2.dir/word97_generated.cpp.o
/usr/src/RPM/BUILD/wv2-0.4.2/src/word97_generated.cpp:8326:2: warning: #warning "Couldn't generate reading code for SEPX::grpprl" [-Wcpp]
 8326 | #warning "Couldn't generate reading code for SEPX::grpprl"
      |  ^~~~~~~
/usr/src/RPM/BUILD/wv2-0.4.2/src/word97_generated.cpp:8342:2: warning: #warning "Couldn't generate writing code for SEPX::grpprl" [-Wcpp]
 8342 | #warning "Couldn't generate writing code for SEPX::grpprl"
      |  ^~~~~~~
/usr/src/RPM/BUILD/wv2-0.4.2/src/word97_generated.cpp:8363:2: warning: #warning "Can't compare SEPX::grpprl items" [-Wcpp]
 8363 | #warning "Can't compare SEPX::grpprl items"
      |  ^~~~~~~
In file included from /usr/src/RPM/BUILD/wv2-0.4.2/src/word97_generated.h:33,
                 from /usr/src/RPM/BUILD/wv2-0.4.2/src/word97_generated.cpp:29:
/usr/src/RPM/BUILD/wv2-0.4.2/src/utilities.h:28:51: warning: 'template<class _Arg, class _Result> struct std::unary_function' is deprecated [-Wdeprecated-declarations]
   28 |     template<class T> struct Delete : public std::unary_function<T*, void>
      |                                                   ^~~~~~~~~~~~~~
In file included from /usr/include/c++/13/functional:49,
                 from /usr/src/RPM/BUILD/wv2-0.4.2/src/utilities.h:23:
/usr/include/c++/13/bits/stl_function.h:117:12: note: declared here
  117 |     struct unary_function
      |            ^~~~~~~~~~~~~~
/usr/src/RPM/BUILD/wv2-0.4.2/src/word97_generated.cpp: In member function 'wvWare::Word97::SHD::write(wvWare::OLEStreamWriter*, bool) const':
/usr/src/RPM/BUILD/wv2-0.4.2/src/word97_generated.cpp:615:15: warning: 'shifterU16' is used uninitialized [-Wuninitialized]
  615 |     shifterU16|=ipat << 10;
      |     ~~~~~~~~~~^~~~~~~~~~~~
/usr/src/RPM/BUILD/wv2-0.4.2/src/word97_generated.cpp:608:9: note: 'shifterU16' was declared here
  608 |     U16 shifterU16;
      |         ^~~~~~~~~~
make[2]: Leaving directory '/usr/src/RPM/BUILD/wv2-0.4.2/BUILD-x86_64-alt-linux'
make[2]: Entering directory '/usr/src/RPM/BUILD/wv2-0.4.2/BUILD-x86_64-alt-linux'
[ 56%] Building CXX object src/CMakeFiles/wv2.dir/lists.cpp.o
In file included from /usr/src/RPM/BUILD/wv2-0.4.2/src/word97_generated.h:33,
                 from /usr/src/RPM/BUILD/wv2-0.4.2/src/lists.cpp:21:
/usr/src/RPM/BUILD/wv2-0.4.2/src/utilities.h:28:51: warning: 'template<class _Arg, class _Result> struct std::unary_function' is deprecated [-Wdeprecated-declarations]
   28 |     template<class T> struct Delete : public std::unary_function<T*, void>
      |                                                   ^~~~~~~~~~~~~~
In file included from /usr/include/c++/13/bits/refwrap.h:39,
                 from /usr/include/c++/13/vector:68,
                 from /usr/src/RPM/BUILD/wv2-0.4.2/src/lists.h:22,
                 from /usr/src/RPM/BUILD/wv2-0.4.2/src/lists.cpp:19:
/usr/include/c++/13/bits/stl_function.h:117:12: note: declared here
  117 |     struct unary_function
      |            ^~~~~~~~~~~~~~
make[2]: Leaving directory '/usr/src/RPM/BUILD/wv2-0.4.2/BUILD-x86_64-alt-linux'
make[2]: Entering directory '/usr/src/RPM/BUILD/wv2-0.4.2/BUILD-x86_64-alt-linux'
[ 72%] Building CXX object src/CMakeFiles/wv2.dir/footnotes97.cpp.o
In file included from /usr/src/RPM/BUILD/wv2-0.4.2/src/word97_generated.h:33,
                 from /usr/src/RPM/BUILD/wv2-0.4.2/src/footnotes97.cpp:21:
/usr/src/RPM/BUILD/wv2-0.4.2/src/utilities.h:28:51: warning: 'template<class _Arg, class _Result> struct std::unary_function' is deprecated [-Wdeprecated-declarations]
   28 |     template<class T> struct Delete : public std::unary_function<T*, void>
      |                                                   ^~~~~~~~~~~~~~
In file included from /usr/include/c++/13/bits/refwrap.h:39,
                 from /usr/include/c++/13/vector:68,
                 from /usr/src/RPM/BUILD/wv2-0.4.2/src/footnotes97.h:25,
                 from /usr/src/RPM/BUILD/wv2-0.4.2/src/footnotes97.cpp:19:
/usr/include/c++/13/bits/stl_function.h:117:12: note: declared here
  117 |     struct unary_function
      |            ^~~~~~~~~~~~~~
make[2]: Leaving directory '/usr/src/RPM/BUILD/wv2-0.4.2/BUILD-x86_64-alt-linux'
make[2]: Entering directory '/usr/src/RPM/BUILD/wv2-0.4.2/BUILD-x86_64-alt-linux'
[ 81%] Building CXX object src/CMakeFiles/wv2.dir/fields.cpp.o
In file included from /usr/src/RPM/BUILD/wv2-0.4.2/src/word97_generated.h:33,
                 from /usr/src/RPM/BUILD/wv2-0.4.2/src/fields.cpp:22:
/usr/src/RPM/BUILD/wv2-0.4.2/src/utilities.h:28:51: warning: 'template<class _Arg, class _Result> struct std::unary_function' is deprecated [-Wdeprecated-declarations]
   28 |     template<class T> struct Delete : public std::unary_function<T*, void>
      |                                                   ^~~~~~~~~~~~~~
In file included from /usr/include/c++/13/string:49,
                 from /usr/src/RPM/BUILD/wv2-0.4.2/src/olestorage.h:22,
                 from /usr/src/RPM/BUILD/wv2-0.4.2/src/olestream.h:22,
                 from /usr/src/RPM/BUILD/wv2-0.4.2/src/fields.cpp:20:
/usr/include/c++/13/bits/stl_function.h:117:12: note: declared here
  117 |     struct unary_function
      |            ^~~~~~~~~~~~~~
make[2]: Leaving directory '/usr/src/RPM/BUILD/wv2-0.4.2/BUILD-x86_64-alt-linux'
make[2]: Entering directory '/usr/src/RPM/BUILD/wv2-0.4.2/BUILD-x86_64-alt-linux'
[ 97%] Building CXX object src/CMakeFiles/wv2.dir/zcodec.cxx.o
/usr/src/RPM/BUILD/wv2-0.4.2/src/zcodec.cxx:551:1: warning: "/*" within comment [-Wcomment]
  551 | /*ULONG ZCodec::UpdateCRC ( ULONG nLatestCRC, ULONG nNumber )
      |  
/usr/src/RPM/BUILD/wv2-0.4.2/src/zcodec.cxx: In member function 'void ZCodec::ImplWriteBack(std::vector<unsigned char>*)':
/usr/src/RPM/BUILD/wv2-0.4.2/src/zcodec.cxx:288:30: warning: comparison of integer expressions of different signedness: 'int' and 'ULONG' {aka 'long unsigned int'} [-Wsign-compare]
  288 |             for(int i = 0; i < nAvail; i++)
      |                            ~~^~~~~~~~
make[2]: Leaving directory '/usr/src/RPM/BUILD/wv2-0.4.2/BUILD-x86_64-alt-linux'
make[2]: Entering directory '/usr/src/RPM/BUILD/wv2-0.4.2/BUILD-x86_64-alt-linux'
[ 91%] Building CXX object src/CMakeFiles/wv2.dir/graphics.cpp.o
In file included from /usr/src/RPM/BUILD/wv2-0.4.2/src/word97_generated.h:33,
                 from /usr/src/RPM/BUILD/wv2-0.4.2/src/graphics.cpp:20:
/usr/src/RPM/BUILD/wv2-0.4.2/src/utilities.h:28:51: warning: 'template<class _Arg, class _Result> struct std::unary_function' is deprecated [-Wdeprecated-declarations]
   28 |     template<class T> struct Delete : public std::unary_function<T*, void>
      |                                                   ^~~~~~~~~~~~~~
In file included from /usr/include/c++/13/string:49,
                 from /usr/src/RPM/BUILD/wv2-0.4.2/src/graphics.h:22,
                 from /usr/src/RPM/BUILD/wv2-0.4.2/src/graphics.cpp:19:
/usr/include/c++/13/bits/stl_function.h:117:12: note: declared here
  117 |     struct unary_function
      |            ^~~~~~~~~~~~~~
make[2]: Leaving directory '/usr/src/RPM/BUILD/wv2-0.4.2/BUILD-x86_64-alt-linux'
make[2]: Entering directory '/usr/src/RPM/BUILD/wv2-0.4.2/BUILD-x86_64-alt-linux'
[100%] Linking CXX shared library libwv2.so
make[2]: Leaving directory '/usr/src/RPM/BUILD/wv2-0.4.2/BUILD-x86_64-alt-linux'
make[1]: Entering directory '/usr/src/RPM/BUILD/wv2-0.4.2/BUILD-x86_64-alt-linux'
[100%] Built target wv2
make[1]: Leaving directory '/usr/src/RPM/BUILD/wv2-0.4.2/BUILD-x86_64-alt-linux'
+ popd
~/RPM/BUILD/wv2-0.4.2
+ exit 0
Executing(%install): /bin/sh -e /usr/src/tmp/rpm-tmp.77977
+ umask 022
+ /bin/mkdir -p /usr/src/RPM/BUILD
+ cd /usr/src/RPM/BUILD
+ /bin/chmod -Rf u+rwX -- /usr/src/tmp/wv2-buildroot
+ :
+ /bin/rm -rf -- /usr/src/tmp/wv2-buildroot
+ PATH=/usr/libexec/rpm-build:/usr/src/bin:/bin:/usr/bin:/usr/X11R6/bin:/usr/games
+ cd wv2-0.4.2
+ __kde_install
+ make -C BUILD-x86_64-alt-linux DESTDIR=/usr/src/tmp/wv2-buildroot install
make: Entering directory '/usr/src/RPM/BUILD/wv2-0.4.2/BUILD-x86_64-alt-linux'
make[1]: Entering directory '/usr/src/RPM/BUILD/wv2-0.4.2/BUILD-x86_64-alt-linux'
make[2]: Entering directory '/usr/src/RPM/BUILD/wv2-0.4.2/BUILD-x86_64-alt-linux'
make[2]: Leaving directory '/usr/src/RPM/BUILD/wv2-0.4.2/BUILD-x86_64-alt-linux'
[100%] Built target wv2
make[1]: Leaving directory '/usr/src/RPM/BUILD/wv2-0.4.2/BUILD-x86_64-alt-linux'
Install the project...
-- Install configuration: "Release"
-- Installing: /usr/src/tmp/wv2-buildroot/usr/bin/wv2-config
-- Installing: /usr/src/tmp/wv2-buildroot/usr/lib64/libwv2.so.4.0.1
-- Installing: /usr/src/tmp/wv2-buildroot/usr/lib64/libwv2.so.4
-- Installing: /usr/src/tmp/wv2-buildroot/usr/lib64/libwv2.so
-- Installing: /usr/src/tmp/wv2-buildroot/usr/lib64/wvWare/wv2.cmake
-- Installing: /usr/src/tmp/wv2-buildroot/usr/lib64/wvWare/wv2-release.cmake
-- Installing: /usr/src/tmp/wv2-buildroot/usr/include/wv2/olestorage.h
-- Installing: /usr/src/tmp/wv2-buildroot/usr/include/wv2/olestream.h
-- Installing: /usr/src/tmp/wv2-buildroot/usr/include/wv2/word95_generated.h
-- Installing: /usr/src/tmp/wv2-buildroot/usr/include/wv2/word97_generated.h
-- Installing: /usr/src/tmp/wv2-buildroot/usr/include/wv2/word_helper.h
-- Installing: /usr/src/tmp/wv2-buildroot/usr/include/wv2/parser.h
-- Installing: /usr/src/tmp/wv2-buildroot/usr/include/wv2/parserfactory.h
-- Installing: /usr/src/tmp/wv2-buildroot/usr/include/wv2/ustring.h
-- Installing: /usr/src/tmp/wv2-buildroot/usr/include/wv2/textconverter.h
-- Installing: /usr/src/tmp/wv2-buildroot/usr/include/wv2/styles.h
-- Installing: /usr/src/tmp/wv2-buildroot/usr/include/wv2/sharedptr.h
-- Installing: /usr/src/tmp/wv2-buildroot/usr/include/wv2/convert.h
-- Installing: /usr/src/tmp/wv2-buildroot/usr/include/wv2/global.h
-- Installing: /usr/src/tmp/wv2-buildroot/usr/include/wv2/handlers.h
-- Installing: /usr/src/tmp/wv2-buildroot/usr/include/wv2/fonts.h
-- Installing: /usr/src/tmp/wv2-buildroot/usr/include/wv2/lists.h
-- Installing: /usr/src/tmp/wv2-buildroot/usr/include/wv2/utilities.h
-- Installing: /usr/src/tmp/wv2-buildroot/usr/include/wv2/paragraphproperties.h
-- Installing: /usr/src/tmp/wv2-buildroot/usr/include/wv2/functor.h
-- Installing: /usr/src/tmp/wv2-buildroot/usr/include/wv2/functordata.h
-- Installing: /usr/src/tmp/wv2-buildroot/usr/include/wv2/associatedstrings.h
-- Installing: /usr/src/tmp/wv2-buildroot/usr/include/wv2/fields.h
-- Installing: /usr/src/tmp/wv2-buildroot/usr/include/wv2/dllmagic.h
-- Installing: /usr/src/tmp/wv2-buildroot/usr/include/wv2/wvlog.h
-- Installing: /usr/src/tmp/wv2-buildroot/usr/include/wv2/wv2version.h
-- Installing: /usr/src/tmp/wv2-buildroot/usr/include/wv2/zcodec.hxx
-- Installing: /usr/src/tmp/wv2-buildroot/usr/lib64/libwv2.la
make: Leaving directory '/usr/src/RPM/BUILD/wv2-0.4.2/BUILD-x86_64-alt-linux'
+ /usr/lib/rpm/brp-alt
Cleaning files in /usr/src/tmp/wv2-buildroot (auto)
removed './usr/lib64/libwv2.la'
mode of './usr/lib64/libwv2.so.4.0.1' changed from 0755 (rwxr-xr-x) to 0644 (rw-r--r--)
Verifying and fixing files in /usr/src/tmp/wv2-buildroot (binconfig,pkgconfig,libtool,desktop,gnuconfig)
/usr/bin/wv2-config:
82c82
< 	includes=" -I/usr/include -I/usr/include/libgsf-1 -I/usr/include/glib-2.0 -I/usr/lib64/glib-2.0/include"
---
> 	includes="  -I/usr/include/libgsf-1 -I/usr/include/glib-2.0 -I/usr/lib64/glib-2.0/include"
84c84
< 		includes="-I${prefix}/include $includes"
---
> 		includes=" $includes"
/usr/bin/wv2-config:
90c90
< 	libdirs=-L${exec_prefix}/lib64
---
> 	libdirs=
Checking contents of files in /usr/src/tmp/wv2-buildroot/ (default)
Compressing files in /usr/src/tmp/wv2-buildroot (auto)
Adjusting library links in /usr/src/tmp/wv2-buildroot
./usr/lib64: (from <cmdline>:0)
	libwv2.so.4 -> libwv2.so.4.0.1
Verifying ELF objects in /usr/src/tmp/wv2-buildroot (arch=normal,fhs=normal,lfs=relaxed,lint=relaxed,rpath=normal,stack=normal,textrel=normal,unresolved=normal)
Processing files: libwv2-0.4.2-alt3
Executing(%doc): /bin/sh -e /usr/src/tmp/rpm-tmp.19560
+ umask 022
+ /bin/mkdir -p /usr/src/RPM/BUILD
+ cd /usr/src/RPM/BUILD
+ cd wv2-0.4.2
+ DOCDIR=/usr/src/tmp/wv2-buildroot/usr/share/doc/libwv2-0.4.2
+ export DOCDIR
+ rm -rf /usr/src/tmp/wv2-buildroot/usr/share/doc/libwv2-0.4.2
+ /bin/mkdir -p /usr/src/tmp/wv2-buildroot/usr/share/doc/libwv2-0.4.2
+ cp -prL AUTHORS ChangeLog README THANKS TODO /usr/src/tmp/wv2-buildroot/usr/share/doc/libwv2-0.4.2
+ chmod -R go-w /usr/src/tmp/wv2-buildroot/usr/share/doc/libwv2-0.4.2
+ chmod -R a+rX /usr/src/tmp/wv2-buildroot/usr/share/doc/libwv2-0.4.2
+ exit 0
Finding Provides (using /usr/lib/rpm/find-provides)
Executing: /bin/sh -e /usr/src/tmp/rpm-tmp.c0pZU6
find-provides: running scripts (alternatives,debuginfo,gir,lib,pam,perl,pkgconfig,python,python3,shell,typelib)
lib.prov: /usr/src/tmp/wv2-buildroot/usr/lib64/libwv2.so.4: 1783 symbols, 21 bpp
Finding Requires (using /usr/lib/rpm/find-requires)
Executing: /bin/sh -e /usr/src/tmp/rpm-tmp.9C8OtV
find-requires: running scripts (cpp,debuginfo,files,gir-js,gir-python,gir,lib,pam,perl,pkgconfig,pkgconfiglib,python,python3,rpmlib,shebang,shell,static,symlinks,systemd-services,typelib)
lib.req: WARNING: /usr/src/tmp/wv2-buildroot/usr/lib64/libwv2.so.4.0.1: underlinked libraries: /usr/lib64/libgobject-2.0.so.0
lib.req: WARNING: /usr/src/tmp/wv2-buildroot/usr/lib64/libwv2.so.4: underlinked libraries: /usr/lib64/libgobject-2.0.so.0
Provides: libwv2.so.4()(64bit) = set:odjCak8vaNK6zBjnGCgJYthEI5IeUVI5zJGJTiQjqRyOFax4xPaeZkyNvGUBrbrq1hZFyBlGuGIREtkxxwudZwbLM7QRtffiu5hD0apHA5uehSNlwt4nm5Z3KLBXa93Px7vvZfWjhSJBP9wgzYat27Y0OoZkrAuuEk2Iab2G5JwpVIX68tcvrnJFyNeqlFpuuKfr98n1HL8cGzGjaItCb3B5tYol1S5qssQZmlTvmXdb4HYgrOxdOvUsANq4jBhZ1zq1UZFPDIXiLtZyS7ZibMn4Tat4ZDKZ1pCEJSZ1xjrAIAtg9ruGzd5BEjopY9xTDHqJgqv4DiQkG6DZsApxW2UBLaL2J0vjzHvjiQxYZp7NHAOo5YGUhrHHPAZ6ZnBQW85CrORmWsWPZAjwfR6gNLGBUIXBdEx4hOcBm4bGxBBayIjfJha7tuoEDvb1iaENvc5QkkoiUNS7a0lMG2lfZ2gZxyuvZEpV01Fcm2s1QcrS2v11vkZqszvlmetVSF8APyZdt1J7pti4bGFM1G65yo0wSOmzgwP9Oa1YQ0dH2lFk18LmCZtT4P35FuNiyUGcq6WyRzi8ZoeuGMSptKfOFSn6ygc8VUGyNfdY9FtyirqpI46eD9VS1oGCoOMsC4zOhnQovUnkvQotBSd8g38Vad8Z9zHZeoTOcZBrHGfkvRBGZJ5HabnbiHR4DKq0cwdsnyKGL5cdkU3V95jMfhueZc0Y6eQnVZAcpOfpCZq7DQh1amYDiuQ4vFLKxdIpbzRJ4R0gKovJLPcZr74ABKdB8zwfNcrTSnT2o4X7SEy1d7weV9UrDdi7AaMJZbNFWn46rTjYZI12evjWBR4tvSZofZekDyUUAgIV7va4rPCmsZmuGu1p0MtQ8A1RQxE4fHxtxwAGZEYc6Ih5dfIiwhQdOU9AZ1b8krGmOWkpIRIQ6ierhVeZdHTZvCoE3zS1LvLaL588XAFsC1TrvSnE5woFVk2pMzju09alD8bCgzqTNBn0sOSwvZzisa66cfZA8eaIVCUOc3KcNU3FipuSEQYe44RXJZ5DI47wsTwU77ZLyYfELDQicDgw4RPlA16t9ZaHOcyTZfsDjo7gaLx48ikiYVHTQElhSlSRFf7HkyHh52Z1mkISnk5rIZrABISkDYpmdxjP9Rs8i5pkojq5AWnc8ktdy07gFLOTS8wce9AQWs347aSMFPdsqNSi1LBBAZwu9dHZ3HhUwBZgQ5jIzFel4SUWcBd8wIeig9TCsCXnYnq3nmGAevEUKViOh5W7f9LY7xfzQXgqWmlU7mbpUjZm3JMjPAIyN6KuidPvYx2ledDfT62mj2CoZoMDtzcLnAhkZ0rfawJ3kUj2yPh8tWywkkNnfgpqhwjGAqJCM55Ljn5VM4634WvoguvCGjU4LlPk905nYnZC4XYZGpNP02Ef6HcI3UJ9lpUO4rpfot35LU6WdKEdfsIEdK4W0DqEHvUmkdHIOWNnGhEPvS5mP1FZadzxJ2hWu6d2Yd6gYHaWzPMCZdRC127Ope0yaWdZ4oh4ez3m4rz4Yzewou5bgTcQUaaZIeZFqBEQ3ZiJMKiGFBxhSqtW5jqsuiDAkCDZgrlb8qtXXGjB0y11KC5PtMhV2YDYJdZCtFIPxfJxooHZEwZglC4hlcuQoGjuLiVJtzwqn5fpKDNyE2eW2ud17ef3EjjclDWIAY61X7ZjlHeEYaS4q5m51LF6a3ZFZzcHwq89E7HpwrERosTY1skQcNhQqijUuPrg6JZ4Z7PmmZvPWoXSH7g0y4oqsBq2tZCxWZdie9IQZlaey2bLOMe5HTrgZsyfZowR7PtmCwjJuVcFOOaR2lUpxZgjbbKU7Zgm8Y44GkqVw9fQyuuGUz3sN5ztkvdR2NkNxKvRhkI4MdYRkT4GCZDFb2ZFcQrCXFjOJJhJAvlTrhCiKuDwAMqi82zQrlnkRWb1qDcKeBVxYb56KwbIv4q38MAkMqWylhrPqPBdWpiGZKgYy83bR6xmxUz1WZtrZjxh4CZ2Bv8SCtAqB0chyaCnR9edjZ1Xkn0e1foI74fzZq7Qgynx8VSLY4WfzDqJM03l5DmZ7Zzv8fm0RjVH0WixbSBROtWaPJn81OMO4sXVwYHG5eh48qXiRngnHNT2LV4H7wDqSGPfhE7TEQhxdRkqOMBpb6osp0HiGu3GViTXhYjkeWJywVJh69iD2AjZCWnlmawvqVwvMj074tdZl6sS6nPrObHq1fcUkdRybfSHpm86ZeRUU0UCq3UkI2aBbXXMC5SjdZn5PCzIADA87UdSMYgQHi54Z2AIKgsnlIMItDJEAwJPaZrmhBGeL5SemX3WZsNOMQChVMplEFnWUIGpwAA0HMaWmZ4SOkQZvOtf8veArfLZA4xDCnpdxphiZ6VOnG9GZ1PTFuzDRpVJEN66VG2fBa6xq5je9l8HA9ZFzjprWeZsg41jRGw4gv7VAJYAij49ZFmMWWBBSJy6ehQpG2lwYqKoo8pnSVdcogseMrxUmIYblibamhX5T0Lx0rtyjM1WSvWJxwVaZxVRnTMRfuI8CnTGTP7VuYeY5rGdcMZ4NUJFVTo5ZBhuI99Y8SYrGipZ5kZ9XCp99CQZt7joXj3NXBpxQa4ven6hF1e4d3125ZuVCu7YxK6lbhgGJZJbsadAXI4NEMVbmbpkVLmsYIpkXrIFx7N6G5nof9d9qnW2ltN53LWhyVCBfqk4Ds5I2UWY3JgG0jPthFxUDdyxYleEH4Q3DNgc5zHR0lsV8fJcap02ZAXYEMcIh8SYjS7zAt2DMlUut92j47f5JQoYG31vwjne6s0RPS7TIjhSNm6ZxqWVwlApYy9wZIHOTErlbONJZnDX5mMpnE0209kbfjEpaIS2XrYs42Jp7mkCi5g6Nq1dxO0iEhLcodbzvAs4ZEeZs8iPpcG7o6lCABt35DZ4ZdJG3TDjPF40r0zUVNdN0GCAAu9vusyuvCP2x7xUkQkPp2sw21EaciRfW9fPfi7aQZfQwwQN1oCvXTfFNcmHZ1S7SmsMNPU17c5l5pBnckvkvAsU7iHUwgdUoJLYEnVV1tL9rKL3A6P5GOs0ct46uWtmBPHyhWeewunKwfZuATdubwfAujHVmLbe5bfh78byWTwGvh4pDA9cMg9EcEJPNEw1RmMcdZr4YeU4ALDu1rLIEWfy36pLxolEJJnADScs5lCkdvriupZLke5xRfgxZiimHTaHs34686cMWk8Zu63blyBNbPPB5lp5GDcUSG1p7nDKZbSeAK0yyMl6DAC6RSJhIHyUsnSaXyTSr4KdgM46GHbfKcnLhg2VclfT4mmxHEZAeLoXmRFf82Onr2somiXEkddw6L9fVdF71SRxIBJuHZpASKKdjAlQLcaEjf2b3b3DEAONY6ZAGUZF8ODnXxEj0l2aJAolhn8u1IJpSEyfstzWzxw1UJ4FYMHP07G8oqKeAe5TMMqYjKyksbx8MOQJhEoxcZAZGLI06uXbBvHbHchgtusUgd2exRNZLHBZtAaXT5PZ9coyk9hd2ZyC7
Requires: libc.so.6(GLIBC_2.14)(64bit), libc.so.6(GLIBC_2.2.5)(64bit), libc.so.6(GLIBC_2.3.4)(64bit), libc.so.6(GLIBC_2.4)(64bit), libgcc_s.so.1(GCC_3.0)(64bit), libgcc_s.so.1(GCC_3.3.1)(64bit), libglib-2.0.so.0()(64bit) >= set:omUpjxlpf1, libgsf-1.so.114()(64bit) >= set:mhaWRZJG9AiBbYwcBPtjbNqnD9Ko1Zrb8qljDXij8AEjGtRcuSFUXsygNd8ghOvMLu1, libstdc++.so.6(CXXABI_1.3)(64bit), libstdc++.so.6(CXXABI_1.3.8)(64bit), libstdc++.so.6(CXXABI_1.3.9)(64bit), libstdc++.so.6(GLIBCXX_3.4)(64bit), libstdc++.so.6(GLIBCXX_3.4.11)(64bit), libstdc++.so.6(GLIBCXX_3.4.15)(64bit), libstdc++.so.6(GLIBCXX_3.4.20)(64bit), libstdc++.so.6(GLIBCXX_3.4.21)(64bit), libstdc++.so.6(GLIBCXX_3.4.29)(64bit), libstdc++.so.6(GLIBCXX_3.4.32)(64bit), libstdc++.so.6(GLIBCXX_3.4.9)(64bit), libz.so.1()(64bit) >= set:khb6pwmYBXk6jXbkhJZj1, rtld(GNU_HASH)
Requires(rpmlib): rpmlib(SetVersions)
Finding debuginfo files (using /usr/lib/rpm/find-debuginfo-files)
Executing: /bin/sh -e /usr/src/tmp/rpm-tmp.srTXZ8
Creating libwv2-debuginfo package
Processing files: libwv2-devel-0.4.2-alt3
Executing(%doc): /bin/sh -e /usr/src/tmp/rpm-tmp.11135
+ umask 022
+ /bin/mkdir -p /usr/src/RPM/BUILD
+ cd /usr/src/RPM/BUILD
+ cd wv2-0.4.2
+ DOCDIR=/usr/src/tmp/wv2-buildroot/usr/share/doc/libwv2-devel-0.4.2
+ export DOCDIR
+ rm -rf /usr/src/tmp/wv2-buildroot/usr/share/doc/libwv2-devel-0.4.2
+ /bin/mkdir -p /usr/src/tmp/wv2-buildroot/usr/share/doc/libwv2-devel-0.4.2
+ cp -prL AUTHORS ChangeLog README THANKS TODO /usr/src/tmp/wv2-buildroot/usr/share/doc/libwv2-devel-0.4.2
+ chmod -R go-w /usr/src/tmp/wv2-buildroot/usr/share/doc/libwv2-devel-0.4.2
+ chmod -R a+rX /usr/src/tmp/wv2-buildroot/usr/share/doc/libwv2-devel-0.4.2
+ cp -prL doc /usr/src/tmp/wv2-buildroot/usr/share/doc/libwv2-devel-0.4.2
+ chmod -R go-w /usr/src/tmp/wv2-buildroot/usr/share/doc/libwv2-devel-0.4.2
+ chmod -R a+rX /usr/src/tmp/wv2-buildroot/usr/share/doc/libwv2-devel-0.4.2
+ exit 0
Finding Provides (using /usr/lib/rpm/find-provides)
Executing: /bin/sh -e /usr/src/tmp/rpm-tmp.NA1DtW
find-provides: running scripts (alternatives,debuginfo,gir,lib,pam,perl,pkgconfig,python,python3,shell,typelib)
Finding Requires (using /usr/lib/rpm/find-requires)
Executing: /bin/sh -e /usr/src/tmp/rpm-tmp.hhbroE
find-requires: running scripts (cpp,debuginfo,files,gir-js,gir-python,gir,lib,pam,perl,pkgconfig,pkgconfiglib,python,python3,rpmlib,shebang,shell,static,symlinks,systemd-services,typelib)
/usr/src/tmp/wv2-buildroot/usr/include/wv2/fonts.h:23:10: fatal error: vector: No such file or directory
   23 | #include <vector>
      |          ^~~~~~~~
compilation terminated.
cpp.req: /usr/src/tmp/wv2-buildroot/usr/include/wv2/fonts.h: cpp failed, trying c++ mode
In file included from /usr/src/tmp/wv2-buildroot/usr/include/wv2/olestream.h:22:
/usr/src/tmp/wv2-buildroot/usr/include/wv2/olestorage.h:26:10: fatal error: gsf/gsf.h: No such file or directory
   26 | #include <gsf/gsf.h>
      |          ^~~~~~~~~~~
compilation terminated.
cpp.req: WARNING: /usr/src/tmp/wv2-buildroot/usr/include/wv2/olestream.h: cpp failed
/usr/src/tmp/wv2-buildroot/usr/include/wv2/olestorage.h:26:10: fatal error: gsf/gsf.h: No such file or directory
   26 | #include <gsf/gsf.h>
      |          ^~~~~~~~~~~
compilation terminated.
cpp.req: WARNING: /usr/src/tmp/wv2-buildroot/usr/include/wv2/olestorage.h: cpp failed
In file included from /usr/src/tmp/wv2-buildroot/usr/include/wv2/olestream.h:22,
                 from /usr/src/tmp/wv2-buildroot/usr/include/wv2/word_helper.h:22:
/usr/src/tmp/wv2-buildroot/usr/include/wv2/olestorage.h:26:10: fatal error: gsf/gsf.h: No such file or directory
   26 | #include <gsf/gsf.h>
      |          ^~~~~~~~~~~
compilation terminated.
cpp.req: WARNING: /usr/src/tmp/wv2-buildroot/usr/include/wv2/word_helper.h: cpp failed
find-requires: FINDPACKAGE-COMMANDS: cat
Provides: wv2-devel = 0.4.2-alt3
Requires: libwv2 = 0.4.2-alt3, /bin/sh, /usr/lib64/libwv2.so.4, coreutils
Finding debuginfo files (using /usr/lib/rpm/find-debuginfo-files)
Executing: /bin/sh -e /usr/src/tmp/rpm-tmp.mEGM8a
Processing files: libwv2-debuginfo-0.4.2-alt3
Finding Provides (using /usr/lib/rpm/find-provides)
Executing: /bin/sh -e /usr/src/tmp/rpm-tmp.KcNaNk
find-provides: running scripts (debuginfo)
Finding Requires (using /usr/lib/rpm/find-requires)
Executing: /bin/sh -e /usr/src/tmp/rpm-tmp.Jjfbzi
find-requires: running scripts (debuginfo)
Provides: debug64(libwv2.so.4)
Requires: libwv2 = 0.4.2-alt3, debug64(libc.so.6), debug64(libgcc_s.so.1), debug64(libglib-2.0.so.0), debug64(libgsf-1.so.114), debug64(libstdc++.so.6), debug64(libz.so.1)
Removing 1 extra deps from libwv2-devel due to dependency on libwv2
Wrote: /usr/src/RPM/RPMS/x86_64/libwv2-0.4.2-alt3.x86_64.rpm (w2.lzdio)
Wrote: /usr/src/RPM/RPMS/x86_64/libwv2-devel-0.4.2-alt3.x86_64.rpm (w2.lzdio)
Wrote: /usr/src/RPM/RPMS/x86_64/libwv2-debuginfo-0.4.2-alt3.x86_64.rpm (w2.lzdio)
40.63user 11.64system 0:19.03elapsed 274%CPU (0avgtext+0avgdata 187340maxresident)k
0inputs+0outputs (0major+2162833minor)pagefaults 0swaps
/.out/libwv2-0.4.2-alt3.x86_64.rpm: The use of such a license name is ambiguous: LGPL
/.out/libwv2-devel-0.4.2-alt3.x86_64.rpm: The use of such a license name is ambiguous: LGPL
/.out/libwv2-debuginfo-0.4.2-alt3.x86_64.rpm: The use of such a license name is ambiguous: GPL
3.27user 1.58system 0:30.91elapsed 15%CPU (0avgtext+0avgdata 126564maxresident)k
112inputs+0outputs (0major+239117minor)pagefaults 0swaps
--- libwv2-0.4.2-alt3.x86_64.rpm.repo	2013-04-02 12:18:14.000000000 +0000
+++ libwv2-0.4.2-alt3.x86_64.rpm.hasher	2023-10-23 02:45:28.238109712 +0000
@@ -11,3 +11,2 @@
 Requires: libc.so.6(GLIBC_2.2.5)(64bit)  
-Requires: libc.so.6(GLIBC_2.3)(64bit)  
 Requires: libc.so.6(GLIBC_2.3.4)(64bit)  
@@ -15,6 +14,9 @@
 Requires: libgcc_s.so.1(GCC_3.0)(64bit)  
+Requires: libgcc_s.so.1(GCC_3.3.1)(64bit)  
 Requires: libglib-2.0.so.0()(64bit) >= set:omUpjxlpf1
 Requires: rpmlib(SetVersions)  
-Requires: libgsf-1.so.114()(64bit) >= set:mhaWRZJG9AiRq06YlfyBKOVKFBoJHP4nI0ZJ54JGFPtF9G3zmNdFSlPUpDyLP925Tw059ZxYHn
+Requires: libgsf-1.so.114()(64bit) >= set:mhaWRZJG9AiBbYwcBPtjbNqnD9Ko1Zrb8qljDXij8AEjGtRcuSFUXsygNd8ghOvMLu1
 Requires: libstdc++.so.6(CXXABI_1.3)(64bit)  
+Requires: libstdc++.so.6(CXXABI_1.3.8)(64bit)  
+Requires: libstdc++.so.6(CXXABI_1.3.9)(64bit)  
 Requires: libstdc++.so.6(GLIBCXX_3.4)(64bit)  
@@ -22,2 +24,6 @@
 Requires: libstdc++.so.6(GLIBCXX_3.4.15)(64bit)  
+Requires: libstdc++.so.6(GLIBCXX_3.4.20)(64bit)  
+Requires: libstdc++.so.6(GLIBCXX_3.4.21)(64bit)  
+Requires: libstdc++.so.6(GLIBCXX_3.4.29)(64bit)  
+Requires: libstdc++.so.6(GLIBCXX_3.4.32)(64bit)  
 Requires: libstdc++.so.6(GLIBCXX_3.4.9)(64bit)  
@@ -25,8 +31,7 @@
 Requires: rtld(GNU_HASH)  
-Requires: rtld(GNU_UNIQUE)  
 Requires: rpmlib(PayloadIsLzma)  
-Provides: libwv2.so.4()(64bit) = set:odjCak8ZBg9iQ4qqDKkdxqVXygpbotMPpb6rlrLBEGMZplbKjL9l292DlsYZetPVflYOJBdJwEZANOalflSqQeGMg1L7kPfIY2vgyyzAnhQ9wiSapBpMd8OeK2IzUOGEZDyFZ6VKiOMsUNTnZHZkhSJBfMki9QkEHTQ9sM38zVjrAuuEkak3boVzmMIsSBmKZ3vrnJFyNeqlFpuuKfrF87iVgoqN4xhtktixtChpVoWa5HaMKgzzzSTGKZIqLpxoB7qjeApe7pI6NkpkvcG5wZDevOK7Z20JXNiPQ7ZibMn4Tat4ZDKZ1pCE7IjRZoMFdy9l9ruGzNSaxBND4uvKGR2FZ1NF4dBGNFLAlnO2R5E5owLaL2JwLr0TUWTA4t8Lvu4LiazlMHy7JJKejSrZnBQW85CrORmWOvutVvRZc6YFS0aZlRisXm18p3q8hAcjFRwQbI6mmG8OeZ4rAOhD76W7SVwS2qY7j1d55C4uIZ1a0lMG2lfZ2gZxyuvZEpV01Fcm2s1QcrS2v11vQuzhZJUnBBjnKta2VIovT5QuAR9hIEC27EG830QmSq42se9B5z3UFxp3rA2lFk18LucZsYXryVxykLEssmKfITAhPgnIuk2N7tYIqn3SptKfOFSnKP2sfUU2jxMDAS9aJFB5KJm6eD9VS1oGCoOMsC4zOhnQovUnkvQotBSd8g38Vu87viveKSXhTb2lrCVLSmlvEZihFKolpVqhqJCUQl3w1IxXiQlZd2C6aYxYAy9UDoVYajf3Mro1UDZCKnYjcpOfpCZq7DQh1amYDiuaA9ZDMycII5JbzRJ4R0gKovJLPcZr74ABKdB8zwfNcrTSnT2ZfV4X7SEy1d7sJVUu2ZmDdi7AaMJZbNFWn46rTjYZI12evjWKZKPS7vWtGjhssi8SYzf5yJpjbKGw5VFW5A1qhwjjFw9MNhPsWgkyDRJHxl8A75dY7VpcozaMZ4o4tzcu2pvIwgJFq9HLFsEH3inP1bJxAPmkKjvLuXZCyxecq7YZtHOr12OepaDLLlMuXPZiIbZqjIQsax45CVoLSq28hFW4pN4qkb1Z6qV50DIdUTZE4Dyx1PPfxUEMCrybPcUO4zzjn8BOYIhFVt88GTrXHLIOAVUZz8Td8ZhZydXZfwZu9J4P94KEZhmcy3fnh6oQBQHHOcGPZ1WvKP9I38BTg2jzKENm9NDLujzm5pnd8AzjvemF4n34FmkISnk5r26mVBIAlZEfP9vCljUQsid7ykh65SAm1FZlc8ktdy07gFLOTSoYi8FRV6Edk0aSMFPdsqNSi1LBBAZwu9dHZ3HhUwBZgQ5zEVxNkDa2rstCO6HunBRh2aVSAPsZyZrcwFiWYxyXCrBZ1bGgZEDk1NaZhxfzQXgqWmlU7mb5Xd18vrE5uqCAlcSMRjGpZrYAjvEapZtYYJZ21lZ8wRAw9Cf2vSdOYuh6hR3rfawJzB8Sp91NV8Aeth8L5HbZlhiVajb2siBkHRevXXbFnZpKaOVdgEZx6ATDFW4eNrRcl2gN5ZBZC4X4nukdbu6g0Z1zXjdx4ZI2urilZ0sohTpMW6qqYxSj60SduzpAaSnOYMNySUiE3sGxKZhK5lPaHIuYBq4cM3OxYsgqLSc6Sa4FXpQ8ohJpSB38ZllQ7DxdXXqP0x3Vc70h5Z6W9I8ItT69U7t0NYamwKpENlkZptZjRaNNXX1iHnFTBzkpoAJmDuNA6DWmaPjvoHq1hHrvntG4gc8y3UcmcT17BbMvOTSYrtFIPxfJxooHZEMzUZ7B9hk5z7dCWATHkurnlOB8pKDNyE2eW2ud17ef3EjjclDWIAY61X7ZjlHU6ZnpjEl4qno1L53qhZFZzcHwq89EzjOPcMdQqcKrZgGlCQqCU8qdF9sLVd8h5FqfRvPmGcTUvm7rTuZ8a6qTA0jzHkjEXT2JhfmnOjKvFU81DFyV4Pxuoon3iKUZexrntmYN71HfObXnmCckgplLsCkppBqxaYIgJzzbZhZgShckFQO1juE5Zcj5vswbKoIzWHFmgEJXntibinB0KxLCimkgEqZvBK8YDcQrCXFjO1cSQEmOLGXdR2Ze4A4mj2ho1qFZaWyGmv9gXANRFcfAvFMcflOno1Cv1q38MAkgwJySCRCbrQPQgX1ZK8XChxJtzgHgYN0tZKjctZ4o4t1gDnaZwNSIzkH4w9ioUuyjPQpO2SFK0s2uMof8u6Z5fExYBC4x8VSLY4WfzDqJM03l5DmZ7Zzv8fmzugyspEgkD2Eb5KonmbTFHcTux48HFIw9USP1VnlbMFGJblv1tJ6vbYCjIu0uGpHeZA4WNdatkojdBCcspSy1CPrI3IaFWdECbtL7NfhVETaNfOKUCHe58DC9W5beZGab5MxhTleEhw3yK6Zy3erzHVdFdcIGmQxdfxjRkbKYoLCpxmk1UZaNN1MdJPZ7sHTkm1BOBZdxdbIDqYLypPhmOjismEBa5IN6C7yulGwwn48AIKgsTCrnkoSKPSdeb8E0YRaGaOy8YmoXosCE6QZ9zBxFdzONDdVbQQb9eM0991mxlQJW9rpaqZDVK7Af7OJDTvy8YQYaLFu55QphiZ6VdKOoaslyqvcvDWdZ6DEDBTOCMYccOlZ942UlcEIN9F2pBcVf7DOSQtYp8yUthpGa81QThepbfFQ4hOvq1HHnmqTaqU4hfDd15G5OtXqKoo8pnSVdcogseMrxUmIYblibamhX5Tw7rUaMmDU4swKZ7WfHRioKOvAnvt3nZE7byVRJWZc7VuYeoRQMgIAzwoYSQYrImnN20VNCAMzoPLFaBRnkZ9XCpFmtTaJvvcxJfd4LnC5iHgYVs5M7pF1e4d3125ZuVCu7YxK6lbhgGJZJbsadAXI4dT5jsZimbpkVLmsYIpkXHLfydkbKpCbe9d9qnW2dOABUyxnZ84PdbvQE8eVao5MRV7qxk1CCXyi3NLUVaQgZqsgn9E7ezZbxiZ3jcKm3SISbOhuqpkO01f2xvlfZjac3r4ydZAS7zAt2XGSOasLK4VZBdiUOFipcd2HQjne6s0RPS7FHDMF8Xobjrq2TQP1H8PU5PlolZIHOTErlbONJZnPG4lHpx5sS5aw0eRcCJYcxCFcB8z4STUVEs7ifp7mkCi5g6Nq1dxO0WddJEn6ICBNfir3Jd14z8dDNEuwpkpiDFnW6aeTu7XLrl7KfDCjVYyhF5omQYzpEhYYUCo0RTu9vZgFsgvvCP2x7xUkQkPp2sw21pbWHzkZ3W9fPfiLZfF11Fz3McZCZKDQo6HD47voWZJD6sYcuM1jhRMtImuNgZ1R797ZhiHUwgdUoJLYEzOrzYwKTAdTT1izV2lpAt46uWtm9xeVlN8t77gLbnM7vDYK1rpCFWdJCrZeyjNOjQ1OyIMnD3GZlVrpEtiCM03BwOwSZoiBM26krxDuVdZvIZqZuwjgjIldZ2oXB5lZxN1zITgIaQSSbOjr6KyajGCLd9LIZDGntZpMW7EgvhOqZKZv8Hs34686cMWk8Zu63blyBNbPjYh4xG3fpMJl3OeKe54KXHJ3FbwE8sBN9FFdcpuIdytl4miBt5ESFZ6I4Lk68efQ2nCMGoVNBVWd2i8DFWVCMOas5Z7OV5vDbWlK3MSZj8hVUZBr2skAvPQealj368IEdVJgThRMHx9y0XWgSOmLlPKhTC2Nzo5ZbcaIIDZj2b3bz6U6eFscLN5EBgNZzhAfLS3hD0G4kqHUGPGEb4L0SScrkN7KKhrMNg8o0ubhafYWcMxa2CCH3FjNdcI6ZDHQ8KXAyr941mCKdZabfbAVDZlvp1I2gh1DUBOLlJosaj4kD77ekzwjotYZLqFvjGIvncTDcoyk9hd2ZyC7
+Provides: libwv2.so.4()(64bit) = set:odjCak8vaNK6zBjnGCgJYthEI5IeUVI5zJGJTiQjqRyOFax4xPaeZkyNvGUBrbrq1hZFyBlGuGIREtkxxwudZwbLM7QRtffiu5hD0apHA5uehSNlwt4nm5Z3KLBXa93Px7vvZfWjhSJBP9wgzYat27Y0OoZkrAuuEk2Iab2G5JwpVIX68tcvrnJFyNeqlFpuuKfr98n1HL8cGzGjaItCb3B5tYol1S5qssQZmlTvmXdb4HYgrOxdOvUsANq4jBhZ1zq1UZFPDIXiLtZyS7ZibMn4Tat4ZDKZ1pCEJSZ1xjrAIAtg9ruGzd5BEjopY9xTDHqJgqv4DiQkG6DZsApxW2UBLaL2J0vjzHvjiQxYZp7NHAOo5YGUhrHHPAZ6ZnBQW85CrORmWsWPZAjwfR6gNLGBUIXBdEx4hOcBm4bGxBBayIjfJha7tuoEDvb1iaENvc5QkkoiUNS7a0lMG2lfZ2gZxyuvZEpV01Fcm2s1QcrS2v11vkZqszvlmetVSF8APyZdt1J7pti4bGFM1G65yo0wSOmzgwP9Oa1YQ0dH2lFk18LmCZtT4P35FuNiyUGcq6WyRzi8ZoeuGMSptKfOFSn6ygc8VUGyNfdY9FtyirqpI46eD9VS1oGCoOMsC4zOhnQovUnkvQotBSd8g38Vad8Z9zHZeoTOcZBrHGfkvRBGZJ5HabnbiHR4DKq0cwdsnyKGL5cdkU3V95jMfhueZc0Y6eQnVZAcpOfpCZq7DQh1amYDiuQ4vFLKxdIpbzRJ4R0gKovJLPcZr74ABKdB8zwfNcrTSnT2o4X7SEy1d7weV9UrDdi7AaMJZbNFWn46rTjYZI12evjWBR4tvSZofZekDyUUAgIV7va4rPCmsZmuGu1p0MtQ8A1RQxE4fHxtxwAGZEYc6Ih5dfIiwhQdOU9AZ1b8krGmOWkpIRIQ6ierhVeZdHTZvCoE3zS1LvLaL588XAFsC1TrvSnE5woFVk2pMzju09alD8bCgzqTNBn0sOSwvZzisa66cfZA8eaIVCUOc3KcNU3FipuSEQYe44RXJZ5DI47wsTwU77ZLyYfELDQicDgw4RPlA16t9ZaHOcyTZfsDjo7gaLx48ikiYVHTQElhSlSRFf7HkyHh52Z1mkISnk5rIZrABISkDYpmdxjP9Rs8i5pkojq5AWnc8ktdy07gFLOTS8wce9AQWs347aSMFPdsqNSi1LBBAZwu9dHZ3HhUwBZgQ5jIzFel4SUWcBd8wIeig9TCsCXnYnq3nmGAevEUKViOh5W7f9LY7xfzQXgqWmlU7mbpUjZm3JMjPAIyN6KuidPvYx2ledDfT62mj2CoZoMDtzcLnAhkZ0rfawJ3kUj2yPh8tWywkkNnfgpqhwjGAqJCM55Ljn5VM4634WvoguvCGjU4LlPk905nYnZC4XYZGpNP02Ef6HcI3UJ9lpUO4rpfot35LU6WdKEdfsIEdK4W0DqEHvUmkdHIOWNnGhEPvS5mP1FZadzxJ2hWu6d2Yd6gYHaWzPMCZdRC127Ope0yaWdZ4oh4ez3m4rz4Yzewou5bgTcQUaaZIeZFqBEQ3ZiJMKiGFBxhSqtW5jqsuiDAkCDZgrlb8qtXXGjB0y11KC5PtMhV2YDYJdZCtFIPxfJxooHZEwZglC4hlcuQoGjuLiVJtzwqn5fpKDNyE2eW2ud17ef3EjjclDWIAY61X7ZjlHeEYaS4q5m51LF6a3ZFZzcHwq89E7HpwrERosTY1skQcNhQqijUuPrg6JZ4Z7PmmZvPWoXSH7g0y4oqsBq2tZCxWZdie9IQZlaey2bLOMe5HTrgZsyfZowR7PtmCwjJuVcFOOaR2lUpxZgjbbKU7Zgm8Y44GkqVw9fQyuuGUz3sN5ztkvdR2NkNxKvRhkI4MdYRkT4GCZDFb2ZFcQrCXFjOJJhJAvlTrhCiKuDwAMqi82zQrlnkRWb1qDcKeBVxYb56KwbIv4q38MAkMqWylhrPqPBdWpiGZKgYy83bR6xmxUz1WZtrZjxh4CZ2Bv8SCtAqB0chyaCnR9edjZ1Xkn0e1foI74fzZq7Qgynx8VSLY4WfzDqJM03l5DmZ7Zzv8fm0RjVH0WixbSBROtWaPJn81OMO4sXVwYHG5eh48qXiRngnHNT2LV4H7wDqSGPfhE7TEQhxdRkqOMBpb6osp0HiGu3GViTXhYjkeWJywVJh69iD2AjZCWnlmawvqVwvMj074tdZl6sS6nPrObHq1fcUkdRybfSHpm86ZeRUU0UCq3UkI2aBbXXMC5SjdZn5PCzIADA87UdSMYgQHi54Z2AIKgsnlIMItDJEAwJPaZrmhBGeL5SemX3WZsNOMQChVMplEFnWUIGpwAA0HMaWmZ4SOkQZvOtf8veArfLZA4xDCnpdxphiZ6VOnG9GZ1PTFuzDRpVJEN66VG2fBa6xq5je9l8HA9ZFzjprWeZsg41jRGw4gv7VAJYAij49ZFmMWWBBSJy6ehQpG2lwYqKoo8pnSVdcogseMrxUmIYblibamhX5T0Lx0rtyjM1WSvWJxwVaZxVRnTMRfuI8CnTGTP7VuYeY5rGdcMZ4NUJFVTo5ZBhuI99Y8SYrGipZ5kZ9XCp99CQZt7joXj3NXBpxQa4ven6hF1e4d3125ZuVCu7YxK6lbhgGJZJbsadAXI4NEMVbmbpkVLmsYIpkXrIFx7N6G5nof9d9qnW2ltN53LWhyVCBfqk4Ds5I2UWY3JgG0jPthFxUDdyxYleEH4Q3DNgc5zHR0lsV8fJcap02ZAXYEMcIh8SYjS7zAt2DMlUut92j47f5JQoYG31vwjne6s0RPS7TIjhSNm6ZxqWVwlApYy9wZIHOTErlbONJZnDX5mMpnE0209kbfjEpaIS2XrYs42Jp7mkCi5g6Nq1dxO0iEhLcodbzvAs4ZEeZs8iPpcG7o6lCABt35DZ4ZdJG3TDjPF40r0zUVNdN0GCAAu9vusyuvCP2x7xUkQkPp2sw21EaciRfW9fPfi7aQZfQwwQN1oCvXTfFNcmHZ1S7SmsMNPU17c5l5pBnckvkvAsU7iHUwgdUoJLYEnVV1tL9rKL3A6P5GOs0ct46uWtmBPHyhWeewunKwfZuATdubwfAujHVmLbe5bfh78byWTwGvh4pDA9cMg9EcEJPNEw1RmMcdZr4YeU4ALDu1rLIEWfy36pLxolEJJnADScs5lCkdvriupZLke5xRfgxZiimHTaHs34686cMWk8Zu63blyBNbPPB5lp5GDcUSG1p7nDKZbSeAK0yyMl6DAC6RSJhIHyUsnSaXyTSr4KdgM46GHbfKcnLhg2VclfT4mmxHEZAeLoXmRFf82Onr2somiXEkddw6L9fVdF71SRxIBJuHZpASKKdjAlQLcaEjf2b3b3DEAONY6ZAGUZF8ODnXxEj0l2aJAolhn8u1IJpSEyfstzWzxw1UJ4FYMHP07G8oqKeAe5TMMqYjKyksbx8MOQJhEoxcZAZGLI06uXbBvHbHchgtusUgd2exRNZLHBZtAaXT5PZ9coyk9hd2ZyC7
 Provides: libwv2 = 0.4.2-alt3
 File: /usr/lib64/libwv2.so.4	120777	root:root		libwv2.so.4.0.1
-File: /usr/lib64/libwv2.so.4.0.1	100644	root:root	001b3a9d2318e957558030c51cadd94c	
+File: /usr/lib64/libwv2.so.4.0.1	100644	root:root	0eaaccad626d21522f5a4a2e802cd5e0	
 File: /usr/lib64/wvWare	40755	root:root		
@@ -38,2 +43,2 @@
 File: /usr/share/doc/libwv2-0.4.2/TODO	100644	root:root	fabc73a875a4e1d5acf6e37fd59f3e63	
-RPMIdentity: e3f2e12c9ee70f269d07ffb7bf54f9c7bb62493ec1fea2886d11ffa06eb6e57a4f005686bce8701a8aebe54f1c77dcd22984867cb056b3710587d2a9752e6d99
+RPMIdentity: 13b3c1c1f0683997120e94be3fdfd2ecf3fe1c05d6c63519ad40327027b7c3da1b8d41fd2a942ec613b817a70bd0e470e2aedd27d15b96b734dcedc18c4cc1e8
--- libwv2-debuginfo-0.4.2-alt3.x86_64.rpm.repo	2013-04-02 12:18:14.000000000 +0000
+++ libwv2-debuginfo-0.4.2-alt3.x86_64.rpm.hasher	2023-10-23 02:45:28.311110561 +0000
@@ -1,4 +1,4 @@
-/usr/lib/debug/.build-id/3f	40755	root:root	
-/usr/lib/debug/.build-id/3f/02fb13cd03c7c9faed057a994783862ebd4b73	120777	root:root	../../../../lib64/libwv2.so.4.0.1
-/usr/lib/debug/.build-id/3f/02fb13cd03c7c9faed057a994783862ebd4b73.debug	120777	root:root	../../usr/lib64/libwv2.so.4.0.1.debug
+/usr/lib/debug/.build-id/2f	40755	root:root	
+/usr/lib/debug/.build-id/2f/e2a2713b8247425b5fc2d0fa9bdc22e2b7e3d2	120777	root:root	../../../../lib64/libwv2.so.4.0.1
+/usr/lib/debug/.build-id/2f/e2a2713b8247425b5fc2d0fa9bdc22e2b7e3d2.debug	120777	root:root	../../usr/lib64/libwv2.so.4.0.1.debug
 /usr/lib/debug/usr/lib64/libwv2.so.4.0.1.debug	100644	root:root	
@@ -6,2 +6,4 @@
 /usr/src/debug/wv2-0.4.2	40755	root:root	
+/usr/src/debug/wv2-0.4.2/BUILD-x86_64-alt-linux	40755	root:root	
+/usr/src/debug/wv2-0.4.2/BUILD-x86_64-alt-linux/src	40755	root:root	
 /usr/src/debug/wv2-0.4.2/src	40755	root:root	
@@ -90,8 +92,10 @@
 Provides: libwv2-debuginfo = 0.4.2-alt3
-File: /usr/lib/debug/.build-id/3f	40755	root:root		
-File: /usr/lib/debug/.build-id/3f/02fb13cd03c7c9faed057a994783862ebd4b73	120777	root:root		../../../../lib64/libwv2.so.4.0.1
-File: /usr/lib/debug/.build-id/3f/02fb13cd03c7c9faed057a994783862ebd4b73.debug	120777	root:root		../../usr/lib64/libwv2.so.4.0.1.debug
-File: /usr/lib/debug/usr/lib64/libwv2.so.4.0.1.debug	100644	root:root	4f12d607a6f899584c46460319837cb9	
+File: /usr/lib/debug/.build-id/2f	40755	root:root		
+File: /usr/lib/debug/.build-id/2f/e2a2713b8247425b5fc2d0fa9bdc22e2b7e3d2	120777	root:root		../../../../lib64/libwv2.so.4.0.1
+File: /usr/lib/debug/.build-id/2f/e2a2713b8247425b5fc2d0fa9bdc22e2b7e3d2.debug	120777	root:root		../../usr/lib64/libwv2.so.4.0.1.debug
+File: /usr/lib/debug/usr/lib64/libwv2.so.4.0.1.debug	100644	root:root	7418bcdc040c819068b74265d575da1f	
 File: /usr/lib/debug/usr/lib64/libwv2.so.4.debug	120777	root:root		libwv2.so.4.0.1.debug
 File: /usr/src/debug/wv2-0.4.2	40755	root:root		
+File: /usr/src/debug/wv2-0.4.2/BUILD-x86_64-alt-linux	40755	root:root		
+File: /usr/src/debug/wv2-0.4.2/BUILD-x86_64-alt-linux/src	40755	root:root		
 File: /usr/src/debug/wv2-0.4.2/src	40755	root:root		
@@ -170,2 +174,2 @@
 File: /usr/src/debug/wv2-0.4.2/src/zcodec.hxx	100644	root:root	a7fc60c0f9a4be7874135b246a1ad4dd	
-RPMIdentity: 6693775e7f7289ff66f13b151206a42c6a9626fe14e250505ed0dc7fb1a103e3948973b57c50b344a9f758458a38f6c54ad678f0ef65dcb344a05f32e35b0caa
+RPMIdentity: 0e9d768d9bd010e5dbfe71e01f3e79e819e5dfdc4e05a406d3f9096461a15f3b4e8af8e9296ba573f2e77fb9e975fe23bbf4f691dc82638fc42a974acb24446c
--- libwv2-devel-0.4.2-alt3.x86_64.rpm.repo	2013-04-02 12:18:14.000000000 +0000
+++ libwv2-devel-0.4.2-alt3.x86_64.rpm.hasher	2023-10-23 02:45:28.383111398 +0000
@@ -87,4 +87,4 @@
 File: /usr/lib64/libwv2.so	120777	root:root		libwv2.so.4
-File: /usr/lib64/wvWare/wv2-release.cmake	100644	root:root	f4fb9613aba6954c156e2d270d8893d7	
-File: /usr/lib64/wvWare/wv2.cmake	100644	root:root	a9f6e0e0a53f9e3f20b3af377c70d3d6	
+File: /usr/lib64/wvWare/wv2-release.cmake	100644	root:root	040aa46317b95e20ce26c40bdcd45a0b	
+File: /usr/lib64/wvWare/wv2.cmake	100644	root:root	82e14a37a00052df4a31e3a9283296c7	
 File: /usr/share/doc/libwv2-devel-0.4.2	40755	root:root		
@@ -110,2 +110,2 @@
 File: /usr/share/doc/libwv2-devel-0.4.2/doc/parsers.png	100644	root:root	f096e9286ec1ff2894eec780e1a6d5ff	
-RPMIdentity: 7a2b3b3499bbf8a89ed999ebbdefbbc8d43cf8ca008d98895c3b0d4bed7c274cef1be099c36bd8243b5a4c9c82bd9d02ef3c3eb83184c8293912a1a1a9bc7484
+RPMIdentity: 569a2149ca022a35dee751de7711e46b7b4ebd7f1a36357fa344c3f96b4c14322cc141d45d5803863b10195103674b0c64fb35997aeb7c87157e47a7d0b5d5bf