<86>Oct  7 03:36:20 userdel[3151556]: delete user 'rooter'
<86>Oct  7 03:36:20 userdel[3151556]: removed group 'rooter' owned by 'rooter'
<86>Oct  7 03:36:20 userdel[3151556]: removed shadow group 'rooter' owned by 'rooter'
<86>Oct  7 03:36:20 groupadd[3151571]: group added to /etc/group: name=rooter, GID=1817
<86>Oct  7 03:36:20 groupadd[3151571]: group added to /etc/gshadow: name=rooter
<86>Oct  7 03:36:20 groupadd[3151571]: new group: name=rooter, GID=1817
<86>Oct  7 03:36:20 useradd[3151579]: new user: name=rooter, UID=1817, GID=1817, home=/root, shell=/bin/bash, from=none
<86>Oct  7 03:36:20 userdel[3151590]: delete user 'builder'
<86>Oct  7 03:36:20 userdel[3151590]: removed group 'builder' owned by 'builder'
<86>Oct  7 03:36:20 userdel[3151590]: removed shadow group 'builder' owned by 'builder'
<86>Oct  7 03:36:20 groupadd[3151599]: group added to /etc/group: name=builder, GID=1818
<86>Oct  7 03:36:20 groupadd[3151599]: group added to /etc/gshadow: name=builder
<86>Oct  7 03:36:20 groupadd[3151599]: new group: name=builder, GID=1818
<86>Oct  7 03:36:20 useradd[3151605]: new user: name=builder, UID=1818, GID=1818, home=/usr/src, shell=/bin/bash, from=none
<13>Oct  7 03:36:23 rpmi: rpm-macros-meson-1.2.2-alt1 sisyphus+330737.100.1.1 1696175876 installed
<13>Oct  7 03:36:23 rpmi: ninja-build-1.11.1-alt2 sisyphus+327335.100.1.1 1692285423 installed
<13>Oct  7 03:36:23 rpmi: libmpdec3-2.5.1-alt3 sisyphus+314490.500.5.1 1675432004 installed
<13>Oct  7 03:36:23 rpmi: libgdbm-1.8.3-alt10 sisyphus+278100.1600.1.1 1626058413 installed
<13>Oct  7 03:36:23 rpmi: libexpat-2.5.0-alt1 sisyphus+309227.100.1.1 1667075764 installed
<13>Oct  7 03:36:23 rpmi: libb2-0.98.1-alt1_1 sisyphus+291614.100.1.1 1638962877 installed
<13>Oct  7 03:36:23 rpmi: libp11-kit-1:0.24.1-alt2 sisyphus+324666.100.1.1 1689083439 installed
<13>Oct  7 03:36:23 rpmi: libtasn1-4.19.0-alt3 sisyphus+327816.100.1.1 1692802615 installed
<13>Oct  7 03:36:23 rpmi: rpm-macros-alternatives-0.5.2-alt2 sisyphus+315270.200.2.1 1676457367 installed
<13>Oct  7 03:36:23 rpmi: alternatives-0.5.2-alt2 sisyphus+315270.200.2.1 1676457367 installed
<13>Oct  7 03:36:23 rpmi: ca-certificates-2023.07.31-alt1 sisyphus+326137.200.1.1 1690809798 installed
<13>Oct  7 03:36:23 rpmi: ca-trust-0.1.4-alt1 sisyphus+308690.100.1.1 1666182992 installed
<13>Oct  7 03:36:23 rpmi: p11-kit-trust-1:0.24.1-alt2 sisyphus+324666.100.1.1 1689083439 installed
<13>Oct  7 03:36:23 rpmi: libcrypto3-3.1.3-alt1 sisyphus+329935.40.3.2 1695159002 installed
<13>Oct  7 03:36:23 rpmi: libssl3-3.1.3-alt1 sisyphus+329935.40.3.2 1695159002 installed
<13>Oct  7 03:36:23 rpmi: python3-3.11.4-alt3 sisyphus+330215.1400.3.1 1695493590 installed
<13>Oct  7 03:36:24 rpmi: python3-base-3.11.4-alt3 sisyphus+330215.1400.3.1 1695493590 installed
<13>Oct  7 03:36:24 rpmi: python3-module-typing_extensions-4.7.1-alt1 sisyphus+324215.100.1.1 1688464174 installed
<13>Oct  7 03:36:24 rpmi: meson-1.2.2-alt1 sisyphus+330737.100.1.1 1696175876 installed
<13>Oct  7 03:36:33 rpmi: libjpeg-2:2.1.2-alt1.2 sisyphus+300827.100.2.1 1653916633 installed
<13>Oct  7 03:36:33 rpmi: libwayland-client-1.22.0-alt1.1 sisyphus+318010.100.1.1 1680606299 installed
<13>Oct  7 03:36:33 rpmi: libpng16-1.6.40-alt1 sisyphus+323732.100.1.1 1687771851 installed
<13>Oct  7 03:36:33 rpmi: libusb-1.0.26-alt2 sisyphus+305525.100.1.1 1660924427 installed
<13>Oct  7 03:36:33 rpmi: vapi-common-0.56.13-alt1 sisyphus+328259.100.1.1 1693392101 installed
<13>Oct  7 03:36:33 rpmi: sgml-common-0.6.3-alt15 sisyphus+276099.100.1.1 1624817971 installed
<13>Oct  7 03:36:33 rpmi: libwebp7-1.3.2-alt1 sisyphus+329541.100.1.1 1694676223 installed
<13>Oct  7 03:36:33 rpmi: libopus-1.4-alt1 sisyphus+319474.100.1.1 1682669952 installed
<13>Oct  7 03:36:33 rpmi: libogg-1.3.5-alt1 sisyphus+278100.3400.1.1 1626058929 installed
<13>Oct  7 03:36:33 rpmi: libfribidi-1.0.13-alt1 sisyphus+320646.100.1.1 1684307082 installed
<13>Oct  7 03:36:33 rpmi: libgudev-1:238-alt1 sisyphus+324364.100.1.1 1688646144 installed
<13>Oct  7 03:36:33 rpmi: libsqlite3-3.42.0-alt1 sisyphus+321513.100.1.1 1684602997 installed
<13>Oct  7 03:36:33 rpmi: libvorbis-1.3.7-alt1 sisyphus+275738.100.1.1 1624751601 installed
<13>Oct  7 03:36:33 rpmi: libwayland-egl-4:18.1.0-alt1.1 sisyphus+318010.100.1.1 1680606299 installed
<13>Oct  7 03:36:33 rpmi: libxslt-1.1.37-alt1 sisyphus+307481.100.1.1 1664360521 installed
<13>Oct  7 03:36:33 rpmi: liblcms2-2.15-alt1 sisyphus+316039.100.1.1 1677666328 installed
<13>Oct  7 03:36:33 rpmi: perl-HTTP-Date-6.06-alt1 sisyphus+324527.100.1.1 1688834564 installed
<13>Oct  7 03:36:33 rpmi: perl-XML-NamespaceSupport-1.12-alt1 1491296348 installed
<13>Oct  7 03:36:33 rpmi: libserd-0.30.10-alt1_3 sisyphus+288138.100.1.1 1635175831 installed
<13>Oct  7 03:36:33 rpmi: libgsm-1.0.17-alt1 sisyphus+275359.100.2.1 1624907612 installed
<13>Oct  7 03:36:33 rpmi: libraw1394-11-2.1.2-alt1 sisyphus+278262.100.1.1 1626081867 installed
<13>Oct  7 03:36:33 rpmi: libgomp1-13.2.1-alt2 sisyphus+327572.100.1.1 1692472816 installed
<13>Oct  7 03:36:34 rpmi: python3-module-Pygments-2.16.1-alt1 sisyphus+326610.100.1.1 1691406169 installed
<13>Oct  7 03:36:34 rpmi: xml-utils-1:2.10.4-alt1 sisyphus+311250.4140.175.1 1685628991 installed
<13>Oct  7 03:36:34 rpmi: docbook-dtds-4.5-alt1 sisyphus+276837.100.1.1 1625242123 installed
<13>Oct  7 03:36:34 rpmi: libidn2-2.3.4-alt1 sisyphus+309023.100.1.1 1666791084 installed
<13>Oct  7 03:36:34 rpmi: libnettle8-3.9.1-alt1 sisyphus+322548.100.1.2 1686176879 installed
<13>Oct  7 03:36:34 rpmi: libopenjpeg2.0-2.5.0-alt1 sisyphus+299926.300.3.1 1652478843 installed
<13>Oct  7 03:36:34 rpmi: rpm-build-gir-0.7.3-alt3.1 sisyphus+319393.100.1.1 1682538783 installed
<13>Oct  7 03:36:34 rpmi: glib2-devel-2.78.0-alt1 sisyphus+329802.100.1.1 1694991222 installed
<13>Oct  7 03:36:34 rpmi: libdc1394-22-2.2.5-alt1.1 sisyphus+311484.100.1.1 1670647146 installed
<13>Oct  7 03:36:34 rpmi: libsord-0.16.14-alt1_2 sisyphus+328228.100.1.1 1693337618 installed
<13>Oct  7 03:36:34 rpmi: libwayland-cursor-1.22.0-alt1.1 sisyphus+318010.100.1.1 1680606299 installed
<13>Oct  7 03:36:34 rpmi: libgraphene-1.10.8-alt1 sisyphus+296855.100.1.1 1647633383 installed
<13>Oct  7 03:36:34 rpmi: python3-module-six-1.16.0-alt2 sisyphus+324249.100.1.1 1688484676 installed
<13>Oct  7 03:36:34 rpmi: libxkbcommon-1.5.0-alt1 sisyphus+312911.100.1.1 1673035568 installed
<13>Oct  7 03:36:34 rpmi: libepoxy-1.5.10-alt1 sisyphus+296853.200.2.1 1647631866 installed
<13>Oct  7 03:36:34 rpmi: perl-LWP-MediaTypes-6.04-alt1 sisyphus+225468.100.1.1 1553186684 installed
<13>Oct  7 03:36:34 rpmi: perl-Compress-Raw-Zlib-2.206-alt1 sisyphus+325780.100.1.1 1690558898 installed
<13>Oct  7 03:36:34 rpmi: perl-libnet-1:3.15-alt1 sisyphus+317310.100.1.1 1679580208 installed
<13>Oct  7 03:36:34 rpmi: perl-Term-ANSIColor-5.01-alt1 sisyphus+244783.100.1.2 1579747505 installed
<13>Oct  7 03:36:34 rpmi: perl-XML-SAX-Base-1.09-alt1 1494364363 installed
<13>Oct  7 03:36:34 rpmi: libsbc1-2.0-alt2 sisyphus+322708.100.1.1 1686327806 installed
<13>Oct  7 03:36:34 rpmi: libfreeaptx-0.1.1-alt1 sisyphus+282022.100.1.1 1628182661 installed
<13>Oct  7 03:36:34 rpmi: liblame-3.100-alt1 sisyphus+276241.100.1.2 1624925657 installed
<13>Oct  7 03:36:34 rpmi: libSDL2-2.28.4-alt1 sisyphus+330842.100.1.1 1696276201 installed
<13>Oct  7 03:36:34 rpmi: libdvdread8-6.1.3-alt1 sisyphus+302642.100.1.1 1656163148 installed
<13>Oct  7 03:36:34 rpmi: libpixman-3:0.42.2-alt1 sisyphus+309549.100.1.1 1667649219 installed
<13>Oct  7 03:36:34 rpmi: libaom3-3.5.0-alt1 sisyphus+312085.100.1.1 1671551546 installed
<13>Oct  7 03:36:34 rpmi: libimath29-3.1.6-alt4 sisyphus+327372.100.1.1 1692353376 installed
<13>Oct  7 03:36:34 rpmi: libiex30-3.1.5-alt2.2 sisyphus+324124.100.1.1 1688379858 installed
<13>Oct  7 03:36:34 rpmi: liborc-0.4.34-alt1 sisyphus+322149.200.2.1 1685451287 installed
<13>Oct  7 03:36:34 rpmi: libglvnd-7:1.7.0-alt1 sisyphus+330949.100.1.1 1696424893 installed
<13>Oct  7 03:36:34 rpmi: libwayland-server-1.22.0-alt1.1 sisyphus+318010.100.1.1 1680606299 installed
<13>Oct  7 03:36:34 rpmi: python3-module-pkg_resources-1:68.2.2-alt1 sisyphus+329927.100.2.1 1695208269 installed
<13>Oct  7 03:36:34 rpmi: libnspr-1:4.35-alt1 sisyphus+308164.100.1.1 1665397040 installed
<13>Oct  7 03:36:34 rpmi: libnss-3.94.0-alt1 sisyphus+330862.100.1.2 1696334310 installed
<13>Oct  7 03:36:34 rpmi: libnghttp2-1.54.0-alt1 sisyphus+324359.10000.11.1 1689368798 installed
<13>Oct  7 03:36:34 rpmi: libkmod-31-alt1 sisyphus+330699.100.1.1 1696072422 installed
<13>Oct  7 03:36:34 rpmi: libatk-2.50.0-alt1 sisyphus+329802.300.1.1 1694991397 installed
<13>Oct  7 03:36:34 rpmi: kmod-31-alt1 sisyphus+330699.100.1.1 1696072422 installed
<13>Oct  7 03:36:34 rpmi: python3-module-nss-1.0.1-alt6 sisyphus+311250.15200.175.1 1685632753 installed
<13>Oct  7 03:36:34 rpmi: libilmthread30-3.1.5-alt2.2 sisyphus+324124.100.1.1 1688379858 installed
<13>Oct  7 03:36:35 rpmi: libopenexr30-3.1.5-alt2.2 sisyphus+324124.100.1.1 1688379858 installed
<13>Oct  7 03:36:35 rpmi: libdvdnav-6.1.1-alt1 sisyphus+279367.100.1.1 1626478896 installed
<13>Oct  7 03:36:35 rpmi: perl-Data-Dump-1.25-alt1 sisyphus+276551.100.1.1 1625126880 installed
<13>Oct  7 03:36:35 rpmi: python3-module-genshi-0.7.7-alt1 sisyphus+311250.13200.175.1 1685632292 installed
<13>Oct  7 03:36:35 rpmi: libsratom-0.6.6-alt2_1 sisyphus+324869.100.1.1 1689333943 installed
<13>Oct  7 03:36:35 rpmi: liblilv-0.24.12-alt1_3 sisyphus+295914.100.1.1 1645726269 installed
<13>Oct  7 03:36:35 rpmi: libhogweed6-3.9.1-alt1 sisyphus+322548.100.1.2 1686176879 installed
<13>Oct  7 03:36:35 rpmi: libgnutls30-3.8.1-alt2 sisyphus+326772.40.3.1 1692114175 installed
<13>Oct  7 03:36:35 rpmi: libngtcp2.13-0.16.0-alt1 sisyphus+323677.40.3.1 1687690555 installed
<13>Oct  7 03:36:35 rpmi: libngtcp2_crypto_gnutls5-0.16.0-alt1 sisyphus+323677.40.3.1 1687690555 installed
<13>Oct  7 03:36:35 rpmi: docbook-style-xsl-1.79.1-alt4 sisyphus+232871.100.1.1 1561238010 installed
<13>Oct  7 03:36:35 rpmi: libsoundtouch-2.3.2-alt1 sisyphus+314961.100.1.1 1675954593 installed
<13>Oct  7 03:36:35 rpmi: libiec61883-1.2.0-alt1.qa1 sisyphus+275365.100.1.2 1624491850 installed
<13>Oct  7 03:36:35 rpmi: perl-File-Listing-6.16-alt1 sisyphus+325783.100.1.1 1690559356 installed
<13>Oct  7 03:36:35 rpmi: xsltproc-1.1.37-alt1 sisyphus+307481.100.1.1 1664360521 installed
<13>Oct  7 03:36:35 rpmi: libflac8-1.3.3.0.79.37d1-alt2 sisyphus+278100.1400.1.1 1626058195 installed
<13>Oct  7 03:36:35 rpmi: libtheora-2:1.1.1-alt6 sisyphus+277967.100.1.1 1625928129 installed
<13>Oct  7 03:36:35 rpmi: libusb-devel-1.0.26-alt2 sisyphus+305525.100.1.1 1660924427 installed
<13>Oct  7 03:36:35 rpmi: libv4l-1.24.1-alt1 sisyphus+315985.200.2.1 1677588853 installed
<13>Oct  7 03:36:35 rpmi: perl-Term-Cap-1.18-alt1 sisyphus+315126.100.1.1 1676227129 installed
<13>Oct  7 03:36:35 rpmi: perl-Pod-Escapes-1.07-alt1 1418767892 installed
<13>Oct  7 03:36:35 rpmi: libpython3-3.11.4-alt3 sisyphus+330215.1400.3.1 1695493590 installed
<13>Oct  7 03:36:35 rpmi: pam_wrapper-1.1.4-alt2 sisyphus+317359.1100.9.2 1686174620 installed
<13>Oct  7 03:36:35 rpmi: libpamtest-1.1.4-alt2 sisyphus+317359.1100.9.2 1686174620 installed
<13>Oct  7 03:36:35 rpmi: rpm-build-vala-0.3-alt1 sisyphus+277005.100.1.2 1625345329 installed
<13>Oct  7 03:36:35 rpmi: iso-codes-4.15.0-alt1 sisyphus+319467.100.1.1 1682666958 installed
<13>Oct  7 03:36:35 rpmi: python3-module-webencodings-0.5.1-alt2 sisyphus+276020.100.1.1 1624812421 installed
<13>Oct  7 03:36:35 rpmi: python3-module-cssselect-1.2.0-alt1 sisyphus+317931.100.1.1 1680503903 installed
<13>Oct  7 03:36:35 rpmi: python3-module-html5lib-1:1.1-alt1 sisyphus+278096.120.5.1 1626086978 installed
<13>Oct  7 03:36:36 rpmi: python3-module-lxml-4.9.3-alt1 sisyphus+329615.100.1.1 1694745792 installed
<13>Oct  7 03:36:36 rpmi: libOpenSP-1.5.2-alt3.qa1 sisyphus+277622.100.1.1 1625720785 installed
<13>Oct  7 03:36:36 rpmi: openjade-1.3.2-alt15 sisyphus+277596.100.1.1 1625712297 installed
<13>Oct  7 03:36:36 rpmi: docbook-style-dsssl-1.79-alt3 sisyphus+276057.100.1.1 1624814788 installed
<13>Oct  7 03:36:36 rpmi: libwebrtc-0.3-alt2 sisyphus+277616.100.1.1 1625719132 installed
<13>Oct  7 03:36:36 rpmi: libvo-amrwbenc-0.1.3-alt1 sisyphus+275410.100.1.2 1624504610 installed
<13>Oct  7 03:36:36 rpmi: libvo-aacenc-0.1.3-alt2 sisyphus+285812.100.1.1 1632410909 installed
<13>Oct  7 03:36:36 rpmi: libsrtp2-2.5.0-alt2 sisyphus+325593.100.1.1 1690366474 installed
<13>Oct  7 03:36:36 rpmi: libopenh264-2.3.1-alt1.1 sisyphus+311295.100.1.1 1670335709 installed
<13>Oct  7 03:36:36 rpmi: libtbb-2021.10.0-alt1 sisyphus+326616.100.1.1 1691408580 installed
<13>Oct  7 03:36:36 rpmi: libprotobuf32-3.21.12-alt3 sisyphus+326710.100.1.1 1691431000 installed
<13>Oct  7 03:36:36 rpmi: libglog-0.5.0-alt1 sisyphus+291409.100.1.1 1638655127 installed
<13>Oct  7 03:36:37 rpmi: libzeromq-4.3.4-alt3 sisyphus+326735.200.2.1 1691482840 installed
<13>Oct  7 03:36:37 rpmi: librabbitmq-c4-0.13.0-alt1 sisyphus+324359.2500.6.1 1689327161 installed
<13>Oct  7 03:36:37 rpmi: libgme-0.6.3-alt2 sisyphus+293048.100.1.1 1641452306 installed
<13>Oct  7 03:36:37 rpmi: libudfread-1.1.2-alt2 sisyphus+286325.100.1.1 1633263312 installed
<13>Oct  7 03:36:37 rpmi: vulkan-filesystem-1.3.261.1-alt1 sisyphus+329816.1000.4.1 1695108094 installed
<13>Oct  7 03:36:37 rpmi: libvulkan1-1.3.261.1-alt1 sisyphus+329816.1000.4.1 1695108094 installed
<13>Oct  7 03:36:37 rpmi: libsoxr-0.1.3-alt1.1 sisyphus+317908.100.1.1 1680415073 installed
<13>Oct  7 03:36:37 rpmi: libxvid-1.3.7-alt1 sisyphus+292833.100.1.1 1640949610 installed
<13>Oct  7 03:36:37 rpmi: libnuma-2.0.14-alt2 sisyphus+278485.100.1.1 1626104244 installed
<13>Oct  7 03:36:37 rpmi: libx265-199-3.5-alt1.1 sisyphus+277560.100.1.1 1625697230 installed
<13>Oct  7 03:36:37 rpmi: libx264-164-alt1.1 sisyphus+322210.100.1.1 1685494917 installed
<13>Oct  7 03:36:37 rpmi: libvpx6-1.11.0-alt2 sisyphus+294379.500.5.1 1644490611 installed
<13>Oct  7 03:36:37 rpmi: libtwolame-0.4.0-alt1 sisyphus+277783.100.1.1 1625798476 installed
<13>Oct  7 03:36:37 rpmi: libspeex-1.2-alt2 sisyphus+287335.100.1.1 1634381369 installed
<13>Oct  7 03:36:37 rpmi: libsnappy-1.1.7-alt1 sisyphus+276400.100.1.2 1625016393 installed
<13>Oct  7 03:36:37 rpmi: libopencore-amrwb0-0.1.6-alt1 sisyphus+307923.100.1.1 1665032483 installed
<13>Oct  7 03:36:37 rpmi: libopencore-amrnb0-0.1.6-alt1 sisyphus+307923.100.1.1 1665032483 installed
<13>Oct  7 03:36:37 rpmi: libdav1d-1.2.1-alt1 sisyphus+323931.100.1.1 1688113641 installed
<13>Oct  7 03:36:37 rpmi: libcodec2-1.0.5-alt1 sisyphus+307919.100.1.1 1665032098 installed
<13>Oct  7 03:36:37 rpmi: libopenal1-1.22.2-alt1 sisyphus+303860.40.2.1 1658091308 installed
<13>Oct  7 03:36:37 rpmi: libmodplug-0.8.9.0-alt1 sisyphus+275375.100.2.2 1624495419 installed
<13>Oct  7 03:36:37 rpmi: libdv-1.0.0-alt6 sisyphus+286805.100.2.1 1633968015 installed
<13>Oct  7 03:36:37 rpmi: libyajl-2.1.0-alt3 sisyphus+322972.100.1.1 1686724493 installed
<13>Oct  7 03:36:37 rpmi: libkate-0.4.1-alt1.6 sisyphus+282639.100.1.1 1628935971 installed
<13>Oct  7 03:36:37 rpmi: libdatrie-0.2.13-alt1_7 sisyphus+328221.100.1.1 1693336966 installed
<13>Oct  7 03:36:37 rpmi: libthai-0.1.29-alt1_6 sisyphus+328230.100.1.2 1693348044 installed
<13>Oct  7 03:36:37 rpmi: usbids-20230825-alt1 sisyphus+327952.100.1.1 1693025831 installed
<13>Oct  7 03:36:37 rpmi: pciids-20230922-alt1 sisyphus+330116.100.1.1 1695424341 installed
<13>Oct  7 03:36:37 rpmi: hwdata-0.374-alt1 sisyphus+329322.100.1.1 1694450297 installed
<13>Oct  7 03:36:37 rpmi: gtk+3-themes-incompatible-3.20-alt3 1461944560 installed
<13>Oct  7 03:36:37 rpmi: perl-Try-Tiny-0.31-alt1 sisyphus+290597.100.1.1 1637915507 installed
<13>Oct  7 03:36:37 rpmi: perl-IO-Socket-IP-0.42-alt1 sisyphus+325815.100.1.2 1690571193 installed
<13>Oct  7 03:36:37 rpmi: perl-Module-Load-0.36-alt1 sisyphus+258992.100.1.1 1601543407 installed
<13>Oct  7 03:36:37 rpmi: perl-Compress-Raw-Bzip2-2.206-alt1 sisyphus+325779.100.1.1 1690558767 installed
<13>Oct  7 03:36:37 rpmi: perl-IO-Compress-Brotli-2:0.004001-alt3 sisyphus+302124.100.1.1 1655283093 installed
<13>Oct  7 03:36:37 rpmi: perl-Clone-0.46-alt1 sisyphus+308850.100.1.3 1666451819 installed
<13>Oct  7 03:36:37 rpmi: perl-HTML-Tagset-3.20-alt2 1317725093 installed
<13>Oct  7 03:36:37 rpmi: perl-Filter-1.64-alt1 sisyphus+305464.100.1.1 1660815327 installed
<13>Oct  7 03:36:37 rpmi: perl-Encode-3.19-alt1 sisyphus+304776.100.1.1 1659623409 installed
<13>Oct  7 03:36:37 rpmi: perl-URI-5.21-alt1 sisyphus+327918.100.1.1 1692972838 installed
<13>Oct  7 03:36:37 rpmi: perl-IO-Compress-2.206-alt1 sisyphus+325819.100.1.1 1690563199 installed
<13>Oct  7 03:36:37 rpmi: perl-Net-HTTP-6.23-alt1 sisyphus+323470.100.1.1 1687422469 installed
<13>Oct  7 03:36:37 rpmi: perl-HTML-Parser-3.81-alt1 sisyphus+314462.100.1.1 1675193797 installed
<13>Oct  7 03:36:37 rpmi: perl-WWW-RobotRules-6.02-alt1 1329756211 installed
<13>Oct  7 03:36:37 rpmi: perl-Encode-Locale-1.05-alt1 1444608613 installed
<13>Oct  7 03:36:37 rpmi: perl-IO-HTML-1.004-alt1 sisyphus+258983.100.1.1 1601542619 installed
<13>Oct  7 03:36:37 rpmi: perl-HTTP-Message-6.45-alt1 sisyphus+330728.100.1.1 1696162276 installed
<13>Oct  7 03:36:37 rpmi: perl-HTTP-Negotiate-6.01-alt1 1329760563 installed
<13>Oct  7 03:36:37 rpmi: perl-libwww-6.72-alt1 sisyphus+325791.100.1.2 1690563984 installed
<13>Oct  7 03:36:37 rpmi: perl-XML-LibXML-2.0209-alt1 sisyphus+325808.100.1.2 1690570827 installed
<13>Oct  7 03:36:37 rpmi: perl-XML-SAX-1.02-alt1 sisyphus+232322.100.1.1 1560758406 installed
<13>Oct  7 03:36:37 rpmi: perl-XML-Simple-2.25-alt2 sisyphus+257498.100.1.1 1599324034 installed
<13>Oct  7 03:36:37 rpmi: icon-naming-utils-0.8.90-alt1 sisyphus+276851.100.1.1 1625243947 installed
<13>Oct  7 03:36:38 rpmi: icon-theme-adwaita-45.0-alt1 sisyphus+325066.500.6.2 1695203960 installed
<13>Oct  7 03:36:38 rpmi: perl-XML-Parser-2.46-alt1 sisyphus+279723.1300.1.1 1626649131 installed
<13>Oct  7 03:36:38 rpmi: perl-Pod-Simple-3.45-alt1 sisyphus+321554.100.1.1 1684663135 installed
<13>Oct  7 03:36:38 rpmi: perl-Pod-Usage-2.03-alt1 sisyphus+300436.100.1.3 1653292807 installed
<13>Oct  7 03:36:38 rpmi: perl-podlators-5.01-alt1 sisyphus+312638.100.1.1 1672339228 installed
<13>Oct  7 03:36:38 rpmi: libgdk-pixbuf-locales-2.42.10-alt1 sisyphus+308991.100.1.1 1666721198 installed
<13>Oct  7 03:36:38 rpmi: liblash-1:0.5.4-alt1_51 sisyphus+318973.100.1.1 1682020745 installed
<13>Oct  7 03:36:38 rpmi: libwebrtc-audio-processing-1.3-alt1 sisyphus+329601.100.1.1 1694712770 installed
<13>Oct  7 03:36:38 rpmi: libmysofa-1.3.1-alt1 sisyphus+315331.100.1.1 1676576074 installed
<13>Oct  7 03:36:38 rpmi: libldac2-2.0.2.3-alt0.1 sisyphus+278007.100.1.2 1625973044 installed
<13>Oct  7 03:36:38 rpmi: liblc3-1.0.4-alt1 sisyphus+326418.100.1.1 1691156615 installed
<13>Oct  7 03:36:38 rpmi: libsigc++2-2.12.1-alt1 sisyphus+331046.200.2.1 1696511642 installed
<13>Oct  7 03:36:38 rpmi: libconfig-c++-1.5-alt3 sisyphus+286668.100.1.1 1633707351 installed
<13>Oct  7 03:36:38 rpmi: libfdk-aac2-2.0.2-alt0.2.g3f864cc sisyphus+314245.200.2.1 1674832943 installed
<13>Oct  7 03:36:38 rpmi: libtdb-1.4.8-alt1 sisyphus+311250.77540.178.1 1685825503 installed
<13>Oct  7 03:36:38 rpmi: libltdl7-2.4.7-alt3 sisyphus+328983.1500.12.1 1695073832 installed
<13>Oct  7 03:36:38 rpmi: libasyncns-0.8-alt2.qa1 sisyphus+275091.100.1.1 1624402241 installed
<13>Oct  7 03:36:38 rpmi: sound-theme-freedesktop-0.8-alt1 sisyphus+277010.100.1.2 1625346634 installed
<13>Oct  7 03:36:38 rpmi: libyaml2-0.2.5-alt1 sisyphus+278391.100.1.1 1626094928 installed
<13>Oct  7 03:36:38 rpmi: libdeflate-1.19-alt1 sisyphus+329822.100.2.2 1695269327 installed
<13>Oct  7 03:36:38 rpmi: libtiff5-4.4.0-alt4 sisyphus+322581.100.1.2 1686180089 installed
<13>Oct  7 03:36:38 rpmi: libgtest-1.13.0-alt2 sisyphus+318771.100.1.1 1681838178 installed
<13>Oct  7 03:36:38 rpmi: libevent2.1-2.1.12-alt1 sisyphus+324359.3500.11.1 1689364661 installed
<13>Oct  7 03:36:38 rpmi: libbluez-5.69-alt1 sisyphus+328785.100.1.1 1693919034 installed
<13>Oct  7 03:36:38 rpmi: libmpg123-1:1.31.3-alt1 sisyphus+330461.100.1.1 1695807698 installed
<13>Oct  7 03:36:38 rpmi: libsndfile-1.1.0-alt1 sisyphus+306371.40.3.1 1662942389 installed
<13>Oct  7 03:36:38 rpmi: libinstpatch-1.1.6-alt1.1 sisyphus+279572.100.1.2 1626605094 installed
<13>Oct  7 03:36:38 rpmi: libfaad2-2.10.1-alt1 sisyphus+317706.100.1.1 1680093777 installed
<13>Oct  7 03:36:38 rpmi: libfaac0-1.28-alt2 sisyphus+275719.100.1.1 1624749512 installed
<13>Oct  7 03:36:38 rpmi: libdca0-0.0.5-alt4.qa1 sisyphus+275349.100.1.2 1624487408 installed
<13>Oct  7 03:36:38 rpmi: libfftw3-common-3.3.8-alt2 sisyphus+278100.1300.1.1 1626057222 installed
<13>Oct  7 03:36:38 rpmi: libfftw3-3.3.8-alt2 sisyphus+278100.1300.1.1 1626057222 installed
<13>Oct  7 03:36:38 rpmi: libchromaprint1-1.5.1-alt1 sisyphus+324130.100.1.1 1688382112 installed
<13>Oct  7 03:36:38 rpmi: libbs2b-3.1.0-alt1.4 sisyphus+284589.100.1.1 1630750787 installed
<13>Oct  7 03:36:38 rpmi: libgraphite2-1.3.14-alt2.1 sisyphus+279571.100.1.2 1626605111 installed
<13>Oct  7 03:36:38 rpmi: libxshmfence-1.3.2-alt1 sisyphus+311428.400.1.1 1670577525 installed
<13>Oct  7 03:36:38 rpmi: libpciaccess-1:0.17-alt1 sisyphus+308663.300.1.1 1666168260 installed
<13>Oct  7 03:36:38 rpmi: libdrm-1:2.4.116-alt2 sisyphus+328892.100.1.1 1694073858 installed
<13>Oct  7 03:36:38 rpmi: libcamera-1:0.1.0-alt2 sisyphus+325263.60.3.1 1689937923 installed
<13>Oct  7 03:36:38 rpmi: python3-module-zipp-3.17.0-alt1 sisyphus+330459.100.2.1 1695891920 installed
<13>Oct  7 03:36:38 rpmi: python3-module-importlib-metadata-6.8.0-alt1 sisyphus+325197.100.2.1 1689870041 installed
<13>Oct  7 03:36:38 rpmi: python3-module-markdown-3.4.4-alt1 sisyphus+325554.100.1.1 1690304554 installed
<13>Oct  7 03:36:38 rpmi: python3-module-polib-1.1.1-alt1 sisyphus+282657.100.1.1 1628954165 installed
<13>Oct  7 03:36:38 rpmi: python3-module-click-8.1.7-alt1 sisyphus+327424.100.2.1 1695395098 installed
<13>Oct  7 03:36:38 rpmi: python3-module-zope.interface-6.0-alt1 sisyphus+326348.600.4.1 1691597453 installed
<13>Oct  7 03:36:38 rpmi: python3-module-chameleon.core-4.2.0-alt1 sisyphus+330407.100.1.1 1695735099 installed
<13>Oct  7 03:36:38 rpmi: python3-module-lingua-4.15.0-alt2 sisyphus+304052.100.1.1 1658352892 installed
<13>Oct  7 03:36:39 rpmi: python3-module-babel-1:2.12.1-alt1 sisyphus+317409.100.1.1 1679678193 installed
<13>Oct  7 03:36:39 rpmi: python3-module-markupsafe-1:2.1.3-alt1 sisyphus+323659.100.1.1 1687595160 installed
<13>Oct  7 03:36:39 rpmi: python3-module-pycparser-2.21-alt1.1 sisyphus+309935.7300.4.1 1668527005 installed
<13>Oct  7 03:36:39 rpmi: python3-module-cffi-1.16.0-alt1 sisyphus+330935.100.2.1 1696495686 installed
<13>Oct  7 03:36:39 rpmi: python3-module-cryptography-41.0.3-alt1 sisyphus+326306.100.1.1 1690985258 installed
<13>Oct  7 03:36:39 rpmi: python3-module-beaker-1.12.1-alt1 sisyphus+319143.100.1.1 1682256768 installed
<13>Oct  7 03:36:39 rpmi: python3-module-mako-1.2.4-alt2 sisyphus+319351.100.1.1 1682510722 installed
<13>Oct  7 03:36:39 rpmi: libffi-devel-1:3.4.2-alt2 sisyphus+287629.100.2.1 1634659242 installed
<13>Oct  7 03:36:39 rpmi: libduktape-2.6.0-alt2 sisyphus+322268.100.1.1 1685614482 installed
<13>Oct  7 03:36:39 rpmi: libssh2-1.11.0-alt1 sisyphus+327652.100.1.1 1692636577 installed
<13>Oct  7 03:36:39 rpmi: publicsuffix-list-dafsa-20230701-alt1 sisyphus+324303.100.1.1 1688561153 installed
<13>Oct  7 03:36:39 rpmi: libpsl-0.21.2-alt1 sisyphus+312536.100.1.1 1672131178 installed
<13>Oct  7 03:36:39 rpmi: libnghttp3.7-0.12.0-alt1 sisyphus+323677.20.3.1 1687690506 installed
<13>Oct  7 03:36:39 rpmi: openldap-common-2.6.6-alt1 sisyphus+330946.100.2.1 1696432854 installed
<13>Oct  7 03:36:39 rpmi: libntlm-1.5-alt1 sisyphus+278100.3300.1.1 1626058899 installed
<13>Oct  7 03:36:39 rpmi: libidn-1.37-alt2 sisyphus+300849.100.1.1 1653769687 installed
<13>Oct  7 03:36:39 rpmi: libverto-0.3.2-alt1_1 sisyphus+321176.2200.10.2 1684803947 installed
<13>Oct  7 03:36:39 rpmi: liblmdb-0.9.31-alt1 sisyphus+330946.40.2.1 1696431544 installed
<13>Oct  7 03:36:39 rpmi: libkeyutils-1.6.3-alt1 sisyphus+266061.100.1.1 1612919566 installed
<13>Oct  7 03:36:39 rpmi: libcom_err-1.46.4.0.5.4cda-alt1 sisyphus+283826.100.1.1 1629975345 installed
<86>Oct  7 03:36:39 groupadd[3204539]: group added to /etc/group: name=_keytab, GID=999
<86>Oct  7 03:36:39 groupadd[3204539]: group added to /etc/gshadow: name=_keytab
<86>Oct  7 03:36:39 groupadd[3204539]: new group: name=_keytab, GID=999
<13>Oct  7 03:36:39 rpmi: libkrb5-1.21.2-alt1 sisyphus+327265.100.1.1 1692185462 installed
<13>Oct  7 03:36:39 rpmi: libgsasl-1.8.0-alt3 sisyphus+275307.100.1.2 1624478543 installed
<86>Oct  7 03:36:39 groupadd[3205011]: group added to /etc/group: name=sasl, GID=998
<86>Oct  7 03:36:39 groupadd[3205011]: group added to /etc/gshadow: name=sasl
<86>Oct  7 03:36:39 groupadd[3205011]: new group: name=sasl, GID=998
<13>Oct  7 03:36:39 rpmi: libsasl2-3-2.1.27-alt2.2 sisyphus+324359.6000.12.1 1689392001 installed
<13>Oct  7 03:36:39 rpmi: libldap2-2.6.6-alt1 sisyphus+330946.100.2.1 1696432854 installed
<13>Oct  7 03:36:39 rpmi: libneon-0.32.2-alt1 sisyphus+325006.1300.1.1 1689496916 installed
<13>Oct  7 03:36:39 rpmi: libssh-0.10.5-alt1 sisyphus+324359.1500.6.1 1689326418 installed
<13>Oct  7 03:36:39 rpmi: libbrotlicommon-1.1.0-alt1 sisyphus+328501.100.1.1 1693598419 installed
<13>Oct  7 03:36:39 rpmi: libbrotlidec-1.1.0-alt1 sisyphus+328501.100.1.1 1693598419 installed
<13>Oct  7 03:36:39 rpmi: libharfbuzz-8.2.1-alt1 sisyphus+329986.40.2.1 1695293816 installed
<13>Oct  7 03:36:39 rpmi: libfreetype-2.13.2-alt1 sisyphus+328677.100.1.1 1693834345 installed
<13>Oct  7 03:36:39 rpmi: libfontconfig1-2.14.2-alt8 sisyphus+328444.100.1.1 1693553402 installed
<13>Oct  7 03:36:39 rpmi: libcurl-8.3.0-alt1 sisyphus+329453.400.5.1 1694962561 installed
<13>Oct  7 03:36:39 rpmi: libraptor2-2.0.15-alt1 sisyphus+275177.100.1.2 1624430693 installed
<13>Oct  7 03:36:39 rpmi: liblrdf-0.6.1-alt1 sisyphus+278205.100.1.1 1626077040 installed
<13>Oct  7 03:36:39 rpmi: libass9-0.17.1-alt1 sisyphus+315891.100.1.1 1677487408 installed
<13>Oct  7 03:36:39 rpmi: libbluray-1.3.4-alt1 sisyphus+310888.100.1.1 1669800489 installed
<13>Oct  7 03:36:39 rpmi: libharfbuzz-gobject-8.2.1-alt1 sisyphus+329986.40.2.1 1695293816 installed
<13>Oct  7 03:36:39 rpmi: libjson-c5-0.15-alt1.1 sisyphus+279547.100.1.2 1626594466 installed
<13>Oct  7 03:36:39 rpmi: libCharLS2-2.0.0-alt1_3 sisyphus+276376.100.1.1 1624988382 installed
<13>Oct  7 03:36:40 rpmi: gdcm-3.0.21-alt1 sisyphus+325243.100.1.1 1689861410 installed
<13>Oct  7 03:36:40 rpmi: libdevmapper-1.02.196-alt1 sisyphus+328928.400.3.1 1694103931 installed
<13>Oct  7 03:36:40 rpmi: mount-2.39.2-alt1 sisyphus+329530.100.1.1 1694630186 installed
<13>Oct  7 03:36:40 rpmi: losetup-2.39.2-alt1 sisyphus+329530.100.1.1 1694630186 installed
<13>Oct  7 03:36:40 rpmi: lsblk-2.39.2-alt1 sisyphus+329530.100.1.1 1694630186 installed
<86>Oct  7 03:36:40 groupadd[3206727]: group added to /etc/group: name=tape, GID=997
<86>Oct  7 03:36:40 groupadd[3206727]: group added to /etc/gshadow: name=tape
<86>Oct  7 03:36:40 groupadd[3206727]: new group: name=tape, GID=997
<86>Oct  7 03:36:40 groupadd[3206781]: group added to /etc/group: name=dialout, GID=996
<86>Oct  7 03:36:40 groupadd[3206781]: group added to /etc/gshadow: name=dialout
<86>Oct  7 03:36:40 groupadd[3206781]: new group: name=dialout, GID=996
<86>Oct  7 03:36:40 groupadd[3206811]: group added to /etc/group: name=input, GID=995
<86>Oct  7 03:36:40 groupadd[3206811]: group added to /etc/gshadow: name=input
<86>Oct  7 03:36:40 groupadd[3206811]: new group: name=input, GID=995
<86>Oct  7 03:36:40 groupadd[3206855]: group added to /etc/group: name=video, GID=994
<86>Oct  7 03:36:40 groupadd[3206855]: group added to /etc/gshadow: name=video
<86>Oct  7 03:36:40 groupadd[3206855]: new group: name=video, GID=994
<86>Oct  7 03:36:40 groupadd[3206894]: group added to /etc/group: name=render, GID=993
<86>Oct  7 03:36:40 groupadd[3206894]: group added to /etc/gshadow: name=render
<86>Oct  7 03:36:40 groupadd[3206894]: new group: name=render, GID=993
<86>Oct  7 03:36:40 groupadd[3206930]: group added to /etc/group: name=sgx, GID=992
<86>Oct  7 03:36:40 groupadd[3206930]: group added to /etc/gshadow: name=sgx
<86>Oct  7 03:36:40 groupadd[3206930]: new group: name=sgx, GID=992
<13>Oct  7 03:36:40 rpmi: udev-1:254.5-alt1.2 sisyphus+331053.100.1.1 1696514772 installed
<13>Oct  7 03:36:40 rpmi: dmsetup-1.02.196-alt1 sisyphus+328928.400.3.1 1694103931 installed
<13>Oct  7 03:36:40 rpmi: dconf-profile-0.1-alt1 sisyphus+325633.340.3.1 1690415358 installed
<13>Oct  7 03:36:40 rpmi: desktop-file-utils-0.26-alt4 sisyphus+324226.100.1.1 1688469484 installed
<13>Oct  7 03:36:40 rpmi: shared-mime-info-2.2-alt1 sisyphus+297388.100.1.1 1648466615 installed
<13>Oct  7 03:36:40 rpmi: gsettings-desktop-schemas-data-45.0-alt1 sisyphus+325066.400.6.2 1695203930 installed
<13>Oct  7 03:36:41 rpmi: libgio-2.78.0-alt1 sisyphus+329802.100.1.1 1694991222 installed
<13>Oct  7 03:36:41 rpmi: gsettings-desktop-schemas-45.0-alt1 sisyphus+325066.400.6.2 1695203930 installed
<13>Oct  7 03:36:41 rpmi: gobject-introspection-1.78.1-alt1 sisyphus+329802.200.1.1 1694991313 installed
<13>Oct  7 03:36:41 rpmi: libgio-devel-2.78.0-alt1 sisyphus+329802.100.1.1 1694991222 installed
<13>Oct  7 03:36:41 rpmi: libgstreamer1.0-1.22.6-alt1 sisyphus+329988.100.1.3 1695309446 installed
<13>Oct  7 03:36:41 rpmi: libgdk-pixbuf-2.42.10-alt1 sisyphus+308991.100.1.1 1666721198 installed
<13>Oct  7 03:36:41 rpmi: libjson-glib-1.8.0-alt1 sisyphus+325066.600.6.2 1695204014 installed
<13>Oct  7 03:36:41 rpmi: libgusb-0.4.6-alt1 sisyphus+322791.100.1.1 1686422571 installed
<13>Oct  7 03:36:41 rpmi: libcolord-1.4.6-alt1 sisyphus+296000.100.1.1 1646050421 installed
<13>Oct  7 03:36:41 rpmi: gobject-introspection-x11-1.78.1-alt1 sisyphus+329802.200.1.1 1694991313 installed
<13>Oct  7 03:36:41 rpmi: gobject-introspection-devel-1.78.1-alt1 sisyphus+329802.200.1.1 1694991313 installed
<13>Oct  7 03:36:41 rpmi: libfprint2-1.94.5-alt3.1 sisyphus+322467.100.1.1 1685955271 installed
<13>Oct  7 03:36:41 rpmi: libjson-glib-gir-1.8.0-alt1 sisyphus+325066.600.6.2 1695204014 installed
<13>Oct  7 03:36:41 rpmi: libgusb-gir-0.4.6-alt1 sisyphus+322791.100.1.1 1686422571 installed
<13>Oct  7 03:36:41 rpmi: gtk4-update-icon-cache-4.12.3-alt1 sisyphus+330542.100.1.1 1695913138 installed
<13>Oct  7 03:36:41 rpmi: libgstreamer1.0-gir-1.22.6-alt1 sisyphus+329988.100.1.3 1695309446 installed
<13>Oct  7 03:36:41 rpmi: libglibmm-2.66.6-alt1 sisyphus+317974.200.1.1 1680536526 installed
<13>Oct  7 03:36:41 rpmi: libxml++2-2.42.2-alt1 sisyphus+306456.100.1.1 1662733125 installed
<13>Oct  7 03:36:41 rpmi: libffado-2.4.1-alt4 sisyphus+275355.100.1.3 1624491060 installed
<13>Oct  7 03:36:41 rpmi: libfprint2-gir-1.94.5-alt3.1 sisyphus+322467.100.1.1 1685955271 installed
<13>Oct  7 03:36:41 rpmi: libjson-glib-gir-devel-1.8.0-alt1 sisyphus+325066.600.6.2 1695204014 installed
<13>Oct  7 03:36:41 rpmi: libfprint2-devel-1.94.5-alt3.1 sisyphus+322467.100.1.1 1685955271 installed
<13>Oct  7 03:36:41 rpmi: libjson-glib-devel-1.8.0-alt1 sisyphus+325066.600.6.2 1695204014 installed
<13>Oct  7 03:36:41 rpmi: libgdk-pixbuf-gir-2.42.10-alt1 sisyphus+308991.100.1.1 1666721198 installed
<13>Oct  7 03:36:41 rpmi: gstreamer1.0-1.22.6-alt1 sisyphus+329988.100.1.3 1695309446 installed
<13>Oct  7 03:36:41 rpmi: libgraphene-gir-1.10.8-alt1 sisyphus+296855.100.1.1 1647633383 installed
<13>Oct  7 03:36:41 rpmi: libharfbuzz-gir-8.2.1-alt1 sisyphus+329986.40.2.1 1695293816 installed
<13>Oct  7 03:36:41 rpmi: libdconf-0.40.0-alt3 sisyphus+325650.100.1.1 1690417205 installed
<13>Oct  7 03:36:41 rpmi: libproxy-0.5.3-alt1 sisyphus+327644.100.1.1 1692627185 installed
<13>Oct  7 03:36:41 rpmi: glib-networking-2.78.0-alt1 sisyphus+329802.1000.1.1 1694991922 installed
<13>Oct  7 03:36:41 rpmi: libsoup-2.74.3-alt1.1 sisyphus+318260.100.1.1 1680994685 installed
<13>Oct  7 03:36:41 rpmi: libsoup3.0-3.4.3-alt1 sisyphus+329802.1100.1.1 1694991970 installed
<13>Oct  7 03:36:41 rpmi: libsoup-devel-2.74.3-alt1.1 sisyphus+318260.100.1.1 1680994685 installed
<13>Oct  7 03:36:41 rpmi: vala-0.56.13-alt1 sisyphus+328259.100.1.1 1693392101 installed
<13>Oct  7 03:36:41 rpmi: libsoup3.0-devel-3.4.3-alt1 sisyphus+329802.1100.1.1 1694991970 installed
<13>Oct  7 03:36:41 rpmi: libgusb-devel-0.4.6-alt1 sisyphus+322791.100.1.1 1686422571 installed
<13>Oct  7 03:36:41 rpmi: libgusb-gir-devel-0.4.6-alt1 sisyphus+322791.100.1.1 1686422571 installed
<13>Oct  7 03:36:41 rpmi: libnice-0.1.21-alt2 sisyphus+324575.200.1.1 1688980156 installed
<13>Oct  7 03:36:41 rpmi: libcloudproviders-0.3.4-alt1 sisyphus+328878.100.1.1 1694037049 installed
<13>Oct  7 03:36:41 rpmi: libX11-locales-3:1.8.7-alt1 sisyphus+330921.200.1.1 1696400315 installed
<13>Oct  7 03:36:41 rpmi: libXdmcp-1.1.4-alt1 sisyphus+311188.1000.1.1 1670233857 installed
<13>Oct  7 03:36:41 rpmi: libXau-1.0.11-alt1 sisyphus+311428.100.1.1 1670577439 installed
<13>Oct  7 03:36:41 rpmi: libxcb-1.16-alt1 sisyphus+327325.200.1.1 1692276261 installed
<13>Oct  7 03:36:41 rpmi: libX11-3:1.8.7-alt1 sisyphus+330921.200.1.1 1696400315 installed
<13>Oct  7 03:36:41 rpmi: libXext-1.3.5-alt1 sisyphus+309285.100.1.1 1667212412 installed
<13>Oct  7 03:36:41 rpmi: libXfixes-6.0.0-alt1 sisyphus+284644.300.1.1 1630910331 installed
<13>Oct  7 03:36:41 rpmi: libXrender-0.9.11-alt1 sisyphus+308841.100.1.1 1666436130 installed
<13>Oct  7 03:36:41 rpmi: libcairo-1:1.18.0-alt1 sisyphus+330227.100.1.1 1695539090 installed
<13>Oct  7 03:36:41 rpmi: libcairo-gobject-1:1.18.0-alt1 sisyphus+330227.100.1.1 1695539090 installed
<13>Oct  7 03:36:41 rpmi: libXrandr-1.5.4-alt1 sisyphus+330992.100.1.1 1696485400 installed
<13>Oct  7 03:36:41 rpmi: libXi-1.8-alt1 sisyphus+285490.200.1.1 1632124174 installed
<13>Oct  7 03:36:41 rpmi: libXcursor-1.2.1-alt1 sisyphus+297765.200.1.1 1649053926 installed
<13>Oct  7 03:36:41 rpmi: libXinerama-1.1.5-alt1 sisyphus+309287.100.1.1 1667213208 installed
<13>Oct  7 03:36:41 rpmi: libXdamage-1.1.6-alt1 sisyphus+311188.300.1.1 1670233711 installed
<13>Oct  7 03:36:41 rpmi: libzvbi-0.2.35-alt2 sisyphus+275416.100.1.3 1624507095 installed
<13>Oct  7 03:36:41 rpmi: libgbm-4:23.2.1-alt1 sisyphus+331044.100.1.3 1696517465 installed
<13>Oct  7 03:36:41 rpmi: libXft-2.3.7-alt1 sisyphus+310164.100.1.1 1668680608 installed
<13>Oct  7 03:36:41 rpmi: libpango-1.51.1-alt1 sisyphus+329828.40.3.1 1695333192 installed
<13>Oct  7 03:36:41 rpmi: librsvg-1:2.57.0-alt1 sisyphus+329802.400.1.1 1694991555 installed
<13>Oct  7 03:36:41 rpmi: libpango-gir-1.51.1-alt1 sisyphus+329828.40.3.1 1695333192 installed
<13>Oct  7 03:36:41 rpmi: libXtst-1.2.4-alt1 sisyphus+308663.1300.1.1 1666168495 installed
<13>Oct  7 03:36:41 rpmi: libXxf86vm-1.1.5-alt1 sisyphus+308663.1400.1.1 1666168523 installed
<13>Oct  7 03:36:41 rpmi: libGLX-mesa-4:23.2.1-alt1 sisyphus+331044.100.1.3 1696517465 installed
<13>Oct  7 03:36:41 rpmi: libGLX-7:1.7.0-alt1 sisyphus+330949.100.1.1 1696424893 installed
<13>Oct  7 03:36:41 rpmi: libGL-7:1.7.0-alt1 sisyphus+330949.100.1.1 1696424893 installed
<13>Oct  7 03:36:41 rpmi: libva-2.19.0-alt1 sisyphus+324382.100.1.2 1688673125 installed
<13>Oct  7 03:36:41 rpmi: libEGL-mesa-4:23.2.1-alt1 sisyphus+331044.100.1.3 1696517465 installed
<13>Oct  7 03:36:41 rpmi: libEGL-7:1.7.0-alt1 sisyphus+330949.100.1.1 1696424893 installed
<13>Oct  7 03:36:41 rpmi: libgst-plugins1.0-1.22.6-alt1 sisyphus+329988.200.1.3 1695309540 installed
<13>Oct  7 03:36:41 rpmi: libgst-plugins1.0-gir-1.22.6-alt1 sisyphus+329988.200.1.3 1695309540 installed
<13>Oct  7 03:36:41 rpmi: libvdpau-1:1.5-alt1 sisyphus+298034.100.1.1 1649336822 installed
<13>Oct  7 03:36:42 rpmi: libavutil56-2:4.4.4-alt2 sisyphus+328663.6100.6.1 1694099198 installed
<13>Oct  7 03:36:42 rpmi: libswresample3-2:4.4.4-alt2 sisyphus+328663.6100.6.1 1694099198 installed
<13>Oct  7 03:36:42 rpmi: libavcodec58-2:4.4.4-alt2 sisyphus+328663.6100.6.1 1694099198 installed
<13>Oct  7 03:36:42 rpmi: libavformat58-2:4.4.4-alt2 sisyphus+328663.6100.6.1 1694099198 installed
<13>Oct  7 03:36:42 rpmi: libswscale5-2:4.4.4-alt2 sisyphus+328663.6100.6.1 1694099198 installed
<13>Oct  7 03:36:42 rpmi: libXv-1.0.12-alt1 sisyphus+311188.600.1.1 1670233799 installed
<13>Oct  7 03:36:42 rpmi: xprop-1.2.5-alt1 sisyphus+279025.100.1.1 1626354198 installed
<13>Oct  7 03:36:42 rpmi: libXcomposite-0.4.6-alt1 sisyphus+311188.200.1.1 1670233682 installed
<13>Oct  7 03:36:42 rpmi: liblz4-1:1.9.4-alt1 sisyphus+309416.100.1.1 1667412981 installed
<13>Oct  7 03:36:42 rpmi: libsystemd-1:254.5-alt1.2 sisyphus+331053.100.1.1 1696514772 installed
<13>Oct  7 03:36:42 rpmi: libdbus-1.14.10-alt1 sisyphus+328676.100.1.1 1693833777 installed
<13>Oct  7 03:36:42 rpmi: libpulseaudio-16.1-alt1 sisyphus+325006.1700.1.1 1689497224 installed
<13>Oct  7 03:36:42 rpmi: libat-spi2-core-2.50.0-alt1 sisyphus+329802.300.1.1 1694991397 installed
<13>Oct  7 03:36:42 rpmi: libavahi-0.8-alt2 sisyphus+321176.300.10.2 1684802422 installed
<13>Oct  7 03:36:42 rpmi: libcups-2.4.7-alt1 sisyphus+330606.100.1.1 1695998942 installed
<13>Oct  7 03:36:42 rpmi: libpolkit-0.120-alt1.qa2 sisyphus+296007.100.1.1 1646053422 installed
<86>Oct  7 03:36:42 groupadd[3215757]: group added to /etc/group: name=colord, GID=991
<86>Oct  7 03:36:42 groupadd[3215757]: group added to /etc/gshadow: name=colord
<86>Oct  7 03:36:42 groupadd[3215757]: new group: name=colord, GID=991
<86>Oct  7 03:36:42 useradd[3215780]: new user: name=colord, UID=999, GID=991, home=/var/colord, shell=/dev/null, from=none
<13>Oct  7 03:36:42 rpmi: colord-1.4.6-alt1 sisyphus+296000.100.1.1 1646050421 installed
<13>Oct  7 03:36:42 rpmi: at-spi2-atk-2.50.0-alt1 sisyphus+329802.300.1.1 1694991397 installed
<13>Oct  7 03:36:42 rpmi: dbus-tools-1.14.10-alt1 sisyphus+328676.100.1.1 1693833777 installed
<86>Oct  7 03:36:42 groupadd[3215935]: group added to /etc/group: name=messagebus, GID=990
<86>Oct  7 03:36:42 groupadd[3215935]: group added to /etc/gshadow: name=messagebus
<86>Oct  7 03:36:42 groupadd[3215935]: new group: name=messagebus, GID=990
<86>Oct  7 03:36:42 useradd[3215953]: new user: name=messagebus, UID=998, GID=990, home=/run/dbus, shell=/dev/null, from=none
<13>Oct  7 03:36:42 rpmi: dbus-1.14.10-alt1 sisyphus+328676.100.1.1 1693833777 installed
<13>Oct  7 03:36:42 rpmi: dbus-tools-gui-1.14.10-alt1 sisyphus+328676.100.1.1 1693833777 installed
<13>Oct  7 03:36:42 rpmi: at-spi2-core-2.50.0-alt1 sisyphus+329802.300.1.1 1694991397 installed
<13>Oct  7 03:36:42 rpmi: dconf-0.40.0-alt3 sisyphus+325650.100.1.1 1690417205 installed
<13>Oct  7 03:36:42 rpmi: libgtk+3-schemas-3.24.38-alt1 sisyphus+321614.100.1.1 1684749819 installed
<13>Oct  7 03:36:43 rpmi: libgtk+3-3.24.38-alt1 sisyphus+321614.100.1.1 1684749819 installed
<13>Oct  7 03:36:43 rpmi: libopencv4.7-1:4.7.0-alt1.1 sisyphus+323354.100.2.1 1687262391 installed
<13>Oct  7 03:36:43 rpmi: libzbar-0.23.92-alt4 sisyphus+328321.3000.9.1 1693487375 installed
<13>Oct  7 03:36:44 rpmi: libdbus-devel-1.14.10-alt1 sisyphus+328676.100.1.1 1693833777 installed
<13>Oct  7 03:36:44 rpmi: libdbus-glib-1:0.110-alt1 sisyphus+278470.100.1.2 1626224690 installed
<13>Oct  7 03:36:44 rpmi: python3-module-dbus-1.3.2-alt1.1 sisyphus+311250.50040.178.1 1685785456 installed
<13>Oct  7 03:36:44 rpmi: alsa-ucm-conf-1.2.8-alt8 sisyphus+322508.200.2.1 1687380386 installed
<13>Oct  7 03:36:44 rpmi: alsa-topology-conf-1.2.5.1-alt1 sisyphus+274777.100.1.1 1624089141 installed
<13>Oct  7 03:36:44 rpmi: libalsa-1:1.2.8-alt1 sisyphus+310349.200.1.1 1668964316 installed
<13>Oct  7 03:36:44 rpmi: libcanberra-0.30-alt3 sisyphus+275093.100.2.3 1624562350 installed
<13>Oct  7 03:36:44 rpmi: pipewire-libs-0.3.80-alt1.1 sisyphus+329609.100.1.1 1694718583 installed
<13>Oct  7 03:36:44 rpmi: pipewire-jack-libs-0.3.80-alt1.1 sisyphus+329609.100.1.1 1694718583 installed
<13>Oct  7 03:36:44 rpmi: libfluidsynth-2.3.4-alt1 sisyphus+330255.500.3.1 1695660767 installed
<13>Oct  7 03:36:44 rpmi: libSDL-1.2.14-alt10 sisyphus+284852.100.1.1 1631107838 installed
<13>Oct  7 03:36:44 rpmi: libmjpegtools2.1-2.2.1-alt1 sisyphus+286352.100.1.1 1633334535 installed
<13>Oct  7 03:36:44 rpmi: gst-plugins-bad1.0-1.22.6-alt1 sisyphus+329988.400.1.3 1695309800 installed
<13>Oct  7 03:36:45 rpmi: libgtk4-4.12.3-alt1 sisyphus+330542.100.1.1 1695913138 installed
<13>Oct  7 03:36:45 rpmi: libgtk4-gir-4.12.3-alt1 sisyphus+330542.100.1.1 1695913138 installed
<13>Oct  7 03:36:45 rpmi: python3-module-pygobject3-3.46.0-alt1 sisyphus+329802.700.1.1 1694991885 installed
<13>Oct  7 03:36:45 rpmi: rpm-macros-pam0-1.5.3-alt1 sisyphus+320140.100.1.1 1683581440 installed
<13>Oct  7 03:36:45 rpmi: libpam0-devel-1.5.3-alt1 sisyphus+320140.100.1.1 1683581440 installed
<13>Oct  7 03:36:45 rpmi: libpamtest-devel-1.1.4-alt2 sisyphus+317359.1100.9.2 1686174620 installed
<13>Oct  7 03:36:45 rpmi: python3-module-dbusmock-0.29.1-alt1 sisyphus+325680.100.1.1 1690452641 installed
<13>Oct  7 03:36:45 rpmi: libdbus-glib-devel-1:0.110-alt1 sisyphus+278470.100.1.2 1626224690 installed
<13>Oct  7 03:36:45 rpmi: libpolkit-devel-0.120-alt1.qa2 sisyphus+296007.100.1.1 1646053422 installed
<13>Oct  7 03:36:45 rpmi: libsystemd-devel-1:254.5-alt1.2 sisyphus+331053.100.1.1 1696514772 installed
<13>Oct  7 03:36:45 rpmi: python3-module-pycairo-1.25.0-alt1 sisyphus+330441.100.1.1 1695757648 installed
<13>Oct  7 03:36:45 rpmi: libfprint2-gir-devel-1.94.5-alt3.1 sisyphus+322467.100.1.1 1685955271 installed
<13>Oct  7 03:36:45 rpmi: intltool-0.51.0-alt2 1513698802 installed
<13>Oct  7 03:36:45 rpmi: gtk-doc-1.33.2-alt1.1 sisyphus+283111.200.2.1 1629197210 installed
<13>Oct  7 03:36:45 rpmi: python3-module-libpamtest-1.1.4-alt2 sisyphus+317359.1100.9.2 1686174620 installed
Building target platforms: x86_64
Building for target x86_64
Wrote: /usr/src/in/nosrpm/fprintd-1.94.2-alt1.nosrc.rpm (w1.gzdio)
Installing fprintd-1.94.2-alt1.src.rpm
Building target platforms: x86_64
Building for target x86_64
Executing(%prep): /bin/sh -e /usr/src/tmp/rpm-tmp.25929
+ umask 022
+ /bin/mkdir -p /usr/src/RPM/BUILD
+ cd /usr/src/RPM/BUILD
+ cd /usr/src/RPM/BUILD
+ rm -rf fprintd-1.94.2
+ echo 'Source #0 (fprintd-1.94.2.tar):'
Source #0 (fprintd-1.94.2.tar):
+ /bin/tar -xf /usr/src/RPM/SOURCES/fprintd-1.94.2.tar
+ cd fprintd-1.94.2
+ /bin/chmod -c -Rf u+rwX,go-w .
+ echo 'Patch #0 (fprintd-1.94.2.patch):'
Patch #0 (fprintd-1.94.2.patch):
+ /usr/bin/patch -p1
patching file tests/pam/test_pam_fprintd.py
patching file tests/test_fprintd_utils.py
+ exit 0
Executing(%build): /bin/sh -e /usr/src/tmp/rpm-tmp.25929
+ umask 022
+ /bin/mkdir -p /usr/src/RPM/BUILD
+ cd /usr/src/RPM/BUILD
+ cd fprintd-1.94.2
+ mkdir -p x86_64-alt-linux
+ CFLAGS='-pipe -frecord-gcc-switches -Wall -g -O2 -flto=auto'
+ export CFLAGS
+ CXXFLAGS='-pipe -frecord-gcc-switches -Wall -g -O2 -flto=auto'
+ export CXXFLAGS
+ FFLAGS='-pipe -frecord-gcc-switches -Wall -g -O2 -flto=auto'
+ export FFLAGS
+ FCFLAGS='-pipe -frecord-gcc-switches -Wall -g -O2 -flto=auto'
+ export FCFLAGS
+ /usr/bin/meson setup . x86_64-alt-linux -Doptimization=2 --prefix=/usr --bindir=/usr/bin --sbindir=/usr/sbin --libexecdir=/usr/lib --libdir=/usr/lib64 --localstatedir=/var --sharedstatedir=/var/lib --includedir=/usr/include --datadir=/usr/share --sysconfdir=/etc --mandir=/usr/share/man --infodir=/usr/share/info --localedir=/usr/share/locale --wrap-mode=nodownload
The Meson build system
Version: 1.2.2
Source dir: /usr/src/RPM/BUILD/fprintd-1.94.2
Build dir: /usr/src/RPM/BUILD/fprintd-1.94.2/x86_64-alt-linux
Build type: native build
Project name: fprintd
Project version: 1.94.2
C compiler for the host machine: cc (gcc 13.2.1 "x86_64-alt-linux-gcc (GCC) 13.2.1 20230817 (ALT Sisyphus 13.2.1-alt2)")
C linker for the host machine: cc ld.bfd 2.41.0.20230826
Host machine cpu family: x86_64
Host machine cpu: x86_64
Compiler for C supports arguments -fno-strict-aliasing: YES 
Compiler for C supports arguments -Wcast-align: YES 
Compiler for C supports arguments -Werror=address: YES 
Compiler for C supports arguments -Werror=array-bounds: YES 
Compiler for C supports arguments -Werror=empty-body: YES 
Compiler for C supports arguments -Werror=implicit: YES 
Compiler for C supports arguments -Werror=init-self: YES 
Compiler for C supports arguments -Werror=int-to-pointer-cast: YES 
Compiler for C supports arguments -Werror=main: YES 
Compiler for C supports arguments -Werror=missing-braces: YES 
Compiler for C supports arguments -Werror=nonnull: YES 
Compiler for C supports arguments -Werror=pointer-to-int-cast: YES 
Compiler for C supports arguments -Werror=redundant-decls: YES 
Compiler for C supports arguments -Werror=return-type: YES 
Compiler for C supports arguments -Werror=sequence-point: YES 
Compiler for C supports arguments -Werror=trigraphs: YES 
Compiler for C supports arguments -Werror=write-strings: YES 
Compiler for C supports arguments -Wformat-nonliteral: YES 
Compiler for C supports arguments -Wformat-security: YES 
Compiler for C supports arguments -Wformat=2: YES 
Compiler for C supports arguments -Wignored-qualifiers: YES 
Compiler for C supports arguments -Wimplicit-function-declaration: YES 
Compiler for C supports arguments -Wlogical-op: YES 
Compiler for C supports arguments -Wmissing-declarations: YES 
Compiler for C supports arguments -Wmissing-format-attribute: YES 
Compiler for C supports arguments -Wmissing-include-dirs: YES 
Compiler for C supports arguments -Wmissing-noreturn: YES 
Compiler for C supports arguments -Wmissing-prototypes: YES 
Compiler for C supports arguments -Wnested-externs: YES 
Compiler for C supports arguments -Wold-style-definition: YES 
Compiler for C supports arguments -Wpointer-arith: YES 
Compiler for C supports arguments -Wshadow: YES 
Compiler for C supports arguments -Wstrict-prototypes: YES 
Compiler for C supports arguments -Wtype-limits: YES 
Compiler for C supports arguments -Wundef: YES 
Compiler for C supports arguments -Wunused: YES 
Compiler for C supports arguments -Wno-unused-parameter: YES 
Compiler for C supports arguments -Wno-pedantic: YES 
Compiler for C supports arguments -DGLIB_VERSION_MIN_REQUIRED=GLIB_VERSION_2_56: YES 
Compiler for C supports arguments -DGLIB_VERSION_MAX_ALLOWED=GLIB_VERSION_2_56: YES 
Found pkg-config: /usr/bin/pkg-config (0.29.2)
Run-time dependency glib-2.0 found: YES 2.78.0
Run-time dependency gio-2.0 found: YES 2.78.0
Run-time dependency gio-unix-2.0 found: YES 2.78.0
Run-time dependency gmodule-2.0 found: YES 2.78.0
Run-time dependency libfprint-2 found: YES 1.94.5
Run-time dependency polkit-gobject-1 found: YES 0.120
Run-time dependency dbus-1 found: YES 1.14.10
Run-time dependency libsystemd found: YES 254
Has header "security/pam_modules.h" : YES 
Library pam found: YES
Program pod2man found: YES (/usr/bin/pod2man)
Program xsltproc found: YES (/usr/bin/xsltproc)
Run-time dependency systemd found: YES 254
Run-time dependency pam_wrapper found: YES 1.1.4
Program xmllint found: YES (/usr/bin/xmllint)
Program python3 found: YES (/usr/bin/python3)
WARNING: You should add the boolean check kwarg to the run_command call.
         It currently defaults to false,
         but it will default to true in future releases of meson.
         See also: https://github.com/mesonbuild/meson/issues/9300
Configuring config.h using configuration
Program bash found: YES (/bin/bash)
Dependency gio-2.0 found: YES 2.78.0 (cached)
Program gdbus-codegen found: YES (/usr/bin/gdbus-codegen)
Found pkg-config: /usr/bin/pkg-config (0.29.2)
Program patch found: YES (/usr/bin/patch)
Dependency glib-2.0 found: YES 2.78.0 (cached)
Program glib-mkenums found: YES (/usr/bin/glib-mkenums)
Dependency glib-2.0 found: YES 2.78.0 (cached)
Program glib-mkenums found: YES (/usr/bin/glib-mkenums)
Configuring net.reactivated.Fprint.service using configuration
Configuring fprintd.service using configuration
Program msgfmt found: YES (/usr/bin/msgfmt)
Configuring fprintd-pam-test using configuration
Message: Found library pam_wrapper as /usr/lib64/gcc/x86_64-alt-linux/13/../../../../lib64/libpam_wrapper.so
Program unittest_inspector.py found: YES (/usr/src/RPM/BUILD/fprintd-1.94.2/tests/unittest_inspector.py)
Program valgrind found: NO
Program msginit found: YES (/usr/bin/msginit)
Program msgmerge found: YES (/usr/bin/msgmerge)
Program xgettext found: YES (/usr/bin/xgettext)
Program check-translations.sh found: YES (/usr/src/RPM/BUILD/fprintd-1.94.2/po/check-translations.sh)
Message: 
System paths:
  prefix: /usr
  fprintd daemon directory: /usr/lib
  fprintd modules directory: /usr/lib64/fprintd/modules
  fprintd prints storage directory: /var/lib/fprint
  DBus configuration directory: /usr/share/dbus-1/system.d
  DBus service directory: /usr/share/dbus-1/system-services
  DBus interfaces directory: /usr/share/dbus-1/interfaces
  Polkit policy directory: /usr/share/polkit-1/actions/
  Systemd service directory: /lib/systemd/system
  PAM module directory: /lib64/security

Optional features:

  PAM module: true
  Manuals: true
  GTK Doc: false
  XML Linter true

Test setup:

  With address sanitizer: false

Build targets in project: 92
NOTICE: Future-deprecated features used:
 * 0.56.0: {'dependency.get_pkgconfig_variable', 'meson.build_root', 'meson.source_root'}

fprintd 1.94.2

  User defined options
    bindir        : /usr/bin
    datadir       : /usr/share
    includedir    : /usr/include
    infodir       : /usr/share/info
    libdir        : /usr/lib64
    libexecdir    : /usr/lib
    localedir     : /usr/share/locale
    localstatedir : /var
    mandir        : /usr/share/man
    optimization  : 2
    prefix        : /usr
    sbindir       : /usr/sbin
    sharedstatedir: /var/lib
    sysconfdir    : /etc
    wrap_mode     : nodownload

Found ninja-1.11.1 at /usr/bin/ninja
+ ninja-build -j16 -C x86_64-alt-linux
ninja: Entering directory `x86_64-alt-linux'
[1/106] Generating po/af/LC_MESSAGES/fprintd-af.mo with a custom command
[2/106] Generating po/ar/LC_MESSAGES/fprintd-ar.mo with a custom command
[3/106] Generating po/as/LC_MESSAGES/fprintd-as.mo with a custom command
[4/106] Generating po/ast/LC_MESSAGES/fprintd-ast.mo with a custom command
[5/106] Generating po/az/LC_MESSAGES/fprintd-az.mo with a custom command
[6/106] Generating po/be/LC_MESSAGES/fprintd-be.mo with a custom command
[7/106] Generating po/bg/LC_MESSAGES/fprintd-bg.mo with a custom command
[8/106] Generating po/bn_IN/LC_MESSAGES/fprintd-bn_IN.mo with a custom command
[9/106] Generating po/ca/LC_MESSAGES/fprintd-ca.mo with a custom command
[10/106] Generating po/ca@valencia/LC_MESSAGES/fprintd-ca@valencia.mo with a custom command
[11/106] Generating po/cs/LC_MESSAGES/fprintd-cs.mo with a custom command
[12/106] Generating po/cy/LC_MESSAGES/fprintd-cy.mo with a custom command
[13/106] Generating po/da/LC_MESSAGES/fprintd-da.mo with a custom command
[14/106] Generating po/de/LC_MESSAGES/fprintd-de.mo with a custom command
[15/106] Generating po/el/LC_MESSAGES/fprintd-el.mo with a custom command
[16/106] Generating po/en_GB/LC_MESSAGES/fprintd-en_GB.mo with a custom command
[17/106] Generating po/eo/LC_MESSAGES/fprintd-eo.mo with a custom command
[18/106] Generating po/es/LC_MESSAGES/fprintd-es.mo with a custom command
[19/106] Generating po/eu/LC_MESSAGES/fprintd-eu.mo with a custom command
[20/106] Generating po/et/LC_MESSAGES/fprintd-et.mo with a custom command
[21/106] Generating po/fa/LC_MESSAGES/fprintd-fa.mo with a custom command
[22/106] Generating po/fi/LC_MESSAGES/fprintd-fi.mo with a custom command
[23/106] Generating po/fo/LC_MESSAGES/fprintd-fo.mo with a custom command
[24/106] Generating po/fr/LC_MESSAGES/fprintd-fr.mo with a custom command
[25/106] Generating po/fur/LC_MESSAGES/fprintd-fur.mo with a custom command
[26/106] Generating po/ga/LC_MESSAGES/fprintd-ga.mo with a custom command
[27/106] Generating po/gl/LC_MESSAGES/fprintd-gl.mo with a custom command
[28/106] Generating po/gu/LC_MESSAGES/fprintd-gu.mo with a custom command
[29/106] Generating po/he/LC_MESSAGES/fprintd-he.mo with a custom command
[30/106] Generating po/hi/LC_MESSAGES/fprintd-hi.mo with a custom command
[31/106] Generating po/hr/LC_MESSAGES/fprintd-hr.mo with a custom command
[32/106] Generating po/hu/LC_MESSAGES/fprintd-hu.mo with a custom command
[33/106] Generating po/ia/LC_MESSAGES/fprintd-ia.mo with a custom command
[34/106] Generating po/id/LC_MESSAGES/fprintd-id.mo with a custom command
[35/106] Generating po/it/LC_MESSAGES/fprintd-it.mo with a custom command
[36/106] Generating po/ja/LC_MESSAGES/fprintd-ja.mo with a custom command
[37/106] Generating po/ka/LC_MESSAGES/fprintd-ka.mo with a custom command
[38/106] Generating src/fprintd-dbus.h with a custom command
[39/106] Generating po/kk/LC_MESSAGES/fprintd-kk.mo with a custom command
[40/106] Generating po/kn/LC_MESSAGES/fprintd-kn.mo with a custom command
[41/106] Generating src/fprintd-dbus.c with a custom command
[42/106] Generating po/ko/LC_MESSAGES/fprintd-ko.mo with a custom command
[43/106] Generating po/ky/LC_MESSAGES/fprintd-ky.mo with a custom command
[44/106] Generating po/lt/LC_MESSAGES/fprintd-lt.mo with a custom command
[45/106] Generating po/lv/LC_MESSAGES/fprintd-lv.mo with a custom command
[46/106] Generating po/ml/LC_MESSAGES/fprintd-ml.mo with a custom command
[47/106] Generating po/mr/LC_MESSAGES/fprintd-mr.mo with a custom command
[48/106] Generating src/fprintd-dbus-interactive with a custom command
patching file src/fprintd-dbus-interactive.c (read from src/fprintd-dbus.c)
[49/106] Generating po/ms/LC_MESSAGES/fprintd-ms.mo with a custom command
[50/106] Generating po/nb/LC_MESSAGES/fprintd-nb.mo with a custom command
[51/106] Generating po/nl/LC_MESSAGES/fprintd-nl.mo with a custom command
[52/106] Generating po/nn/LC_MESSAGES/fprintd-nn.mo with a custom command
[53/106] Generating po/oc/LC_MESSAGES/fprintd-oc.mo with a custom command
[54/106] Generating data/man_fprintd.1 with a custom command
[55/106] Generating po/or/LC_MESSAGES/fprintd-or.mo with a custom command
[56/106] Generating po/pa/LC_MESSAGES/fprintd-pa.mo with a custom command
[57/106] Generating data/man_pam_fprintd.8 with a custom command
[58/106] Generating po/pl/LC_MESSAGES/fprintd-pl.mo with a custom command
[59/106] Generating po/pt/LC_MESSAGES/fprintd-pt.mo with a custom command
[60/106] Generating po/pt_BR/LC_MESSAGES/fprintd-pt_BR.mo with a custom command
[61/106] Generating po/ro/LC_MESSAGES/fprintd-ro.mo with a custom command
[62/106] Generating po/sk/LC_MESSAGES/fprintd-sk.mo with a custom command
[63/106] Generating po/ru/LC_MESSAGES/fprintd-ru.mo with a custom command
[64/106] Generating po/sl/LC_MESSAGES/fprintd-sl.mo with a custom command
[65/106] Generating po/sq/LC_MESSAGES/fprintd-sq.mo with a custom command
[66/106] Generating po/sr/LC_MESSAGES/fprintd-sr.mo with a custom command
[67/106] Generating po/sr@latin/LC_MESSAGES/fprintd-sr@latin.mo with a custom command
[68/106] Generating po/sv/LC_MESSAGES/fprintd-sv.mo with a custom command
[69/106] Generating po/ta/LC_MESSAGES/fprintd-ta.mo with a custom command
[70/106] Generating po/te/LC_MESSAGES/fprintd-te.mo with a custom command
[71/106] Generating po/th/LC_MESSAGES/fprintd-th.mo with a custom command
[72/106] Generating po/tr/LC_MESSAGES/fprintd-tr.mo with a custom command
[73/106] Generating po/uk/LC_MESSAGES/fprintd-uk.mo with a custom command
[74/106] Generating po/vi/LC_MESSAGES/fprintd-vi.mo with a custom command
[75/106] Generating po/wa/LC_MESSAGES/fprintd-wa.mo with a custom command
[76/106] Generating po/zh_CN/LC_MESSAGES/fprintd-zh_CN.mo with a custom command
[77/106] Generating po/zh_HK/LC_MESSAGES/fprintd-zh_HK.mo with a custom command
[78/106] Generating po/zh_TW/LC_MESSAGES/fprintd-zh_TW.mo with a custom command
[79/106] Generating src/fprintd-enums.h with a custom command (wrapped by meson because command contains newlines, to capture output)
[80/106] Compiling C object pam/pam_fprintd.so.p/pam_fprintd.c.o
[81/106] Generating src/fprintd-enums.c with a custom command (wrapped by meson because command contains newlines, to capture output)
[82/106] Generating data/net.reactivated.fprint.device.policy with a custom command
[83/106] Compiling C object utils/fprintd-list.p/list.c.o
[84/106] Compiling C object utils/fprintd-delete.p/delete.c.o
[85/106] Compiling C object utils/fprintd-enroll.p/enroll.c.o
[86/106] Compiling C object utils/fprintd-verify.p/verify.c.o
[87/106] Compiling C object src/libfprintd-private.a.p/meson-generated_.._fprintd-enums.c.o
[88/106] Compiling C object src/fprintd.p/file_storage.c.o
[89/106] Compiling C object src/fprintd.p/main.c.o
[90/106] Compiling C object src/fprintd.p/meson-generated_.._fprintd-enums.c.o
[91/106] Compiling C object src/libfprintd-private.a.p/manager.c.o
[92/106] Compiling C object utils/fprintd-verify.p/meson-generated_.._.._src_fprintd-dbus-interactive.c.o
[93/106] Compiling C object utils/fprintd-enroll.p/meson-generated_.._.._src_fprintd-dbus-interactive.c.o
[94/106] Compiling C object utils/fprintd-delete.p/meson-generated_.._.._src_fprintd-dbus-interactive.c.o
[95/106] Compiling C object utils/fprintd-list.p/meson-generated_.._.._src_fprintd-dbus-interactive.c.o
[96/106] Compiling C object src/libfprintd-private.a.p/device.c.o
[97/106] Compiling C object src/libfprintd-private.a.p/meson-generated_.._fprintd-dbus-interactive.c.o
[98/106] Compiling C object src/fprintd.p/meson-generated_.._fprintd-dbus-interactive.c.o
[99/106] Linking target pam/pam_fprintd.so
[100/106] Linking static target src/libfprintd-private.a
[101/106] Generating tests/pam/services/pam_test_service_file with a custom command
[102/106] Linking target utils/fprintd-enroll
[103/106] Linking target utils/fprintd-list
[104/106] Linking target utils/fprintd-delete
[105/106] Linking target utils/fprintd-verify
[106/106] Linking target src/fprintd
+ exit 0
Executing(%install): /bin/sh -e /usr/src/tmp/rpm-tmp.59043
+ umask 022
+ /bin/mkdir -p /usr/src/RPM/BUILD
+ cd /usr/src/RPM/BUILD
+ /bin/chmod -Rf u+rwX -- /usr/src/tmp/fprintd-buildroot
+ :
+ /bin/rm -rf -- /usr/src/tmp/fprintd-buildroot
+ PATH=/usr/libexec/rpm-build:/usr/src/bin:/bin:/usr/bin:/usr/X11R6/bin:/usr/games
+ cd fprintd-1.94.2
+ DESTDIR=/usr/src/tmp/fprintd-buildroot
+ ninja-build -C x86_64-alt-linux install
ninja: Entering directory `x86_64-alt-linux'
[1/2] Generating tests/pam/services/pam_test_service_file with a custom command
[1/2] Installing files.
Installing src/fprintd to /usr/src/tmp/fprintd-buildroot/usr/lib
Installing data/net.reactivated.fprint.device.policy to /usr/src/tmp/fprintd-buildroot/usr/share/polkit-1/actions
Installing data/fprintd.1 to /usr/src/tmp/fprintd-buildroot/usr/share/man/man1
Installing data/pam_fprintd.8 to /usr/src/tmp/fprintd-buildroot/usr/share/man/man8
Installing utils/fprintd-delete to /usr/src/tmp/fprintd-buildroot/usr/bin
Installing utils/fprintd-enroll to /usr/src/tmp/fprintd-buildroot/usr/bin
Installing utils/fprintd-list to /usr/src/tmp/fprintd-buildroot/usr/bin
Installing utils/fprintd-verify to /usr/src/tmp/fprintd-buildroot/usr/bin
Installing pam/pam_fprintd.so to /usr/src/tmp/fprintd-buildroot/lib64/security
Installing po/af/LC_MESSAGES/fprintd.mo to /usr/src/tmp/fprintd-buildroot/usr/share/locale/af/LC_MESSAGES
Installing po/ar/LC_MESSAGES/fprintd.mo to /usr/src/tmp/fprintd-buildroot/usr/share/locale/ar/LC_MESSAGES
Installing po/as/LC_MESSAGES/fprintd.mo to /usr/src/tmp/fprintd-buildroot/usr/share/locale/as/LC_MESSAGES
Installing po/ast/LC_MESSAGES/fprintd.mo to /usr/src/tmp/fprintd-buildroot/usr/share/locale/ast/LC_MESSAGES
Installing po/az/LC_MESSAGES/fprintd.mo to /usr/src/tmp/fprintd-buildroot/usr/share/locale/az/LC_MESSAGES
Installing po/be/LC_MESSAGES/fprintd.mo to /usr/src/tmp/fprintd-buildroot/usr/share/locale/be/LC_MESSAGES
Installing po/bg/LC_MESSAGES/fprintd.mo to /usr/src/tmp/fprintd-buildroot/usr/share/locale/bg/LC_MESSAGES
Installing po/bn_IN/LC_MESSAGES/fprintd.mo to /usr/src/tmp/fprintd-buildroot/usr/share/locale/bn_IN/LC_MESSAGES
Installing po/ca/LC_MESSAGES/fprintd.mo to /usr/src/tmp/fprintd-buildroot/usr/share/locale/ca/LC_MESSAGES
Installing po/ca@valencia/LC_MESSAGES/fprintd.mo to /usr/src/tmp/fprintd-buildroot/usr/share/locale/ca@valencia/LC_MESSAGES
Installing po/cs/LC_MESSAGES/fprintd.mo to /usr/src/tmp/fprintd-buildroot/usr/share/locale/cs/LC_MESSAGES
Installing po/cy/LC_MESSAGES/fprintd.mo to /usr/src/tmp/fprintd-buildroot/usr/share/locale/cy/LC_MESSAGES
Installing po/da/LC_MESSAGES/fprintd.mo to /usr/src/tmp/fprintd-buildroot/usr/share/locale/da/LC_MESSAGES
Installing po/de/LC_MESSAGES/fprintd.mo to /usr/src/tmp/fprintd-buildroot/usr/share/locale/de/LC_MESSAGES
Installing po/el/LC_MESSAGES/fprintd.mo to /usr/src/tmp/fprintd-buildroot/usr/share/locale/el/LC_MESSAGES
Installing po/en_GB/LC_MESSAGES/fprintd.mo to /usr/src/tmp/fprintd-buildroot/usr/share/locale/en_GB/LC_MESSAGES
Installing po/eo/LC_MESSAGES/fprintd.mo to /usr/src/tmp/fprintd-buildroot/usr/share/locale/eo/LC_MESSAGES
Installing po/es/LC_MESSAGES/fprintd.mo to /usr/src/tmp/fprintd-buildroot/usr/share/locale/es/LC_MESSAGES
Installing po/et/LC_MESSAGES/fprintd.mo to /usr/src/tmp/fprintd-buildroot/usr/share/locale/et/LC_MESSAGES
Installing po/eu/LC_MESSAGES/fprintd.mo to /usr/src/tmp/fprintd-buildroot/usr/share/locale/eu/LC_MESSAGES
Installing po/fa/LC_MESSAGES/fprintd.mo to /usr/src/tmp/fprintd-buildroot/usr/share/locale/fa/LC_MESSAGES
Installing po/fi/LC_MESSAGES/fprintd.mo to /usr/src/tmp/fprintd-buildroot/usr/share/locale/fi/LC_MESSAGES
Installing po/fo/LC_MESSAGES/fprintd.mo to /usr/src/tmp/fprintd-buildroot/usr/share/locale/fo/LC_MESSAGES
Installing po/fr/LC_MESSAGES/fprintd.mo to /usr/src/tmp/fprintd-buildroot/usr/share/locale/fr/LC_MESSAGES
Installing po/fur/LC_MESSAGES/fprintd.mo to /usr/src/tmp/fprintd-buildroot/usr/share/locale/fur/LC_MESSAGES
Installing po/ga/LC_MESSAGES/fprintd.mo to /usr/src/tmp/fprintd-buildroot/usr/share/locale/ga/LC_MESSAGES
Installing po/gl/LC_MESSAGES/fprintd.mo to /usr/src/tmp/fprintd-buildroot/usr/share/locale/gl/LC_MESSAGES
Installing po/gu/LC_MESSAGES/fprintd.mo to /usr/src/tmp/fprintd-buildroot/usr/share/locale/gu/LC_MESSAGES
Installing po/he/LC_MESSAGES/fprintd.mo to /usr/src/tmp/fprintd-buildroot/usr/share/locale/he/LC_MESSAGES
Installing po/hi/LC_MESSAGES/fprintd.mo to /usr/src/tmp/fprintd-buildroot/usr/share/locale/hi/LC_MESSAGES
Installing po/hr/LC_MESSAGES/fprintd.mo to /usr/src/tmp/fprintd-buildroot/usr/share/locale/hr/LC_MESSAGES
Installing po/hu/LC_MESSAGES/fprintd.mo to /usr/src/tmp/fprintd-buildroot/usr/share/locale/hu/LC_MESSAGES
Installing po/ia/LC_MESSAGES/fprintd.mo to /usr/src/tmp/fprintd-buildroot/usr/share/locale/ia/LC_MESSAGES
Installing po/id/LC_MESSAGES/fprintd.mo to /usr/src/tmp/fprintd-buildroot/usr/share/locale/id/LC_MESSAGES
Installing po/it/LC_MESSAGES/fprintd.mo to /usr/src/tmp/fprintd-buildroot/usr/share/locale/it/LC_MESSAGES
Installing po/ja/LC_MESSAGES/fprintd.mo to /usr/src/tmp/fprintd-buildroot/usr/share/locale/ja/LC_MESSAGES
Installing po/ka/LC_MESSAGES/fprintd.mo to /usr/src/tmp/fprintd-buildroot/usr/share/locale/ka/LC_MESSAGES
Installing po/kk/LC_MESSAGES/fprintd.mo to /usr/src/tmp/fprintd-buildroot/usr/share/locale/kk/LC_MESSAGES
Installing po/kn/LC_MESSAGES/fprintd.mo to /usr/src/tmp/fprintd-buildroot/usr/share/locale/kn/LC_MESSAGES
Installing po/ko/LC_MESSAGES/fprintd.mo to /usr/src/tmp/fprintd-buildroot/usr/share/locale/ko/LC_MESSAGES
Installing po/ky/LC_MESSAGES/fprintd.mo to /usr/src/tmp/fprintd-buildroot/usr/share/locale/ky/LC_MESSAGES
Installing po/lt/LC_MESSAGES/fprintd.mo to /usr/src/tmp/fprintd-buildroot/usr/share/locale/lt/LC_MESSAGES
Installing po/lv/LC_MESSAGES/fprintd.mo to /usr/src/tmp/fprintd-buildroot/usr/share/locale/lv/LC_MESSAGES
Installing po/ml/LC_MESSAGES/fprintd.mo to /usr/src/tmp/fprintd-buildroot/usr/share/locale/ml/LC_MESSAGES
Installing po/mr/LC_MESSAGES/fprintd.mo to /usr/src/tmp/fprintd-buildroot/usr/share/locale/mr/LC_MESSAGES
Installing po/ms/LC_MESSAGES/fprintd.mo to /usr/src/tmp/fprintd-buildroot/usr/share/locale/ms/LC_MESSAGES
Installing po/nb/LC_MESSAGES/fprintd.mo to /usr/src/tmp/fprintd-buildroot/usr/share/locale/nb/LC_MESSAGES
Installing po/nl/LC_MESSAGES/fprintd.mo to /usr/src/tmp/fprintd-buildroot/usr/share/locale/nl/LC_MESSAGES
Installing po/nn/LC_MESSAGES/fprintd.mo to /usr/src/tmp/fprintd-buildroot/usr/share/locale/nn/LC_MESSAGES
Installing po/oc/LC_MESSAGES/fprintd.mo to /usr/src/tmp/fprintd-buildroot/usr/share/locale/oc/LC_MESSAGES
Installing po/or/LC_MESSAGES/fprintd.mo to /usr/src/tmp/fprintd-buildroot/usr/share/locale/or/LC_MESSAGES
Installing po/pa/LC_MESSAGES/fprintd.mo to /usr/src/tmp/fprintd-buildroot/usr/share/locale/pa/LC_MESSAGES
Installing po/pl/LC_MESSAGES/fprintd.mo to /usr/src/tmp/fprintd-buildroot/usr/share/locale/pl/LC_MESSAGES
Installing po/pt/LC_MESSAGES/fprintd.mo to /usr/src/tmp/fprintd-buildroot/usr/share/locale/pt/LC_MESSAGES
Installing po/pt_BR/LC_MESSAGES/fprintd.mo to /usr/src/tmp/fprintd-buildroot/usr/share/locale/pt_BR/LC_MESSAGES
Installing po/ro/LC_MESSAGES/fprintd.mo to /usr/src/tmp/fprintd-buildroot/usr/share/locale/ro/LC_MESSAGES
Installing po/ru/LC_MESSAGES/fprintd.mo to /usr/src/tmp/fprintd-buildroot/usr/share/locale/ru/LC_MESSAGES
Installing po/sk/LC_MESSAGES/fprintd.mo to /usr/src/tmp/fprintd-buildroot/usr/share/locale/sk/LC_MESSAGES
Installing po/sl/LC_MESSAGES/fprintd.mo to /usr/src/tmp/fprintd-buildroot/usr/share/locale/sl/LC_MESSAGES
Installing po/sq/LC_MESSAGES/fprintd.mo to /usr/src/tmp/fprintd-buildroot/usr/share/locale/sq/LC_MESSAGES
Installing po/sr/LC_MESSAGES/fprintd.mo to /usr/src/tmp/fprintd-buildroot/usr/share/locale/sr/LC_MESSAGES
Installing po/sr@latin/LC_MESSAGES/fprintd.mo to /usr/src/tmp/fprintd-buildroot/usr/share/locale/sr@latin/LC_MESSAGES
Installing po/sv/LC_MESSAGES/fprintd.mo to /usr/src/tmp/fprintd-buildroot/usr/share/locale/sv/LC_MESSAGES
Installing po/ta/LC_MESSAGES/fprintd.mo to /usr/src/tmp/fprintd-buildroot/usr/share/locale/ta/LC_MESSAGES
Installing po/te/LC_MESSAGES/fprintd.mo to /usr/src/tmp/fprintd-buildroot/usr/share/locale/te/LC_MESSAGES
Installing po/th/LC_MESSAGES/fprintd.mo to /usr/src/tmp/fprintd-buildroot/usr/share/locale/th/LC_MESSAGES
Installing po/tr/LC_MESSAGES/fprintd.mo to /usr/src/tmp/fprintd-buildroot/usr/share/locale/tr/LC_MESSAGES
Installing po/uk/LC_MESSAGES/fprintd.mo to /usr/src/tmp/fprintd-buildroot/usr/share/locale/uk/LC_MESSAGES
Installing po/vi/LC_MESSAGES/fprintd.mo to /usr/src/tmp/fprintd-buildroot/usr/share/locale/vi/LC_MESSAGES
Installing po/wa/LC_MESSAGES/fprintd.mo to /usr/src/tmp/fprintd-buildroot/usr/share/locale/wa/LC_MESSAGES
Installing po/zh_CN/LC_MESSAGES/fprintd.mo to /usr/src/tmp/fprintd-buildroot/usr/share/locale/zh_CN/LC_MESSAGES
Installing po/zh_HK/LC_MESSAGES/fprintd.mo to /usr/src/tmp/fprintd-buildroot/usr/share/locale/zh_HK/LC_MESSAGES
Installing po/zh_TW/LC_MESSAGES/fprintd.mo to /usr/src/tmp/fprintd-buildroot/usr/share/locale/zh_TW/LC_MESSAGES
Installing /usr/src/RPM/BUILD/fprintd-1.94.2/src/net.reactivated.Fprint.Manager.xml to /usr/src/tmp/fprintd-buildroot/usr/share/dbus-1/interfaces
Installing /usr/src/RPM/BUILD/fprintd-1.94.2/src/net.reactivated.Fprint.Device.xml to /usr/src/tmp/fprintd-buildroot/usr/share/dbus-1/interfaces
Installing /usr/src/RPM/BUILD/fprintd-1.94.2/data/net.reactivated.Fprint.conf to /usr/src/tmp/fprintd-buildroot/usr/share/dbus-1/system.d
Installing /usr/src/RPM/BUILD/fprintd-1.94.2/x86_64-alt-linux/data/net.reactivated.Fprint.service to /usr/src/tmp/fprintd-buildroot/usr/share/dbus-1/system-services
Installing /usr/src/RPM/BUILD/fprintd-1.94.2/x86_64-alt-linux/data/fprintd.service to /usr/src/tmp/fprintd-buildroot/lib/systemd/system
Installing /usr/src/RPM/BUILD/fprintd-1.94.2/data/fprintd.conf to /usr/src/tmp/fprintd-buildroot/etc
+ /usr/lib/rpm/find-lang fprintd
+ mkdir -p /usr/src/tmp/fprintd-buildroot/etc/pam.d
+ install -m0644 -p /usr/src/RPM/SOURCES/system-auth-fprintd /usr/src/tmp/fprintd-buildroot/etc/pam.d/
+ install -m0644 -p /usr/src/RPM/SOURCES/system-auth-use_first_pass-fprintd /usr/src/tmp/fprintd-buildroot/etc/pam.d/
+ /usr/lib/rpm/brp-alt
Cleaning files in /usr/src/tmp/fprintd-buildroot (auto)
mode of './lib64/security/pam_fprintd.so' changed from 0755 (rwxr-xr-x) to 0644 (rw-r--r--)
Verifying and fixing files in /usr/src/tmp/fprintd-buildroot (binconfig,pkgconfig,libtool,desktop,gnuconfig)
Checking contents of files in /usr/src/tmp/fprintd-buildroot/ (default)
Compressing files in /usr/src/tmp/fprintd-buildroot (auto)
Adjusting library links in /usr/src/tmp/fprintd-buildroot
./lib: (from <cmdline>:0)
./lib64: (from <cmdline>:0)
./usr/lib: (from <cmdline>:0)
Verifying ELF objects in /usr/src/tmp/fprintd-buildroot (arch=normal,fhs=normal,lfs=relaxed,lint=relaxed,rpath=normal,stack=normal,textrel=normal,unresolved=normal)
Executing(%check): /bin/sh -e /usr/src/tmp/rpm-tmp.33329
+ umask 022
+ /bin/mkdir -p /usr/src/RPM/BUILD
+ cd /usr/src/RPM/BUILD
+ cd fprintd-1.94.2
+ ninja-build -C x86_64-alt-linux test
ninja: Entering directory `x86_64-alt-linux'
[1/2] Generating tests/pam/services/pam_test_service_file with a custom command
[1/2] Running all tests.
  1/531 fprintd / net.reactivated.fprint.device.policy                                                                                                                                         OK              3.60s
  2/531 fprintd:daemon+fprintd+FPrindConcurrentPolkitRequestsTest / FPrindConcurrentPolkitRequestsTest.test_hanging_claim_can_proceed_when_released                                            OK              3.62s
  3/531 fprintd:daemon+fprintd+FPrindConcurrentPolkitRequestsTest / FPrindConcurrentPolkitRequestsTest.test_hanging_claim_does_not_block_empty_list                                            OK              3.62s
  4/531 fprintd:daemon+fprintd+FPrindConcurrentPolkitRequestsTest / FPrindConcurrentPolkitRequestsTest.test_hanging_claim_does_not_block_list                                                  OK              3.62s
  5/531 fprintd:daemon+fprintd+FPrindConcurrentPolkitRequestsTest / FPrindConcurrentPolkitRequestsTest.test_hanging_claim_does_not_block_new_claim                                             OK              3.62s
  6/531 fprintd:daemon+fprintd+FPrindConcurrentPolkitRequestsTest / FPrindConcurrentPolkitRequestsTest.test_hanging_claim_does_not_block_new_claim_external_client                             OK              3.62s
  7/531 fprintd:daemon+fprintd+FPrindConcurrentPolkitRequestsTest / FPrindConcurrentPolkitRequestsTest.test_hanging_claim_does_not_block_new_release                                           OK              3.62s
  8/531 fprintd:daemon+fprintd+FPrindConcurrentPolkitRequestsTest / FPrindConcurrentPolkitRequestsTest.test_hanging_claim_does_not_block_verification                                          OK              3.62s
  9/531 fprintd:daemon+fprintd+FPrintdManagerPreStartTests / FPrintdManagerPreStartTests.test_manager_get_devices_on_name_appeared                                                             OK              3.62s
 10/531 fprintd:daemon+fprintd+FPrintdManagerPreStartTests / FPrintdManagerPreStartTests.test_manager_get_no_default_device                                                                    OK              3.62s
 11/531 fprintd:daemon+fprintd+FPrintdManagerPreStartTests / FPrintdManagerPreStartTests.test_manager_get_no_devices                                                                           OK              3.62s
 12/531 fprintd:daemon+fprintd+FPrintdManagerTests / FPrintdManagerTests.test_manager_get_default_device                                                                                       OK              3.61s
 13/531 fprintd:daemon+fprintd+FPrintdManagerTests / FPrintdManagerTests.test_manager_get_devices                                                                                              OK              3.61s
 14/531 fprintd:daemon+fprintd+FPrintdUtilsTest / FPrintdUtilsTest.test_delete_already_claimed                                                                                                 OK              3.61s
 15/531 fprintd:daemon+fprintd+FPrintdUtilsTest / FPrintdUtilsTest.test_delete_error                                                                                                           OK              3.60s
 16/531 fprintd:daemon+fprintd+FPrintdUtilsTest / FPrintdUtilsTest.test_delete_error_claiming                                                                                                  OK              3.59s
 17/531 fprintd:daemon+fprintd+FPrintdUtilsTest / FPrintdUtilsTest.test_delete_no_prints                                                                                                       OK              3.53s
 18/531 fprintd:daemon+fprintd+FPrintdUtilsTest / FPrintdUtilsTest.test_delete_release_error                                                                                                   OK              3.50s
 19/531 fprintd:daemon+fprintd+FPrintdUtilsTest / FPrintdUtilsTest.test_delete_single_finger                                                                                                   OK              3.48s
 20/531 fprintd:daemon+fprintd+FPrintdUtilsTest / FPrintdUtilsTest.test_enroll                                                                                                                 OK              3.47s
 21/531 fprintd:daemon+fprintd+FPrintdUtilsTest / FPrintdUtilsTest.test_enroll_error                                                                                                           OK              3.45s
 22/531 fprintd:daemon+fprintd+FPrintdUtilsTest / FPrintdUtilsTest.test_enroll_error_invalid_finger                                                                                            OK              3.41s
 23/531 fprintd:daemon+fprintd+FPrintdUtilsTest / FPrintdUtilsTest.test_vanished_client_operation_is_cancelled                                                                                 OK              3.39s
 24/531 fprintd:daemon+fprintd+FPrintdUtilsTest / FPrintdUtilsTest.test_verify_any_finger_error                                                                                                OK              3.38s
 25/531 fprintd:daemon+fprintd+FPrintdUtilsTest / FPrintdUtilsTest.test_verify_any_finger_match                                                                                                OK              3.33s
 26/531 fprintd:daemon+fprintd+FPrintdUtilsTest / FPrintdUtilsTest.test_verify_any_finger_no_match                                                                                             OK              3.31s
 27/531 fprintd:daemon+fprintd+FPrintdUtilsTest / FPrintdUtilsTest.test_verify_error                                                                                                           OK              3.28s
 28/531 fprintd:daemon+fprintd+FPrintdUtilsTest / FPrintdUtilsTest.test_verify_match                                                                                                           OK              3.27s
 29/531 fprintd:daemon+fprintd+FPrintdUtilsTest / FPrintdUtilsTest.test_verify_no_match                                                                                                        OK              3.26s
 30/531 fprintd:daemon+fprintd+FPrintdVirtualDeviceClaimedTest / FPrintdVirtualDeviceClaimedTest.test_already_claimed_other_user_delete_enrolled_fingers                                       OK              3.23s
 31/531 fprintd:daemon+fprintd+FPrintdVirtualDeviceClaimedTest / FPrintdVirtualDeviceClaimedTest.test_already_claimed_other_user_delete_enrolled_fingers_no_prints                             OK              3.21s
 32/531 fprintd:daemon+fprintd+FPrintdVirtualDeviceClaimedTest / FPrintdVirtualDeviceClaimedTest.test_already_claimed_same_user_delete_enrolled_fingers                                        OK              3.15s
 33/531 fprintd:daemon+fprintd+FPrintdVirtualDeviceClaimedTest / FPrintdVirtualDeviceClaimedTest.test_already_claimed_same_user_delete_enrolled_fingers_no_prints                              OK              3.14s
 34/531 fprintd:daemon+fprintd+FPrintdVirtualDeviceClaimedTest / FPrintdVirtualDeviceClaimedTest.test_always_allowed_enroll_stop                                                               OK              3.12s
 35/531 fprintd:daemon+fprintd+FPrintdVirtualDeviceClaimedTest / FPrintdVirtualDeviceClaimedTest.test_always_allowed_verify_stop                                                               OK              3.11s
 36/531 fprintd:daemon+fprintd+FPrintdVirtualDeviceClaimedTest / FPrintdVirtualDeviceClaimedTest.test_any_finger_delete_print                                                                  OK              3.09s
 37/531 fprintd:daemon+fprintd+FPrintdVirtualDeviceClaimedTest / FPrintdVirtualDeviceClaimedTest.test_any_finger_enroll_start                                                                  OK              3.08s
 38/531 fprintd:daemon+fprintd+FPrintdVirtualDeviceClaimedTest / FPrintdVirtualDeviceClaimedTest.test_busy_device_release_on_enroll                                                            OK              3.05s
 39/531 fprintd:daemon+fprintd+FPrintdVirtualDeviceClaimedTest / FPrintdVirtualDeviceClaimedTest.test_busy_device_release_on_verify                                                            OK              3.02s
 40/531 fprintd:daemon+fprintd+FPrintdVirtualDeviceClaimedTest / FPrintdVirtualDeviceClaimedTest.test_busy_device_release_on_verify_finger                                                     OK              2.99s
 41/531 fprintd:daemon+fprintd+FPrintdVirtualDeviceClaimedTest / FPrintdVirtualDeviceClaimedTest.test_concourrent_delete_enrolled_finger                                                       OK              2.97s
 42/531 fprintd:daemon+fprintd+FPrintdVirtualDeviceClaimedTest / FPrintdVirtualDeviceClaimedTest.test_concourrent_delete_enrolled_fingers                                                      OK              2.93s
 43/531 fprintd:daemon+fprintd+FPrintdVirtualDeviceClaimedTest / FPrintdVirtualDeviceClaimedTest.test_concourrent_delete_enrolled_fingers2                                                     OK              2.90s
 44/531 fprintd:daemon+fprintd+FPrintdVirtualDeviceClaimedTest / FPrintdVirtualDeviceClaimedTest.test_concourrent_delete_enrolled_fingers_unclaimed                                            OK              2.87s
 45/531 fprintd:daemon+fprintd+FPrintdVirtualDeviceClaimedTest / FPrintdVirtualDeviceClaimedTest.test_concourrent_enroll_start                                                                 OK              2.84s
 46/531 fprintd:daemon+fprintd+FPrintdVirtualDeviceClaimedTest / FPrintdVirtualDeviceClaimedTest.test_concourrent_list_enrolled_fingers                                                        OK              2.82s
 47/531 fprintd:daemon+fprintd+FPrintdVirtualDeviceClaimedTest / FPrintdVirtualDeviceClaimedTest.test_concourrent_release                                                                      OK              2.79s
 48/531 fprintd:daemon+fprintd+FPrintdVirtualDeviceClaimedTest / FPrintdVirtualDeviceClaimedTest.test_concourrent_verify_start                                                                 OK              2.77s
 49/531 fprintd:daemon+fprintd+FPrintdVirtualDeviceClaimedTest / FPrintdVirtualDeviceClaimedTest.test_delete_enrolled_finger_from_other_client                                                 OK              2.75s
 50/531 fprintd:daemon+fprintd+FPrintdVirtualDeviceClaimedTest / FPrintdVirtualDeviceClaimedTest.test_delete_enrolled_fingers2_from_other_client                                               OK              2.74s
 51/531 fprintd:daemon+fprintd+FPrintdVirtualDeviceClaimedTest / FPrintdVirtualDeviceClaimedTest.test_delete_enrolled_fingers_from_other_client                                                OK              2.72s
 52/531 fprintd:daemon+fprintd+FPrintdVirtualDeviceClaimedTest / FPrintdVirtualDeviceClaimedTest.test_delete_with_no_enrolled_prints                                                           OK              2.69s
 53/531 fprintd:daemon+fprintd+FPrintdVirtualDeviceClaimedTest / FPrintdVirtualDeviceClaimedTest.test_enroll_delete2                                                                           OK              2.67s
 54/531 fprintd:daemon+fprintd+FPrintdVirtualDeviceClaimedTest / FPrintdVirtualDeviceClaimedTest.test_enroll_delete2_multiple                                                                  OK              2.63s
 55/531 fprintd:daemon+fprintd+FPrintdVirtualDeviceClaimedTest / FPrintdVirtualDeviceClaimedTest.test_enroll_delete2_storage_error                                                             OK              2.60s
 56/531 fprintd:daemon+fprintd+FPrintdVirtualDeviceClaimedTest / FPrintdVirtualDeviceClaimedTest.test_enroll_delete_single                                                                     OK              2.58s
 57/531 fprintd:daemon+fprintd+FPrintdVirtualDeviceClaimedTest / FPrintdVirtualDeviceClaimedTest.test_enroll_delete_single_storage_error                                                       OK              2.55s
 58/531 fprintd:daemon+fprintd+FPrintdVirtualDeviceClaimedTest / FPrintdVirtualDeviceClaimedTest.test_enroll_delete_storage_error                                                              OK              2.53s
 59/531 fprintd:daemon+fprintd+FPrintdVirtualDeviceClaimedTest / FPrintdVirtualDeviceClaimedTest.test_enroll_finger_status                                                                     OK              2.51s
 60/531 fprintd:daemon+fprintd+FPrintdVirtualDeviceClaimedTest / FPrintdVirtualDeviceClaimedTest.test_enroll_invalid_storage_dir                                                               OK              2.50s
 61/531 fprintd:daemon+fprintd+FPrintdVirtualDeviceClaimedTest / FPrintdVirtualDeviceClaimedTest.test_enroll_start_from_other_client                                                           OK              2.47s
 62/531 fprintd:daemon+fprintd+FPrintdVirtualDeviceClaimedTest / FPrintdVirtualDeviceClaimedTest.test_enroll_stop_cancels                                                                      OK              2.45s
 63/531 fprintd:daemon+fprintd+FPrintdVirtualDeviceClaimedTest / FPrintdVirtualDeviceClaimedTest.test_enroll_stop_not_started                                                                  OK              2.41s
 64/531 fprintd:daemon+fprintd+FPrintdVirtualDeviceClaimedTest / FPrintdVirtualDeviceClaimedTest.test_enroll_verify_list_delete                                                                OK              2.36s
 65/531 fprintd:daemon+fprintd+FPrintdVirtualDeviceClaimedTest / FPrintdVirtualDeviceClaimedTest.test_enroll_write_print_error                                                                 OK              2.33s
 66/531 fprintd:daemon+fprintd+FPrintdVirtualDeviceClaimedTest / FPrintdVirtualDeviceClaimedTest.test_identify_finger_not_enrolled                                                             OK              2.30s
 67/531 fprintd:daemon+fprintd+FPrintdVirtualDeviceClaimedTest / FPrintdVirtualDeviceClaimedTest.test_identify_finger_not_enrolled_stops_verification                                          OK              2.27s
 68/531 fprintd:daemon+fprintd+FPrintdVirtualDeviceClaimedTest / FPrintdVirtualDeviceClaimedTest.test_list_enrolled_fingers_current_user                                                       OK              2.23s
 69/531 fprintd:daemon+fprintd+FPrintdVirtualDeviceClaimedTest / FPrintdVirtualDeviceClaimedTest.test_release_from_other_client                                                                OK              2.20s
 70/531 fprintd:daemon+fprintd+FPrintdVirtualDeviceClaimedTest / FPrintdVirtualDeviceClaimedTest.test_unallowed_delete_enrolled_finger                                                         OK              2.18s
 71/531 fprintd:daemon+fprintd+FPrintdVirtualDeviceClaimedTest / FPrintdVirtualDeviceClaimedTest.test_unallowed_delete_enrolled_fingers                                                        OK              2.15s
 72/531 fprintd:daemon+fprintd+FPrintdVirtualDeviceClaimedTest / FPrintdVirtualDeviceClaimedTest.test_unallowed_delete_enrolled_fingers2                                                       OK              2.11s
 73/531 fprintd:daemon+fprintd+FPrintdVirtualDeviceClaimedTest / FPrintdVirtualDeviceClaimedTest.test_unallowed_enroll_start                                                                   OK              2.08s
 74/531 fprintd:daemon+fprintd+FPrintdVirtualDeviceClaimedTest / FPrintdVirtualDeviceClaimedTest.test_unallowed_list_enrolled_fingers                                                          OK              2.05s
 75/531 fprintd:daemon+fprintd+FPrintdVirtualDeviceClaimedTest / FPrintdVirtualDeviceClaimedTest.test_unallowed_list_enrolled_fingers_current_user                                             OK              2.01s
 76/531 fprintd:daemon+fprintd+FPrintdVirtualDeviceClaimedTest / FPrintdVirtualDeviceClaimedTest.test_unallowed_verify_start                                                                   OK              1.96s
 77/531 fprintd:daemon+fprintd+FPrintdVirtualDeviceClaimedTest / FPrintdVirtualDeviceClaimedTest.test_verify_finger_not_enrolled_stops_verification                                            OK              1.70s
 78/531 fprintd:daemon+fprintd+FPrintdVirtualDeviceClaimedTest / FPrintdVirtualDeviceClaimedTest.test_verify_finger_stop_cancels                                                               OK              1.66s
 79/531 fprintd:daemon+fprintd+FPrintdVirtualDeviceClaimedTest / FPrintdVirtualDeviceClaimedTest.test_verify_start_finger_from_other_client                                                    OK              3.69s
 80/531 fprintd:daemon+fprintd+FPrintdVirtualDeviceClaimedTest / FPrintdVirtualDeviceClaimedTest.test_verify_finger_no_match_restart                                                           OK              3.89s
 81/531 fprintd:daemon+fprintd+FPrintdVirtualDeviceClaimedTest / FPrintdVirtualDeviceClaimedTest.test_verify_invalid_storage_dir                                                               OK              3.76s
 82/531 fprintd:daemon+fprintd+FPrintdVirtualDeviceClaimedTest / FPrintdVirtualDeviceClaimedTest.test_verify_read_print_error                                                                  OK              3.74s
 83/531 fprintd:daemon+fprintd+FPrintdVirtualDeviceClaimedTest / FPrintdVirtualDeviceClaimedTest.test_verify_finger_not_enrolled                                                               OK              3.86s
 84/531 fprintd:daemon+fprintd+FPrintdVirtualDeviceClaimedTest / FPrintdVirtualDeviceClaimedTest.test_verify_finger_status                                                                     OK              3.82s
 85/531 fprintd:daemon+fprintd+FPrintdVirtualDeviceClaimedTest / FPrintdVirtualDeviceClaimedTest.test_verify_stop_not_started                                                                  OK              3.63s
 86/531 fprintd:daemon+fprintd+FPrindConcurrentPolkitRequestsTest / FPrindConcurrentPolkitRequestsTest.test_hanging_claim_enroll_does_not_block_new_claim                                      OK              5.94s
 87/531 fprintd:daemon+fprintd+FPrintdVirtualDeviceClaimedTest / FPrintdVirtualDeviceClaimedTest.test_verify_finger_match                                                                      OK              4.16s
 88/531 fprintd:daemon+fprintd+FPrintdVirtualDeviceClaimedTest / FPrintdVirtualDeviceClaimedTest.test_verify_finger_no_match                                                                   OK              4.13s
 89/531 fprintd:daemon+fprintd+FPrintdUtilsTest / FPrintdUtilsTest.test_delete_multiple_users_single_finger                                                                                    OK              6.06s
 90/531 fprintd:daemon+fprintd+FPrintdVirtualDeviceClaimedTest / FPrintdVirtualDeviceClaimedTest.test_verify_any_finger_match                                                                  OK              4.30s
 91/531 fprintd:daemon+fprintd+FPrintdVirtualDeviceClaimedTest / FPrintdVirtualDeviceClaimedTest.test_verify_any_finger_no_match                                                               OK              4.24s
 92/531 fprintd:daemon+fprintd+FPrintdVirtualDeviceEnrollTests / FPrintdVirtualDeviceEnrollTests.test_delete_finger_during_enroll                                                              OK              3.67s
 93/531 fprintd:daemon+fprintd+FPrintdVirtualDeviceClaimedTest / FPrintdVirtualDeviceClaimedTest.test_verify_stop_cancels                                                                      OK              3.90s
 94/531 fprintd:daemon+fprintd+FPrintdVirtualDeviceClaimedTest / FPrintdVirtualDeviceClaimedTest.test_wrong_finger_enroll_start                                                                OK              3.71s
 95/531 fprintd:daemon+fprintd+FPrintdVirtualDeviceClaimedTest / FPrintdVirtualDeviceClaimedTest.test_verify_with_no_enrolled_prints                                                           OK              3.83s
 96/531 fprintd:daemon+fprintd+FPrintdVirtualDeviceClaimedTest / FPrintdVirtualDeviceClaimedTest.test_verify_start_from_other_client                                                           OK              3.94s
 97/531 fprintd:daemon+fprintd+FPrintdVirtualDeviceEnrollTests / FPrintdVirtualDeviceEnrollTests.test_delete_fingers_during_enroll                                                             OK              3.61s
 98/531 fprintd:daemon+fprintd+FPrintdVirtualDeviceClaimedTest / FPrintdVirtualDeviceClaimedTest.test_wrong_finger_delete_print                                                                OK              3.74s
 99/531 fprintd:daemon+fprintd+FPrintdVirtualDeviceEnrollTests / FPrintdVirtualDeviceEnrollTests.test_delete_fingers2_during_enroll                                                            OK              3.66s
100/531 fprintd:daemon+fprintd+FPrintdVirtualDeviceClaimedTest / FPrintdVirtualDeviceClaimedTest.test_verify_wrong_finger_match                                                                OK              3.89s
101/531 fprintd:daemon+fprintd+FPrintdVirtualDeviceEnrollTests / FPrintdVirtualDeviceEnrollTests.test_enroll_error_data_full                                                                   OK              3.46s
102/531 fprintd:daemon+fprintd+FPrintdVirtualDeviceEnrollTests / FPrintdVirtualDeviceEnrollTests.test_enroll_concourrent_stop                                                                  OK              3.62s
103/531 fprintd:daemon+fprintd+FPrintdVirtualDeviceClaimedTest / FPrintdVirtualDeviceClaimedTest.test_enroll_users_duplicate_prints                                                            OK              4.88s
104/531 fprintd:daemon+fprintd+FPrintdVirtualDeviceEnrollTests / FPrintdVirtualDeviceEnrollTests.test_enroll_already_enrolled_finger                                                           OK              3.91s
105/531 fprintd:daemon+fprintd+FPrintdVirtualDeviceClaimedTest / FPrintdVirtualDeviceClaimedTest.test_verify_wrong_finger_no_match                                                             OK              4.12s
106/531 fprintd:daemon+fprintd+FPrintdVirtualDeviceEnrollTests / FPrintdVirtualDeviceEnrollTests.test_enroll_error_data_invalid                                                                OK              3.69s
107/531 fprintd:daemon+fprintd+FPrintdVirtualDeviceEnrollTests / FPrintdVirtualDeviceEnrollTests.test_enroll_error_already_open                                                                OK              3.79s
108/531 fprintd:daemon+fprintd+FPrintdVirtualDeviceEnrollTests / FPrintdVirtualDeviceEnrollTests.test_enroll_error_busy                                                                        OK              3.76s
109/531 fprintd:daemon+fprintd+FPrintdVirtualDeviceEnrollTests / FPrintdVirtualDeviceEnrollTests.test_enroll_retry_remove_finger                                                               OK              3.47s
110/531 fprintd:daemon+fprintd+FPrintdVirtualDeviceIdentificationTests / FPrintdVirtualDeviceIdentificationTests.test_enroll_start_during_verify                                               OK              3.16s
111/531 fprintd:daemon+fprintd+FPrintdVirtualDeviceIdentificationTests / FPrintdVirtualDeviceIdentificationTests.test_enroll_stop_during_verify                                                OK              3.11s
112/531 fprintd:daemon+fprintd+FPrintdVirtualDeviceEnrollTests / FPrintdVirtualDeviceEnrollTests.test_enroll_retry_general                                                                     OK              3.50s
113/531 fprintd:daemon+fprintd+FPrintdVirtualDeviceEnrollTests / FPrintdVirtualDeviceEnrollTests.test_enroll_error_general                                                                     OK              3.65s
114/531 fprintd:daemon+fprintd+FPrintdVirtualDeviceIdentificationTests / FPrintdVirtualDeviceIdentificationTests.test_delete_finger_during_verify                                              OK              3.23s
115/531 fprintd:daemon+fprintd+FPrintdVirtualDeviceEnrollTests / FPrintdVirtualDeviceEnrollTests.test_enroll_error_data_not_found                                                              OK              3.68s
116/531 fprintd:daemon+fprintd+FPrintdVirtualDeviceEnrollTests / FPrintdVirtualDeviceEnrollTests.test_enroll_error_not_supported                                                               OK              3.59s
117/531 fprintd:daemon+fprintd+FPrintdVirtualDeviceEnrollTests / FPrintdVirtualDeviceEnrollTests.test_enroll_error_proto                                                                       OK              3.56s
118/531 fprintd:daemon+fprintd+FPrintdVirtualDeviceEnrollTests / FPrintdVirtualDeviceEnrollTests.test_enroll_stop_from_other_client                                                            OK              3.36s
119/531 fprintd:daemon+fprintd+FPrintdVirtualDeviceEnrollTests / FPrintdVirtualDeviceEnrollTests.test_enroll_duplicate_image                                                                   OK              3.85s
120/531 fprintd:daemon+fprintd+FPrintdVirtualDeviceEnrollTests / FPrintdVirtualDeviceEnrollTests.test_enroll_error_not_open                                                                    OK              3.63s
121/531 fprintd:daemon+fprintd+FPrintdVirtualDeviceEnrollTests / FPrintdVirtualDeviceEnrollTests.test_enroll_retry_center_finger                                                               OK              3.54s
122/531 fprintd:daemon+fprintd+FPrintdVirtualDeviceEnrollTests / FPrintdVirtualDeviceEnrollTests.test_verify_start_during_enroll                                                               OK              3.35s
123/531 fprintd:daemon+fprintd+FPrintdVirtualDeviceIdentificationTests / FPrintdVirtualDeviceIdentificationTests.test_delete_fingers2_during_verify                                            OK              3.24s
124/531 fprintd:daemon+fprintd+FPrintdVirtualDeviceIdentificationTests / FPrintdVirtualDeviceIdentificationTests.test_delete_fingers_during_verify                                             OK              3.22s
125/531 fprintd:daemon+fprintd+FPrintdVirtualDeviceEnrollTests / FPrintdVirtualDeviceEnrollTests.test_enroll_start_during_enroll                                                               OK              3.44s
126/531 fprintd:daemon+fprintd+FPrintdVirtualDeviceEnrollTests / FPrintdVirtualDeviceEnrollTests.test_enroll_retry_too_short                                                                   OK              3.47s
127/531 fprintd:daemon+fprintd+FPrintdVirtualDeviceEnrollTests / FPrintdVirtualDeviceEnrollTests.test_verify_stop_during_enroll                                                                OK              3.31s
128/531 fprintd:daemon+fprintd+FPrintdVirtualDeviceClaimedTest / FPrintdVirtualDeviceClaimedTest.test_verify_any_finger_multiple_users                                                         FAIL            5.50s   exit status 1
>>> G_DEBUG=fatal-criticals MALLOC_PERTURB_=132 G_MESSAGES_DEBUG=all MALLOC_CHECK_=2 TOPSRCDIR=/usr/src/RPM/BUILD/fprintd-1.94.2 G_SLICE=always-malloc FPRINT_BUILD_DIR=/usr/src/RPM/BUILD/fprintd-1.94.2/x86_64-alt-linux/src /usr/bin/python3 /usr/src/RPM/BUILD/fprintd-1.94.2/tests/fprintd.py FPrintdVirtualDeviceClaimedTest.test_verify_any_finger_multiple_users
――――――――――――――――――――――――――――――――――――― ✀  ―――――――――――――――――――――――――――――――――――――
Listing only the last 100 lines from a long log.
Changed properties {'finger-needed': <false>} invalidated []
EnrollStatus ('enroll-stage-passed', false)
Changed properties {'finger-needed': <true>} invalidated []
Changed properties {'finger-needed': <false>} invalidated []
EnrollStatus ('enroll-stage-passed', false)
Changed properties {'finger-needed': <true>} invalidated []
Changed properties {'finger-needed': <false>} invalidated []
EnrollStatus ('enroll-stage-passed', false)
Changed properties {'finger-needed': <true>} invalidated []
Changed properties {'finger-needed': <false>} invalidated []
EnrollStatus ('enroll-stage-passed', false)
Changed properties {'finger-needed': <true>} invalidated []
Changed properties {'finger-needed': <false>} invalidated []
EnrollStatus ('enroll-completed', true)
Changed properties {'finger-needed': <true>} invalidated []
Changed properties {'finger-needed': <false>} invalidated []
EnrollStatus ('enroll-stage-passed', false)
Changed properties {'finger-needed': <true>} invalidated []
Changed properties {'finger-needed': <false>} invalidated []
EnrollStatus ('enroll-stage-passed', false)
Changed properties {'finger-needed': <true>} invalidated []
Changed properties {'finger-needed': <false>} invalidated []
EnrollStatus ('enroll-stage-passed', false)
Changed properties {'finger-needed': <true>} invalidated []
Changed properties {'finger-needed': <false>} invalidated []
EnrollStatus ('enroll-stage-passed', false)
Changed properties {'finger-needed': <true>} invalidated []
Changed properties {'finger-needed': <false>} invalidated []
EnrollStatus ('enroll-stage-passed', false)
Changed properties {'finger-needed': <true>} invalidated []
Changed properties {'finger-needed': <false>} invalidated []
EnrollStatus ('enroll-completed', true)
VerifyFingerSelected ('left-thumb',)
Changed properties {'finger-needed': <true>} invalidated []
Changed properties {'finger-needed': <false>} invalidated []
VerifyStatus ('verify-match', true)
VerifyFingerSelected ('left-thumb',)
Changed properties {'finger-needed': <true>} invalidated []
Changed properties {'finger-needed': <false>} invalidated []
VerifyStatus ('verify-no-match', true)
VerifyFingerSelected ('left-thumb',)
Changed properties {'finger-needed': <true>} invalidated []
Changed properties {'finger-needed': <false>} invalidated []
VerifyStatus ('verify-no-match', true)
VerifyFingerSelected ('left-thumb',)
Changed properties {'finger-needed': <true>} invalidated []
Changed properties {'finger-needed': <false>} invalidated []
VerifyStatus ('verify-no-match', true)
VerifyFingerSelected ('right-index-finger',)
Changed properties {'finger-needed': <true>} invalidated []
Changed properties {'finger-needed': <false>} invalidated []
VerifyStatus ('verify-no-match', true)
VerifyFingerSelected ('right-index-finger',)
Changed properties {'finger-needed': <true>} invalidated []
Changed properties {'finger-needed': <false>} invalidated []
VerifyStatus ('verify-match', true)
VerifyFingerSelected ('right-index-finger',)
Changed properties {'finger-needed': <true>} invalidated []
Changed properties {'finger-needed': <false>} invalidated []
VerifyStatus ('verify-no-match', true)
VerifyFingerSelected ('right-index-finger',)
Changed properties {'finger-needed': <true>} invalidated []
Changed properties {'finger-needed': <false>} invalidated []
VerifyStatus ('verify-no-match', true)
VerifyFingerSelected ('any',)
Changed properties {'finger-needed': <true>} invalidated []
Changed properties {'finger-needed': <false>} invalidated []
VerifyStatus ('verify-no-match', true)
VerifyFingerSelected ('any',)
Changed properties {'finger-needed': <true>} invalidated []
Changed properties {'finger-needed': <false>} invalidated []
VerifyStatus ('verify-no-match', true)
VerifyFingerSelected ('any',)
Changed properties {'finger-needed': <true>} invalidated []
Changed properties {'finger-needed': <false>} invalidated []
VerifyStatus ('verify-match', true)
VerifyFingerSelected ('any',)
Changed properties {'finger-needed': <true>} invalidated []
Changed properties {'finger-needed': <false>} invalidated []
VerifyStatus ('verify-match', true)
stderr:
test_verify_any_finger_multiple_users (__main__.FPrintdVirtualDeviceClaimedTest.test_verify_any_finger_multiple_users) ... FAIL
/usr/lib64/python3.11/unittest/case.py:587: ResourceWarning: unclosed file <_io.BufferedReader name=8>
  function(*args, **kwargs)
ResourceWarning: Enable tracemalloc to get the object allocation traceback

======================================================================
FAIL: test_verify_any_finger_multiple_users (__main__.FPrintdVirtualDeviceClaimedTest.test_verify_any_finger_multiple_users)
----------------------------------------------------------------------
Traceback (most recent call last):
  File "/usr/src/RPM/BUILD/fprintd-1.94.2/tests/fprintd.py", line 314, in daemon_stop
    self.daemon_log.assert_closed()
  File "/usr/src/RPM/BUILD/fprintd-1.94.2/tests/output_checker.py", line 174, in assert_closed
    raise AssertionError("OutputCheck: Write side has not been closed yet!")
AssertionError: OutputCheck: Write side has not been closed yet!

----------------------------------------------------------------------
Ran 1 test in 3.952s

FAILED (failures=1)
――――――――――――――――――――――――――――――――――――――――――――――――――――――――――――――――――――――――――――――

129/531 fprintd:daemon+fprintd+FPrintdVirtualDeviceIdentificationTests / FPrintdVirtualDeviceIdentificationTests.test_multiple_verify                                                          OK              3.84s
130/531 fprintd:daemon+fprintd+FPrintdVirtualDeviceIdentificationTests / FPrintdVirtualDeviceIdentificationTests.test_multiple_verify_cancelled                                                OK              3.68s
131/531 fprintd:daemon+fprintd+FPrintdVirtualDeviceIdentificationTests / FPrintdVirtualDeviceIdentificationTests.test_verify_concourrent_stop                                                  OK              3.68s
132/531 fprintd:daemon+fprintd+FPrintdVirtualDeviceIdentificationTests / FPrintdVirtualDeviceIdentificationTests.test_verify_error_already_open                                                OK              3.68s
133/531 fprintd:daemon+fprintd+FPrintdVirtualDeviceIdentificationTests / FPrintdVirtualDeviceIdentificationTests.test_verify_error_busy                                                        OK              3.67s
134/531 fprintd:daemon+fprintd+FPrintdVirtualDeviceIdentificationTests / FPrintdVirtualDeviceIdentificationTests.test_verify_error_data_full                                                   OK              3.67s
135/531 fprintd:daemon+fprintd+FPrintdVirtualDeviceIdentificationTests / FPrintdVirtualDeviceIdentificationTests.test_verify_error_data_invalid                                                OK              3.67s
136/531 fprintd:daemon+fprintd+FPrintdVirtualDeviceIdentificationTests / FPrintdVirtualDeviceIdentificationTests.test_verify_error_data_not_found                                              OK              3.66s
137/531 fprintd:daemon+fprintd+FPrintdVirtualDeviceIdentificationTests / FPrintdVirtualDeviceIdentificationTests.test_verify_error_general                                                     OK              3.63s
138/531 fprintd:daemon+fprintd+FPrintdVirtualDeviceIdentificationTests / FPrintdVirtualDeviceIdentificationTests.test_verify_error_ignored_after_report                                        OK              3.62s
139/531 fprintd:daemon+fprintd+FPrintdVirtualDeviceIdentificationTests / FPrintdVirtualDeviceIdentificationTests.test_verify_error_not_open                                                    OK              3.62s
140/531 fprintd:daemon+fprintd+FPrintdVirtualDeviceIdentificationTests / FPrintdVirtualDeviceIdentificationTests.test_verify_error_not_supported                                               OK              3.60s
141/531 fprintd:daemon+fprintd+FPrintdVirtualDeviceIdentificationTests / FPrintdVirtualDeviceIdentificationTests.test_verify_error_proto                                                       OK              3.59s
142/531 fprintd:daemon+fprintd+FPrintdVirtualDeviceIdentificationTests / FPrintdVirtualDeviceIdentificationTests.test_verify_retry_center_finger                                               OK              3.57s
143/531 fprintd:daemon+fprintd+FPrintdVirtualDeviceIdentificationTests / FPrintdVirtualDeviceIdentificationTests.test_verify_retry_general                                                     OK              3.56s
144/531 fprintd:daemon+fprintd+FPrintdVirtualDeviceIdentificationTests / FPrintdVirtualDeviceIdentificationTests.test_verify_retry_remove_finger                                               OK              3.49s
145/531 fprintd:daemon+fprintd+FPrintdVirtualDeviceIdentificationTests / FPrintdVirtualDeviceIdentificationTests.test_verify_retry_too_short                                                   OK              3.47s
146/531 fprintd:daemon+fprintd+FPrintdVirtualDeviceIdentificationTests / FPrintdVirtualDeviceIdentificationTests.test_verify_start_during_verify                                               OK              3.47s
147/531 fprintd:daemon+fprintd+FPrintdVirtualDeviceIdentificationTests / FPrintdVirtualDeviceIdentificationTests.test_verify_stop_from_other_client                                            OK              3.45s
148/531 fprintd:daemon+fprintd+FPrintdVirtualDeviceIdentificationTests / FPrintdVirtualDeviceIdentificationTests.test_verify_stop_waits_for_completion                                         OK              3.44s
149/531 fprintd:daemon+fprintd+FPrintdVirtualDeviceIdentificationTests / FPrintdVirtualDeviceIdentificationTests.test_verify_stop_waits_for_completion_is_stopped_by_release                   OK              3.41s
150/531 fprintd:daemon+fprintd+FPrintdVirtualDeviceNoStorageEnrollTests / FPrintdVirtualDeviceNoStorageEnrollTests.test_delete_finger_during_enroll                                            OK              3.37s
151/531 fprintd:daemon+fprintd+FPrintdVirtualDeviceNoStorageEnrollTests / FPrintdVirtualDeviceNoStorageEnrollTests.test_delete_fingers2_during_enroll                                          OK              3.32s
152/531 fprintd:daemon+fprintd+FPrintdVirtualDeviceNoStorageEnrollTests / FPrintdVirtualDeviceNoStorageEnrollTests.test_delete_fingers_during_enroll                                           OK              3.27s
153/531 fprintd:daemon+fprintd+FPrintdVirtualDeviceNoStorageEnrollTests / FPrintdVirtualDeviceNoStorageEnrollTests.test_enroll_already_enrolled_finger                                         OK              3.23s
154/531 fprintd:daemon+fprintd+FPrintdVirtualDeviceNoStorageEnrollTests / FPrintdVirtualDeviceNoStorageEnrollTests.test_enroll_concourrent_stop                                                OK              3.19s
155/531 fprintd:daemon+fprintd+FPrintdVirtualDeviceNoStorageEnrollTests / FPrintdVirtualDeviceNoStorageEnrollTests.test_enroll_duplicate_image                                                 OK              3.16s
156/531 fprintd:daemon+fprintd+FPrintdVirtualDeviceNoStorageEnrollTests / FPrintdVirtualDeviceNoStorageEnrollTests.test_enroll_error_already_open                                              OK              3.13s
157/531 fprintd:daemon+fprintd+FPrintdVirtualDeviceNoStorageEnrollTests / FPrintdVirtualDeviceNoStorageEnrollTests.test_enroll_error_busy                                                      OK              3.11s
158/531 fprintd:daemon+fprintd+FPrintdVirtualDeviceNoStorageEnrollTests / FPrintdVirtualDeviceNoStorageEnrollTests.test_enroll_error_data_full                                                 OK              3.09s
159/531 fprintd:daemon+fprintd+FPrintdVirtualDeviceNoStorageEnrollTests / FPrintdVirtualDeviceNoStorageEnrollTests.test_enroll_error_data_invalid                                              OK              3.06s
160/531 fprintd:daemon+fprintd+FPrintdVirtualDeviceNoStorageEnrollTests / FPrintdVirtualDeviceNoStorageEnrollTests.test_enroll_error_data_not_found                                            OK              3.04s
161/531 fprintd:daemon+fprintd+FPrintdVirtualDeviceNoStorageEnrollTests / FPrintdVirtualDeviceNoStorageEnrollTests.test_enroll_error_general                                                   OK              3.02s
162/531 fprintd:daemon+fprintd+FPrintdVirtualDeviceNoStorageEnrollTests / FPrintdVirtualDeviceNoStorageEnrollTests.test_enroll_error_not_open                                                  OK              2.96s
163/531 fprintd:daemon+fprintd+FPrintdVirtualDeviceNoStorageEnrollTests / FPrintdVirtualDeviceNoStorageEnrollTests.test_enroll_error_not_supported                                             OK              2.95s
164/531 fprintd:daemon+fprintd+FPrintdVirtualDeviceNoStorageEnrollTests / FPrintdVirtualDeviceNoStorageEnrollTests.test_enroll_error_proto                                                     OK              2.92s
165/531 fprintd:daemon+fprintd+FPrintdVirtualDeviceNoStorageEnrollTests / FPrintdVirtualDeviceNoStorageEnrollTests.test_enroll_retry_center_finger                                             OK              2.89s
166/531 fprintd:daemon+fprintd+FPrintdVirtualDeviceNoStorageEnrollTests / FPrintdVirtualDeviceNoStorageEnrollTests.test_enroll_retry_general                                                   OK              2.87s
167/531 fprintd:daemon+fprintd+FPrintdVirtualDeviceNoStorageEnrollTests / FPrintdVirtualDeviceNoStorageEnrollTests.test_enroll_retry_remove_finger                                             OK              2.80s
168/531 fprintd:daemon+fprintd+FPrintdVirtualDeviceNoStorageEnrollTests / FPrintdVirtualDeviceNoStorageEnrollTests.test_enroll_retry_too_short                                                 OK              2.77s
169/531 fprintd:daemon+fprintd+FPrintdVirtualDeviceNoStorageEnrollTests / FPrintdVirtualDeviceNoStorageEnrollTests.test_enroll_start_during_enroll                                             OK              2.72s
170/531 fprintd:daemon+fprintd+FPrintdVirtualDeviceNoStorageEnrollTests / FPrintdVirtualDeviceNoStorageEnrollTests.test_enroll_stop_from_other_client                                          OK              2.67s
171/531 fprintd:daemon+fprintd+FPrintdVirtualDeviceNoStorageEnrollTests / FPrintdVirtualDeviceNoStorageEnrollTests.test_verify_start_during_enroll                                             OK              2.66s
172/531 fprintd:daemon+fprintd+FPrintdVirtualDeviceNoStorageEnrollTests / FPrintdVirtualDeviceNoStorageEnrollTests.test_verify_stop_during_enroll                                              OK              2.63s
173/531 fprintd:daemon+fprintd+FPrintdVirtualDeviceNoStorageIdentificationTests / FPrintdVirtualDeviceNoStorageIdentificationTests.test_delete_finger_during_verify                            OK              2.62s
174/531 fprintd:daemon+fprintd+FPrintdVirtualDeviceNoStorageIdentificationTests / FPrintdVirtualDeviceNoStorageIdentificationTests.test_delete_fingers2_during_verify                          OK              2.56s
175/531 fprintd:daemon+fprintd+FPrintdVirtualDeviceNoStorageIdentificationTests / FPrintdVirtualDeviceNoStorageIdentificationTests.test_delete_fingers_during_verify                           OK              2.54s
176/531 fprintd:daemon+fprintd+FPrintdVirtualDeviceNoStorageIdentificationTests / FPrintdVirtualDeviceNoStorageIdentificationTests.test_enroll_start_during_verify                             OK              2.52s
177/531 fprintd:daemon+fprintd+FPrintdVirtualDeviceNoStorageIdentificationTests / FPrintdVirtualDeviceNoStorageIdentificationTests.test_enroll_stop_during_verify                              OK              2.50s
178/531 fprintd:daemon+fprintd+FPrintdVirtualDeviceNoStorageIdentificationTests / FPrintdVirtualDeviceNoStorageIdentificationTests.test_multiple_verify                                        OK              2.48s
179/531 fprintd:daemon+fprintd+FPrintdVirtualDeviceNoStorageIdentificationTests / FPrintdVirtualDeviceNoStorageIdentificationTests.test_verify_concourrent_stop                                OK              2.42s
180/531 fprintd:daemon+fprintd+FPrintdVirtualDeviceNoStorageIdentificationTests / FPrintdVirtualDeviceNoStorageIdentificationTests.test_verify_error_already_open                              OK              3.72s
181/531 fprintd:daemon+fprintd+FPrintdVirtualDeviceIdentificationTests / FPrintdVirtualDeviceIdentificationTests.test_verify_retry_general_restarted                                           OK              4.98s
182/531 fprintd:daemon+fprintd+FPrintdVirtualDeviceNoStorageIdentificationTests / FPrintdVirtualDeviceNoStorageIdentificationTests.test_verify_error_proto                                     OK              3.49s
183/531 fprintd:daemon+fprintd+FPrintdVirtualDeviceNoStorageIdentificationTests / FPrintdVirtualDeviceNoStorageIdentificationTests.test_verify_error_general                                   OK              3.61s
184/531 fprintd:daemon+fprintd+FPrintdVirtualDeviceNoStorageIdentificationTests / FPrintdVirtualDeviceNoStorageIdentificationTests.test_verify_error_not_supported                             OK              3.51s
185/531 fprintd:daemon+fprintd+FPrintdVirtualDeviceNoStorageIdentificationTests / FPrintdVirtualDeviceNoStorageIdentificationTests.test_verify_error_data_full                                 OK              3.72s
186/531 fprintd:daemon+fprintd+FPrintdVirtualDeviceNoStorageIdentificationTests / FPrintdVirtualDeviceNoStorageIdentificationTests.test_verify_error_busy                                      OK              3.74s
187/531 fprintd:daemon+fprintd+FPrintdVirtualDeviceNoStorageIdentificationTests / FPrintdVirtualDeviceNoStorageIdentificationTests.test_verify_error_not_open                                  OK              3.55s
188/531 fprintd:daemon+fprintd+FPrintdVirtualDeviceNoStorageIdentificationTests / FPrintdVirtualDeviceNoStorageIdentificationTests.test_verify_error_data_invalid                              OK              3.70s
189/531 fprintd:daemon+fprintd+FPrintdVirtualDeviceNoStorageIdentificationTests / FPrintdVirtualDeviceNoStorageIdentificationTests.test_verify_error_data_not_found                            OK              3.67s
190/531 fprintd:daemon+fprintd+FPrintdVirtualDeviceNoStorageIdentificationTests / FPrintdVirtualDeviceNoStorageIdentificationTests.test_verify_retry_general                                   OK              3.44s
191/531 fprintd:daemon+fprintd+FPrintdVirtualDeviceNoStorageIdentificationTests / FPrintdVirtualDeviceNoStorageIdentificationTests.test_verify_error_ignored_after_report                      OK              3.58s
192/531 fprintd:daemon+fprintd+FPrintdVirtualDeviceNoStorageIdentificationTests / FPrintdVirtualDeviceNoStorageIdentificationTests.test_verify_retry_remove_finger                             OK              3.40s
193/531 fprintd:daemon+fprintd+FPrintdVirtualDeviceNoStorageIdentificationTests / FPrintdVirtualDeviceNoStorageIdentificationTests.test_verify_retry_center_finger                             OK              3.51s
194/531 fprintd:daemon+fprintd+FPrintdVirtualDeviceNoStorageIdentificationTests / FPrintdVirtualDeviceNoStorageIdentificationTests.test_verify_start_during_verify                             OK              3.36s
195/531 fprintd:daemon+fprintd+FPrintdVirtualDeviceNoStorageIdentificationTests / FPrintdVirtualDeviceNoStorageIdentificationTests.test_verify_stop_from_other_client                          OK              3.34s
196/531 fprintd:daemon+fprintd+FPrintdVirtualDeviceNoStorageVerificationTests / FPrintdVirtualDeviceNoStorageVerificationTests.test_delete_finger_during_verify                                OK              3.24s
197/531 fprintd:daemon+fprintd+FPrintdVirtualDeviceNoStorageVerificationTests / FPrintdVirtualDeviceNoStorageVerificationTests.test_delete_fingers2_during_verify                              OK              3.21s
198/531 fprintd:daemon+fprintd+FPrintdVirtualDeviceNoStorageIdentificationTests / FPrintdVirtualDeviceNoStorageIdentificationTests.test_verify_retry_too_short                                 OK              3.41s
199/531 fprintd:daemon+fprintd+FPrintdVirtualDeviceNoStorageVerificationTests / FPrintdVirtualDeviceNoStorageVerificationTests.test_enroll_stop_during_verify                                  OK              3.13s
200/531 fprintd:daemon+fprintd+FPrintdVirtualDeviceNoStorageVerificationTests / FPrintdVirtualDeviceNoStorageVerificationTests.test_multiple_verify                                            OK              3.11s
201/531 fprintd:daemon+fprintd+FPrintdVirtualDeviceNoStorageVerificationTests / FPrintdVirtualDeviceNoStorageVerificationTests.test_verify_concourrent_stop                                    OK              3.30s
202/531 fprintd:daemon+fprintd+FPrintdVirtualDeviceNoStorageVerificationTests / FPrintdVirtualDeviceNoStorageVerificationTests.test_verify_error_data_full                                     OK              3.26s
203/531 fprintd:daemon+fprintd+FPrintdVirtualDeviceIdentificationTests / FPrintdVirtualDeviceIdentificationTests.test_verify_stop_waits_for_completion_waiting_timeout                         OK              5.16s
204/531 fprintd:daemon+fprintd+FPrintdVirtualDeviceNoStorageVerificationTests / FPrintdVirtualDeviceNoStorageVerificationTests.test_verify_error_already_open                                  OK              3.30s
205/531 fprintd:daemon+fprintd+FPrintdVirtualDeviceNoStorageVerificationTests / FPrintdVirtualDeviceNoStorageVerificationTests.test_verify_error_busy                                          OK              3.29s
206/531 fprintd:daemon+fprintd+FPrintdVirtualDeviceNoStorageVerificationTests / FPrintdVirtualDeviceNoStorageVerificationTests.test_enroll_start_during_verify                                 OK              3.44s
207/531 fprintd:daemon+fprintd+FPrintdVirtualDeviceNoStorageVerificationTests / FPrintdVirtualDeviceNoStorageVerificationTests.test_delete_fingers_during_verify                               OK              3.47s
208/531 fprintd:daemon+fprintd+FPrintdVirtualDeviceNoStorageVerificationTests / FPrintdVirtualDeviceNoStorageVerificationTests.test_verify_error_data_invalid                                  OK              3.26s
209/531 fprintd:daemon+fprintd+FPrintdVirtualDeviceNoStorageIdentificationTests / FPrintdVirtualDeviceNoStorageIdentificationTests.test_verify_stop_waits_for_completion                       OK              3.60s
210/531 fprintd:daemon+fprintd+FPrintdVirtualDeviceNoStorageIdentificationTests / FPrintdVirtualDeviceNoStorageIdentificationTests.test_verify_stop_waits_for_completion_is_stopped_by_release OK              3.59s
211/531 fprintd:daemon+fprintd+FPrintdVirtualDeviceNoStorageIdentificationTests / FPrintdVirtualDeviceNoStorageIdentificationTests.test_verify_retry_general_restarted                         OK              4.29s
212/531 fprintd:daemon+fprintd+FPrintdVirtualDeviceNoStorageVerificationTests / FPrintdVirtualDeviceNoStorageVerificationTests.test_verify_error_data_not_found                                OK              3.70s
213/531 fprintd:daemon+fprintd+FPrintdVirtualDeviceNoStorageVerificationTests / FPrintdVirtualDeviceNoStorageVerificationTests.test_verify_error_general                                       OK              3.68s
214/531 fprintd:daemon+fprintd+FPrintdVirtualDeviceNoStorageVerificationTests / FPrintdVirtualDeviceNoStorageVerificationTests.test_verify_error_not_open                                      OK              3.58s
215/531 fprintd:daemon+fprintd+FPrintdVirtualDeviceNoStorageVerificationTests / FPrintdVirtualDeviceNoStorageVerificationTests.test_verify_error_not_supported                                 OK              3.57s
216/531 fprintd:daemon+fprintd+FPrintdVirtualDeviceNoStorageVerificationTests / FPrintdVirtualDeviceNoStorageVerificationTests.test_verify_error_proto                                         OK              3.56s
217/531 fprintd:daemon+fprintd+FPrintdVirtualDeviceNoStorageVerificationTests / FPrintdVirtualDeviceNoStorageVerificationTests.test_verify_retry_center_finger                                 OK              3.54s
218/531 fprintd:daemon+fprintd+FPrintdVirtualDeviceNoStorageVerificationTests / FPrintdVirtualDeviceNoStorageVerificationTests.test_verify_retry_general                                       OK              3.51s
219/531 fprintd:daemon+fprintd+FPrintdVirtualDeviceNoStorageVerificationTests / FPrintdVirtualDeviceNoStorageVerificationTests.test_verify_retry_remove_finger                                 OK              3.46s
220/531 fprintd:daemon+fprintd+FPrintdVirtualDeviceNoStorageVerificationTests / FPrintdVirtualDeviceNoStorageVerificationTests.test_verify_retry_too_short                                     OK              3.43s
221/531 fprintd:daemon+fprintd+FPrintdVirtualDeviceNoStorageVerificationTests / FPrintdVirtualDeviceNoStorageVerificationTests.test_verify_start_during_verify                                 OK              3.42s
222/531 fprintd:daemon+fprintd+FPrintdVirtualDeviceNoStorageVerificationTests / FPrintdVirtualDeviceNoStorageVerificationTests.test_verify_error_ignored_after_report                          OK              3.62s
223/531 fprintd:daemon+fprintd+FPrintdVirtualDeviceNoStorageIdentificationTests / FPrintdVirtualDeviceNoStorageIdentificationTests.test_verify_stop_waits_for_completion_waiting_timeout       OK              4.14s
224/531 fprintd:daemon+fprintd+FPrintdVirtualDeviceNoStorageVerificationTests / FPrintdVirtualDeviceNoStorageVerificationTests.test_multiple_verify_cancelled                                  OK              3.92s
225/531 fprintd:daemon+fprintd+FPrintdVirtualDeviceNoStorageIdentificationTests / FPrintdVirtualDeviceNoStorageIdentificationTests.test_multiple_verify_cancelled                              OK              4.79s
226/531 fprintd:daemon+fprintd+FPrintdVirtualDeviceNoStorageVerificationTests / FPrintdVirtualDeviceNoStorageVerificationTests.test_verify_stop_from_other_client                              OK              3.69s
227/531 fprintd:daemon+fprintd+FPrintdVirtualDeviceStorageClaimedTest / FPrintdVirtualDeviceStorageClaimedTest.test_already_claimed_other_user_delete_enrolled_fingers_no_prints               OK              3.59s
228/531 fprintd:daemon+fprintd+FPrintdVirtualDeviceStorageClaimedTest / FPrintdVirtualDeviceStorageClaimedTest.test_any_finger_delete_print                                                    OK              3.48s
229/531 fprintd:daemon+fprintd+FPrintdVirtualDeviceStorageClaimedTest / FPrintdVirtualDeviceStorageClaimedTest.test_any_finger_enroll_start                                                    OK              3.43s
230/531 fprintd:daemon+fprintd+FPrintdVirtualDeviceStorageClaimedTest / FPrintdVirtualDeviceStorageClaimedTest.test_concourrent_delete_enrolled_fingers                                        OK              3.25s
231/531 fprintd:daemon+fprintd+FPrintdVirtualDeviceStorageClaimedTest / FPrintdVirtualDeviceStorageClaimedTest.test_always_allowed_enroll_stop                                                 OK              3.54s
232/531 fprintd:daemon+fprintd+FPrintdVirtualDeviceStorageClaimedTest / FPrintdVirtualDeviceStorageClaimedTest.test_busy_device_release_on_verify                                              OK              3.37s
233/531 fprintd:daemon+fprintd+FPrintdVirtualDeviceStorageClaimedTest / FPrintdVirtualDeviceStorageClaimedTest.test_always_allowed_verify_stop                                                 OK              3.53s
234/531 fprintd:daemon+fprintd+FPrintdVirtualDeviceStorageClaimedTest / FPrintdVirtualDeviceStorageClaimedTest.test_busy_device_release_on_enroll                                              OK              3.42s
235/531 fprintd:daemon+fprintd+FPrintdVirtualDeviceNoStorageVerificationTests / FPrintdVirtualDeviceNoStorageVerificationTests.test_verify_stop_waits_for_completion_is_stopped_by_release     OK              3.67s
236/531 fprintd:daemon+fprintd+FPrintdVirtualDeviceStorageClaimedTest / FPrintdVirtualDeviceStorageClaimedTest.test_concourrent_delete_enrolled_finger                                         OK              3.29s
237/531 fprintd:daemon+fprintd+FPrintdVirtualDeviceStorageClaimedTest / FPrintdVirtualDeviceStorageClaimedTest.test_concourrent_enroll_start                                                   OK              3.17s
238/531 fprintd:daemon+fprintd+FPrintdVirtualDeviceStorageClaimedTest / FPrintdVirtualDeviceStorageClaimedTest.test_already_claimed_same_user_delete_enrolled_fingers_no_prints                OK              3.59s
239/531 fprintd:daemon+fprintd+FPrintdVirtualDeviceStorageClaimedTest / FPrintdVirtualDeviceStorageClaimedTest.test_concourrent_delete_enrolled_fingers2                                       OK              3.25s
240/531 fprintd:daemon+fprintd+FPrintdVirtualDeviceNoStorageVerificationTests / FPrintdVirtualDeviceNoStorageVerificationTests.test_verify_stop_waits_for_completion                           OK              3.72s
241/531 fprintd:daemon+fprintd+FPrintdVirtualDeviceStorageClaimedTest / FPrintdVirtualDeviceStorageClaimedTest.test_concourrent_verify_start                                                   OK              3.10s
242/531 fprintd:daemon+fprintd+FPrintdVirtualDeviceStorageClaimedTest / FPrintdVirtualDeviceStorageClaimedTest.test_concourrent_release                                                        OK              3.14s
243/531 fprintd:daemon+fprintd+FPrintdVirtualDeviceStorageClaimedTest / FPrintdVirtualDeviceStorageClaimedTest.test_delete_enrolled_finger_device_removed                                      OK              3.08s
244/531 fprintd:daemon+fprintd+FPrintdVirtualDeviceStorageClaimedTest / FPrintdVirtualDeviceStorageClaimedTest.test_concourrent_list_enrolled_fingers                                          OK              3.17s
245/531 fprintd:daemon+fprintd+FPrintdVirtualDeviceStorageClaimedTest / FPrintdVirtualDeviceStorageClaimedTest.test_busy_device_release_on_verify_finger                                       OK              3.36s
246/531 fprintd:daemon+fprintd+FPrintdVirtualDeviceStorageClaimedTest / FPrintdVirtualDeviceStorageClaimedTest.test_concourrent_delete_enrolled_fingers_unclaimed                              OK              3.24s
247/531 fprintd:daemon+fprintd+FPrintdVirtualDeviceStorageClaimedTest / FPrintdVirtualDeviceStorageClaimedTest.test_delete_enrolled_finger_device_error                                        OK              3.10s
248/531 fprintd:daemon+fprintd+FPrintdVirtualDeviceNoStorageVerificationTests / FPrintdVirtualDeviceNoStorageVerificationTests.test_verify_stop_waits_for_completion_waiting_timeout           OK              3.68s
249/531 fprintd:daemon+fprintd+FPrintdVirtualDeviceStorageClaimedTest / FPrintdVirtualDeviceStorageClaimedTest.test_delete_enrolled_fingers2_device_error                                      OK              3.02s
250/531 fprintd:daemon+fprintd+FPrintdVirtualDeviceStorageClaimedTest / FPrintdVirtualDeviceStorageClaimedTest.test_delete_enrolled_finger_storage_error_has_higher_priority                   OK              3.05s
251/531 fprintd:daemon+fprintd+FPrintdVirtualDeviceStorageClaimedTest / FPrintdVirtualDeviceStorageClaimedTest.test_already_claimed_other_user_delete_enrolled_fingers                         OK              3.67s
252/531 fprintd:daemon+fprintd+FPrintdVirtualDeviceStorageClaimedTest / FPrintdVirtualDeviceStorageClaimedTest.test_delete_enrolled_finger_from_other_client                                   OK              3.07s
253/531 fprintd:daemon+fprintd+FPrintdVirtualDeviceStorageClaimedTest / FPrintdVirtualDeviceStorageClaimedTest.test_already_claimed_same_user_delete_enrolled_fingers                          OK              3.64s
254/531 fprintd:daemon+fprintd+FPrintdVirtualDeviceNoStorageVerificationTests / FPrintdVirtualDeviceNoStorageVerificationTests.test_verify_retry_general_restarted                             OK              3.92s
255/531 fprintd:daemon+fprintd+FPrintdVirtualDeviceStorageClaimedTest / FPrintdVirtualDeviceStorageClaimedTest.test_delete_enrolled_fingers2_device_removed                                    OK              3.00s
256/531 fprintd:daemon+fprintd+FPrintdVirtualDeviceStorageClaimedTest / FPrintdVirtualDeviceStorageClaimedTest.test_delete_enrolled_fingers2_from_other_client                                 OK              3.77s
257/531 fprintd:daemon+fprintd+FPrintdVirtualDeviceStorageClaimedTest / FPrintdVirtualDeviceStorageClaimedTest.test_delete_enrolled_fingers2_storage_error_has_higher_priority                 OK              3.74s
258/531 fprintd:daemon+fprintd+FPrintdVirtualDeviceStorageClaimedTest / FPrintdVirtualDeviceStorageClaimedTest.test_delete_enrolled_fingers_device_error                                       OK              3.69s
259/531 fprintd:daemon+fprintd+FPrintdVirtualDeviceStorageClaimedTest / FPrintdVirtualDeviceStorageClaimedTest.test_delete_enrolled_fingers_device_removed                                     OK              3.66s
260/531 fprintd:daemon+fprintd+FPrintdVirtualDeviceStorageClaimedTest / FPrintdVirtualDeviceStorageClaimedTest.test_delete_enrolled_fingers_from_other_client                                  OK              3.65s
261/531 fprintd:daemon+fprintd+FPrintdVirtualDeviceStorageClaimedTest / FPrintdVirtualDeviceStorageClaimedTest.test_delete_enrolled_fingers_storage_error_has_higher_priority                  OK              3.63s
262/531 fprintd:daemon+fprintd+FPrintdVirtualDeviceStorageClaimedTest / FPrintdVirtualDeviceStorageClaimedTest.test_delete_with_no_enrolled_prints                                             OK              3.63s
263/531 fprintd:daemon+fprintd+FPrintdVirtualDeviceStorageClaimedTest / FPrintdVirtualDeviceStorageClaimedTest.test_enroll_delete2                                                             OK              3.61s
264/531 fprintd:daemon+fprintd+FPrintdVirtualDeviceStorageClaimedTest / FPrintdVirtualDeviceStorageClaimedTest.test_enroll_delete2_storage_error                                               OK              3.58s
265/531 fprintd:daemon+fprintd+FPrintdVirtualDeviceStorageClaimedTest / FPrintdVirtualDeviceStorageClaimedTest.test_enroll_delete_single                                                       OK              3.57s
266/531 fprintd:daemon+fprintd+FPrintdVirtualDeviceStorageClaimedTest / FPrintdVirtualDeviceStorageClaimedTest.test_enroll_delete_single_storage_error                                         OK              3.56s
267/531 fprintd:daemon+fprintd+FPrintdVirtualDeviceStorageClaimedTest / FPrintdVirtualDeviceStorageClaimedTest.test_enroll_delete_storage_error                                                OK              3.55s
268/531 fprintd:daemon+fprintd+FPrintdVirtualDeviceStorageClaimedTest / FPrintdVirtualDeviceStorageClaimedTest.test_enroll_finger_status                                                       OK              3.53s
269/531 fprintd:daemon+fprintd+FPrintdVirtualDeviceStorageClaimedTest / FPrintdVirtualDeviceStorageClaimedTest.test_enroll_invalid_storage_dir                                                 OK              3.52s
270/531 fprintd:daemon+fprintd+FPrintdVirtualDeviceStorageClaimedTest / FPrintdVirtualDeviceStorageClaimedTest.test_enroll_start_from_other_client                                             OK              3.50s
271/531 fprintd:daemon+fprintd+FPrintdVirtualDeviceStorageClaimedTest / FPrintdVirtualDeviceStorageClaimedTest.test_enroll_stop_cancels                                                        OK              3.49s
272/531 fprintd:daemon+fprintd+FPrintdVirtualDeviceStorageClaimedTest / FPrintdVirtualDeviceStorageClaimedTest.test_enroll_stop_not_started                                                    OK              3.46s
273/531 fprintd:daemon+fprintd+FPrintdVirtualDeviceStorageClaimedTest / FPrintdVirtualDeviceStorageClaimedTest.test_enroll_users_duplicate_prints                                              OK              3.43s
274/531 fprintd:daemon+fprintd+FPrintdVirtualDeviceStorageClaimedTest / FPrintdVirtualDeviceStorageClaimedTest.test_enroll_write_print_error                                                   OK              3.37s
275/531 fprintd:daemon+fprintd+FPrintdVirtualDeviceStorageClaimedTest / FPrintdVirtualDeviceStorageClaimedTest.test_identify_finger_not_enrolled                                               OK              3.36s
276/531 fprintd:daemon+fprintd+FPrintdVirtualDeviceStorageClaimedTest / FPrintdVirtualDeviceStorageClaimedTest.test_identify_finger_not_enrolled_stops_verification                            OK              3.33s
277/531 fprintd:daemon+fprintd+FPrintdVirtualDeviceStorageClaimedTest / FPrintdVirtualDeviceStorageClaimedTest.test_list_enrolled_fingers_current_user                                         OK              3.30s
278/531 fprintd:daemon+fprintd+FPrintdVirtualDeviceStorageClaimedTest / FPrintdVirtualDeviceStorageClaimedTest.test_release_error                                                              OK              3.28s
279/531 fprintd:daemon+fprintd+FPrintdVirtualDeviceStorageClaimedTest / FPrintdVirtualDeviceStorageClaimedTest.test_release_fails_while_closing                                                OK              3.25s
280/531 fprintd:daemon+fprintd+FPrintdVirtualDeviceStorageClaimedTest / FPrintdVirtualDeviceStorageClaimedTest.test_release_from_other_client                                                  OK              3.22s
281/531 fprintd:daemon+fprintd+FPrintdVirtualDeviceStorageClaimedTest / FPrintdVirtualDeviceStorageClaimedTest.test_unallowed_delete_enrolled_finger                                           OK              3.12s
282/531 fprintd:daemon+fprintd+FPrintdVirtualDeviceStorageClaimedTest / FPrintdVirtualDeviceStorageClaimedTest.test_unallowed_delete_enrolled_fingers                                          OK              3.09s
283/531 fprintd:daemon+fprintd+FPrintdVirtualDeviceStorageClaimedTest / FPrintdVirtualDeviceStorageClaimedTest.test_unallowed_delete_enrolled_fingers2                                         OK              3.04s
284/531 fprintd:daemon+fprintd+FPrintdVirtualDeviceStorageClaimedTest / FPrintdVirtualDeviceStorageClaimedTest.test_unallowed_enroll_start                                                     OK              3.01s
285/531 fprintd:daemon+fprintd+FPrintdVirtualDeviceStorageClaimedTest / FPrintdVirtualDeviceStorageClaimedTest.test_unallowed_list_enrolled_fingers                                            OK              2.98s
286/531 fprintd:daemon+fprintd+FPrintdVirtualDeviceStorageClaimedTest / FPrintdVirtualDeviceStorageClaimedTest.test_unallowed_list_enrolled_fingers_current_user                               OK              2.96s
287/531 fprintd:daemon+fprintd+FPrintdVirtualDeviceStorageClaimedTest / FPrintdVirtualDeviceStorageClaimedTest.test_unallowed_verify_start                                                     OK              2.95s
288/531 fprintd:daemon+fprintd+FPrintdVirtualDeviceStorageClaimedTest / FPrintdVirtualDeviceStorageClaimedTest.test_verify_any_finger_match                                                    OK              2.94s
289/531 fprintd:daemon+fprintd+FPrintdVirtualDeviceStorageClaimedTest / FPrintdVirtualDeviceStorageClaimedTest.test_verify_finger_match                                                        OK              2.88s
290/531 fprintd:daemon+fprintd+FPrintdVirtualDeviceStorageClaimedTest / FPrintdVirtualDeviceStorageClaimedTest.test_verify_finger_not_enrolled                                                 OK              2.79s
291/531 fprintd:daemon+fprintd+FPrintdVirtualDeviceStorageClaimedTest / FPrintdVirtualDeviceStorageClaimedTest.test_verify_finger_not_enrolled_stops_verification                              OK              2.75s
292/531 fprintd:daemon+fprintd+FPrintdVirtualDeviceStorageClaimedTest / FPrintdVirtualDeviceStorageClaimedTest.test_verify_finger_status                                                       OK              2.74s
293/531 fprintd:daemon+fprintd+FPrintdVirtualDeviceStorageClaimedTest / FPrintdVirtualDeviceStorageClaimedTest.test_verify_finger_stop_cancels                                                 OK              2.68s
294/531 fprintd:daemon+fprintd+FPrintdVirtualDeviceStorageClaimedTest / FPrintdVirtualDeviceStorageClaimedTest.test_verify_invalid_storage_dir                                                 OK              2.66s
295/531 fprintd:daemon+fprintd+FPrintdVirtualDeviceStorageClaimedTest / FPrintdVirtualDeviceStorageClaimedTest.test_verify_read_print_error                                                    OK              2.64s
296/531 fprintd:daemon+fprintd+FPrintdVirtualDeviceStorageClaimedTest / FPrintdVirtualDeviceStorageClaimedTest.test_verify_start_finger_from_other_client                                      OK              2.59s
297/531 fprintd:daemon+fprintd+FPrintdVirtualDeviceStorageClaimedTest / FPrintdVirtualDeviceStorageClaimedTest.test_verify_start_from_other_client                                             OK              2.56s
298/531 fprintd:daemon+fprintd+FPrintdVirtualDeviceStorageClaimedTest / FPrintdVirtualDeviceStorageClaimedTest.test_verify_stop_cancels                                                        OK              2.53s
299/531 fprintd:daemon+fprintd+FPrintdVirtualDeviceStorageClaimedTest / FPrintdVirtualDeviceStorageClaimedTest.test_verify_stop_not_started                                                    OK              2.50s
300/531 fprintd:daemon+fprintd+FPrintdVirtualDeviceStorageClaimedTest / FPrintdVirtualDeviceStorageClaimedTest.test_enroll_delete2_multiple                                                    OK              3.66s
301/531 fprintd:daemon+fprintd+FPrintdVirtualDeviceStorageClaimedTest / FPrintdVirtualDeviceStorageClaimedTest.test_verify_any_finger_multiple_users                                           OK              4.11s
302/531 fprintd:daemon+fprintd+FPrintdVirtualDeviceStorageClaimedTest / FPrintdVirtualDeviceStorageClaimedTest.test_verify_with_no_enrolled_prints                                             OK              3.69s
303/531 fprintd:daemon+fprintd+FPrintdVirtualDeviceStorageClaimedTest / FPrintdVirtualDeviceStorageClaimedTest.test_verify_finger_no_match_restart                                             OK              4.08s
304/531 fprintd:daemon+fprintd+FPrintdVirtualDeviceStorageClaimedTest / FPrintdVirtualDeviceStorageClaimedTest.test_enroll_verify_list_delete                                                  OK              4.71s
305/531 fprintd:daemon+fprintd+FPrintdVirtualDeviceStorageClaimedTest / FPrintdVirtualDeviceStorageClaimedTest.test_verify_wrong_finger_match                                                  OK              3.63s
306/531 fprintd:daemon+fprintd+FPrintdVirtualDeviceStorageClaimedTest / FPrintdVirtualDeviceStorageClaimedTest.test_verify_any_finger_no_match                                                 OK              4.20s
307/531 fprintd:daemon+fprintd+FPrintdVirtualDeviceStorageClaimedTest / FPrintdVirtualDeviceStorageClaimedTest.test_wrong_finger_delete_print                                                  OK              3.56s
308/531 fprintd:daemon+fprintd+FPrintdVirtualDeviceStorageClaimedTest / FPrintdVirtualDeviceStorageClaimedTest.test_wrong_finger_enroll_start                                                  OK              3.56s
309/531 fprintd:daemon+fprintd+FPrintdVirtualDeviceStorageIdentificationTests / FPrintdVirtualDeviceStorageIdentificationTests.test_delete_finger_during_verify                                OK              3.53s
310/531 fprintd:daemon+fprintd+FPrintdVirtualDeviceStorageIdentificationTests / FPrintdVirtualDeviceStorageIdentificationTests.test_delete_fingers2_during_verify                              OK              3.52s
311/531 fprintd:daemon+fprintd+FPrintdVirtualDeviceStorageIdentificationTests / FPrintdVirtualDeviceStorageIdentificationTests.test_enroll_start_during_verify                                 OK              3.48s
312/531 fprintd:daemon+fprintd+FPrintdVirtualDeviceStorageIdentificationTests / FPrintdVirtualDeviceStorageIdentificationTests.test_enroll_stop_during_verify                                  OK              3.46s
313/531 fprintd:daemon+fprintd+FPrintdVirtualDeviceStorageIdentificationTests / FPrintdVirtualDeviceStorageIdentificationTests.test_verify_concourrent_stop                                    OK              3.39s
314/531 fprintd:daemon+fprintd+FPrintdVirtualDeviceStorageIdentificationTests / FPrintdVirtualDeviceStorageIdentificationTests.test_delete_fingers_during_verify                               OK              3.51s
315/531 fprintd:daemon+fprintd+FPrintdVirtualDeviceStorageClaimedTest / FPrintdVirtualDeviceStorageClaimedTest.test_verify_finger_no_match                                                     OK              4.16s
316/531 fprintd:daemon+fprintd+FPrintdVirtualDeviceStorageClaimedTest / FPrintdVirtualDeviceStorageClaimedTest.test_verify_wrong_finger_no_match                                               OK              3.66s
317/531 fprintd:daemon+fprintd+FPrintdVirtualDeviceStorageIdentificationTests / FPrintdVirtualDeviceStorageIdentificationTests.test_verify_error_already_open                                  OK              3.63s
318/531 fprintd:daemon+fprintd+FPrintdVirtualDeviceStorageIdentificationTests / FPrintdVirtualDeviceStorageIdentificationTests.test_verify_error_busy                                          OK              3.62s
319/531 fprintd:daemon+fprintd+FPrintdVirtualDeviceStorageIdentificationTests / FPrintdVirtualDeviceStorageIdentificationTests.test_verify_error_data_full                                     OK              3.60s
320/531 fprintd:daemon+fprintd+FPrintdVirtualDeviceStorageIdentificationTests / FPrintdVirtualDeviceStorageIdentificationTests.test_verify_error_data_invalid                                  OK              3.60s
321/531 fprintd:daemon+fprintd+FPrintdVirtualDeviceStorageIdentificationTests / FPrintdVirtualDeviceStorageIdentificationTests.test_verify_error_data_not_found                                OK              3.58s
322/531 fprintd:daemon+fprintd+FPrintdVirtualDeviceStorageIdentificationTests / FPrintdVirtualDeviceStorageIdentificationTests.test_verify_error_general                                       OK              3.54s
323/531 fprintd:daemon+fprintd+FPrintdVirtualDeviceStorageIdentificationTests / FPrintdVirtualDeviceStorageIdentificationTests.test_verify_error_ignored_after_report                          OK              3.52s
324/531 fprintd:daemon+fprintd+FPrintdVirtualDeviceStorageIdentificationTests / FPrintdVirtualDeviceStorageIdentificationTests.test_verify_error_not_open                                      OK              3.51s
325/531 fprintd:daemon+fprintd+FPrintdVirtualDeviceStorageIdentificationTests / FPrintdVirtualDeviceStorageIdentificationTests.test_verify_error_not_supported                                 OK              3.48s
326/531 fprintd:daemon+fprintd+FPrintdVirtualDeviceStorageIdentificationTests / FPrintdVirtualDeviceStorageIdentificationTests.test_verify_error_proto                                         OK              3.47s
327/531 fprintd:daemon+fprintd+FPrintdVirtualDeviceStorageIdentificationTests / FPrintdVirtualDeviceStorageIdentificationTests.test_verify_retry_center_finger                                 OK              3.44s
328/531 fprintd:daemon+fprintd+FPrintdVirtualDeviceStorageIdentificationTests / FPrintdVirtualDeviceStorageIdentificationTests.test_verify_retry_general                                       OK              3.41s
329/531 fprintd:daemon+fprintd+FPrintdVirtualDeviceStorageIdentificationTests / FPrintdVirtualDeviceStorageIdentificationTests.test_verify_retry_remove_finger                                 OK              3.35s
330/531 fprintd:daemon+fprintd+FPrintdVirtualDeviceStorageIdentificationTests / FPrintdVirtualDeviceStorageIdentificationTests.test_verify_retry_too_short                                     OK              3.31s
331/531 fprintd:daemon+fprintd+FPrintdVirtualDeviceStorageIdentificationTests / FPrintdVirtualDeviceStorageIdentificationTests.test_verify_start_during_verify                                 OK              3.28s
332/531 fprintd:daemon+fprintd+FPrintdVirtualDeviceStorageIdentificationTests / FPrintdVirtualDeviceStorageIdentificationTests.test_verify_stop_from_other_client                              OK              3.25s
333/531 fprintd:daemon+fprintd+FPrintdVirtualDeviceStorageIdentificationTests / FPrintdVirtualDeviceStorageIdentificationTests.test_verify_stop_waits_for_completion                           OK              3.22s
334/531 fprintd:daemon+fprintd+FPrintdVirtualDeviceStorageIdentificationTests / FPrintdVirtualDeviceStorageIdentificationTests.test_multiple_verify                                            OK              3.80s
335/531 fprintd:daemon+fprintd+FPrintdVirtualDeviceStorageIdentificationTests / FPrintdVirtualDeviceStorageIdentificationTests.test_verify_stop_waits_for_completion_is_stopped_by_release     OK              3.21s
336/531 fprintd:daemon+fprintd+FPrintdVirtualDeviceStorageClaimedTest / FPrintdVirtualDeviceStorageClaimedTest.test_release_waits_for_deletion                                                 OK              4.85s
337/531 fprintd:daemon+fprintd+FPrintdVirtualDeviceStorageTest / FPrintdVirtualDeviceStorageTest.test_allowed_claim_current_user                                                               OK              3.65s
338/531 fprintd:daemon+fprintd+FPrintdVirtualDeviceStorageTest / FPrintdVirtualDeviceStorageTest.test_allowed_claim_release_enroll                                                             OK              3.60s
339/531 fprintd:daemon+fprintd+FPrintdVirtualDeviceStorageTest / FPrintdVirtualDeviceStorageTest.test_allowed_claim_release_verify                                                             OK              3.59s
340/531 fprintd:daemon+fprintd+FPrintdVirtualDeviceStorageTest / FPrintdVirtualDeviceStorageTest.test_allowed_list_enrolled_fingers_current_user                                               OK              3.58s
341/531 fprintd:daemon+fprintd+FPrintdVirtualDeviceStorageTest / FPrintdVirtualDeviceStorageTest.test_allowed_list_enrolled_fingers_empty_user                                                 OK              3.56s
342/531 fprintd:daemon+fprintd+FPrintdVirtualDeviceStorageTest / FPrintdVirtualDeviceStorageTest.test_always_allowed_release                                                                   OK              3.55s
343/531 fprintd:daemon+fprintd+FPrintdVirtualDeviceStorageTest / FPrintdVirtualDeviceStorageTest.test_claim_device_open_fail                                                                   OK              3.52s
344/531 fprintd:daemon+fprintd+FPrintdVirtualDeviceStorageTest / FPrintdVirtualDeviceStorageTest.test_claim_error                                                                              OK              3.46s
345/531 fprintd:daemon+fprintd+FPrintdVirtualDeviceStorageTest / FPrintdVirtualDeviceStorageTest.test_concourrent_claim                                                                        OK              3.41s
346/531 fprintd:daemon+fprintd+FPrintdVirtualDeviceStorageIdentificationTests / FPrintdVirtualDeviceStorageIdentificationTests.test_verify_retry_general_restarted                             OK              4.01s
347/531 fprintd:daemon+fprintd+FPrintdVirtualDeviceStorageTest / FPrintdVirtualDeviceStorageTest.test_enroll_stages_property                                                                   OK              3.49s
348/531 fprintd:daemon+fprintd+FPrintdVirtualDeviceStorageTest / FPrintdVirtualDeviceStorageTest.test_initial_finger_needed                                                                    OK              3.43s
349/531 fprintd:daemon+fprintd+FPrintdVirtualDeviceStorageTest / FPrintdVirtualDeviceStorageTest.test_name_property                                                                            OK              3.40s
350/531 fprintd:daemon+fprintd+FPrintdVirtualDeviceStorageTest / FPrintdVirtualDeviceStorageTest.test_suspend_inhibit_cancels_enroll                                                           OK              3.32s
351/531 fprintd:daemon+fprintd+FPrintdVirtualDeviceStorageTest / FPrintdVirtualDeviceStorageTest.test_suspend_inhibit_unclaimed                                                                OK              3.28s
352/531 fprintd:daemon+fprintd+FPrintdVirtualDeviceStorageTest / FPrintdVirtualDeviceStorageTest.test_suspend_prevents_enroll                                                                  OK              3.27s
353/531 fprintd:daemon+fprintd+FPrintdVirtualDeviceStorageTest / FPrintdVirtualDeviceStorageTest.test_unallowed_claim                                                                          OK              3.23s
354/531 fprintd:daemon+fprintd+FPrintdVirtualDeviceStorageTest / FPrintdVirtualDeviceStorageTest.test_unallowed_delete2_with_verify_claim                                                      OK              3.17s
355/531 fprintd:daemon+fprintd+FPrintdVirtualDeviceStorageTest / FPrintdVirtualDeviceStorageTest.test_unallowed_delete_single_with_verify_claim                                                OK              3.14s
356/531 fprintd:daemon+fprintd+FPrintdVirtualDeviceStorageTest / FPrintdVirtualDeviceStorageTest.test_unallowed_delete_with_verify_claim                                                       OK              3.12s
357/531 fprintd:daemon+fprintd+FPrintdVirtualDeviceStorageTest / FPrintdVirtualDeviceStorageTest.test_unallowed_enroll_with_verify_claim                                                       OK              3.10s
358/531 fprintd:daemon+fprintd+FPrintdVirtualDeviceStorageTest / FPrintdVirtualDeviceStorageTest.test_unallowed_verify_with_enroll_claim                                                       OK              3.06s
359/531 fprintd:daemon+fprintd+FPrintdVirtualDeviceStorageTest / FPrintdVirtualDeviceStorageTest.test_unclaimed_delete_enrolled_fingers                                                        OK              3.02s
360/531 fprintd:daemon+fprintd+FPrintdVirtualDeviceStorageTest / FPrintdVirtualDeviceStorageTest.test_unclaimed_delete_enrolled_fingers2                                                       OK              3.00s
361/531 fprintd:daemon+fprintd+FPrintdVirtualDeviceStorageTest / FPrintdVirtualDeviceStorageTest.test_multiple_claims                                                                          OK              3.45s
362/531 fprintd:daemon+fprintd+FPrintdVirtualDeviceStorageTest / FPrintdVirtualDeviceStorageTest.test_suspend_inhibit_claimed                                                                  OK              3.32s
363/531 fprintd:daemon+fprintd+FPrintdVirtualDeviceStorageTest / FPrintdVirtualDeviceStorageTest.test_unallowed_claim_current_user                                                             OK              3.21s
364/531 fprintd:daemon+fprintd+FPrintdVirtualDeviceStorageTest / FPrintdVirtualDeviceStorageTest.test_scan_type                                                                                OK              3.36s
365/531 fprintd:daemon+fprintd+FPrintdVirtualDeviceStorageTest / FPrintdVirtualDeviceStorageTest.test_unclaimed_delete_enrolled_finger                                                         OK              3.07s
366/531 fprintd:daemon+fprintd+FPrintdVirtualDeviceStorageTest / FPrintdVirtualDeviceStorageTest.test_unclaimed_enroll_stop                                                                    OK              2.91s
367/531 fprintd:daemon+fprintd+FPrintdVirtualDeviceStorageIdentificationTests / FPrintdVirtualDeviceStorageIdentificationTests.test_multiple_verify_cancelled                                  OK              4.65s
368/531 fprintd:daemon+fprintd+FPrintdVirtualDeviceStorageTest / FPrintdVirtualDeviceStorageTest.test_unclaimed_delete_enrolled_fingers_no_prints                                              OK              3.01s
369/531 fprintd:daemon+fprintd+FPrintdVirtualDeviceStorageTest / FPrintdVirtualDeviceStorageTest.test_unclaimed_list_enrolled_fingers_error                                                    OK              2.84s
370/531 fprintd:daemon+fprintd+FPrintdVirtualDeviceStorageTest / FPrintdVirtualDeviceStorageTest.test_unclaimed_list_enrolled_fingers                                                          OK              2.89s
371/531 fprintd:daemon+fprintd+FPrintdVirtualDeviceStorageTest / FPrintdVirtualDeviceStorageTest.test_unclaimed_list_enrolled_fingers_ignores_invalid                                          OK              2.83s
372/531 fprintd:daemon+fprintd+FPrintdVirtualDeviceStorageTest / FPrintdVirtualDeviceStorageTest.test_unclaimed_enroll_start                                                                   OK              2.96s
373/531 fprintd:daemon+fprintd+FPrintdVirtualDeviceStorageTest / FPrintdVirtualDeviceStorageTest.test_removal_during_enroll                                                                    OK              3.42s
374/531 fprintd:daemon+fprintd+FPrintdVirtualDeviceStorageTest / FPrintdVirtualDeviceStorageTest.test_unclaimed_release                                                                        OK              2.81s
375/531 fprintd:daemon+fprintd+FPrintdVirtualDeviceStorageTest / FPrintdVirtualDeviceStorageTest.test_unclaimed_verify_start                                                                   OK              2.78s
376/531 fprintd:daemon+fprintd+FPrintdVirtualDeviceStorageTest / FPrintdVirtualDeviceStorageTest.test_claim_disconnect                                                                         OK              3.76s
377/531 fprintd:daemon+fprintd+FPrintdVirtualDeviceStorageTest / FPrintdVirtualDeviceStorageTest.test_identify_running_disconnect                                                              OK              3.53s
378/531 fprintd:daemon+fprintd+FPrintdVirtualDeviceStorageTest / FPrintdVirtualDeviceStorageTest.test_claim_from_other_client_is_released_when_vanished                                        OK              3.70s
379/531 fprintd:daemon+fprintd+FPrintdVirtualDeviceStorageTest / FPrintdVirtualDeviceStorageTest.test_enroll_running_disconnect                                                                OK              3.56s
380/531 fprintd:daemon+fprintd+FPrintdVirtualDeviceStorageTest / FPrintdVirtualDeviceStorageTest.test_enroll_done_disconnect                                                                   OK              3.57s
381/531 fprintd:daemon+fprintd+FPrintdVirtualDeviceStorageTest / FPrintdVirtualDeviceStorageTest.test_unclaimed_verify_stop                                                                    OK              3.84s
382/531 fprintd:daemon+fprintd+FPrintdVirtualDeviceStorageIdentificationTests / FPrintdVirtualDeviceStorageIdentificationTests.test_verify_stop_waits_for_completion_waiting_timeout           OK              5.11s
383/531 fprintd:daemon+fprintd+FPrintdVirtualDeviceStorageTest / FPrintdVirtualDeviceStorageTest.test_verify_running_disconnect                                                                OK              3.81s
384/531 fprintd:daemon+fprintd+FPrintdVirtualDeviceStorageTest / FPrintdVirtualDeviceStorageTest.test_identify_done_disconnect                                                                 OK              4.72s
385/531 fprintd:daemon+fprintd+FPrintdVirtualDeviceStorageVerificationTests / FPrintdVirtualDeviceStorageVerificationTests.test_delete_finger_during_verify                                    OK              3.73s
386/531 fprintd:daemon+fprintd+FPrintdVirtualDeviceStorageVerificationTests / FPrintdVirtualDeviceStorageVerificationTests.test_delete_fingers2_during_verify                                  OK              3.72s
387/531 fprintd:daemon+fprintd+FPrintdVirtualDeviceStorageVerificationTests / FPrintdVirtualDeviceStorageVerificationTests.test_delete_fingers_during_verify                                   OK              3.70s
388/531 fprintd:daemon+fprintd+FPrintdVirtualDeviceStorageVerificationTests / FPrintdVirtualDeviceStorageVerificationTests.test_enroll_start_during_verify                                     OK              3.69s
389/531 fprintd:daemon+fprintd+FPrintdVirtualDeviceStorageVerificationTests / FPrintdVirtualDeviceStorageVerificationTests.test_enroll_stop_during_verify                                      OK              3.67s
390/531 fprintd:daemon+fprintd+FPrintdVirtualDeviceStorageVerificationTests / FPrintdVirtualDeviceStorageVerificationTests.test_multiple_verify                                                OK              3.64s
391/531 fprintd:daemon+fprintd+FPrintdVirtualDeviceStorageVerificationTests / FPrintdVirtualDeviceStorageVerificationTests.test_verify_concourrent_stop                                        OK              3.61s
392/531 fprintd:daemon+fprintd+FPrintdVirtualDeviceStorageVerificationTests / FPrintdVirtualDeviceStorageVerificationTests.test_verify_error_already_open                                      OK              3.59s
393/531 fprintd:daemon+fprintd+FPrintdVirtualDeviceStorageVerificationTests / FPrintdVirtualDeviceStorageVerificationTests.test_verify_error_busy                                              OK              3.55s
394/531 fprintd:daemon+fprintd+FPrintdVirtualDeviceStorageVerificationTests / FPrintdVirtualDeviceStorageVerificationTests.test_verify_error_data_full                                         OK              3.54s
395/531 fprintd:daemon+fprintd+FPrintdVirtualDeviceStorageVerificationTests / FPrintdVirtualDeviceStorageVerificationTests.test_verify_error_data_invalid                                      OK              3.51s
396/531 fprintd:daemon+fprintd+FPrintdVirtualDeviceStorageVerificationTests / FPrintdVirtualDeviceStorageVerificationTests.test_verify_error_data_not_found                                    OK              3.50s
397/531 fprintd:daemon+fprintd+FPrintdVirtualDeviceStorageVerificationTests / FPrintdVirtualDeviceStorageVerificationTests.test_verify_error_general                                           OK              3.49s
398/531 fprintd:daemon+fprintd+FPrintdVirtualDeviceStorageVerificationTests / FPrintdVirtualDeviceStorageVerificationTests.test_verify_error_ignored_after_report                              OK              3.48s
399/531 fprintd:daemon+fprintd+FPrintdVirtualDeviceStorageVerificationTests / FPrintdVirtualDeviceStorageVerificationTests.test_verify_error_not_open                                          OK              3.46s
400/531 fprintd:daemon+fprintd+FPrintdVirtualDeviceStorageVerificationTests / FPrintdVirtualDeviceStorageVerificationTests.test_verify_error_not_supported                                     OK              3.41s
401/531 fprintd:daemon+fprintd+FPrintdVirtualDeviceStorageVerificationTests / FPrintdVirtualDeviceStorageVerificationTests.test_verify_error_proto                                             OK              3.38s
402/531 fprintd:daemon+fprintd+FPrintdVirtualDeviceStorageVerificationTests / FPrintdVirtualDeviceStorageVerificationTests.test_verify_retry_center_finger                                     OK              3.37s
403/531 fprintd:daemon+fprintd+FPrintdVirtualDeviceStorageVerificationTests / FPrintdVirtualDeviceStorageVerificationTests.test_verify_retry_general                                           OK              3.34s
404/531 fprintd:daemon+fprintd+FPrintdVirtualDeviceStorageVerificationTests / FPrintdVirtualDeviceStorageVerificationTests.test_verify_retry_remove_finger                                     OK              3.28s
405/531 fprintd:daemon+fprintd+FPrintdVirtualDeviceStorageVerificationTests / FPrintdVirtualDeviceStorageVerificationTests.test_verify_retry_too_short                                         OK              3.24s
406/531 fprintd:daemon+fprintd+FPrintdVirtualDeviceStorageVerificationTests / FPrintdVirtualDeviceStorageVerificationTests.test_verify_start_during_verify                                     OK              3.21s
407/531 fprintd:daemon+fprintd+FPrintdVirtualDeviceStorageVerificationTests / FPrintdVirtualDeviceStorageVerificationTests.test_verify_stop_from_other_client                                  OK              3.19s
408/531 fprintd:daemon+fprintd+FPrintdVirtualDeviceStorageVerificationTests / FPrintdVirtualDeviceStorageVerificationTests.test_verify_stop_waits_for_completion                               OK              3.16s
409/531 fprintd:daemon+fprintd+FPrintdVirtualDeviceTest / FPrintdVirtualDeviceTest.test_allowed_claim_current_user                                                                             OK              3.08s
410/531 fprintd:daemon+fprintd+FPrintdVirtualDeviceTest / FPrintdVirtualDeviceTest.test_allowed_claim_release_verify                                                                           OK              3.03s
411/531 fprintd:daemon+fprintd+FPrintdVirtualDeviceTest / FPrintdVirtualDeviceTest.test_allowed_list_enrolled_fingers_empty_user                                                               OK              2.98s
412/531 fprintd:daemon+fprintd+FPrintdVirtualDeviceTest / FPrintdVirtualDeviceTest.test_always_allowed_release                                                                                 OK              2.95s
413/531 fprintd:daemon+fprintd+FPrintdVirtualDeviceTest / FPrintdVirtualDeviceTest.test_claim_device_open_fail                                                                                 OK              2.91s
414/531 fprintd:daemon+fprintd+FPrintdVirtualDeviceTest / FPrintdVirtualDeviceTest.test_concourrent_claim                                                                                      OK              2.82s
415/531 fprintd:daemon+fprintd+FPrintdVirtualDeviceTest / FPrintdVirtualDeviceTest.test_enroll_stages_property                                                                                 OK              2.71s
416/531 fprintd:daemon+fprintd+FPrintdVirtualDeviceTest / FPrintdVirtualDeviceTest.test_allowed_list_enrolled_fingers_current_user                                                             OK              3.02s
417/531 fprintd:daemon+fprintd+FPrintdVirtualDeviceTest / FPrintdVirtualDeviceTest.test_allowed_claim_release_enroll                                                                           OK              3.06s
418/531 fprintd:daemon+fprintd+FPrintdVirtualDeviceStorageVerificationTests / FPrintdVirtualDeviceStorageVerificationTests.test_verify_stop_waits_for_completion_is_stopped_by_release         OK              3.15s
419/531 fprintd:daemon+fprintd+FPrintdVirtualDeviceStorageVerificationTests / FPrintdVirtualDeviceStorageVerificationTests.test_multiple_verify_cancelled                                      OK              3.70s
420/531 fprintd:daemon+fprintd+FPrintdVirtualDeviceStorageVerificationTests / FPrintdVirtualDeviceStorageVerificationTests.test_verify_retry_general_restarted                                 OK              3.36s
421/531 fprintd:daemon+fprintd+FPrintdVirtualDeviceTest / FPrintdVirtualDeviceTest.test_initial_finger_needed                                                                                  OK              2.62s
422/531 fprintd:daemon+fprintd+FPrintdVirtualDeviceTest / FPrintdVirtualDeviceTest.test_multiple_claims                                                                                        OK              2.61s
423/531 fprintd:daemon+fprintd+FPrintdVirtualDeviceTest / FPrintdVirtualDeviceTest.test_name_property                                                                                          OK              2.54s
424/531 fprintd:daemon+fprintd+FPrintdVirtualDeviceTest / FPrintdVirtualDeviceTest.test_scan_type                                                                                              OK              2.49s
425/531 fprintd:daemon+fprintd+FPrintdVirtualDeviceTest / FPrintdVirtualDeviceTest.test_suspend_inhibit_cancels_enroll                                                                         OK              2.47s
426/531 fprintd:daemon+fprintd+FPrintdVirtualDeviceTest / FPrintdVirtualDeviceTest.test_suspend_inhibit_claimed                                                                                OK              2.46s
427/531 fprintd:daemon+fprintd+FPrintdVirtualDeviceTest / FPrintdVirtualDeviceTest.test_suspend_inhibit_unclaimed                                                                              OK              2.45s
428/531 fprintd:daemon+fprintd+FPrintdVirtualDeviceTest / FPrintdVirtualDeviceTest.test_unallowed_claim                                                                                        OK              2.42s
429/531 fprintd:daemon+fprintd+FPrintdVirtualDeviceTest / FPrintdVirtualDeviceTest.test_unallowed_claim_current_user                                                                           OK              2.40s
430/531 fprintd:daemon+fprintd+FPrintdVirtualDeviceTest / FPrintdVirtualDeviceTest.test_unallowed_delete2_with_verify_claim                                                                    OK              2.38s
431/531 fprintd:daemon+fprintd+FPrintdVirtualDeviceTest / FPrintdVirtualDeviceTest.test_removal_during_enroll                                                                                  OK              2.54s
432/531 fprintd:daemon+fprintd+FPrintdVirtualDeviceTest / FPrintdVirtualDeviceTest.test_unallowed_delete_single_with_verify_claim                                                              OK              2.32s
433/531 fprintd:daemon+fprintd+FPrintdVirtualDeviceTest / FPrintdVirtualDeviceTest.test_suspend_prevents_enroll                                                                                OK              2.44s
434/531 fprintd:daemon+fprintd+FPrintdVirtualDeviceTest / FPrintdVirtualDeviceTest.test_unallowed_delete_with_verify_claim                                                                     OK              2.30s
435/531 fprintd:daemon+fprintd+FPrintdVirtualDeviceTest / FPrintdVirtualDeviceTest.test_unallowed_enroll_with_verify_claim                                                                     OK              2.28s
436/531 fprintd:daemon+fprintd+FPrintdVirtualDeviceStorageTest / FPrintdVirtualDeviceStorageTest.test_verify_done_disconnect                                                                   OK              3.99s
437/531 fprintd:daemon+fprintd+FPrintdVirtualDeviceTest / FPrintdVirtualDeviceTest.test_unclaimed_delete_enrolled_finger                                                                       OK              2.20s
438/531 fprintd:daemon+fprintd+FPrintdVirtualDeviceTest / FPrintdVirtualDeviceTest.test_unclaimed_delete_enrolled_fingers2                                                                     OK              2.14s
439/531 fprintd:daemon+fprintd+FPrintdVirtualDeviceTest / FPrintdVirtualDeviceTest.test_unclaimed_delete_enrolled_fingers_no_prints                                                            OK              2.13s
440/531 fprintd:daemon+fprintd+FPrintdVirtualDeviceTest / FPrintdVirtualDeviceTest.test_unclaimed_enroll_start                                                                                 OK              2.10s
441/531 fprintd:daemon+fprintd+FPrintdVirtualDeviceTest / FPrintdVirtualDeviceTest.test_unclaimed_enroll_stop                                                                                  OK              2.08s
442/531 fprintd:daemon+fprintd+FPrintdVirtualDeviceTest / FPrintdVirtualDeviceTest.test_unclaimed_list_enrolled_fingers                                                                        OK              2.04s
443/531 fprintd:daemon+fprintd+FPrintdVirtualDeviceTest / FPrintdVirtualDeviceTest.test_unclaimed_list_enrolled_fingers_error                                                                  OK              2.01s
444/531 fprintd:daemon+fprintd+FPrintdVirtualDeviceTest / FPrintdVirtualDeviceTest.test_unclaimed_list_enrolled_fingers_ignores_invalid                                                        OK              1.99s
445/531 fprintd:daemon+fprintd+FPrintdVirtualDeviceTest / FPrintdVirtualDeviceTest.test_unclaimed_release                                                                                      OK              1.95s
446/531 fprintd:daemon+fprintd+FPrintdVirtualDeviceTest / FPrintdVirtualDeviceTest.test_unclaimed_verify_start                                                                                 OK              1.94s
447/531 fprintd:daemon+fprintd+FPrintdVirtualDeviceTest / FPrintdVirtualDeviceTest.test_unclaimed_verify_stop                                                                                  OK              1.92s
448/531 fprintd:daemon+fprintd+FPrintdVirtualDeviceVerificationTests / FPrintdVirtualDeviceVerificationTests.test_delete_fingers2_during_verify                                                OK              1.81s
449/531 fprintd:daemon+fprintd+FPrintdVirtualDeviceTest / FPrintdVirtualDeviceTest.test_unallowed_verify_with_enroll_claim                                                                     OK              2.23s
450/531 fprintd:daemon+fprintd+FPrintdVirtualDeviceTest / FPrintdVirtualDeviceTest.test_unclaimed_delete_enrolled_fingers                                                                      OK              2.19s
451/531 fprintd:daemon+fprintd+FPrintdVirtualDeviceVerificationTests / FPrintdVirtualDeviceVerificationTests.test_enroll_start_during_verify                                                   OK              1.73s
452/531 fprintd:daemon+fprintd+FPrintdVirtualDeviceTest / FPrintdVirtualDeviceTest.test_claim_disconnect                                                                                       OK              2.97s
453/531 fprintd:daemon+fprintd+FPrintdVirtualDeviceVerificationTests / FPrintdVirtualDeviceVerificationTests.test_delete_finger_during_verify                                                  OK              1.85s
454/531 fprintd:daemon+fprintd+FPrintdVirtualDeviceVerificationTests / FPrintdVirtualDeviceVerificationTests.test_enroll_stop_during_verify                                                    OK              1.69s
455/531 fprintd:daemon+fprintd+FPrintdVirtualDeviceVerificationTests / FPrintdVirtualDeviceVerificationTests.test_delete_fingers_during_verify                                                 OK              1.77s
456/531 fprintd:daemon+fprintd+FPrintdVirtualDeviceTest / FPrintdVirtualDeviceTest.test_enroll_running_disconnect                                                                              OK              2.86s
457/531 fprintd:daemon+fprintd+FPrintdVirtualDeviceTest / FPrintdVirtualDeviceTest.test_enroll_done_disconnect                                                                                 OK              2.91s
458/531 fprintd:daemon+fprintd+FPrintdVirtualDeviceTest / FPrintdVirtualDeviceTest.test_identify_running_disconnect                                                                            OK              2.76s
459/531 fprintd:daemon+fprintd+FPrintdVirtualDeviceTest / FPrintdVirtualDeviceTest.test_claim_from_other_client_is_released_when_vanished                                                      OK              2.95s
460/531 fprintd:daemon+fprintd+FPrintdVirtualDeviceStorageVerificationTests / FPrintdVirtualDeviceStorageVerificationTests.test_verify_stop_waits_for_completion_waiting_timeout               OK              3.24s
461/531 fprintd:daemon+fprintd+FPrintdVirtualDeviceVerificationTests / FPrintdVirtualDeviceVerificationTests.test_verify_concourrent_stop                                                      OK              1.61s
462/531 fprintd:daemon+fprintd+FPrintdVirtualDeviceVerificationTests / FPrintdVirtualDeviceVerificationTests.test_verify_error_already_open                                                    OK              1.57s
463/531 fprintd:daemon+fprintd+FPrintdVirtualDeviceVerificationTests / FPrintdVirtualDeviceVerificationTests.test_verify_error_busy                                                            OK              1.55s
464/531 fprintd:daemon+fprintd+FPrintdVirtualDeviceVerificationTests / FPrintdVirtualDeviceVerificationTests.test_verify_error_data_full                                                       OK              1.54s
465/531 fprintd:daemon+fprintd+FPrintdVirtualDeviceVerificationTests / FPrintdVirtualDeviceVerificationTests.test_verify_error_data_invalid                                                    OK              1.52s
466/531 fprintd:daemon+fprintd+FPrintdVirtualDeviceVerificationTests / FPrintdVirtualDeviceVerificationTests.test_verify_error_data_not_found                                                  OK              1.51s
467/531 fprintd:daemon+fprintd+FPrintdVirtualDeviceVerificationTests / FPrintdVirtualDeviceVerificationTests.test_verify_error_general                                                         OK              1.50s
468/531 fprintd:daemon+fprintd+FPrintdVirtualDeviceVerificationTests / FPrintdVirtualDeviceVerificationTests.test_verify_error_not_open                                                        OK              1.39s
469/531 fprintd:daemon+fprintd+FPrintdVirtualDeviceVerificationTests / FPrintdVirtualDeviceVerificationTests.test_verify_error_not_supported                                                   OK              1.37s
470/531 fprintd:daemon+fprintd+FPrintdVirtualDeviceVerificationTests / FPrintdVirtualDeviceVerificationTests.test_verify_error_proto                                                           OK              1.35s
471/531 fprintd:daemon+fprintd+FPrintdVirtualDeviceVerificationTests / FPrintdVirtualDeviceVerificationTests.test_verify_retry_general                                                         OK              1.32s
472/531 fprintd:daemon+fprintd+FPrintdVirtualDeviceVerificationTests / FPrintdVirtualDeviceVerificationTests.test_verify_start_during_verify                                                   OK              1.20s
473/531 fprintd:daemon+fprintd+FPrintdVirtualNoStorageDeviceTest / FPrintdVirtualNoStorageDeviceTest.test_verify_any_finger_match_first_only                                                   OK              1.07s
474/531 fprintd:daemon+fprintd+FPrintdVirtualDeviceVerificationTests / FPrintdVirtualDeviceVerificationTests.test_verify_retry_remove_finger                                                   OK              1.29s
475/531 fprintd:daemon+fprintd+FPrintdVirtualNoStorageDeviceTest / FPrintdVirtualNoStorageDeviceTest.test_verify_any_finger_no_match                                                           OK              1.03s
476/531 fprintd:daemon+fprintd+FPrintdVirtualDeviceVerificationTests / FPrintdVirtualDeviceVerificationTests.test_multiple_verify                                                              OK              1.72s
477/531 fprintd:daemon+fprintd+FPrintdVirtualDeviceVerificationTests / FPrintdVirtualDeviceVerificationTests.test_verify_retry_too_short                                                       OK              1.26s
478/531 fprintd:daemon+fprintd+FPrintdVirtualStorageDeviceTests / FPrintdVirtualStorageDeviceTests.test_garbage_collect_failed_on_duplicate                                                    OK              0.90s
479/531 fprintd:daemon+fprintd+FPrintdVirtualDeviceVerificationTests / FPrintdVirtualDeviceVerificationTests.test_verify_stop_from_other_client                                                OK              1.20s
480/531 fprintd:daemon+fprintd+FPrintdVirtualDeviceTest / FPrintdVirtualDeviceTest.test_verify_running_disconnect                                                                              OK              1.97s
481/531 fprintd:daemon+fprintd+FPrintdVirtualDeviceVerificationTests / FPrintdVirtualDeviceVerificationTests.test_verify_retry_center_finger                                                   OK              1.39s
482/531 fprintd:daemon+fprintd+FPrintdVirtualStorageDeviceTests / FPrintdVirtualStorageDeviceTests.test_scan_type_changes                                                                      OK              0.89s
483/531 fprintd:daemon+fprintd+FPrintdVirtualStorageNoListDeviceTests / FPrintdVirtualStorageNoListDeviceTests.test_clear_storage                                                              OK              0.85s
484/531 fprintd:daemon+fprintd+FPrintdVirtualDeviceVerificationTests / FPrintdVirtualDeviceVerificationTests.test_verify_error_ignored_after_report                                            OK              1.63s
485/531 fprintd:daemon+fprintd+FPrintdVirtualStorageDeviceTests / FPrintdVirtualStorageDeviceTests.test_enroll_with_one_stage_only                                                             OK              1.09s
486/531 fprintd:daemon+fprintd+FPrintdVirtualDeviceVerificationTests / FPrintdVirtualDeviceVerificationTests.test_verify_stop_waits_for_completion_is_stopped_by_release                       OK              1.33s
487/531 fprintd:daemon+fprintd+FPrintdVirtualDeviceTest / FPrintdVirtualDeviceTest.test_identify_done_disconnect                                                                               OK              3.12s
488/531 fprintd:daemon+fprintd+FPrintdVirtualDeviceVerificationTests / FPrintdVirtualDeviceVerificationTests.test_verify_stop_waits_for_completion                                             OK              1.50s
489/531 fprintd:+test_fprintd_utils+TestFprintdUtils / TestFprintdUtils.test_fprintd_enroll                                                                                                    OK              1.05s
490/531 fprintd:+test_fprintd_utils+TestFprintdUtilsNoDeviceTests / TestFprintdUtilsNoDeviceTests.test_fprintd_enroll                                                                          OK              0.96s
491/531 fprintd:+test_fprintd_utils+TestFprintdUtilsNoDeviceTests / TestFprintdUtilsNoDeviceTests.test_fprintd_delete                                                                          OK              1.04s
492/531 fprintd:+test_fprintd_utils+TestFprintdUtilsVerify / TestFprintdUtilsVerify.test_fprintd_list_all_fingers                                                                              OK              0.94s
493/531 fprintd:daemon+fprintd+FPrintdVirtualDeviceVerificationTests / FPrintdVirtualDeviceVerificationTests.test_multiple_verify_cancelled                                                    OK              2.11s
494/531 fprintd:+test_fprintd_utils+TestFprintdUtilsNoDeviceTests / TestFprintdUtilsNoDeviceTests.test_fprintd_verify                                                                          OK              1.01s
495/531 fprintd:daemon+fprintd+FPrintdVirtualStorageDeviceTests / FPrintdVirtualStorageDeviceTests.test_local_storage_cleanup_no_match                                                         OK              1.28s
496/531 fprintd:+test_fprintd_utils+TestFprintdUtilsNoDeviceTests / TestFprintdUtilsNoDeviceTests.test_fprintd_list                                                                            OK              1.07s
497/531 fprintd:daemon+fprintd+FPrintdVirtualStorageDeviceTests / FPrintdVirtualStorageDeviceTests.test_garbage_collect_on_duplicate                                                           OK              1.44s
498/531 fprintd:daemon+fprintd+FPrintdVirtualStorageDeviceTests / FPrintdVirtualStorageDeviceTests.test_local_storage_cleanup_data_error                                                       OK              1.47s
499/531 fprintd:+test_fprintd_utils+TestFprintdUtilsVerify / TestFprintdUtilsVerify.test_fprintd_verify_no_enrolled_fingers                                                                    OK              0.89s
500/531 fprintd:+test_fprintd_utils+TestFprintdUtils / TestFprintdUtils.test_fprintd_delete                                                                                                    OK              1.46s
501/531 fprintd:+test_fprintd_utils+TestFprintdUtils / TestFprintdUtils.test_fprintd_list                                                                                                      OK              1.50s
502/531 fprintd:daemon+fprintd+FPrintdVirtualDeviceVerificationTests / FPrintdVirtualDeviceVerificationTests.test_verify_retry_general_restarted                                               OK              2.28s
503/531 fprintd:+test_fprintd_utils+TestFprintdUtilsVerify / TestFprintdUtilsVerify.test_fprintd_verify                                                                                        OK              1.49s
504/531 fprintd:+test_fprintd_utils+TestFprintdUtilsVerify / TestFprintdUtilsVerify.test_fprintd_multiple_verify_fails                                                                         OK              1.57s
505/531 fprintd:+test_fprintd_utils+TestFprintdUtilsVerify / TestFprintdUtilsVerify.test_fprintd_verify_any_finger_no_identification                                                           OK              1.43s
506/531 fprintd:+test_fprintd_utils+TestFprintdUtilsVerify / TestFprintdUtilsVerify.test_fprintd_verify_any_finger_identification                                                              OK              1.50s
507/531 fprintd:daemon+fprintd+FPrintdVirtualDeviceTest / FPrintdVirtualDeviceTest.test_verify_done_disconnect                                                                                 OK              3.21s
508/531 fprintd:daemon+fprintd+FPrintdVirtualDeviceVerificationTests / FPrintdVirtualDeviceVerificationTests.test_verify_stop_waits_for_completion_waiting_timeout                             OK              2.45s
509/531 fprintd:daemon+fprintd+FPrintdVirtualStorageDeviceTests / FPrintdVirtualStorageDeviceTests.test_delete                                                                                 OK              2.52s
510/531 fprintd:+test_fprintd_utils+TestFprintdUtilsVerify / TestFprintdUtilsVerify.test_fprintd_verify_enrolled_fingers                                                                       OK              2.40s
511/531 fprintd:daemon+fprintd+FPrintdVirtualStorageDeviceTests / FPrintdVirtualStorageDeviceTests.test_garbage_collect                                                                        OK              3.91s
512/531 fprintd:+test_fprintd_utils+TestFprintdUtilsVerify / TestFprintdUtilsVerify.test_fprintd_verify_not_enrolled_fingers                                                                   OK              4.38s
513/531 fprintd:+test_fprintd_utils+TestFprintdUtilsVerify / TestFprintdUtilsVerify.test_fprintd_verify_script                                                                                 OK              5.37s
514/531 fprintd:PAM+test_pam_fprintd+TestPamFprintd / TestPamFprintd.test_pam_already_claimed                                                                                                  OK              0.23s
515/531 fprintd:PAM+test_pam_fprintd+TestPamFprintd / TestPamFprintd.test_pam_fprintd_auth                                                                                                     OK              0.24s
516/531 fprintd:PAM+test_pam_fprintd+TestPamFprintd / TestPamFprintd.test_pam_fprintd_blocks_unexpected_auth                                                                                   OK              0.73s
517/531 fprintd:PAM+test_pam_fprintd+TestPamFprintd / TestPamFprintd.test_pam_fprintd_blocks_unexpected_auth2                                                                                  OK              0.73s
518/531 fprintd:PAM+test_pam_fprintd+TestPamFprintd / TestPamFprintd.test_pam_fprintd_dual_reader_auth                                                                                         OK              0.23s
519/531 fprintd:PAM+test_pam_fprintd+TestPamFprintd / TestPamFprintd.test_pam_fprintd_failed_auth                                                                                              OK              0.23s
520/531 fprintd:PAM+test_pam_fprintd+TestPamFprintd / TestPamFprintd.test_pam_fprintd_identify_error                                                                                           OK              0.23s
521/531 fprintd:PAM+test_pam_fprintd+TestPamFprintd / TestPamFprintd.test_pam_fprintd_identify_error2                                                                                          OK              0.24s
522/531 fprintd:PAM+test_pam_fprintd+TestPamFprintd / TestPamFprintd.test_pam_fprintd_identify_error3                                                                                          OK              0.23s
523/531 fprintd:PAM+test_pam_fprintd+TestPamFprintd / TestPamFprintd.test_pam_fprintd_last_try_auth                                                                                            OK              0.23s
524/531 fprintd:PAM+test_pam_fprintd+TestPamFprintd / TestPamFprintd.test_pam_fprintd_multi_reader_not_all_enrolled                                                                            OK              0.23s
525/531 fprintd:PAM+test_pam_fprintd+TestPamFprintd / TestPamFprintd.test_pam_fprintd_no_fingers                                                                                               OK              0.23s
526/531 fprintd:PAM+test_pam_fprintd+TestPamFprintd / TestPamFprintd.test_pam_fprintd_no_fingers_while_verifying                                                                               OK              0.23s
527/531 fprintd:PAM+test_pam_fprintd+TestPamFprintd / TestPamFprintd.test_pam_fprintd_retry                                                                                                    OK              0.23s
528/531 fprintd:PAM+test_pam_fprintd+TestPamFprintd / TestPamFprintd.test_pam_no_device                                                                                                        OK              0.22s
529/531 fprintd:PAM+test_pam_fprintd+TestPamFprintd / TestPamFprintd.test_pam_notices_fprintd_disappearing                                                                                     OK              0.24s
530/531 fprintd:PAM+test_pam_fprintd+TestPamFprintd / TestPamFprintd.test_pam_timeout                                                                                                          OK             10.28s
531/531 fprintd:dist / check-translations                                                                                                                                                      OK              0.20s

Summary of Failures:

128/531 fprintd:daemon+fprintd+FPrintdVirtualDeviceClaimedTest / FPrintdVirtualDeviceClaimedTest.test_verify_any_finger_multiple_users                                                         FAIL            5.50s   exit status 1

Ok:                 530 
Expected Fail:      0   
Fail:               1   
Unexpected Pass:    0   
Skipped:            0   
Timeout:            0   

Full log written to /usr/src/RPM/BUILD/fprintd-1.94.2/x86_64-alt-linux/meson-logs/testlog.txt
FAILED: meson-internal__test 
/usr/bin/meson test --no-rebuild --print-errorlogs
ninja: build stopped: subcommand failed.
error: Bad exit status from /usr/src/tmp/rpm-tmp.33329 (%check)


RPM build errors:
    Bad exit status from /usr/src/tmp/rpm-tmp.33329 (%check)
Command exited with non-zero status 1
184.73user 65.49system 0:40.52elapsed 617%CPU (0avgtext+0avgdata 75748maxresident)k
0inputs+0outputs (0major+8812349minor)pagefaults 0swaps
hsh-rebuild: rebuild of `fprintd-1.94.2-alt1.src.rpm' failed.
Command exited with non-zero status 1
8.14user 3.28system 1:11.60elapsed 15%CPU (0avgtext+0avgdata 127120maxresident)k
1240inputs+0outputs (0major+394091minor)pagefaults 0swaps