<86>Sep  1 02:48:50 userdel[2026921]: delete user 'rooter'
<86>Sep  1 02:48:50 userdel[2026921]: removed group 'rooter' owned by 'rooter'
<86>Sep  1 02:48:50 userdel[2026921]: removed shadow group 'rooter' owned by 'rooter'
<86>Sep  1 02:48:50 groupadd[2026941]: group added to /etc/group: name=rooter, GID=1250
<86>Sep  1 02:48:50 groupadd[2026941]: group added to /etc/gshadow: name=rooter
<86>Sep  1 02:48:50 groupadd[2026941]: new group: name=rooter, GID=1250
<86>Sep  1 02:48:50 useradd[2026961]: new user: name=rooter, UID=1250, GID=1250, home=/root, shell=/bin/bash, from=none
<86>Sep  1 02:48:50 userdel[2026988]: delete user 'builder'
<86>Sep  1 02:48:50 userdel[2026988]: removed group 'builder' owned by 'builder'
<86>Sep  1 02:48:50 userdel[2026988]: removed shadow group 'builder' owned by 'builder'
<86>Sep  1 02:48:50 groupadd[2027013]: group added to /etc/group: name=builder, GID=1251
<86>Sep  1 02:48:50 groupadd[2027013]: group added to /etc/gshadow: name=builder
<86>Sep  1 02:48:50 groupadd[2027013]: new group: name=builder, GID=1251
<86>Sep  1 02:48:50 useradd[2027031]: new user: name=builder, UID=1251, GID=1251, home=/usr/src, shell=/bin/bash, from=none
<13>Sep  1 02:48:55 rpmi: libruby-3.1.2-alt2.1 sisyphus+328124.4500.1.1 1693252752 installed
<13>Sep  1 02:48:55 rpmi: libncurses6-6.3.20220618-alt4 sisyphus+328055.40.2.1 1693212977 installed
<13>Sep  1 02:48:55 rpmi: libgdbm-1.8.3-alt10 sisyphus+278100.1600.1.1 1626058413 installed
<13>Sep  1 02:48:55 rpmi: libyaml2-0.2.5-alt1 sisyphus+278391.100.1.1 1626094928 installed
<13>Sep  1 02:48:55 rpmi: libyaml-devel-0.2.5-alt1 sisyphus+278391.100.1.1 1626094928 installed
<13>Sep  1 02:48:55 rpmi: libgdbm-devel-1.8.3-alt10 sisyphus+278100.1600.1.1 1626058413 installed
<13>Sep  1 02:48:55 rpmi: rpm-macros-ruby-1:1.1.0-alt2.1 sisyphus+328124.4500.1.1 1693252752 installed
<13>Sep  1 02:48:59 rpmi: valgrind-3.17.0-alt3 sisyphus+284325.100.1.1 1630488680 installed
<13>Sep  1 02:48:59 rpmi: valgrind-devel-3.17.0-alt3 sisyphus+284325.100.1.1 1630488680 installed
<13>Sep  1 02:48:59 rpmi: zlib-devel-1.2.13-alt1 sisyphus+309409.200.2.1 1667402043 installed
<13>Sep  1 02:48:59 rpmi: libreadline-devel-7.0.3-alt4 sisyphus+328124.200.1.1 1693248140 installed
<13>Sep  1 02:48:59 rpmi: groff-base-1.22.3-alt2 sisyphus+275306.100.2.1 1624538375 installed
<13>Sep  1 02:48:59 rpmi: libtinfo-devel-6.3.20220618-alt4 sisyphus+328055.40.2.1 1693212977 installed
<13>Sep  1 02:49:00 rpmi: libncurses-devel-6.3.20220618-alt4 sisyphus+328055.40.2.1 1693212977 installed
<13>Sep  1 02:49:00 rpmi: libncursesw-devel-6.3.20220618-alt4 sisyphus+328055.40.2.1 1693212977 installed
<13>Sep  1 02:49:00 rpmi: libffi-devel-1:3.4.2-alt2 sisyphus+287629.100.2.1 1634659242 installed
<13>Sep  1 02:49:00 rpmi: libdb4.7-devel-4.7.25-alt12 sisyphus+283793.100.2.1 1629966936 installed
<13>Sep  1 02:49:00 rpmi: doxygen-1:1.9.7-alt1 sisyphus+327909.100.1.1 1692968144 installed
<13>Sep  1 02:49:00 rpmi: chrpath-0.16-alt1 sisyphus+278100.500.1.1 1626056633 installed
<13>Sep  1 02:49:00 rpmi: libp11-kit-1:0.24.1-alt2 sisyphus+324666.100.1.1 1689083439 installed
<13>Sep  1 02:49:00 rpmi: libtasn1-4.19.0-alt3 sisyphus+327816.100.1.1 1692802615 installed
<13>Sep  1 02:49:00 rpmi: rpm-macros-alternatives-0.5.2-alt2 sisyphus+315270.200.2.1 1676457367 installed
<13>Sep  1 02:49:00 rpmi: alternatives-0.5.2-alt2 sisyphus+315270.200.2.1 1676457367 installed
<13>Sep  1 02:49:00 rpmi: ca-certificates-2023.07.31-alt1 sisyphus+326137.200.1.1 1690809798 installed
<13>Sep  1 02:49:00 rpmi: ca-trust-0.1.4-alt1 sisyphus+308690.100.1.1 1666182992 installed
<13>Sep  1 02:49:00 rpmi: p11-kit-trust-1:0.24.1-alt2 sisyphus+324666.100.1.1 1689083439 installed
<13>Sep  1 02:49:00 rpmi: libcrypto1.1-1.1.1u-alt3 sisyphus+325014.100.4.1 1689538432 installed
<13>Sep  1 02:49:01 rpmi: libcrypto3-3.1.2-alt1 sisyphus+326244.100.1.1 1690906741 installed
<13>Sep  1 02:49:01 rpmi: libssl3-3.1.2-alt1 sisyphus+326244.100.1.1 1690906741 installed
<13>Sep  1 02:49:01 rpmi: libssl-devel-3.1.2-alt1 sisyphus+326244.100.1.1 1690906741 installed
<13>Sep  1 02:49:01 rpmi: libssl1.1-1.1.1u-alt3 sisyphus+325014.100.4.1 1689538432 installed
<13>Sep  1 02:49:01 rpmi: gem-2:3.3.7-alt2.1 sisyphus+328124.4500.1.1 1693252752 installed
<13>Sep  1 02:49:01 rpmi: gem-minitest-5.18.1-alt1 sisyphus+323401.1400.2.1 1687352748 installed
<13>Sep  1 02:49:01 rpmi: gem-net-telnet-0.2.0.1-alt0.1 sisyphus+238996.14500.5.1 1630597117 installed
<13>Sep  1 02:49:01 rpmi: gem-power-assert-2.0.1-alt1 sisyphus+296637.272.56.4 1654656448 installed
<13>Sep  1 02:49:01 rpmi: gem-rake-13.0.6-alt1 sisyphus+296637.11240.56.4 1654660010 installed
<13>Sep  1 02:49:01 rpmi: gem-test-unit-3.5.3-alt1 sisyphus+296703.16.105.2 1663319196 installed
<13>Sep  1 02:49:01 rpmi: gem-webrick-1.7.0-alt1 sisyphus+264413.200.1.1 1610122897 installed
<13>Sep  1 02:49:01 rpmi: gem-xmlrpc-0.3.2-alt1.1 sisyphus+296703.16100.105.2 1663323187 installed
<13>Sep  1 02:49:01 rpmi: ri-6.4.0.1-alt1 sisyphus+296703.306.105.2 1663320293 installed
<13>Sep  1 02:49:01 rpmi: gem-rdoc-6.4.0.1-alt1 sisyphus+296703.306.105.2 1663320293 installed
<13>Sep  1 02:49:01 rpmi: rdoc-6.4.0.1-alt1 sisyphus+296703.306.105.2 1663320293 installed
<13>Sep  1 02:49:01 rpmi: rake-13.0.6-alt1 sisyphus+296637.11240.56.4 1654660010 installed
<13>Sep  1 02:49:01 rpmi: erb-3.1.2-alt2.1 sisyphus+328124.4500.1.1 1693252752 installed
<13>Sep  1 02:49:01 rpmi: irb-3.1.2-alt2.1 sisyphus+328124.4500.1.1 1693252752 installed
<13>Sep  1 02:49:01 rpmi: bundle-2.2.19-alt1 sisyphus+263530.240.88.5 1629542341 installed
<13>Sep  1 02:49:03 rpmi: gem-bundler-2.2.19-alt1 sisyphus+263530.240.88.5 1629542341 installed
<13>Sep  1 02:49:03 rpmi: ruby-3.1.2-alt2.1 sisyphus+328124.4500.1.1 1693252752 installed
<13>Sep  1 02:49:03 rpmi: ruby-stdlibs-3.1.2-alt2.1 sisyphus+328124.4500.1.1 1693252752 installed
<13>Sep  1 02:49:03 rpmi: gem-setup-5.999.6-alt7 sisyphus+313736.6.47.3 1677064188 installed
<13>Sep  1 02:49:03 rpmi: setup-rb-5.999.6-alt7 sisyphus+313736.6.47.3 1677064188 installed
<13>Sep  1 02:49:03 rpmi: gem-benchmark-driver-0.15.17-alt1 sisyphus+246775.5500.5.1 1630650981 installed
<13>Sep  1 02:49:03 rpmi: gem-rake-compiler-1.2.0-alt1 sisyphus+296637.14700.56.4 1654665972 installed
<13>Sep  1 02:49:03 rpmi: libruby-devel-3.1.2-alt2.1 sisyphus+328124.4500.1.1 1693252752 installed
<13>Sep  1 02:49:03 rpmi: rpm-build-ruby-1:1.1.0-alt1 sisyphus+296703.146.105.1 1663266216 installed
<13>Sep  1 02:49:11 rpmi: llvm-common-15.0.0-alt3 sisyphus+323766.500.5.1 1688120920 installed
<13>Sep  1 02:49:11 rpmi: clang15.0-libs-support-15.0.7-alt4 sisyphus+323298.200.3.1 1687193696 installed
<13>Sep  1 02:49:11 rpmi: llvm15.0-polly-15.0.7-alt4 sisyphus+323298.200.3.1 1687193696 installed
<13>Sep  1 02:49:11 rpmi: libmpdec3-2.5.1-alt3 sisyphus+314490.500.5.1 1675432004 installed
<13>Sep  1 02:49:11 rpmi: libexpat-2.5.0-alt1 sisyphus+309227.100.1.1 1667075764 installed
<13>Sep  1 02:49:11 rpmi: openldap-common-2.6.4-alt1 sisyphus+324359.600.5.1 1689262595 installed
<13>Sep  1 02:49:11 rpmi: libverto-0.3.2-alt1_1 sisyphus+321176.2200.10.2 1684803947 installed
<13>Sep  1 02:49:11 rpmi: liblmdb-0.9.29-alt1.1 sisyphus+306630.100.1.1 1663072360 installed
<13>Sep  1 02:49:11 rpmi: libkeyutils-1.6.3-alt1 sisyphus+266061.100.1.1 1612919566 installed
<13>Sep  1 02:49:11 rpmi: libcom_err-1.46.4.0.5.4cda-alt1 sisyphus+283826.100.1.1 1629975345 installed
<86>Sep  1 02:49:11 groupadd[2067696]: group added to /etc/group: name=_keytab, GID=999
<86>Sep  1 02:49:11 groupadd[2067696]: group added to /etc/gshadow: name=_keytab
<86>Sep  1 02:49:11 groupadd[2067696]: new group: name=_keytab, GID=999
<13>Sep  1 02:49:12 rpmi: libkrb5-1.21.2-alt1 sisyphus+327265.100.1.1 1692185462 installed
<86>Sep  1 02:49:12 groupadd[2067820]: group added to /etc/group: name=sasl, GID=998
<86>Sep  1 02:49:12 groupadd[2067820]: group added to /etc/gshadow: name=sasl
<86>Sep  1 02:49:12 groupadd[2067820]: new group: name=sasl, GID=998
<13>Sep  1 02:49:12 rpmi: libsasl2-3-2.1.27-alt2.2 sisyphus+324359.6000.12.1 1689392001 installed
<13>Sep  1 02:49:12 rpmi: libldap2-2.6.4-alt1 sisyphus+324359.600.5.1 1689262595 installed
<13>Sep  1 02:49:12 rpmi: libpq5-15.4-alt2 sisyphus+327094.100.1.1 1691856915 installed
<13>Sep  1 02:49:12 rpmi: libecpg6-15.4-alt2 sisyphus+327094.100.1.1 1691856915 installed
<13>Sep  1 02:49:12 rpmi: libecpg6-devel-15.4-alt2 sisyphus+327094.100.1.1 1691856915 installed
<13>Sep  1 02:49:12 rpmi: libpq5-devel-15.4-alt2 sisyphus+327094.100.1.1 1691856915 installed
<13>Sep  1 02:49:12 rpmi: libb2-0.98.1-alt1_1 sisyphus+291614.100.1.1 1638962877 installed
<13>Sep  1 02:49:12 rpmi: python3-3.11.4-alt2 sisyphus+324359.500.4.1 1689257961 installed
<13>Sep  1 02:49:13 rpmi: python3-base-3.11.4-alt2 sisyphus+324359.500.4.1 1689257961 installed
<13>Sep  1 02:49:13 rpmi: gcc-c++-common-1.4.27-alt1 sisyphus+278099.1300.1.1 1626028636 installed
<13>Sep  1 02:49:13 rpmi: libstdc++13-devel-13.2.1-alt2 sisyphus+327572.100.1.1 1692472816 installed
<13>Sep  1 02:49:15 rpmi: gcc13-c++-13.2.1-alt2 sisyphus+327572.100.1.1 1692472816 installed
<13>Sep  1 02:49:15 rpmi: gcc-c++-13-alt1 sisyphus+323337.300.1.1 1687267966 installed
<13>Sep  1 02:49:15 rpmi: libtinfo-6.3.20220618-alt4 sisyphus+328055.40.2.1 1693212977 installed
<13>Sep  1 02:49:15 rpmi: libedit3-3.1.20221030-alt1 sisyphus+327935.100.1.1 1692980094 installed
<13>Sep  1 02:49:15 rpmi: llvm15.0-gold-15.0.7-alt4 sisyphus+323298.200.3.1 1687193696 installed
<13>Sep  1 02:49:17 rpmi: llvm15.0-libs-15.0.7-alt4 sisyphus+323298.200.3.1 1687193696 installed
<13>Sep  1 02:49:19 rpmi: clang15.0-libs-15.0.7-alt4 sisyphus+323298.200.3.1 1687193696 installed
<13>Sep  1 02:49:19 rpmi: clang15.0-15.0.7-alt4 sisyphus+323298.200.3.1 1687193696 installed
<13>Sep  1 02:49:19 rpmi: clang-15.0.0-alt3 sisyphus+323766.500.5.1 1688120920 installed
<13>Sep  1 02:49:37 rpmi: clang15.0-devel-15.0.7-alt4 sisyphus+323298.200.3.1 1687193696 installed
<13>Sep  1 02:49:37 rpmi: clang-devel-15.0.0-alt3 sisyphus+323766.500.5.1 1688120920 installed
<13>Sep  1 02:49:38 rpmi: llvm15.0-15.0.7-alt4 sisyphus+323298.200.3.1 1687193696 installed
<13>Sep  1 02:49:38 rpmi: llvm-15.0.0-alt3 sisyphus+323766.500.5.1 1688120920 installed
<13>Sep  1 02:49:40 rpmi: mlir15.0-tools-15.0.7-alt4 sisyphus+323298.200.3.1 1687193696 installed
<13>Sep  1 02:49:56 rpmi: llvm15.0-devel-15.0.7-alt4 sisyphus+323298.200.3.1 1687193696 installed
<13>Sep  1 02:49:56 rpmi: llvm-devel-15.0.0-alt3 sisyphus+323766.500.5.1 1688120920 installed
<13>Sep  1 02:49:56 rpmi: postgresql15-server-devel-15.4-alt2 sisyphus+327094.100.1.1 1691856915 installed
<13>Sep  1 02:49:56 rpmi: postgresql-devel-15.4-alt2 sisyphus+327094.100.1.1 1691856915 installed
<13>Sep  1 02:49:56 rpmi: uni2ascii-4.18-alt1 1308480084 installed
Building target platforms: x86_64
Building for target x86_64
Wrote: /usr/src/in/nosrpm/gem-pg-1.3.5-alt1.nosrc.rpm (w1.gzdio)
Installing gem-pg-1.3.5-alt1.src.rpm
Building target platforms: x86_64
Building for target x86_64
Executing(%prep): /bin/sh -e /usr/src/tmp/rpm-tmp.47364
+ umask 022
+ /bin/mkdir -p /usr/src/RPM/BUILD
+ cd /usr/src/RPM/BUILD
+ cd /usr/src/RPM/BUILD
+ rm -rf gem-pg-1.3.5
+ echo 'Source #0 (gem-pg-1.3.5.tar):'
Source #0 (gem-pg-1.3.5.tar):
+ /bin/tar -xf /usr/src/RPM/SOURCES/gem-pg-1.3.5.tar
+ cd gem-pg-1.3.5
+ /bin/chmod -c -Rf u+rwX,go-w .
+ exit 0
Executing(%build): /bin/sh -e /usr/src/tmp/rpm-tmp.47364
+ umask 022
+ /bin/mkdir -p /usr/src/RPM/BUILD
+ cd /usr/src/RPM/BUILD
+ cd gem-pg-1.3.5
+ rm -f Gemfile.lock
+ /usr/bin/ruby -rvendor-specific /usr/bin/setup.rb build --shebang=auto --prefixes=gem,ruby,rails-engine --gem-version-replace= --ignore-names= --regard-names= --alias=:: --use-gem-dependencies= --pre= --use-gem-version= --ignore-path-tokens=templates,example,examples,sample,samples,spec,test,features,fixtures,doc,docs,contrib,demo,acceptance,conformance,myapp,website,benchmarks,benchmark,gemfiles,misc,steer --debug-io=/usr/src/tmp/debug.log --verbose=debug
(ruby 3.1.2 x86_64-linux)
###### NameError: uninitialized constant BASEDIR

MISCDIR = BASEDIR + 'misc'
          ^^^^^^^
[setup.rb][INFO]> Source list are the following:
[setup.rb][INFO]> V *pg:1.3.5 [/usr/src/RPM/BUILD/gem-pg-1.3.5/pg.gemspec]
[setup.rb][INFO]> X ^ruby-pg [/usr/src/RPM/BUILD/gem-pg-1.3.5/misc/ruby-pg/Rakefile]
[setup.rb][INFO]> - *postgres:0.8.0 [/usr/src/RPM/BUILD/gem-pg-1.3.5/misc/postgres/Rakefile]

- - PRECONFIG - - - - - - - - - - - - - - - - - - - - - - - - - - - - 

SetupConfig was saved. Edit to customize configuration.

- - COMPILE - - - - - - - - - - - - - - - - - - - - - - - - - - - - - 

[TypeError]> no implicit conversion of nil into String	
/usr/src/RPM/BUILD/gem-pg-1.3.5/ext/errorcodes.rb:9:in `initialize'	
/usr/src/RPM/BUILD/gem-pg-1.3.5/ext/errorcodes.rb:9:in `open'	
/usr/src/RPM/BUILD/gem-pg-1.3.5/ext/errorcodes.rb:9:in `<top (required)>'	
/usr/lib/ruby/gemie/gems/setup-5.999.6/lib/setup/compiler.rb:33:in `load'	
/usr/lib/ruby/gemie/gems/setup-5.999.6/lib/setup/compiler.rb:33:in `block in configure'	
/usr/lib/ruby/gemie/gems/setup-5.999.6/lib/setup/compiler.rb:32:in `chdir'	
/usr/lib/ruby/gemie/gems/setup-5.999.6/lib/setup/compiler.rb:32:in `configure'	
/usr/lib/ruby/gemie/gems/setup-5.999.6/lib/setup/compiler.rb:60:in `block (3 levels) in configure'	
/usr/lib/ruby/gemie/gems/setup-5.999.6/lib/setup/compiler.rb:53:in `map'	
/usr/lib/ruby/gemie/gems/setup-5.999.6/lib/setup/compiler.rb:53:in `block (2 levels) in configure'	
/usr/lib/ruby/gemie/gems/setup-5.999.6/lib/setup/compiler.rb:52:in `each'	
/usr/lib/ruby/gemie/gems/setup-5.999.6/lib/setup/compiler.rb:52:in `map'	
/usr/lib/ruby/gemie/gems/setup-5.999.6/lib/setup/compiler.rb:52:in `block in configure'	
/usr/lib/ruby/gemie/gems/setup-5.999.6/lib/setup/compiler.rb:51:in `map'	
/usr/lib/ruby/gemie/gems/setup-5.999.6/lib/setup/compiler.rb:51:in `configure'	
/usr/lib/ruby/gemie/gems/setup-5.999.6/lib/setup/session.rb:148:in `make'	
/usr/lib/ruby/gemie/gems/setup-5.999.6/lib/setup/session.rb:123:in `build'	
/usr/lib/ruby/gemie/gems/setup-5.999.6/lib/setup/session.rb:89:in `apply'	
/usr/lib/ruby/gemie/gems/setup-5.999.6/lib/setup/command.rb:118:in `run'	
/usr/lib/ruby/gemie/gems/setup-5.999.6/lib/setup/command.rb:18:in `run'	
/usr/bin/setup.rb:29:in `<main>'
Calling libpq with GVL unlocked
checking for pg_config... yes
Using config values from /usr/bin/pg_config
checking for whether -Wl,-rpath,/usr/lib64 is accepted as LDFLAGS... yes
Using libpq from /usr/lib64
checking for libpq-fe.h... yes
checking for libpq/libpq-fs.h... yes
checking for pg_config_manual.h... yes
checking for PQconnectdb() in -lpq... yes
checking for PQconninfo() in libpq-fe.h... yes
checking for PQsslAttribute() in libpq-fe.h... yes
checking for PQresultVerboseErrorMessage() in libpq-fe.h... yes
checking for PQencryptPasswordConn() in libpq-fe.h... yes
checking for PQresultMemorySize() in libpq-fe.h... yes
checking for PQenterPipelineMode() in libpq-fe.h... yes
checking for timegm()... yes
checking for rb_gc_adjust_memory_usage()... yes
checking for rb_gc_mark_movable()... yes
checking for rb_io_wait()... yes
checking for unistd.h... yes
checking for inttypes.h... yes
checking for C99 variable length arrays... yes
creating extconf.h
creating Makefile
make: Entering directory '/usr/src/RPM/BUILD/gem-pg-1.3.5/ext'
compiling gvl_wrappers.c
compiling pg.c
In file included from pg.c:50:
/usr/include/pgsql/pg_config.h:1014: warning: "restrict" redefined
 1014 | #define restrict __restrict
      | 
In file included from /usr/include/ruby/ruby/internal/config.h:22,
                 from /usr/include/ruby/ruby/ruby.h:15,
                 from /usr/include/ruby/ruby.h:38,
                 from pg.h:21,
                 from pg.c:49:
/usr/include/ruby/ruby/config.h:74: note: this is the location of the previous definition
   74 | #define restrict __restrict__
      | 
compiling pg_binary_decoder.c
compiling pg_binary_encoder.c
compiling pg_coder.c
compiling pg_connection.c
compiling pg_copy_coder.c
compiling pg_errors.c
compiling pg_record_coder.c
compiling pg_result.c
compiling pg_text_decoder.c
compiling pg_text_encoder.c
compiling pg_tuple.c
compiling pg_type_map.c
compiling pg_type_map_all_strings.c
compiling pg_type_map_by_class.c
compiling pg_type_map_by_column.c
compiling pg_type_map_by_mri_type.c
compiling pg_type_map_by_oid.c
compiling pg_type_map_in_ruby.c
compiling pg_util.c
linking shared-object pg_ext.so
make: Leaving directory '/usr/src/RPM/BUILD/gem-pg-1.3.5/ext'
make: Entering directory '/usr/src/RPM/BUILD/gem-pg-1.3.5/ext'
/bin/install -c -m 0755 pg_ext.so /usr/src/RPM/BUILD/gem-pg-1.3.5/.so.pg/usr/local/lib64/ruby
installing pg_ext libraries
make: Leaving directory '/usr/src/RPM/BUILD/gem-pg-1.3.5/ext'
make: Entering directory '/usr/src/RPM/BUILD/gem-pg-1.3.5/ext'
make: Nothing to be done for 'all'.
make: Leaving directory '/usr/src/RPM/BUILD/gem-pg-1.3.5/ext'
make: Entering directory '/usr/src/RPM/BUILD/gem-pg-1.3.5/ext'
/bin/install -c -m 0755 pg_ext.so /usr/src/RPM/BUILD/gem-pg-1.3.5/.so.pg/usr/local/lib64/ruby
make: Leaving directory '/usr/src/RPM/BUILD/gem-pg-1.3.5/ext'

- - DOCUMENT- - - - - - - - - - - - - - - - - - - - - - - - - - - - - 


+ exit 0
Executing(%install): /bin/sh -e /usr/src/tmp/rpm-tmp.33434
+ umask 022
+ /bin/mkdir -p /usr/src/RPM/BUILD
+ cd /usr/src/RPM/BUILD
+ /bin/chmod -Rf u+rwX -- /usr/src/tmp/gem-pg-buildroot
+ :
+ /bin/rm -rf -- /usr/src/tmp/gem-pg-buildroot
+ PATH=/usr/libexec/rpm-build:/usr/src/bin:/bin:/usr/bin:/usr/X11R6/bin:/usr/games
+ cd gem-pg-1.3.5
+ /usr/bin/ruby -rvendor-specific /usr/bin/setup.rb install --install_prefix=/usr/src/tmp/gem-pg-buildroot --gem-version-replace=
(ruby 3.1.2 x86_64-linux)
[setup.rb][INFO]> Source list are the following:
[setup.rb][INFO]> V *pg:1.3.5 [/usr/src/RPM/BUILD/gem-pg-1.3.5/pg.gemspec]
[setup.rb][INFO]> X ^ruby-pg [/usr/src/RPM/BUILD/gem-pg-1.3.5/misc/ruby-pg/Rakefile]
[setup.rb][INFO]> - *postgres:0.8.0 [/usr/src/RPM/BUILD/gem-pg-1.3.5/misc/postgres/Rakefile]

- - INSTALL - - - - - - - - - - - - - - - - - - - - - - - - - - - - - 

* {exe} ->
* {lib} ->
  % pg < lib
    pg/basic_type_map_based_on_result.rb => [/usr/src/tmp/gem-pg-buildroot]/usr/lib/ruby/gemie/gems/pg-1.3.5/lib/pg/basic_type_map_based_on_result.rb
    pg/basic_type_map_for_queries.rb => [/usr/src/tmp/gem-pg-buildroot]/usr/lib/ruby/gemie/gems/pg-1.3.5/lib/pg/basic_type_map_for_queries.rb
    pg/basic_type_map_for_results.rb => [/usr/src/tmp/gem-pg-buildroot]/usr/lib/ruby/gemie/gems/pg-1.3.5/lib/pg/basic_type_map_for_results.rb
    pg/basic_type_registry.rb => [/usr/src/tmp/gem-pg-buildroot]/usr/lib/ruby/gemie/gems/pg-1.3.5/lib/pg/basic_type_registry.rb
    pg/binary_decoder.rb => [/usr/src/tmp/gem-pg-buildroot]/usr/lib/ruby/gemie/gems/pg-1.3.5/lib/pg/binary_decoder.rb
    pg/coder.rb => [/usr/src/tmp/gem-pg-buildroot]/usr/lib/ruby/gemie/gems/pg-1.3.5/lib/pg/coder.rb
    pg/connection.rb => [/usr/src/tmp/gem-pg-buildroot]/usr/lib/ruby/gemie/gems/pg-1.3.5/lib/pg/connection.rb
    pg/constants.rb => [/usr/src/tmp/gem-pg-buildroot]/usr/lib/ruby/gemie/gems/pg-1.3.5/lib/pg/constants.rb
    pg/exceptions.rb => [/usr/src/tmp/gem-pg-buildroot]/usr/lib/ruby/gemie/gems/pg-1.3.5/lib/pg/exceptions.rb
    pg/result.rb => [/usr/src/tmp/gem-pg-buildroot]/usr/lib/ruby/gemie/gems/pg-1.3.5/lib/pg/result.rb
    pg/text_decoder.rb => [/usr/src/tmp/gem-pg-buildroot]/usr/lib/ruby/gemie/gems/pg-1.3.5/lib/pg/text_decoder.rb
    pg/text_encoder.rb => [/usr/src/tmp/gem-pg-buildroot]/usr/lib/ruby/gemie/gems/pg-1.3.5/lib/pg/text_encoder.rb
    pg/tuple.rb => [/usr/src/tmp/gem-pg-buildroot]/usr/lib/ruby/gemie/gems/pg-1.3.5/lib/pg/tuple.rb
    pg/type_map_by_column.rb => [/usr/src/tmp/gem-pg-buildroot]/usr/lib/ruby/gemie/gems/pg-1.3.5/lib/pg/type_map_by_column.rb
    pg/version.rb => [/usr/src/tmp/gem-pg-buildroot]/usr/lib/ruby/gemie/gems/pg-1.3.5/lib/pg/version.rb
    pg.rb => [/usr/src/tmp/gem-pg-buildroot]/usr/lib/ruby/gemie/gems/pg-1.3.5/lib/pg.rb
* {man} ->
* {ri} ->
  % pg < .ri.pg
    PG/BasicTypeMapBasedOnResult/cdesc-BasicTypeMapBasedOnResult.ri => [/usr/src/tmp/gem-pg-buildroot]/usr/share/ri/pg-1.3.5/PG/BasicTypeMapBasedOnResult/cdesc-BasicTypeMapBasedOnResult.ri
    PG/BasicTypeMapBasedOnResult/new-c.ri => [/usr/src/tmp/gem-pg-buildroot]/usr/share/ri/pg-1.3.5/PG/BasicTypeMapBasedOnResult/new-c.ri
    PG/BasicTypeMapForQueries/BinaryData/cdesc-BinaryData.ri => [/usr/src/tmp/gem-pg-buildroot]/usr/share/ri/pg-1.3.5/PG/BasicTypeMapForQueries/BinaryData/cdesc-BinaryData.ri
    PG/BasicTypeMapForQueries/UndefinedEncoder/cdesc-UndefinedEncoder.ri => [/usr/src/tmp/gem-pg-buildroot]/usr/share/ri/pg-1.3.5/PG/BasicTypeMapForQueries/UndefinedEncoder/cdesc-UndefinedEncoder.ri
    PG/BasicTypeMapForQueries/cdesc-BasicTypeMapForQueries.ri => [/usr/src/tmp/gem-pg-buildroot]/usr/share/ri/pg-1.3.5/PG/BasicTypeMapForQueries/cdesc-BasicTypeMapForQueries.ri
    PG/BasicTypeMapForQueries/encode_array_as%3d-i.ri => [/usr/src/tmp/gem-pg-buildroot]/usr/share/ri/pg-1.3.5/PG/BasicTypeMapForQueries/encode_array_as%3d-i.ri
    PG/BasicTypeMapForQueries/encode_array_as-i.ri => [/usr/src/tmp/gem-pg-buildroot]/usr/share/ri/pg-1.3.5/PG/BasicTypeMapForQueries/encode_array_as-i.ri
    PG/BasicTypeMapForQueries/new-c.ri => [/usr/src/tmp/gem-pg-buildroot]/usr/share/ri/pg-1.3.5/PG/BasicTypeMapForQueries/new-c.ri
    PG/BasicTypeMapForResults/WarningTypeMap/cdesc-WarningTypeMap.ri => [/usr/src/tmp/gem-pg-buildroot]/usr/share/ri/pg-1.3.5/PG/BasicTypeMapForResults/WarningTypeMap/cdesc-WarningTypeMap.ri
    PG/BasicTypeMapForResults/WarningTypeMap/new-c.ri => [/usr/src/tmp/gem-pg-buildroot]/usr/share/ri/pg-1.3.5/PG/BasicTypeMapForResults/WarningTypeMap/new-c.ri
    PG/BasicTypeMapForResults/WarningTypeMap/typecast_result_value-i.ri => [/usr/src/tmp/gem-pg-buildroot]/usr/share/ri/pg-1.3.5/PG/BasicTypeMapForResults/WarningTypeMap/typecast_result_value-i.ri
    PG/BasicTypeMapForResults/cdesc-BasicTypeMapForResults.ri => [/usr/src/tmp/gem-pg-buildroot]/usr/share/ri/pg-1.3.5/PG/BasicTypeMapForResults/cdesc-BasicTypeMapForResults.ri
    PG/BasicTypeMapForResults/new-c.ri => [/usr/src/tmp/gem-pg-buildroot]/usr/share/ri/pg-1.3.5/PG/BasicTypeMapForResults/new-c.ri
    PG/BasicTypeRegistry/Checker/build_coder_maps-i.ri => [/usr/src/tmp/gem-pg-buildroot]/usr/share/ri/pg-1.3.5/PG/BasicTypeRegistry/Checker/build_coder_maps-i.ri
    PG/BasicTypeRegistry/Checker/cdesc-Checker.ri => [/usr/src/tmp/gem-pg-buildroot]/usr/share/ri/pg-1.3.5/PG/BasicTypeRegistry/Checker/cdesc-Checker.ri
    PG/BasicTypeRegistry/Checker/check_format_and_direction-i.ri => [/usr/src/tmp/gem-pg-buildroot]/usr/share/ri/pg-1.3.5/PG/BasicTypeRegistry/Checker/check_format_and_direction-i.ri
    PG/BasicTypeRegistry/CoderMap/cdesc-CoderMap.ri => [/usr/src/tmp/gem-pg-buildroot]/usr/share/ri/pg-1.3.5/PG/BasicTypeRegistry/CoderMap/cdesc-CoderMap.ri
    PG/BasicTypeRegistry/CoderMap/coder_by_name-i.ri => [/usr/src/tmp/gem-pg-buildroot]/usr/share/ri/pg-1.3.5/PG/BasicTypeRegistry/CoderMap/coder_by_name-i.ri
    PG/BasicTypeRegistry/CoderMap/coder_by_oid-i.ri => [/usr/src/tmp/gem-pg-buildroot]/usr/share/ri/pg-1.3.5/PG/BasicTypeRegistry/CoderMap/coder_by_oid-i.ri
    PG/BasicTypeRegistry/CoderMap/coders-i.ri => [/usr/src/tmp/gem-pg-buildroot]/usr/share/ri/pg-1.3.5/PG/BasicTypeRegistry/CoderMap/coders-i.ri
    PG/BasicTypeRegistry/CoderMap/coders_by_name-i.ri => [/usr/src/tmp/gem-pg-buildroot]/usr/share/ri/pg-1.3.5/PG/BasicTypeRegistry/CoderMap/coders_by_name-i.ri
    PG/BasicTypeRegistry/CoderMap/coders_by_oid-i.ri => [/usr/src/tmp/gem-pg-buildroot]/usr/share/ri/pg-1.3.5/PG/BasicTypeRegistry/CoderMap/coders_by_oid-i.ri
    PG/BasicTypeRegistry/CoderMap/new-c.ri => [/usr/src/tmp/gem-pg-buildroot]/usr/share/ri/pg-1.3.5/PG/BasicTypeRegistry/CoderMap/new-c.ri
    PG/BasicTypeRegistry/CoderMapsBundle/cdesc-CoderMapsBundle.ri => [/usr/src/tmp/gem-pg-buildroot]/usr/share/ri/pg-1.3.5/PG/BasicTypeRegistry/CoderMapsBundle/cdesc-CoderMapsBundle.ri
    PG/BasicTypeRegistry/CoderMapsBundle/each_format-i.ri => [/usr/src/tmp/gem-pg-buildroot]/usr/share/ri/pg-1.3.5/PG/BasicTypeRegistry/CoderMapsBundle/each_format-i.ri
    PG/BasicTypeRegistry/CoderMapsBundle/map_for-i.ri => [/usr/src/tmp/gem-pg-buildroot]/usr/share/ri/pg-1.3.5/PG/BasicTypeRegistry/CoderMapsBundle/map_for-i.ri
    PG/BasicTypeRegistry/CoderMapsBundle/new-c.ri => [/usr/src/tmp/gem-pg-buildroot]/usr/share/ri/pg-1.3.5/PG/BasicTypeRegistry/CoderMapsBundle/new-c.ri
    PG/BasicTypeRegistry/CoderMapsBundle/typenames_by_oid-i.ri => [/usr/src/tmp/gem-pg-buildroot]/usr/share/ri/pg-1.3.5/PG/BasicTypeRegistry/CoderMapsBundle/typenames_by_oid-i.ri
    PG/BasicTypeRegistry/alias_type-i.ri => [/usr/src/tmp/gem-pg-buildroot]/usr/share/ri/pg-1.3.5/PG/BasicTypeRegistry/alias_type-i.ri
    PG/BasicTypeRegistry/cdesc-BasicTypeRegistry.ri => [/usr/src/tmp/gem-pg-buildroot]/usr/share/ri/pg-1.3.5/PG/BasicTypeRegistry/cdesc-BasicTypeRegistry.ri
    PG/BasicTypeRegistry/coders_for-i.ri => [/usr/src/tmp/gem-pg-buildroot]/usr/share/ri/pg-1.3.5/PG/BasicTypeRegistry/coders_for-i.ri
    PG/BasicTypeRegistry/define_default_types-i.ri => [/usr/src/tmp/gem-pg-buildroot]/usr/share/ri/pg-1.3.5/PG/BasicTypeRegistry/define_default_types-i.ri
    PG/BasicTypeRegistry/new-c.ri => [/usr/src/tmp/gem-pg-buildroot]/usr/share/ri/pg-1.3.5/PG/BasicTypeRegistry/new-c.ri
    PG/BasicTypeRegistry/register_coder-i.ri => [/usr/src/tmp/gem-pg-buildroot]/usr/share/ri/pg-1.3.5/PG/BasicTypeRegistry/register_coder-i.ri
    PG/BasicTypeRegistry/register_default_types-i.ri => [/usr/src/tmp/gem-pg-buildroot]/usr/share/ri/pg-1.3.5/PG/BasicTypeRegistry/register_default_types-i.ri
    PG/BasicTypeRegistry/register_type-i.ri => [/usr/src/tmp/gem-pg-buildroot]/usr/share/ri/pg-1.3.5/PG/BasicTypeRegistry/register_type-i.ri
    PG/BinaryDecoder/TimestampLocal/cdesc-TimestampLocal.ri => [/usr/src/tmp/gem-pg-buildroot]/usr/share/ri/pg-1.3.5/PG/BinaryDecoder/TimestampLocal/cdesc-TimestampLocal.ri
    PG/BinaryDecoder/TimestampLocal/new-c.ri => [/usr/src/tmp/gem-pg-buildroot]/usr/share/ri/pg-1.3.5/PG/BinaryDecoder/TimestampLocal/new-c.ri
    PG/BinaryDecoder/TimestampUtc/cdesc-TimestampUtc.ri => [/usr/src/tmp/gem-pg-buildroot]/usr/share/ri/pg-1.3.5/PG/BinaryDecoder/TimestampUtc/cdesc-TimestampUtc.ri
    PG/BinaryDecoder/TimestampUtc/new-c.ri => [/usr/src/tmp/gem-pg-buildroot]/usr/share/ri/pg-1.3.5/PG/BinaryDecoder/TimestampUtc/new-c.ri
    PG/BinaryDecoder/TimestampUtcToLocal/cdesc-TimestampUtcToLocal.ri => [/usr/src/tmp/gem-pg-buildroot]/usr/share/ri/pg-1.3.5/PG/BinaryDecoder/TimestampUtcToLocal/cdesc-TimestampUtcToLocal.ri
    PG/BinaryDecoder/TimestampUtcToLocal/new-c.ri => [/usr/src/tmp/gem-pg-buildroot]/usr/share/ri/pg-1.3.5/PG/BinaryDecoder/TimestampUtcToLocal/new-c.ri
    PG/BinaryDecoder/cdesc-BinaryDecoder.ri => [/usr/src/tmp/gem-pg-buildroot]/usr/share/ri/pg-1.3.5/PG/BinaryDecoder/cdesc-BinaryDecoder.ri
    PG/Coder/%3d%3d-i.ri => [/usr/src/tmp/gem-pg-buildroot]/usr/share/ri/pg-1.3.5/PG/Coder/%3d%3d-i.ri
    PG/Coder/BinaryFormatting/cdesc-BinaryFormatting.ri => [/usr/src/tmp/gem-pg-buildroot]/usr/share/ri/pg-1.3.5/PG/Coder/BinaryFormatting/cdesc-BinaryFormatting.ri
    PG/Coder/BinaryFormatting/new-c.ri => [/usr/src/tmp/gem-pg-buildroot]/usr/share/ri/pg-1.3.5/PG/Coder/BinaryFormatting/new-c.ri
    PG/Coder/cdesc-Coder.ri => [/usr/src/tmp/gem-pg-buildroot]/usr/share/ri/pg-1.3.5/PG/Coder/cdesc-Coder.ri
    PG/Coder/dup-i.ri => [/usr/src/tmp/gem-pg-buildroot]/usr/share/ri/pg-1.3.5/PG/Coder/dup-i.ri
    PG/Coder/inspect-i.ri => [/usr/src/tmp/gem-pg-buildroot]/usr/share/ri/pg-1.3.5/PG/Coder/inspect-i.ri
    PG/Coder/inspect_short-i.ri => [/usr/src/tmp/gem-pg-buildroot]/usr/share/ri/pg-1.3.5/PG/Coder/inspect_short-i.ri
    PG/Coder/marshal_dump-i.ri => [/usr/src/tmp/gem-pg-buildroot]/usr/share/ri/pg-1.3.5/PG/Coder/marshal_dump-i.ri
    PG/Coder/marshal_load-i.ri => [/usr/src/tmp/gem-pg-buildroot]/usr/share/ri/pg-1.3.5/PG/Coder/marshal_load-i.ri
    PG/Coder/new-c.ri => [/usr/src/tmp/gem-pg-buildroot]/usr/share/ri/pg-1.3.5/PG/Coder/new-c.ri
    PG/Coder/to_h-i.ri => [/usr/src/tmp/gem-pg-buildroot]/usr/share/ri/pg-1.3.5/PG/Coder/to_h-i.ri
    PG/CompositeCoder/cdesc-CompositeCoder.ri => [/usr/src/tmp/gem-pg-buildroot]/usr/share/ri/pg-1.3.5/PG/CompositeCoder/cdesc-CompositeCoder.ri
    PG/CompositeCoder/inspect-i.ri => [/usr/src/tmp/gem-pg-buildroot]/usr/share/ri/pg-1.3.5/PG/CompositeCoder/inspect-i.ri
    PG/CompositeCoder/to_h-i.ri => [/usr/src/tmp/gem-pg-buildroot]/usr/share/ri/pg-1.3.5/PG/CompositeCoder/to_h-i.ri
    PG/Connection/async_api%3d-c.ri => [/usr/src/tmp/gem-pg-buildroot]/usr/share/ri/pg-1.3.5/PG/Connection/async_api%3d-c.ri
    PG/Connection/async_cancel-i.ri => [/usr/src/tmp/gem-pg-buildroot]/usr/share/ri/pg-1.3.5/PG/Connection/async_cancel-i.ri
    PG/Connection/async_connect-c.ri => [/usr/src/tmp/gem-pg-buildroot]/usr/share/ri/pg-1.3.5/PG/Connection/async_connect-c.ri
    PG/Connection/async_encrypt_password-i.ri => [/usr/src/tmp/gem-pg-buildroot]/usr/share/ri/pg-1.3.5/PG/Connection/async_encrypt_password-i.ri
    PG/Connection/async_get_copy_data-i.ri => [/usr/src/tmp/gem-pg-buildroot]/usr/share/ri/pg-1.3.5/PG/Connection/async_get_copy_data-i.ri
    PG/Connection/async_get_result-i.ri => [/usr/src/tmp/gem-pg-buildroot]/usr/share/ri/pg-1.3.5/PG/Connection/async_get_result-i.ri
    PG/Connection/async_isnonblocking-i.ri => [/usr/src/tmp/gem-pg-buildroot]/usr/share/ri/pg-1.3.5/PG/Connection/async_isnonblocking-i.ri
    PG/Connection/async_ping-c.ri => [/usr/src/tmp/gem-pg-buildroot]/usr/share/ri/pg-1.3.5/PG/Connection/async_ping-c.ri
    PG/Connection/async_put_copy_data-i.ri => [/usr/src/tmp/gem-pg-buildroot]/usr/share/ri/pg-1.3.5/PG/Connection/async_put_copy_data-i.ri
    PG/Connection/async_put_copy_end-i.ri => [/usr/src/tmp/gem-pg-buildroot]/usr/share/ri/pg-1.3.5/PG/Connection/async_put_copy_end-i.ri
    PG/Connection/async_reset-i.ri => [/usr/src/tmp/gem-pg-buildroot]/usr/share/ri/pg-1.3.5/PG/Connection/async_reset-i.ri
    PG/Connection/async_send_api%3d-c.ri => [/usr/src/tmp/gem-pg-buildroot]/usr/share/ri/pg-1.3.5/PG/Connection/async_send_api%3d-c.ri
    PG/Connection/async_setnonblocking-i.ri => [/usr/src/tmp/gem-pg-buildroot]/usr/share/ri/pg-1.3.5/PG/Connection/async_setnonblocking-i.ri
    PG/Connection/cancel-i.ri => [/usr/src/tmp/gem-pg-buildroot]/usr/share/ri/pg-1.3.5/PG/Connection/cancel-i.ri
    PG/Connection/cdesc-Connection.ri => [/usr/src/tmp/gem-pg-buildroot]/usr/share/ri/pg-1.3.5/PG/Connection/cdesc-Connection.ri
    PG/Connection/conndefaults-i.ri => [/usr/src/tmp/gem-pg-buildroot]/usr/share/ri/pg-1.3.5/PG/Connection/conndefaults-i.ri
    PG/Connection/conndefaults_hash-c.ri => [/usr/src/tmp/gem-pg-buildroot]/usr/share/ri/pg-1.3.5/PG/Connection/conndefaults_hash-c.ri
    PG/Connection/conndefaults_hash-i.ri => [/usr/src/tmp/gem-pg-buildroot]/usr/share/ri/pg-1.3.5/PG/Connection/conndefaults_hash-i.ri
    PG/Connection/connect-c.ri => [/usr/src/tmp/gem-pg-buildroot]/usr/share/ri/pg-1.3.5/PG/Connection/connect-c.ri
    PG/Connection/connect_hash_to_string-c.ri => [/usr/src/tmp/gem-pg-buildroot]/usr/share/ri/pg-1.3.5/PG/Connection/connect_hash_to_string-c.ri
    PG/Connection/connect_string_to_hash-c.ri => [/usr/src/tmp/gem-pg-buildroot]/usr/share/ri/pg-1.3.5/PG/Connection/connect_string_to_hash-c.ri
    PG/Connection/conninfo_hash-i.ri => [/usr/src/tmp/gem-pg-buildroot]/usr/share/ri/pg-1.3.5/PG/Connection/conninfo_hash-i.ri
    PG/Connection/copy_data-i.ri => [/usr/src/tmp/gem-pg-buildroot]/usr/share/ri/pg-1.3.5/PG/Connection/copy_data-i.ri
    PG/Connection/encrypt_password-i.ri => [/usr/src/tmp/gem-pg-buildroot]/usr/share/ri/pg-1.3.5/PG/Connection/encrypt_password-i.ri
    PG/Connection/get_copy_data-i.ri => [/usr/src/tmp/gem-pg-buildroot]/usr/share/ri/pg-1.3.5/PG/Connection/get_copy_data-i.ri
    PG/Connection/get_result-i.ri => [/usr/src/tmp/gem-pg-buildroot]/usr/share/ri/pg-1.3.5/PG/Connection/get_result-i.ri
    PG/Connection/isnonblocking-i.ri => [/usr/src/tmp/gem-pg-buildroot]/usr/share/ri/pg-1.3.5/PG/Connection/isnonblocking-i.ri
    PG/Connection/new-c.ri => [/usr/src/tmp/gem-pg-buildroot]/usr/share/ri/pg-1.3.5/PG/Connection/new-c.ri
    PG/Connection/nonblocking%3f-i.ri => [/usr/src/tmp/gem-pg-buildroot]/usr/share/ri/pg-1.3.5/PG/Connection/nonblocking%3f-i.ri
    PG/Connection/open-c.ri => [/usr/src/tmp/gem-pg-buildroot]/usr/share/ri/pg-1.3.5/PG/Connection/open-c.ri
    PG/Connection/parse_connect_args-c.ri => [/usr/src/tmp/gem-pg-buildroot]/usr/share/ri/pg-1.3.5/PG/Connection/parse_connect_args-c.ri
    PG/Connection/ping-c.ri => [/usr/src/tmp/gem-pg-buildroot]/usr/share/ri/pg-1.3.5/PG/Connection/ping-c.ri
    PG/Connection/put_copy_data-i.ri => [/usr/src/tmp/gem-pg-buildroot]/usr/share/ri/pg-1.3.5/PG/Connection/put_copy_data-i.ri
    PG/Connection/put_copy_end-i.ri => [/usr/src/tmp/gem-pg-buildroot]/usr/share/ri/pg-1.3.5/PG/Connection/put_copy_end-i.ri
    PG/Connection/quote_connstr-c.ri => [/usr/src/tmp/gem-pg-buildroot]/usr/share/ri/pg-1.3.5/PG/Connection/quote_connstr-c.ri
    PG/Connection/reset-i.ri => [/usr/src/tmp/gem-pg-buildroot]/usr/share/ri/pg-1.3.5/PG/Connection/reset-i.ri
    PG/Connection/setdb-c.ri => [/usr/src/tmp/gem-pg-buildroot]/usr/share/ri/pg-1.3.5/PG/Connection/setdb-c.ri
    PG/Connection/setdblogin-c.ri => [/usr/src/tmp/gem-pg-buildroot]/usr/share/ri/pg-1.3.5/PG/Connection/setdblogin-c.ri
    PG/Connection/setnonblocking-i.ri => [/usr/src/tmp/gem-pg-buildroot]/usr/share/ri/pg-1.3.5/PG/Connection/setnonblocking-i.ri
    PG/Connection/ssl_attributes-i.ri => [/usr/src/tmp/gem-pg-buildroot]/usr/share/ri/pg-1.3.5/PG/Connection/ssl_attributes-i.ri
    PG/Connection/transaction-i.ri => [/usr/src/tmp/gem-pg-buildroot]/usr/share/ri/pg-1.3.5/PG/Connection/transaction-i.ri
    PG/Constants/cdesc-Constants.ri => [/usr/src/tmp/gem-pg-buildroot]/usr/share/ri/pg-1.3.5/PG/Constants/cdesc-Constants.ri
    PG/CopyCoder/cdesc-CopyCoder.ri => [/usr/src/tmp/gem-pg-buildroot]/usr/share/ri/pg-1.3.5/PG/CopyCoder/cdesc-CopyCoder.ri
    PG/CopyCoder/to_h-i.ri => [/usr/src/tmp/gem-pg-buildroot]/usr/share/ri/pg-1.3.5/PG/CopyCoder/to_h-i.ri
    PG/Error/cdesc-Error.ri => [/usr/src/tmp/gem-pg-buildroot]/usr/share/ri/pg-1.3.5/PG/Error/cdesc-Error.ri
    PG/NotAllCopyDataRetrieved/cdesc-NotAllCopyDataRetrieved.ri => [/usr/src/tmp/gem-pg-buildroot]/usr/share/ri/pg-1.3.5/PG/NotAllCopyDataRetrieved/cdesc-NotAllCopyDataRetrieved.ri
    PG/NotInBlockingMode/cdesc-NotInBlockingMode.ri => [/usr/src/tmp/gem-pg-buildroot]/usr/share/ri/pg-1.3.5/PG/NotInBlockingMode/cdesc-NotInBlockingMode.ri
    PG/RecordCoder/cdesc-RecordCoder.ri => [/usr/src/tmp/gem-pg-buildroot]/usr/share/ri/pg-1.3.5/PG/RecordCoder/cdesc-RecordCoder.ri
    PG/RecordCoder/to_h-i.ri => [/usr/src/tmp/gem-pg-buildroot]/usr/share/ri/pg-1.3.5/PG/RecordCoder/to_h-i.ri
    PG/Result/cdesc-Result.ri => [/usr/src/tmp/gem-pg-buildroot]/usr/share/ri/pg-1.3.5/PG/Result/cdesc-Result.ri
    PG/Result/field_names_as-i.ri => [/usr/src/tmp/gem-pg-buildroot]/usr/share/ri/pg-1.3.5/PG/Result/field_names_as-i.ri
    PG/Result/inspect-i.ri => [/usr/src/tmp/gem-pg-buildroot]/usr/share/ri/pg-1.3.5/PG/Result/inspect-i.ri
    PG/Result/map_types%21-i.ri => [/usr/src/tmp/gem-pg-buildroot]/usr/share/ri/pg-1.3.5/PG/Result/map_types%21-i.ri
    PG/TextDecoder/Date/cdesc-Date.ri => [/usr/src/tmp/gem-pg-buildroot]/usr/share/ri/pg-1.3.5/PG/TextDecoder/Date/cdesc-Date.ri
    PG/TextDecoder/Date/decode-i.ri => [/usr/src/tmp/gem-pg-buildroot]/usr/share/ri/pg-1.3.5/PG/TextDecoder/Date/decode-i.ri
    PG/TextDecoder/JSON/cdesc-JSON.ri => [/usr/src/tmp/gem-pg-buildroot]/usr/share/ri/pg-1.3.5/PG/TextDecoder/JSON/cdesc-JSON.ri
    PG/TextDecoder/JSON/decode-i.ri => [/usr/src/tmp/gem-pg-buildroot]/usr/share/ri/pg-1.3.5/PG/TextDecoder/JSON/decode-i.ri
    PG/TextDecoder/TimestampLocal/cdesc-TimestampLocal.ri => [/usr/src/tmp/gem-pg-buildroot]/usr/share/ri/pg-1.3.5/PG/TextDecoder/TimestampLocal/cdesc-TimestampLocal.ri
    PG/TextDecoder/TimestampLocal/new-c.ri => [/usr/src/tmp/gem-pg-buildroot]/usr/share/ri/pg-1.3.5/PG/TextDecoder/TimestampLocal/new-c.ri
    PG/TextDecoder/TimestampUtc/cdesc-TimestampUtc.ri => [/usr/src/tmp/gem-pg-buildroot]/usr/share/ri/pg-1.3.5/PG/TextDecoder/TimestampUtc/cdesc-TimestampUtc.ri
    PG/TextDecoder/TimestampUtc/new-c.ri => [/usr/src/tmp/gem-pg-buildroot]/usr/share/ri/pg-1.3.5/PG/TextDecoder/TimestampUtc/new-c.ri
    PG/TextDecoder/TimestampUtcToLocal/cdesc-TimestampUtcToLocal.ri => [/usr/src/tmp/gem-pg-buildroot]/usr/share/ri/pg-1.3.5/PG/TextDecoder/TimestampUtcToLocal/cdesc-TimestampUtcToLocal.ri
    PG/TextDecoder/TimestampUtcToLocal/new-c.ri => [/usr/src/tmp/gem-pg-buildroot]/usr/share/ri/pg-1.3.5/PG/TextDecoder/TimestampUtcToLocal/new-c.ri
    PG/TextDecoder/TimestampWithoutTimeZone/cdesc-TimestampWithoutTimeZone.ri => [/usr/src/tmp/gem-pg-buildroot]/usr/share/ri/pg-1.3.5/PG/TextDecoder/TimestampWithoutTimeZone/cdesc-TimestampWithoutTimeZone.ri
    PG/TextDecoder/TimestampWithoutTimeZone/new-c.ri => [/usr/src/tmp/gem-pg-buildroot]/usr/share/ri/pg-1.3.5/PG/TextDecoder/TimestampWithoutTimeZone/new-c.ri
    PG/TextDecoder/cdesc-TextDecoder.ri => [/usr/src/tmp/gem-pg-buildroot]/usr/share/ri/pg-1.3.5/PG/TextDecoder/cdesc-TextDecoder.ri
    PG/TextEncoder/Date/cdesc-Date.ri => [/usr/src/tmp/gem-pg-buildroot]/usr/share/ri/pg-1.3.5/PG/TextEncoder/Date/cdesc-Date.ri
    PG/TextEncoder/Date/encode-i.ri => [/usr/src/tmp/gem-pg-buildroot]/usr/share/ri/pg-1.3.5/PG/TextEncoder/Date/encode-i.ri
    PG/TextEncoder/Inet/cdesc-Inet.ri => [/usr/src/tmp/gem-pg-buildroot]/usr/share/ri/pg-1.3.5/PG/TextEncoder/Inet/cdesc-Inet.ri
    PG/TextEncoder/Inet/encode-i.ri => [/usr/src/tmp/gem-pg-buildroot]/usr/share/ri/pg-1.3.5/PG/TextEncoder/Inet/encode-i.ri
    PG/TextEncoder/JSON/cdesc-JSON.ri => [/usr/src/tmp/gem-pg-buildroot]/usr/share/ri/pg-1.3.5/PG/TextEncoder/JSON/cdesc-JSON.ri
    PG/TextEncoder/JSON/encode-i.ri => [/usr/src/tmp/gem-pg-buildroot]/usr/share/ri/pg-1.3.5/PG/TextEncoder/JSON/encode-i.ri
    PG/TextEncoder/TimestampUtc/cdesc-TimestampUtc.ri => [/usr/src/tmp/gem-pg-buildroot]/usr/share/ri/pg-1.3.5/PG/TextEncoder/TimestampUtc/cdesc-TimestampUtc.ri
    PG/TextEncoder/TimestampUtc/encode-i.ri => [/usr/src/tmp/gem-pg-buildroot]/usr/share/ri/pg-1.3.5/PG/TextEncoder/TimestampUtc/encode-i.ri
    PG/TextEncoder/TimestampWithTimeZone/cdesc-TimestampWithTimeZone.ri => [/usr/src/tmp/gem-pg-buildroot]/usr/share/ri/pg-1.3.5/PG/TextEncoder/TimestampWithTimeZone/cdesc-TimestampWithTimeZone.ri
    PG/TextEncoder/TimestampWithTimeZone/encode-i.ri => [/usr/src/tmp/gem-pg-buildroot]/usr/share/ri/pg-1.3.5/PG/TextEncoder/TimestampWithTimeZone/encode-i.ri
    PG/TextEncoder/TimestampWithoutTimeZone/cdesc-TimestampWithoutTimeZone.ri => [/usr/src/tmp/gem-pg-buildroot]/usr/share/ri/pg-1.3.5/PG/TextEncoder/TimestampWithoutTimeZone/cdesc-TimestampWithoutTimeZone.ri
    PG/TextEncoder/TimestampWithoutTimeZone/encode-i.ri => [/usr/src/tmp/gem-pg-buildroot]/usr/share/ri/pg-1.3.5/PG/TextEncoder/TimestampWithoutTimeZone/encode-i.ri
    PG/TextEncoder/cdesc-TextEncoder.ri => [/usr/src/tmp/gem-pg-buildroot]/usr/share/ri/pg-1.3.5/PG/TextEncoder/cdesc-TextEncoder.ri
    PG/Tuple/cdesc-Tuple.ri => [/usr/src/tmp/gem-pg-buildroot]/usr/share/ri/pg-1.3.5/PG/Tuple/cdesc-Tuple.ri
    PG/Tuple/each_key-i.ri => [/usr/src/tmp/gem-pg-buildroot]/usr/share/ri/pg-1.3.5/PG/Tuple/each_key-i.ri
    PG/Tuple/has_key%3f-i.ri => [/usr/src/tmp/gem-pg-buildroot]/usr/share/ri/pg-1.3.5/PG/Tuple/has_key%3f-i.ri
    PG/Tuple/inspect-i.ri => [/usr/src/tmp/gem-pg-buildroot]/usr/share/ri/pg-1.3.5/PG/Tuple/inspect-i.ri
    PG/Tuple/key%3f-i.ri => [/usr/src/tmp/gem-pg-buildroot]/usr/share/ri/pg-1.3.5/PG/Tuple/key%3f-i.ri
    PG/Tuple/keys-i.ri => [/usr/src/tmp/gem-pg-buildroot]/usr/share/ri/pg-1.3.5/PG/Tuple/keys-i.ri
    PG/TypeMapByColumn/cdesc-TypeMapByColumn.ri => [/usr/src/tmp/gem-pg-buildroot]/usr/share/ri/pg-1.3.5/PG/TypeMapByColumn/cdesc-TypeMapByColumn.ri
    PG/TypeMapByColumn/inspect-i.ri => [/usr/src/tmp/gem-pg-buildroot]/usr/share/ri/pg-1.3.5/PG/TypeMapByColumn/inspect-i.ri
    PG/TypeMapByColumn/oids-i.ri => [/usr/src/tmp/gem-pg-buildroot]/usr/share/ri/pg-1.3.5/PG/TypeMapByColumn/oids-i.ri
    PG/cdesc-PG.ri => [/usr/src/tmp/gem-pg-buildroot]/usr/share/ri/pg-1.3.5/PG/cdesc-PG.ri
    PG/connect-c.ri => [/usr/src/tmp/gem-pg-buildroot]/usr/share/ri/pg-1.3.5/PG/connect-c.ri
    PG/version_string-c.ri => [/usr/src/tmp/gem-pg-buildroot]/usr/share/ri/pg-1.3.5/PG/version_string-c.ri
    cache.ri => [/usr/src/tmp/gem-pg-buildroot]/usr/share/ri/pg-1.3.5/cache.ri
* {inc} ->
  % pg < ext
    gvl_wrappers.h => [/usr/src/tmp/gem-pg-buildroot]/usr/include/gvl_wrappers.h
    pg.h => [/usr/src/tmp/gem-pg-buildroot]/usr/include/pg.h
    pg_util.h => [/usr/src/tmp/gem-pg-buildroot]/usr/include/pg_util.h
    /usr/include -> [/usr/src/tmp/gem-pg-buildroot]/usr/lib/ruby/gemie/gems/pg-1.3.5/ext
* {app} ->
* {log} ->
* {state} ->
* {test} ->
  % pg < spec
* {sup} ->
  % pg < sample
    array_insert.rb => [/usr/src/tmp/gem-pg-buildroot]/usr/lib/ruby/gemie/gems/pg-1.3.5/sample/array_insert.rb
    async_api.rb => [/usr/src/tmp/gem-pg-buildroot]/usr/lib/ruby/gemie/gems/pg-1.3.5/sample/async_api.rb
    async_copyto.rb => [/usr/src/tmp/gem-pg-buildroot]/usr/lib/ruby/gemie/gems/pg-1.3.5/sample/async_copyto.rb
    async_mixed.rb => [/usr/src/tmp/gem-pg-buildroot]/usr/lib/ruby/gemie/gems/pg-1.3.5/sample/async_mixed.rb
    check_conn.rb => [/usr/src/tmp/gem-pg-buildroot]/usr/lib/ruby/gemie/gems/pg-1.3.5/sample/check_conn.rb
    copydata.rb => [/usr/src/tmp/gem-pg-buildroot]/usr/lib/ruby/gemie/gems/pg-1.3.5/sample/copydata.rb
    copyfrom.rb => [/usr/src/tmp/gem-pg-buildroot]/usr/lib/ruby/gemie/gems/pg-1.3.5/sample/copyfrom.rb
    copyto.rb => [/usr/src/tmp/gem-pg-buildroot]/usr/lib/ruby/gemie/gems/pg-1.3.5/sample/copyto.rb
    cursor.rb => [/usr/src/tmp/gem-pg-buildroot]/usr/lib/ruby/gemie/gems/pg-1.3.5/sample/cursor.rb
    disk_usage_report.rb => [/usr/src/tmp/gem-pg-buildroot]/usr/lib/ruby/gemie/gems/pg-1.3.5/sample/disk_usage_report.rb
    issue-119.rb => [/usr/src/tmp/gem-pg-buildroot]/usr/lib/ruby/gemie/gems/pg-1.3.5/sample/issue-119.rb
    losample.rb => [/usr/src/tmp/gem-pg-buildroot]/usr/lib/ruby/gemie/gems/pg-1.3.5/sample/losample.rb
    minimal-testcase.rb => [/usr/src/tmp/gem-pg-buildroot]/usr/lib/ruby/gemie/gems/pg-1.3.5/sample/minimal-testcase.rb
    notify_wait.rb => [/usr/src/tmp/gem-pg-buildroot]/usr/lib/ruby/gemie/gems/pg-1.3.5/sample/notify_wait.rb
    pg_statistics.rb => [/usr/src/tmp/gem-pg-buildroot]/usr/lib/ruby/gemie/gems/pg-1.3.5/sample/pg_statistics.rb
    replication_monitor.rb => [/usr/src/tmp/gem-pg-buildroot]/usr/lib/ruby/gemie/gems/pg-1.3.5/sample/replication_monitor.rb
    test_binary_values.rb => [/usr/src/tmp/gem-pg-buildroot]/usr/lib/ruby/gemie/gems/pg-1.3.5/sample/test_binary_values.rb
    wal_shipper.rb => [/usr/src/tmp/gem-pg-buildroot]/usr/lib/ruby/gemie/gems/pg-1.3.5/sample/wal_shipper.rb
    warehouse_partitions.rb => [/usr/src/tmp/gem-pg-buildroot]/usr/lib/ruby/gemie/gems/pg-1.3.5/sample/warehouse_partitions.rb
* {conf} ->
* {data} ->
  % pg < .
    .appveyor.yml => [/usr/src/tmp/gem-pg-buildroot]/usr/lib/ruby/gemie/gems/pg-1.3.5/.appveyor.yml
    .gems => [/usr/src/tmp/gem-pg-buildroot]/usr/lib/ruby/gemie/gems/pg-1.3.5/.gems
    .gemtest => [/usr/src/tmp/gem-pg-buildroot]/usr/lib/ruby/gemie/gems/pg-1.3.5/.gemtest
    .github/workflows/binary-gems.yml => [/usr/src/tmp/gem-pg-buildroot]/usr/lib/ruby/gemie/gems/pg-1.3.5/.github/workflows/binary-gems.yml
    .github/workflows/source-gem.yml => [/usr/src/tmp/gem-pg-buildroot]/usr/lib/ruby/gemie/gems/pg-1.3.5/.github/workflows/source-gem.yml
    .gitignore => [/usr/src/tmp/gem-pg-buildroot]/usr/lib/ruby/gemie/gems/pg-1.3.5/.gitignore
    .hgsigs => [/usr/src/tmp/gem-pg-buildroot]/usr/lib/ruby/gemie/gems/pg-1.3.5/.hgsigs
    .hgtags => [/usr/src/tmp/gem-pg-buildroot]/usr/lib/ruby/gemie/gems/pg-1.3.5/.hgtags
    .irbrc => [/usr/src/tmp/gem-pg-buildroot]/usr/lib/ruby/gemie/gems/pg-1.3.5/.irbrc
    .pryrc => [/usr/src/tmp/gem-pg-buildroot]/usr/lib/ruby/gemie/gems/pg-1.3.5/.pryrc
    .tm_properties => [/usr/src/tmp/gem-pg-buildroot]/usr/lib/ruby/gemie/gems/pg-1.3.5/.tm_properties
    .travis.yml => [/usr/src/tmp/gem-pg-buildroot]/usr/lib/ruby/gemie/gems/pg-1.3.5/.travis.yml
    BSDL => [/usr/src/tmp/gem-pg-buildroot]/usr/lib/ruby/gemie/gems/pg-1.3.5/BSDL
    Contributors.rdoc => [/usr/src/tmp/gem-pg-buildroot]/usr/lib/ruby/gemie/gems/pg-1.3.5/Contributors.rdoc
    Gemfile => [/usr/src/tmp/gem-pg-buildroot]/usr/lib/ruby/gemie/gems/pg-1.3.5/Gemfile
    History.rdoc => [/usr/src/tmp/gem-pg-buildroot]/usr/lib/ruby/gemie/gems/pg-1.3.5/History.rdoc
    LICENSE => [/usr/src/tmp/gem-pg-buildroot]/usr/lib/ruby/gemie/gems/pg-1.3.5/LICENSE
    Manifest.txt => [/usr/src/tmp/gem-pg-buildroot]/usr/lib/ruby/gemie/gems/pg-1.3.5/Manifest.txt
    POSTGRES => [/usr/src/tmp/gem-pg-buildroot]/usr/lib/ruby/gemie/gems/pg-1.3.5/POSTGRES
    README-OS_X.rdoc => [/usr/src/tmp/gem-pg-buildroot]/usr/lib/ruby/gemie/gems/pg-1.3.5/README-OS_X.rdoc
    README-Windows.rdoc => [/usr/src/tmp/gem-pg-buildroot]/usr/lib/ruby/gemie/gems/pg-1.3.5/README-Windows.rdoc
    README.ja.rdoc => [/usr/src/tmp/gem-pg-buildroot]/usr/lib/ruby/gemie/gems/pg-1.3.5/README.ja.rdoc
    README.rdoc => [/usr/src/tmp/gem-pg-buildroot]/usr/lib/ruby/gemie/gems/pg-1.3.5/README.rdoc
    Rakefile => [/usr/src/tmp/gem-pg-buildroot]/usr/lib/ruby/gemie/gems/pg-1.3.5/Rakefile
    Rakefile.cross => [/usr/src/tmp/gem-pg-buildroot]/usr/lib/ruby/gemie/gems/pg-1.3.5/Rakefile.cross
    certs/ged.pem => [/usr/src/tmp/gem-pg-buildroot]/usr/lib/ruby/gemie/gems/pg-1.3.5/certs/ged.pem
    certs/larskanis-2022.pem => [/usr/src/tmp/gem-pg-buildroot]/usr/lib/ruby/gemie/gems/pg-1.3.5/certs/larskanis-2022.pem
    misc/openssl-pg-segfault.rb => [/usr/src/tmp/gem-pg-buildroot]/usr/lib/ruby/gemie/gems/pg-1.3.5/misc/openssl-pg-segfault.rb
    misc/postgres/History.txt => [/usr/src/tmp/gem-pg-buildroot]/usr/lib/ruby/gemie/gems/pg-1.3.5/misc/postgres/History.txt
    misc/postgres/Manifest.txt => [/usr/src/tmp/gem-pg-buildroot]/usr/lib/ruby/gemie/gems/pg-1.3.5/misc/postgres/Manifest.txt
    misc/postgres/README.txt => [/usr/src/tmp/gem-pg-buildroot]/usr/lib/ruby/gemie/gems/pg-1.3.5/misc/postgres/README.txt
    misc/postgres/Rakefile => [/usr/src/tmp/gem-pg-buildroot]/usr/lib/ruby/gemie/gems/pg-1.3.5/misc/postgres/Rakefile
    misc/postgres/lib/postgres.rb => [/usr/src/tmp/gem-pg-buildroot]/usr/lib/ruby/gemie/gems/pg-1.3.5/misc/postgres/lib/postgres.rb
    misc/ruby-pg/History.txt => [/usr/src/tmp/gem-pg-buildroot]/usr/lib/ruby/gemie/gems/pg-1.3.5/misc/ruby-pg/History.txt
    misc/ruby-pg/Manifest.txt => [/usr/src/tmp/gem-pg-buildroot]/usr/lib/ruby/gemie/gems/pg-1.3.5/misc/ruby-pg/Manifest.txt
    misc/ruby-pg/README.txt => [/usr/src/tmp/gem-pg-buildroot]/usr/lib/ruby/gemie/gems/pg-1.3.5/misc/ruby-pg/README.txt
    misc/ruby-pg/Rakefile => [/usr/src/tmp/gem-pg-buildroot]/usr/lib/ruby/gemie/gems/pg-1.3.5/misc/ruby-pg/Rakefile
    misc/ruby-pg/lib/ruby/pg.rb => [/usr/src/tmp/gem-pg-buildroot]/usr/lib/ruby/gemie/gems/pg-1.3.5/misc/ruby-pg/lib/ruby/pg.rb
    pg.gemspec => [/usr/src/tmp/gem-pg-buildroot]/usr/lib/ruby/gemie/gems/pg-1.3.5/pg.gemspec
    rakelib/task_extension.rb => [/usr/src/tmp/gem-pg-buildroot]/usr/lib/ruby/gemie/gems/pg-1.3.5/rakelib/task_extension.rb
* {.gemspec} ->
  %pg
    /usr/src/tmp/gemspec.20230901-2208211-bar7n0 => [/usr/src/tmp/gem-pg-buildroot]/usr/lib/ruby/gemie/specifications/pg-1.3.5.gemspec
* {gemfile} ->
  %pg
    /usr/src/tmp/Gemfile.20230901-2208211-d967xy => [/usr/src/tmp/gem-pg-buildroot]/usr/lib/ruby/gemie/gems/pg-1.3.5/Gemfile
* scheme
{pg}
  /usr/src/RPM/BUILD/gem-pg-1.3.5/.so.pg/usr/local/lib64/ruby/pg_ext.so => /usr/src/tmp/gem-pg-buildroot/usr/lib64/ruby/gemie/extensions/pg-1.3.5/pg_ext.so
  /usr/lib64/ruby/gemie/extensions/pg-1.3.5/pg_ext.so -> /usr/src/tmp/gem-pg-buildroot/usr/lib/ruby/gemie/gems/pg-1.3.5/lib/pg_ext.so
  >> /usr/src/tmp/gem-pg-buildroot/usr/lib64/ruby/gemie/extensions/pg-1.3.5/gem.build_complete

+ /usr/lib/rpm/brp-alt
Cleaning files in /usr/src/tmp/gem-pg-buildroot (auto)
removed './usr/lib/ruby/gemie/gems/pg-1.3.5/.gitignore'
mode of './usr/lib64/ruby/gemie/extensions/pg-1.3.5/pg_ext.so' changed from 0755 (rwxr-xr-x) to 0644 (rw-r--r--)
Verifying and fixing files in /usr/src/tmp/gem-pg-buildroot (binconfig,pkgconfig,libtool,desktop,gnuconfig)
Checking contents of files in /usr/src/tmp/gem-pg-buildroot/ (default)
Compressing files in /usr/src/tmp/gem-pg-buildroot (auto)
Adjusting library links in /usr/src/tmp/gem-pg-buildroot
./usr/lib64: (from <cmdline>:0)
./usr/lib: (from <cmdline>:0)
./usr/lib/ruby/gemie/gems/pg-1.3.5/misc/ruby-pg/lib: (from <cmdline>:0)
./usr/lib/ruby/gemie/gems/pg-1.3.5/misc/postgres/lib: (from <cmdline>:0)
./usr/lib/ruby/gemie/gems/pg-1.3.5/lib: (from <cmdline>:0)
debugedit: ./usr/lib64/ruby/gemie/extensions/pg-1.3.5/pg_ext.so: DWARF version 0 unhandled
Verifying ELF objects in /usr/src/tmp/gem-pg-buildroot (arch=normal,fhs=normal,lfs=relaxed,lint=relaxed,rpath=normal,stack=normal,textrel=normal,unresolved=normal)
Executing(%check): /bin/sh -e /usr/src/tmp/rpm-tmp.7617
+ umask 022
+ /bin/mkdir -p /usr/src/RPM/BUILD
+ cd /usr/src/RPM/BUILD
+ cd gem-pg-1.3.5
+ /usr/bin/ruby -rvendor-specific /usr/bin/setup.rb test
(ruby 3.1.2 x86_64-linux)
[setup.rb][INFO]> Source list are the following:
[setup.rb][INFO]> V *pg:1.3.5 [/usr/src/RPM/BUILD/gem-pg-1.3.5/pg.gemspec]
[setup.rb][INFO]> X ^ruby-pg [/usr/src/RPM/BUILD/gem-pg-1.3.5/misc/ruby-pg/Rakefile]
[setup.rb][INFO]> - *postgres:0.8.0 [/usr/src/RPM/BUILD/gem-pg-1.3.5/misc/postgres/Rakefile]

+ exit 0
Processing files: gem-pg-1.3.5-alt1
Executing(%doc): /bin/sh -e /usr/src/tmp/rpm-tmp.7617
+ umask 022
+ /bin/mkdir -p /usr/src/RPM/BUILD
+ cd /usr/src/RPM/BUILD
+ cd gem-pg-1.3.5
+ DOCDIR=/usr/src/tmp/gem-pg-buildroot/usr/share/doc/gem-pg-1.3.5
+ export DOCDIR
+ rm -rf /usr/src/tmp/gem-pg-buildroot/usr/share/doc/gem-pg-1.3.5
+ /bin/mkdir -p /usr/src/tmp/gem-pg-buildroot/usr/share/doc/gem-pg-1.3.5
+ cp -prL README.rdoc README.ja.rdoc /usr/src/tmp/gem-pg-buildroot/usr/share/doc/gem-pg-1.3.5
+ chmod -R go-w /usr/src/tmp/gem-pg-buildroot/usr/share/doc/gem-pg-1.3.5
+ chmod -R a+rX /usr/src/tmp/gem-pg-buildroot/usr/share/doc/gem-pg-1.3.5
+ exit 0
warning: absolute symlink: /usr/src/tmp/gem-pg-buildroot/usr/lib/ruby/gemie/gems/pg-1.3.5/ext -> /usr/include
warning: absolute symlink: /usr/src/tmp/gem-pg-buildroot/usr/lib/ruby/gemie/gems/pg-1.3.5/lib/pg_ext.so -> /usr/lib64/ruby/gemie/extensions/pg-1.3.5/pg_ext.so
Finding Provides (using /usr/lib/rpm/find-provides)
Executing: /bin/sh -e /usr/src/tmp/rpm-tmp.vvuzj4
find-provides: running scripts (alternatives,debuginfo,lib,pam,perl,pkgconfig,python,python3,ruby,shell)
ruby.prov: detecting ruby provides for gem-pg...
ruby.prov: project file is '/usr/src/RPM/BUILD/gem-pg-1.3.5/SetupConfig'
ruby.prov: setup.rb provides --install_prefix=/usr/src/tmp/gem-pg-buildroot --package=gem-pg -q
(ruby 3.1.2 x86_64-linux)
* provs ->
  - [pg]
    [lib]:
      gem(pg) = 1.3.5
Finding Requires (using /usr/lib/rpm/find-requires)
Executing: /bin/sh -e /usr/src/tmp/rpm-tmp.jvk6jv
find-requires: running scripts (cpp,debuginfo,files,lib,pam,perl,pkgconfig,pkgconfiglib,python,python3,rpmlib,ruby,shebang,shell,static,symlinks,systemd-services)
ruby.req: detecting ruby requires for gem-pg...
ruby.req: ruby project file is '/usr/src/RPM/BUILD/gem-pg-1.3.5/SetupConfig'
ruby.req: setup.rb requires --install_prefix=/usr/src/tmp/gem-pg-buildroot --package=gem-pg -q
(ruby 3.1.2 x86_64-linux)
* reqs ->
  - [pg]
    [lib]:
      
      ruby >= 0
      rubygems >= 0
Provides: ruby-pg = 1.3.5-alt1, gem(pg) = 1.3.5
Requires: libc.so.6(GLIBC_2.14)(64bit), libc.so.6(GLIBC_2.2.5)(64bit), libc.so.6(GLIBC_2.3)(64bit), libc.so.6(GLIBC_2.3.4)(64bit), libc.so.6(GLIBC_2.4)(64bit), libm.so.6(GLIBC_2.2.5)(64bit), libm.so.6(GLIBC_2.29)(64bit), libpq.so.5()(64bit) >= set:leafCch7MUjTAjklTd3KVOB3mdDkIGl6ZLQzZ87AQgYNuRoXhxhNEcZ18TZDEFI0zXtwuBTOaqXX7BCA6GdxscfWkZgZ6ELgRFcPqFA7pOf3NrXaHhBKtIF66TWyyRs1sjWolW070PyENh7W5wqJtnBmzH9OJjo1rfFFjJO7kdUaHgb4B6QuzxLcX13wdI1NfrDGh9pSmWrfL1RxWcigQrM8SpqYP5U6k9SxAD0L7q5Dgq6QRIlZuYb4ZcKRhi1LXSbRn1, libruby.so.3.1()(64bit) >= set:ogmlcJghfxb30m3IE6LZyHTLACRXbAhDb8eo613beGwYmyBSK6G1pxYQHvW1S51zVH2G4fuwgg4CU1yQhF0KLTt9mzz4nSVyHxLuiPqoINBfHE4hULg0gS7MMqnhzhDa60FeCNurWjhaz1qyFSdnGMX7Ib0ouMxtqhPX5Km3FpBy1cN4s6YO0RR4eyFDu6eq2v3VFWR2gH7Rlhf7FHZ2FBtZJ4oJ4rGv25fffzR7P9qJ74An2rqJW7xl6F7SPMCjdN0CaQnUUc3gsxJ9YmIcZiQBHho1dp2TdRVmUlOasCChxWuwHVcckbkVw6yc88xZn7ZvEZHF94UojxNU5XO6JKdYrrwD7Rk9l1tyXPHUZ8W2q9DXGbessizSfNpztrTj96, rtld(GNU_HASH), ruby >= 0, rubygems >= 0
Requires(rpmlib): rpmlib(SetVersions)
Obsoletes: ruby-pg < 1.3.5-alt1
Finding debuginfo files (using /usr/lib/rpm/find-debuginfo-files)
Executing: /bin/sh -e /usr/src/tmp/rpm-tmp.FBrL6p
Creating gem-pg-debuginfo package
Processing files: gem-pg-doc-1.3.5-alt1
Executing(%doc): /bin/sh -e /usr/src/tmp/rpm-tmp.69457
+ umask 022
+ /bin/mkdir -p /usr/src/RPM/BUILD
+ cd /usr/src/RPM/BUILD
+ cd gem-pg-1.3.5
+ DOCDIR=/usr/src/tmp/gem-pg-buildroot/usr/share/doc/gem-pg-doc-1.3.5
+ export DOCDIR
+ rm -rf /usr/src/tmp/gem-pg-buildroot/usr/share/doc/gem-pg-doc-1.3.5
+ /bin/mkdir -p /usr/src/tmp/gem-pg-buildroot/usr/share/doc/gem-pg-doc-1.3.5
+ cp -prL README.rdoc README.ja.rdoc /usr/src/tmp/gem-pg-buildroot/usr/share/doc/gem-pg-doc-1.3.5
+ chmod -R go-w /usr/src/tmp/gem-pg-buildroot/usr/share/doc/gem-pg-doc-1.3.5
+ chmod -R a+rX /usr/src/tmp/gem-pg-buildroot/usr/share/doc/gem-pg-doc-1.3.5
+ exit 0
Finding Provides (using /usr/lib/rpm/find-provides)
Executing: /bin/sh -e /usr/src/tmp/rpm-tmp.lMkHWG
find-provides: running scripts (alternatives,debuginfo,lib,pam,perl,pkgconfig,python,python3,ruby,shell)
ruby.prov: detecting ruby provides for gem-pg-doc...
ruby.prov: project file is '/usr/src/RPM/BUILD/gem-pg-1.3.5/SetupConfig'
ruby.prov: setup.rb provides --install_prefix=/usr/src/tmp/gem-pg-buildroot --package=gem-pg-doc -q
(ruby 3.1.2 x86_64-linux)
* provs ->
  - [pg]
Finding Requires (using /usr/lib/rpm/find-requires)
Executing: /bin/sh -e /usr/src/tmp/rpm-tmp.PzVbls
find-requires: running scripts (cpp,debuginfo,files,lib,pam,perl,pkgconfig,pkgconfiglib,python,python3,rpmlib,ruby,shebang,shell,static,symlinks,systemd-services)
ruby.req: detecting ruby requires for gem-pg-doc...
ruby.req: ruby project file is '/usr/src/RPM/BUILD/gem-pg-1.3.5/SetupConfig'
ruby.req: setup.rb requires --install_prefix=/usr/src/tmp/gem-pg-buildroot --package=gem-pg-doc -q
(ruby 3.1.2 x86_64-linux)
* reqs ->
  - [pg]
    [doc]:
      gem(pg) = 1.3.5
Requires: gem(pg) = 1.3.5
Processing files: gem-pg-devel-1.3.5-alt1
Executing(%doc): /bin/sh -e /usr/src/tmp/rpm-tmp.12980
+ umask 022
+ /bin/mkdir -p /usr/src/RPM/BUILD
+ cd /usr/src/RPM/BUILD
+ cd gem-pg-1.3.5
+ DOCDIR=/usr/src/tmp/gem-pg-buildroot/usr/share/doc/gem-pg-devel-1.3.5
+ export DOCDIR
+ rm -rf /usr/src/tmp/gem-pg-buildroot/usr/share/doc/gem-pg-devel-1.3.5
+ /bin/mkdir -p /usr/src/tmp/gem-pg-buildroot/usr/share/doc/gem-pg-devel-1.3.5
+ cp -prL README.rdoc README.ja.rdoc /usr/src/tmp/gem-pg-buildroot/usr/share/doc/gem-pg-devel-1.3.5
+ chmod -R go-w /usr/src/tmp/gem-pg-buildroot/usr/share/doc/gem-pg-devel-1.3.5
+ chmod -R a+rX /usr/src/tmp/gem-pg-buildroot/usr/share/doc/gem-pg-devel-1.3.5
+ exit 0
Finding Provides (using /usr/lib/rpm/find-provides)
Executing: /bin/sh -e /usr/src/tmp/rpm-tmp.J7ayI6
find-provides: running scripts (alternatives,debuginfo,lib,pam,perl,pkgconfig,python,python3,ruby,shell)
ruby.prov: detecting ruby provides for gem-pg-devel...
ruby.prov: project file is '/usr/src/RPM/BUILD/gem-pg-1.3.5/SetupConfig'
ruby.prov: setup.rb provides --install_prefix=/usr/src/tmp/gem-pg-buildroot --package=gem-pg-devel -q
(ruby 3.1.2 x86_64-linux)
* provs ->
  - [pg]
Finding Requires (using /usr/lib/rpm/find-requires)
Executing: /bin/sh -e /usr/src/tmp/rpm-tmp.JPWfOV
find-requires: running scripts (cpp,debuginfo,files,lib,pam,perl,pkgconfig,pkgconfiglib,python,python3,rpmlib,ruby,shebang,shell,static,symlinks,systemd-services)
/usr/src/tmp/gem-pg-buildroot/usr/include/pg.h:21:10: fatal error: ruby.h: No such file or directory
   21 | #include "ruby.h"
      |          ^~~~~~~~
compilation terminated.
cpp.req: /usr/src/tmp/gem-pg-buildroot/usr/include/pg.h: cpp failed, trying c++ mode
/usr/src/tmp/gem-pg-buildroot/usr/include/pg.h:21:10: fatal error: ruby.h: No such file or directory
   21 | #include "ruby.h"
      |          ^~~~~~~~
compilation terminated.
cpp.req: WARNING: /usr/src/tmp/gem-pg-buildroot/usr/include/pg.h: cpp failed
/usr/src/tmp/gem-pg-buildroot/usr/include/gvl_wrappers.h:18:10: fatal error: ruby/thread.h: No such file or directory
   18 | #include <ruby/thread.h>
      |          ^~~~~~~~~~~~~~~
compilation terminated.
cpp.req: /usr/src/tmp/gem-pg-buildroot/usr/include/gvl_wrappers.h: cpp failed, trying c++ mode
/usr/src/tmp/gem-pg-buildroot/usr/include/gvl_wrappers.h:18:10: fatal error: ruby/thread.h: No such file or directory
   18 | #include <ruby/thread.h>
      |          ^~~~~~~~~~~~~~~
compilation terminated.
cpp.req: WARNING: /usr/src/tmp/gem-pg-buildroot/usr/include/gvl_wrappers.h: cpp failed
ruby.req: detecting ruby requires for gem-pg-devel...
ruby.req: ruby project file is '/usr/src/RPM/BUILD/gem-pg-1.3.5/SetupConfig'
ruby.req: setup.rb requires --install_prefix=/usr/src/tmp/gem-pg-buildroot --package=gem-pg-devel -q
(ruby 3.1.2 x86_64-linux)
* reqs ->
  - [pg]
    [devel]:
      gem(bundler) >= 1.16
      gem(rake-compiler) >= 1.0
      gem(rake-compiler-dock) >= 1.0
      gem(rdoc) >= 6.4
      gem(rspec) >= 3.5
Requires: gem(pg) = 1.3.5, postgresql-devel, gem(bundler) >= 1.16, gem(rake-compiler) >= 1.0, gem(rake-compiler-dock) >= 1.0, gem(rdoc) >= 6.4, gem(rspec) >= 3.5
Processing files: gem-pg-debuginfo-1.3.5-alt1
Finding Provides (using /usr/lib/rpm/find-provides)
Executing: /bin/sh -e /usr/src/tmp/rpm-tmp.z0uE5R
find-provides: running scripts (debuginfo)
Finding Requires (using /usr/lib/rpm/find-requires)
Executing: /bin/sh -e /usr/src/tmp/rpm-tmp.4a9ocD
find-requires: running scripts (debuginfo)
objdump: '/usr/src/tmp/gem-pg-buildroot/usr/lib/ruby/gemie/gems/pg-1.3.5/lib/pg_ext.so': No such file
debuginfo.req: WARNING: /usr/src/tmp/gem-pg-buildroot/usr/lib/ruby/gemie/gems/pg-1.3.5/lib/pg_ext.so: objdump failed
Requires: gem-pg = 1.3.5-alt1, debug64(libc.so.6), debug64(libm.so.6), debug64(libpq.so.5), debug64(libruby.so.3.1)
Adding to gem-pg-debuginfo a strict dependency on gem-pg
warning: gem-pg-doc: non-strict dependency on gem-pg
warning: gem-pg-devel: non-strict dependency on gem-pg
Wrote: /usr/src/RPM/RPMS/x86_64/gem-pg-1.3.5-alt1.x86_64.rpm (w2.lzdio)
Wrote: /usr/src/RPM/RPMS/noarch/gem-pg-doc-1.3.5-alt1.noarch.rpm (w2.lzdio)
Wrote: /usr/src/RPM/RPMS/noarch/gem-pg-devel-1.3.5-alt1.noarch.rpm (w2.lzdio)
Wrote: /usr/src/RPM/RPMS/x86_64/gem-pg-debuginfo-1.3.5-alt1.x86_64.rpm (w2.lzdio)
26.97user 4.28system 0:35.83elapsed 87%CPU (0avgtext+0avgdata 108184maxresident)k
0inputs+0outputs (0major+760352minor)pagefaults 0swaps
9.76user 3.60system 1:50.87elapsed 12%CPU (0avgtext+0avgdata 126552maxresident)k
80inputs+0outputs (0major+305287minor)pagefaults 0swaps
--- gem-pg-1.3.5-alt1.x86_64.rpm.repo	2022-09-16 09:49:56.000000000 +0000
+++ gem-pg-1.3.5-alt1.x86_64.rpm.hasher	2023-09-01 02:50:37.350566986 +0000
@@ -100,2 +100,3 @@
 Requires: libc.so.6(GLIBC_2.3)(64bit)  
+Requires: libc.so.6(GLIBC_2.3.4)(64bit)  
 Requires: libc.so.6(GLIBC_2.4)(64bit)  
@@ -105,3 +106,3 @@
 Requires: rpmlib(SetVersions)  
-Requires: libruby.so.3.1()(64bit) >= set:ogmlcJghfxb30m3IE6LZyHTLACRXbAhDb8eo613beGwYmyBSK6G1pxYQHvW1S51zVH2G4fuwgg4CU1yQhF0KLTt9mzz4nSVyHxLuiPqutnJDbvmh9yMvx0wIfwxRKy6zelc0itczZ6jvaipcgjcRKVi5uZwS50cfUMeJEVZ2sJ6iPa53oy9UcUB1GH9s4jfZcMhjUr8flLm0qZ8WGEDzQRu9JIXL9Mq9SkZAEUVVpIZoV4JS32ObxdJmZ32HcifIDxdDqy1clELMNp6wU2rjUJopY5WOR8IwCcxXCWsbYap5ejPEgtfMRs66G5Gsg3h64AgZH3ZDQZJQ42sIFMoYytpzmT6ZtS0ffGFiG2W4TDnNXht1JAPtR57eeFhXDUINKJXF43
+Requires: libruby.so.3.1()(64bit) >= set:ogmlcJghfxb30m3IE6LZyHTLACRXbAhDb8eo613beGwYmyBSK6G1pxYQHvW1S51zVH2G4fuwgg4CU1yQhF0KLTt9mzz4nSVyHxLuiPqoINBfHE4hULg0gS7MMqnhzhDa60FeCNurWjhaz1qyFSdnGMX7Ib0ouMxtqhPX5Km3FpBy1cN4s6YO0RR4eyFDu6eq2v3VFWR2gH7Rlhf7FHZ2FBtZJ4oJ4rGv25fffzR7P9qJ74An2rqJW7xl6F7SPMCjdN0CaQnUUc3gsxJ9YmIcZiQBHho1dp2TdRVmUlOasCChxWuwHVcckbkVw6yc88xZn7ZvEZHF94UojxNU5XO6JKdYrrwD7Rk9l1tyXPHUZ8W2q9DXGbessizSfNpztrTj96
 Requires: rtld(GNU_HASH)  
@@ -112,4 +113,2 @@
 Provides: gem(pg) = 1.3.5
-Provides: ruby-gem(pg) = 1.3.5
-Provides: rubygem(pg) = 1.3.5
 Provides: gem-pg = 1.3.5-alt1:sisyphus+296703.7140.105.2
@@ -206,6 +205,6 @@
 File: /usr/lib/ruby/gemie/gems/pg-1.3.5/sample/warehouse_partitions.rb	100755	root:root	6688b77351bd1e18f2306f6d60fbaf3b	
-File: /usr/lib/ruby/gemie/specifications/pg-1.3.5.gemspec	100644	root:root	2e6d5da395263a4c3fd5c2dff348206f	
+File: /usr/lib/ruby/gemie/specifications/pg-1.3.5.gemspec	100644	root:root	da0d08faac17d4f7cbdb4cf52b348196	
 File: /usr/lib64/ruby/gemie/extensions/pg-1.3.5	40755	root:root		
 File: /usr/lib64/ruby/gemie/extensions/pg-1.3.5/gem.build_complete	100644	root:root		
-File: /usr/lib64/ruby/gemie/extensions/pg-1.3.5/pg_ext.so	100644	root:root	325cd017479126ec98f3d3df21353d3c	
+File: /usr/lib64/ruby/gemie/extensions/pg-1.3.5/pg_ext.so	100644	root:root	29c4ad59ecbd412a8a04a93ba7d1c2eb	
 File: /usr/share/doc/gem-pg-1.3.5	40755	root:root		
@@ -213,2 +212,2 @@
 File: /usr/share/doc/gem-pg-1.3.5/README.rdoc	100644	root:root	bd39c7e375d71da035c4f43201e1031a	
-RPMIdentity: eabb4780afe1d39491aa8b49c6e9618e3b2970eea5ff8c061139d0e52f25d8bfd42d03262d41544ef1e9f1ca18abd232dceaa88cdf1cd3dc264cc54f39c9d801
+RPMIdentity: a89e0cd7ab5e5aa6931cae26d993e9a04bff3875c9140830c5caa05b1d0da6ac2007cc884b07c69b1ec11b5bd35264b0a66317121befefa93ea951b9745aaa7e
--- gem-pg-debuginfo-1.3.5-alt1.x86_64.rpm.repo	2022-09-16 09:49:56.000000000 +0000
+++ gem-pg-debuginfo-1.3.5-alt1.x86_64.rpm.hasher	2023-09-01 02:50:37.438567921 +0000
@@ -1,4 +1,4 @@
-/usr/lib/debug/.build-id/87	40755	root:root	
-/usr/lib/debug/.build-id/87/8a4bad175eb0670d878879c3ee723cd46f1e06	120777	root:root	../../../../lib64/ruby/gemie/extensions/pg-1.3.5/pg_ext.so
-/usr/lib/debug/.build-id/87/8a4bad175eb0670d878879c3ee723cd46f1e06.debug	120777	root:root	../../usr/lib64/ruby/gemie/extensions/pg-1.3.5/pg_ext.so.debug
+/usr/lib/debug/.build-id/08	40755	root:root	
+/usr/lib/debug/.build-id/08/bc6a221c7a6d88f84a49a004278065e8a42405	120777	root:root	../../../../lib64/ruby/gemie/extensions/pg-1.3.5/pg_ext.so
+/usr/lib/debug/.build-id/08/bc6a221c7a6d88f84a49a004278065e8a42405.debug	120777	root:root	../../usr/lib64/ruby/gemie/extensions/pg-1.3.5/pg_ext.so.debug
 /usr/lib/debug/usr/lib/ruby	40755	root:root	
@@ -48,5 +48,5 @@
 Provides: gem-pg-debuginfo = 1.3.5-alt1:sisyphus+296703.7140.105.2
-File: /usr/lib/debug/.build-id/87	40755	root:root		
-File: /usr/lib/debug/.build-id/87/8a4bad175eb0670d878879c3ee723cd46f1e06	120777	root:root		../../../../lib64/ruby/gemie/extensions/pg-1.3.5/pg_ext.so
-File: /usr/lib/debug/.build-id/87/8a4bad175eb0670d878879c3ee723cd46f1e06.debug	120777	root:root		../../usr/lib64/ruby/gemie/extensions/pg-1.3.5/pg_ext.so.debug
+File: /usr/lib/debug/.build-id/08	40755	root:root		
+File: /usr/lib/debug/.build-id/08/bc6a221c7a6d88f84a49a004278065e8a42405	120777	root:root		../../../../lib64/ruby/gemie/extensions/pg-1.3.5/pg_ext.so
+File: /usr/lib/debug/.build-id/08/bc6a221c7a6d88f84a49a004278065e8a42405.debug	120777	root:root		../../usr/lib64/ruby/gemie/extensions/pg-1.3.5/pg_ext.so.debug
 File: /usr/lib/debug/usr/lib/ruby	40755	root:root		
@@ -61,3 +61,3 @@
 File: /usr/lib/debug/usr/lib64/ruby/gemie/extensions/pg-1.3.5	40755	root:root		
-File: /usr/lib/debug/usr/lib64/ruby/gemie/extensions/pg-1.3.5/pg_ext.so.debug	100644	root:root	28994cda39f676deb686b26060a14b3d	
+File: /usr/lib/debug/usr/lib64/ruby/gemie/extensions/pg-1.3.5/pg_ext.so.debug	100644	root:root	96cb26c66f7e8eb4e559c902fff0443d	
 File: /usr/src/debug/gem-pg-1.3.5	40755	root:root		
@@ -89,2 +89,2 @@
 File: /usr/src/debug/gem-pg-1.3.5/ext/pg_util.h	100644	root:root	b0af65741325976d5d40f1cd0d0d02ec	
-RPMIdentity: 83064d31d87671079f31bc38b54d464e9aadbd0e25b63e5764bc5242a31cee98a8447e6ddeb93928c833a9e7b80d58d2f8c3e089399d3b89ba182c53a0b69b5a
+RPMIdentity: 27bae87a49f6310d63b0d250a191b15e14e50c8361975059f08bf12f72bb6c30618f4a26f6546f500923dba9b8998e6a84cbe69538be6ce06a786edc615a1e2c
--- gem-pg-devel-1.3.5-alt1.noarch.rpm.repo	2022-09-16 09:49:56.000000000 +0000
+++ gem-pg-devel-1.3.5-alt1.noarch.rpm.hasher	2023-09-01 02:50:37.540569005 +0000
@@ -8,11 +8,6 @@
 Requires: postgresql-devel  
-Requires: gem(bundler) < 3.0
 Requires: gem(bundler) >= 1.16
-Requires: gem(rake-compiler) < 2
 Requires: gem(rake-compiler) >= 1.0
-Requires: gem(rake-compiler-dock) < 2
 Requires: gem(rake-compiler-dock) >= 1.0
-Requires: gem(rdoc) < 7
 Requires: gem(rdoc) >= 6.4
-Requires: gem(rspec) < 4
 Requires: gem(rspec) >= 3.5
@@ -26,2 +21,2 @@
 File: /usr/share/doc/gem-pg-devel-1.3.5/README.rdoc	100644	root:root	bd39c7e375d71da035c4f43201e1031a	
-RPMIdentity: 4c6d4b3b2007b95981a46f2efbca342c5eca1b143651558f0d1f19b9f631a04f404e79a38f66b49ca5fe51217426078b87ee4ade6e2347927a6ed891ebb0aa0b
+RPMIdentity: 8fd8b4b36e625b43aa788cc3523f71678c2f721f2d626107ffcf71bf1cc5da12241b20129af56e00e01240d94e845731650a5b72eadf76f06c80915fca90bf18