<86>Aug  6 06:16:31 userdel[1601259]: delete user 'rooter'
<86>Aug  6 06:16:31 userdel[1601259]: removed group 'rooter' owned by 'rooter'
<86>Aug  6 06:16:31 userdel[1601259]: removed shadow group 'rooter' owned by 'rooter'
<86>Aug  6 06:16:31 groupadd[1601310]: group added to /etc/group: name=rooter, GID=1844
<86>Aug  6 06:16:31 groupadd[1601310]: group added to /etc/gshadow: name=rooter
<86>Aug  6 06:16:31 groupadd[1601310]: new group: name=rooter, GID=1844
<86>Aug  6 06:16:31 useradd[1601335]: new user: name=rooter, UID=1844, GID=1844, home=/root, shell=/bin/bash, from=none
<86>Aug  6 06:16:31 userdel[1601386]: delete user 'builder'
<86>Aug  6 06:16:31 userdel[1601386]: removed group 'builder' owned by 'builder'
<86>Aug  6 06:16:31 userdel[1601386]: removed shadow group 'builder' owned by 'builder'
<86>Aug  6 06:16:31 groupadd[1601478]: group added to /etc/group: name=builder, GID=1845
<86>Aug  6 06:16:31 groupadd[1601478]: group added to /etc/gshadow: name=builder
<86>Aug  6 06:16:31 groupadd[1601478]: new group: name=builder, GID=1845
<86>Aug  6 06:16:31 useradd[1601529]: new user: name=builder, UID=1845, GID=1845, home=/usr/src, shell=/bin/bash, from=none
/usr/src/in/srpm/ppp-2.4.8-alt3.src.rpm: license not found in '/usr/share/license' directory: distributable
<13>Aug  6 06:16:34 rpmi: perl-IPC-Signal-1.00-alt3.1.1 1290501013 installed
<13>Aug  6 06:16:34 rpmi: liblz4-1:1.9.4-alt1 sisyphus+309416.100.1.1 1667412981 installed
<13>Aug  6 06:16:34 rpmi: libsystemd-1:253.7-alt1 sisyphus+325621.200.2.1 1690469230 installed
<13>Aug  6 06:16:34 rpmi: libdbus-1.14.8-alt1 sisyphus+324298.100.1.1 1688559488 installed
<13>Aug  6 06:16:34 rpmi: libpcap0.8-2:1.10.4-alt1 sisyphus+322910.100.5.1 1687282815 installed
<13>Aug  6 06:16:34 rpmi: libatm-2.5.1-alt7 sisyphus+304697.100.1.1 1659517181 installed
<13>Aug  6 06:16:34 rpmi: libp11-kit-1:0.24.1-alt2 sisyphus+324666.100.1.1 1689083439 installed
<13>Aug  6 06:16:34 rpmi: libtasn1-4.19.0-alt2 sisyphus+323514.100.1.1 1687445894 installed
<13>Aug  6 06:16:34 rpmi: rpm-macros-alternatives-0.5.2-alt2 sisyphus+315270.200.2.1 1676457367 installed
<13>Aug  6 06:16:34 rpmi: alternatives-0.5.2-alt2 sisyphus+315270.200.2.1 1676457367 installed
<13>Aug  6 06:16:34 rpmi: ca-certificates-2023.07.31-alt1 sisyphus+326137.200.1.1 1690809798 installed
<13>Aug  6 06:16:34 rpmi: ca-trust-0.1.4-alt1 sisyphus+308690.100.1.1 1666182992 installed
<13>Aug  6 06:16:34 rpmi: p11-kit-trust-1:0.24.1-alt2 sisyphus+324666.100.1.1 1689083439 installed
<13>Aug  6 06:16:35 rpmi: libcrypto3-3.1.2-alt1 sisyphus+326244.100.1.1 1690906741 installed
<13>Aug  6 06:16:35 rpmi: libssl3-3.1.2-alt1 sisyphus+326244.100.1.1 1690906741 installed
<13>Aug  6 06:16:35 rpmi: rpm-macros-pam0-1.5.3-alt1 sisyphus+320140.100.1.1 1683581440 installed
<13>Aug  6 06:16:35 rpmi: libpam0-devel-1.5.3-alt1 sisyphus+320140.100.1.1 1683581440 installed
<13>Aug  6 06:16:35 rpmi: libssl-devel-3.1.2-alt1 sisyphus+326244.100.1.1 1690906741 installed
<13>Aug  6 06:16:35 rpmi: libatm-devel-2.5.1-alt7 sisyphus+304697.100.1.1 1659517181 installed
<13>Aug  6 06:16:35 rpmi: libpcap-devel-2:1.10.4-alt1 sisyphus+322910.100.5.1 1687282815 installed
<13>Aug  6 06:16:35 rpmi: libsystemd-devel-1:253.7-alt1 sisyphus+325621.200.2.1 1690469230 installed
<13>Aug  6 06:16:35 rpmi: perl-Proc-WaitStat-1.00-alt4.1.1 1290595156 installed
<13>Aug  6 06:16:35 rpmi: perl-Proc-Daemon-0.23-alt1 1451923889 installed
<13>Aug  6 06:16:35 rpmi: libudev-devel-1:253.7-alt1 sisyphus+325621.200.2.1 1690469230 installed
Building target platforms: x86_64
Building for target x86_64
Wrote: /usr/src/in/nosrpm/ppp-2.4.8-alt3.nosrc.rpm (w1.gzdio)
Installing ppp-2.4.8-alt3.src.rpm
Building target platforms: x86_64
Building for target x86_64
Executing(%prep): /bin/sh -e /usr/src/tmp/rpm-tmp.85601
+ umask 022
+ /bin/mkdir -p /usr/src/RPM/BUILD
+ cd /usr/src/RPM/BUILD
+ cd /usr/src/RPM/BUILD
+ rm -rf ppp-2.4.8
+ echo 'Source #0 (ppp-2.4.8.tar):'
Source #0 (ppp-2.4.8.tar):
+ /bin/tar -xf /usr/src/RPM/SOURCES/ppp-2.4.8.tar
+ cd ppp-2.4.8
+ /bin/chmod -c -Rf u+rwX,go-w .
+ echo 'Patch #1 (ppp-2.4.8-alt3.patch):'
Patch #1 (ppp-2.4.8-alt3.patch):
+ /usr/bin/patch -p1
patching file README.eap-tls
patching file chat/Makefile.linux
patching file chat/chat.8
patching file configure
patching file etc.ppp/eaptls-client
patching file etc.ppp/eaptls-server
patching file etc.ppp/openssl.cnf
patching file etc.ppp/options
patching file linux/Makefile.top
patching file pppd/Makefile.linux
patching file pppd/auth.c
patching file pppd/cbcp.c
patching file pppd/cbcp.h
patching file pppd/ccp.c
patching file pppd/chap-md5.c
patching file pppd/chap-new.c
patching file pppd/chap_ms.c
patching file pppd/demand.c
patching file pppd/eap-tls.c
patching file pppd/eap-tls.h
patching file pppd/eap.c
patching file pppd/eap.h
patching file pppd/ipcp.c
patching file pppd/ipcp.h
patching file pppd/ipv6cp.c
patching file pppd/ipv6cp.h
patching file pppd/ipxcp.c
patching file pppd/lcp.c
patching file pppd/main.c
patching file pppd/md4.c
patching file pppd/md4.h
patching file pppd/md5.c
patching file pppd/md5.h
patching file pppd/multilink.c
patching file pppd/options.c
patching file pppd/pathnames.h
patching file pppd/plugins/Makefile.linux
patching file pppd/plugins/dhcp/AUTHORS
patching file pppd/plugins/dhcp/COPYING
patching file pppd/plugins/dhcp/Makefile.linux
patching file pppd/plugins/dhcp/README
patching file pppd/plugins/dhcp/clientpacket.c
patching file pppd/plugins/dhcp/clientpacket.h
patching file pppd/plugins/dhcp/debug.h
patching file pppd/plugins/dhcp/dhcpc.c
patching file pppd/plugins/dhcp/dhcpc.h
patching file pppd/plugins/dhcp/dhcpd.h
patching file pppd/plugins/dhcp/files.h
patching file pppd/plugins/dhcp/leases.h
patching file pppd/plugins/dhcp/options.c
patching file pppd/plugins/dhcp/options.h
patching file pppd/plugins/dhcp/packet.c
patching file pppd/plugins/dhcp/packet.h
patching file pppd/plugins/dhcp/socket.c
patching file pppd/plugins/dhcp/socket.h
patching file pppd/plugins/passprompt.c
patching file pppd/plugins/passwordfd.c
patching file pppd/plugins/pppoatm/Makefile.linux
patching file pppd/plugins/pppoatm/pppoatm.c
patching file pppd/plugins/pppol2tp/Makefile.linux
patching file pppd/plugins/pppol2tp/l2tp_event.h
patching file pppd/plugins/pppol2tp/openl2tp.c
patching file pppd/plugins/pppol2tp/pppol2tp.c
patching file pppd/plugins/radius/Makefile.linux
patching file pppd/plugins/radius/clientid.c
patching file pppd/plugins/radius/md5.c
patching file pppd/plugins/radius/radius.c
patching file pppd/plugins/radius/util.c
patching file pppd/plugins/rp-pppoe/Makefile.linux
patching file pppd/plugins/rp-pppoe/if.c
patching file pppd/plugins/rp-pppoe/plugin.c
patching file pppd/plugins/rp-pppoe/pppoe-discovery.8
patching file pppd/plugins/rp-pppoe/pppoe-discovery.c
patching file pppd/plugins/winbind.c
patching file pppd/pppd.8
patching file pppd/pppd.h
patching file pppd/sha1.c
patching file pppd/sha1.h
patching file pppd/sys-linux.c
patching file pppd/sys-solaris.c
patching file pppd/tdb.c
patching file pppd/tty.c
patching file pppd/utils.c
patching file pppdump/Makefile.linux
patching file pppstats/Makefile.linux
patching file sample/auth-down
patching file sample/auth-up
patching file sample/callback-client
patching file sample/callback-server
patching file sample/callback-users
patching file sample/ip-down
patching file sample/ip-up
patching file sample/options
patching file sample/options.ttyXX
patching file sample/pap-secrets
+ sed -i -e 's|/usr/local/etc|/etc|' -e 's|/usr/local/sbin|/usr/sbin|' pppd/plugins/radius/etc/radiusclient.conf
+ sed -i -e 's|/etc/radiusclient|/etc/ppp/radius|g' pppd/plugins/radius/pppd-radattr.8 pppd/plugins/radius/pppd-radius.8 pppd/plugins/radius/avpair.c pppd/plugins/radius/buildreq.c pppd/plugins/radius/clientid.c pppd/plugins/radius/config.c pppd/plugins/radius/dict.c pppd/plugins/radius/ip_util.c pppd/plugins/radius/lock.c pppd/plugins/radius/md5.c pppd/plugins/radius/radattr.c pppd/plugins/radius/radius.c pppd/plugins/radius/radrealms.c pppd/plugins/radius/sendserver.c pppd/plugins/radius/util.c pppd/plugins/radius/includes.h pppd/plugins/radius/options.h pppd/plugins/radius/pathnames.h pppd/plugins/radius/radiusclient.h pppd/plugins/radius/etc/dictionary pppd/plugins/radius/etc/dictionary.ascend pppd/plugins/radius/etc/dictionary.compat pppd/plugins/radius/etc/dictionary.merit pppd/plugins/radius/etc/dictionary.microsoft pppd/plugins/radius/etc/issue pppd/plugins/radius/etc/port-id-map pppd/plugins/radius/etc/radiusclient.conf pppd/plugins/radius/etc/radiusclient.conf.in pppd/plugins/radius/etc/realms pppd/plugins/radius/etc/servers
+ find -type f -name '*.orig' -print -delete
+ rm -f include/linux/if_pppol2tp.h
+ exit 0
Executing(%build): /bin/sh -e /usr/src/tmp/rpm-tmp.85601
+ umask 022
+ /bin/mkdir -p /usr/src/RPM/BUILD
+ cd /usr/src/RPM/BUILD
+ cd ppp-2.4.8
+ CFLAGS='-pipe -frecord-gcc-switches -Wall -g -O2 -flto=auto -fPIC -Wall -D_GNU_SOURCE -fno-strict-aliasing'
+ export CFLAGS
+ CXXFLAGS='-pipe -frecord-gcc-switches -Wall -g -O2 -flto=auto -fPIC -Wall -D_GNU_SOURCE -fno-strict-aliasing'
+ export CXXFLAGS
+ FFLAGS='-pipe -frecord-gcc-switches -Wall -g -O2 -flto=auto -fPIC -Wall -D_GNU_SOURCE -fno-strict-aliasing'
+ export FFLAGS
+ FCFLAGS='-pipe -frecord-gcc-switches -Wall -g -O2 -flto=auto -fPIC -Wall -D_GNU_SOURCE -fno-strict-aliasing'
+ export FCFLAGS
+ '[' -n '' ']'
++ printf %s '-pipe -frecord-gcc-switches -Wall -g -O2 -flto=auto -fPIC -Wall -D_GNU_SOURCE -fno-strict-aliasing'
++ sed -r 's/(^|[[:space:]]+)-[^m][^[:space:]]*//g'
+ ASFLAGS=
+ export ASFLAGS
+ export lt_cv_prog_cc_static_works=no
+ lt_cv_prog_cc_static_works=no
+ export lt_cv_deplibs_check_method=pass_all
+ lt_cv_deplibs_check_method=pass_all
+ readlink -e -- ./configure
+ xargs -ri dirname -- '{}'
+ xargs -ri find '{}' -type f '(' -name config.sub -or -name config.guess ')' -printf '%h/\n'
+ sort -u
+ xargs -rn1 install -pm755 -- /usr/share/gnu-config/config.sub /usr/share/gnu-config/config.guess
+ configure_runstatedir_flags=
+ grep -qF runstatedir=DIR ./configure
+ echo 'rpm-build: warning: ./configure script does not support --runstatedir'
rpm-build: warning: ./configure script does not support --runstatedir
+ ./configure --build=x86_64-alt-linux --host=x86_64-alt-linux --prefix=/usr --exec-prefix=/usr --bindir=/usr/bin --sbindir=/usr/sbin --sysconfdir=/etc --datadir=/usr/share --includedir=/usr/include --libdir=/usr/lib64 --libexecdir=/usr/lib --localstatedir=/var/lib --sharedstatedir=/var/lib --mandir=/usr/share/man --infodir=/usr/share/info --disable-dependency-tracking --disable-silent-rules --without-included-gettext
Configuring for Linux
Creating Makefiles.
  Makefile <= linux/Makefile.top
  pppd/Makefile <= pppd/Makefile.linux
  pppstats/Makefile <= pppstats/Makefile.linux
  chat/Makefile <= chat/Makefile.linux
  pppdump/Makefile <= pppdump/Makefile.linux
  pppd/plugins/Makefile <= pppd/plugins/Makefile.linux
  pppd/plugins/rp-pppoe/Makefile <= pppd/plugins/rp-pppoe/Makefile.linux
  pppd/plugins/radius/Makefile <= pppd/plugins/radius/Makefile.linux
  pppd/plugins/pppoatm/Makefile <= pppd/plugins/pppoatm/Makefile.linux
  pppd/plugins/pppol2tp/Makefile <= pppd/plugins/pppol2tp/Makefile.linux
  pppd/plugins/dhcp/Makefile <= pppd/plugins/dhcp/Makefile.linux
+ make -j16 USE_PAM=y CBCP=y CHAPMS=y MPPE=y HAVE_LIBATM=y HAVE_INET6=y SYSTEMD=y 'COPTS=-pipe -frecord-gcc-switches -Wall -g -O2 -flto=auto -fPIC -Wall -D_GNU_SOURCE -fno-strict-aliasing' CC=gcc libdir=/usr/lib64
cd chat; make -w -j16 -Otarget --jobserver-auth=fifo:/usr/src/tmp/GMfifo1626401 --sync-mutex=fnm:/usr/src/tmp/GmUqeLKu all
make[1]: Entering directory '/usr/src/RPM/BUILD/ppp-2.4.8/chat'
make[1]: warning: -j16 forced in submake: resetting jobserver mode.
make[1]: Leaving directory '/usr/src/RPM/BUILD/ppp-2.4.8/chat'
make[1]: Entering directory '/usr/src/RPM/BUILD/ppp-2.4.8/chat'
gcc -c -pipe -frecord-gcc-switches -Wall -g -O2 -flto=auto -fPIC -Wall -D_GNU_SOURCE -fno-strict-aliasing -DTERMIOS			 -DSIGTYPE=void			 -UNO_SLEEP			 -DFNDELAY=O_NDELAY		 -o chat.o chat.c
chat.c: In function 'main':
chat.c:151:63: warning: value computed is not used [-Wunused-value]
  151 | #define OPTION(c,v)     (_O&2&&**v?*(*v)++:!c||_O&4?0:(!(_O&1)&& \
      |                                                               ^~
chat.c:297:22: note: in expansion of macro 'OPTION'
  297 |     while ((option = OPTION(argc, argv)) != 0) {
      |                      ^~~~~~
chat.c: In function 'chat_send':
chat.c:1047:9: warning: ignoring return value of 'write' declared with attribute 'warn_unused_result' [-Wunused-result]
 1047 |         write(2, s, strlen(s));
      |         ^~~~~~~~~~~~~~~~~~~~~~
chat.c: In function 'echo_stderr':
chat.c:1370:9: warning: ignoring return value of 'write' declared with attribute 'warn_unused_result' [-Wunused-result]
 1370 |         write(2, "\n", 1);
      |         ^~~~~~~~~~~~~~~~~
chat.c:1375:9: warning: ignoring return value of 'write' declared with attribute 'warn_unused_result' [-Wunused-result]
 1375 |         write(2, s, strlen(s));
      |         ^~~~~~~~~~~~~~~~~~~~~~
chat.c: At top level:
chat.c:90:19: warning: 'rcsid' defined but not used [-Wunused-const-variable=]
   90 | static const char rcsid[] = "$Id: chat.c,v 1.30 2004/01/17 05:47:55 carlsonj Exp $";
      |                   ^~~~~
make[1]: Leaving directory '/usr/src/RPM/BUILD/ppp-2.4.8/chat'
make[1]: Entering directory '/usr/src/RPM/BUILD/ppp-2.4.8/chat'
gcc  -pie -o chat chat.o
make[1]: Leaving directory '/usr/src/RPM/BUILD/ppp-2.4.8/chat'
cd pppd/plugins; make -w -j16 -Otarget --jobserver-auth=fifo:/usr/src/tmp/GMfifo1626401 --sync-mutex=fnm:/usr/src/tmp/GmUqeLKu all
make[1]: Entering directory '/usr/src/RPM/BUILD/ppp-2.4.8/pppd/plugins'
make[1]: warning: -j16 forced in submake: resetting jobserver mode.
make[1]: Leaving directory '/usr/src/RPM/BUILD/ppp-2.4.8/pppd/plugins'
make[1]: Entering directory '/usr/src/RPM/BUILD/ppp-2.4.8/pppd/plugins'
gcc -pipe -frecord-gcc-switches -Wall -g -O2 -flto=auto -fPIC -Wall -D_GNU_SOURCE -fno-strict-aliasing -I.. -I../../include -fPIC -DUSE_EAPTLS=1 -DMPPE=1  -shared -o minconn.so minconn.c
make[1]: Leaving directory '/usr/src/RPM/BUILD/ppp-2.4.8/pppd/plugins'
make[1]: Entering directory '/usr/src/RPM/BUILD/ppp-2.4.8/pppd/plugins'
gcc -pipe -frecord-gcc-switches -Wall -g -O2 -flto=auto -fPIC -Wall -D_GNU_SOURCE -fno-strict-aliasing -I.. -I../../include -fPIC -DUSE_EAPTLS=1 -DMPPE=1  -shared -o passwordfd.so passwordfd.c
make[1]: Leaving directory '/usr/src/RPM/BUILD/ppp-2.4.8/pppd/plugins'
make[1]: Entering directory '/usr/src/RPM/BUILD/ppp-2.4.8/pppd/plugins'
gcc -pipe -frecord-gcc-switches -Wall -g -O2 -flto=auto -fPIC -Wall -D_GNU_SOURCE -fno-strict-aliasing -I.. -I../../include -fPIC -DUSE_EAPTLS=1 -DMPPE=1  -shared -o passprompt.so passprompt.c
passprompt.c: In function 'promptpass':
passprompt.c:57:9: warning: ignoring return value of 'seteuid' declared with attribute 'warn_unused_result' [-Wunused-result]
   57 |         seteuid(getuid());
      |         ^~~~~~~~~~~~~~~~~
passprompt.c:58:9: warning: ignoring return value of 'setegid' declared with attribute 'warn_unused_result' [-Wunused-result]
   58 |         setegid(getgid());
      |         ^~~~~~~~~~~~~~~~~
make[1]: Leaving directory '/usr/src/RPM/BUILD/ppp-2.4.8/pppd/plugins'
make[1]: Entering directory '/usr/src/RPM/BUILD/ppp-2.4.8/pppd/plugins'
gcc -pipe -frecord-gcc-switches -Wall -g -O2 -flto=auto -fPIC -Wall -D_GNU_SOURCE -fno-strict-aliasing -I.. -I../../include -fPIC -DUSE_EAPTLS=1 -DMPPE=1  -shared -o winbind.so winbind.c
winbind.c: In function 'run_ntlm_auth':
winbind.c:421:51: warning: pointer targets in passing argument 1 of 'strhex_to_str' differ in signedness [-Wpointer-sign]
  421 |                                 if (strhex_to_str(nt_key, 32, parameter) == 16) {
      |                                                   ^~~~~~
      |                                                   |
      |                                                   u_char * {aka unsigned char *}
winbind.c:168:28: note: expected 'char *' but argument is of type 'u_char *' {aka 'unsigned char *'}
  168 | size_t strhex_to_str(char *p, size_t len, const char *strhex)
      |                      ~~~~~~^
winbind.c: In function 'winbind_chap_verify':
winbind.c:637:50: warning: pointer targets in passing argument 6 of 'GenerateAuthenticatorResponse' differ in signedness [-Wpointer-sign]
  637 |                                 challenge, user, saresponse);
      |                                                  ^~~~~~~~~~
      |                                                  |
      |                                                  char *
In file included from winbind.c:39:
../chap_ms.h:104:32: note: expected 'u_char *' {aka 'unsigned char *'} but argument is of type 'char *'
  104 |                         u_char authResponse[MS_AUTH_RESPONSE_LENGTH+1]);
      |                         ~~~~~~~^~~~~~~~~~~~~~~~~~~~~~~~~~~~~~~~~~~~~~~
winbind.c: In function 'run_ntlm_auth':
winbind.c:305:17: warning: ignoring return value of 'setgid' declared with attribute 'warn_unused_result' [-Wunused-result]
  305 |                 setgid(getgid());
      |                 ^~~~~~~~~~~~~~~~
make[1]: Leaving directory '/usr/src/RPM/BUILD/ppp-2.4.8/pppd/plugins'
for d in rp-pppoe pppoatm pppol2tp radius dhcp; do make -w -j16 -Otarget --jobserver-auth=fifo:/usr/src/tmp/GMfifo1629745 --sync-mutex=fnm:/usr/src/tmp/GmUqeLKu -C $d all || exit $?; done
make[2]: Entering directory '/usr/src/RPM/BUILD/ppp-2.4.8/pppd/plugins/rp-pppoe'
make[2]: warning: -j16 forced in submake: resetting jobserver mode.
make[2]: Leaving directory '/usr/src/RPM/BUILD/ppp-2.4.8/pppd/plugins/rp-pppoe'
make[2]: Entering directory '/usr/src/RPM/BUILD/ppp-2.4.8/pppd/plugins/rp-pppoe'
gcc -pipe -frecord-gcc-switches -Wall -g -O2 -flto=auto -fPIC -Wall -D_GNU_SOURCE -fno-strict-aliasing -I../../../include -fPIC '-DRP_VERSION="3.8p"' -I../../.. -c -o if.o if.c
if.c:16:19: warning: 'RCSID' defined but not used [-Wunused-const-variable=]
   16 | static char const RCSID[] =
      |                   ^~~~~
make[2]: Leaving directory '/usr/src/RPM/BUILD/ppp-2.4.8/pppd/plugins/rp-pppoe'
make[2]: Entering directory '/usr/src/RPM/BUILD/ppp-2.4.8/pppd/plugins/rp-pppoe'
gcc -pipe -frecord-gcc-switches -Wall -g -O2 -flto=auto -fPIC -Wall -D_GNU_SOURCE -fno-strict-aliasing -I../../../include -fPIC '-DRP_VERSION="3.8p"' -I../../.. -c -o debug.o debug.c
debug.c:16:19: warning: 'RCSID' defined but not used [-Wunused-const-variable=]
   16 | static char const RCSID[] =
      |                   ^~~~~
make[2]: Leaving directory '/usr/src/RPM/BUILD/ppp-2.4.8/pppd/plugins/rp-pppoe'
make[2]: Entering directory '/usr/src/RPM/BUILD/ppp-2.4.8/pppd/plugins/rp-pppoe'
gcc -pipe -frecord-gcc-switches -Wall -g -O2 -flto=auto -fPIC -Wall -D_GNU_SOURCE -fno-strict-aliasing -I../../../include -fPIC '-DRP_VERSION="3.8p"' -I../../.. -c -o common.o common.c
common.c: In function 'sendPADT':
common.c:135:19: warning: pointer targets in passing argument 1 of 'strcpy' differ in signedness [-Wpointer-sign]
  135 |         strcpy(err.payload, msg);
      |                ~~~^~~~~~~~
      |                   |
      |                   unsigned char *
In file included from /usr/include/features.h:491,
                 from /usr/include/bits/libc-header-start.h:33,
                 from /usr/include/stdio.h:27,
                 from pppoe.h:18,
                 from common.c:20:
/usr/include/bits/string_fortified.h:77:1: note: expected 'char * restrict' but argument is of type 'unsigned char *'
   77 | __NTH (strcpy (char *__restrict __dest, const char *__restrict __src))
      | ^~~~~
common.c: At top level:
common.c:16:19: warning: 'RCSID' defined but not used [-Wunused-const-variable=]
   16 | static char const RCSID[] =
      |                   ^~~~~
make[2]: Leaving directory '/usr/src/RPM/BUILD/ppp-2.4.8/pppd/plugins/rp-pppoe'
make[2]: Entering directory '/usr/src/RPM/BUILD/ppp-2.4.8/pppd/plugins/rp-pppoe'
gcc -pipe -frecord-gcc-switches -Wall -g -O2 -flto=auto -fPIC -Wall -D_GNU_SOURCE -fno-strict-aliasing -I../../../include -fPIC '-DRP_VERSION="3.8p"' -I../../.. -c -o plugin.o plugin.c
plugin.c:55:2: warning: #warning ugly hack: aligned_u64 must be defined in linux/types.h [-Wcpp]
   55 | #warning ugly hack: aligned_u64 must be defined in linux/types.h
      |  ^~~~~~~
plugin.c:25:19: warning: 'RCSID' defined but not used [-Wunused-const-variable=]
   25 | static char const RCSID[] =
      |                   ^~~~~
make[2]: Leaving directory '/usr/src/RPM/BUILD/ppp-2.4.8/pppd/plugins/rp-pppoe'
make[2]: Entering directory '/usr/src/RPM/BUILD/ppp-2.4.8/pppd/plugins/rp-pppoe'
gcc -pipe -frecord-gcc-switches -Wall -g -O2 -flto=auto -fPIC -Wall -D_GNU_SOURCE -fno-strict-aliasing -I../../../include -fPIC '-DRP_VERSION="3.8p"' -I../../.. -c -o discovery.o discovery.c
discovery.c: In function 'parsePADOTags':
discovery.c:136:9: warning: unused variable 'i' [-Wunused-variable]
  136 |     int i;
      |         ^
discovery.c: At top level:
discovery.c:11:19: warning: 'RCSID' defined but not used [-Wunused-const-variable=]
   11 | static char const RCSID[] =
      |                   ^~~~~
make[2]: Leaving directory '/usr/src/RPM/BUILD/ppp-2.4.8/pppd/plugins/rp-pppoe'
make[2]: Entering directory '/usr/src/RPM/BUILD/ppp-2.4.8/pppd/plugins/rp-pppoe'
gcc -pipe -frecord-gcc-switches -Wall -g -O2 -flto=auto -fPIC -Wall -D_GNU_SOURCE -fno-strict-aliasing -I../../../include -fPIC '-DRP_VERSION="3.8p"' -I../../.. -c -o pppoe-discovery.o pppoe-discovery.c
make[2]: Leaving directory '/usr/src/RPM/BUILD/ppp-2.4.8/pppd/plugins/rp-pppoe'
make[2]: Entering directory '/usr/src/RPM/BUILD/ppp-2.4.8/pppd/plugins/rp-pppoe'
gcc -pipe -frecord-gcc-switches -Wall -g -O2 -flto=auto -fPIC -Wall -D_GNU_SOURCE -fno-strict-aliasing -I../../../include -fPIC '-DRP_VERSION="3.8p"' -shared -o pppoe-discovery pppoe-discovery.o debug.o -ludev
make[2]: Leaving directory '/usr/src/RPM/BUILD/ppp-2.4.8/pppd/plugins/rp-pppoe'
make[2]: Entering directory '/usr/src/RPM/BUILD/ppp-2.4.8/pppd/plugins/rp-pppoe'
gcc -pipe -frecord-gcc-switches -Wall -g -O2 -flto=auto -fPIC -Wall -D_GNU_SOURCE -fno-strict-aliasing -I../../../include -fPIC '-DRP_VERSION="3.8p"' -shared -o rp-pppoe.so plugin.o discovery.o if.o common.o
make[2]: Leaving directory '/usr/src/RPM/BUILD/ppp-2.4.8/pppd/plugins/rp-pppoe'
make[2]: Entering directory '/usr/src/RPM/BUILD/ppp-2.4.8/pppd/plugins/pppoatm'
make[2]: warning: -j16 forced in submake: resetting jobserver mode.
make[2]: Leaving directory '/usr/src/RPM/BUILD/ppp-2.4.8/pppd/plugins/pppoatm'
make[2]: Entering directory '/usr/src/RPM/BUILD/ppp-2.4.8/pppd/plugins/pppoatm'
gcc -pipe -frecord-gcc-switches -Wall -g -O2 -flto=auto -fPIC -Wall -D_GNU_SOURCE -fno-strict-aliasing -I../.. -I../../../include -fPIC -c -o pppoatm.o pppoatm.c
make[2]: Leaving directory '/usr/src/RPM/BUILD/ppp-2.4.8/pppd/plugins/pppoatm'
make[2]: Entering directory '/usr/src/RPM/BUILD/ppp-2.4.8/pppd/plugins/pppoatm'
gcc -pipe -frecord-gcc-switches -Wall -g -O2 -flto=auto -fPIC -Wall -D_GNU_SOURCE -fno-strict-aliasing -I../.. -I../../../include -fPIC  -shared -o pppoatm.so pppoatm.o -latm
make[2]: Leaving directory '/usr/src/RPM/BUILD/ppp-2.4.8/pppd/plugins/pppoatm'
make[2]: Entering directory '/usr/src/RPM/BUILD/ppp-2.4.8/pppd/plugins/pppol2tp'
make[2]: warning: -j16 forced in submake: resetting jobserver mode.
make[2]: Leaving directory '/usr/src/RPM/BUILD/ppp-2.4.8/pppd/plugins/pppol2tp'
make[2]: Entering directory '/usr/src/RPM/BUILD/ppp-2.4.8/pppd/plugins/pppol2tp'
gcc -pipe -frecord-gcc-switches -Wall -g -O2 -flto=auto -fPIC -Wall -D_GNU_SOURCE -fno-strict-aliasing -I. -I../.. -I../../../include -fPIC -c -o pppol2tp.o pppol2tp.c
pppol2tp.c: In function 'setdevname_pppol2tp':
pppol2tp.c:135:60: warning: pointer targets in passing argument 3 of 'getsockname' differ in signedness [-Wpointer-sign]
  135 |         if(getsockname(pppol2tp_fd, (struct sockaddr *)&s, &len) < 0) {
      |                                                            ^~~~
      |                                                            |
      |                                                            int *
In file included from /usr/include/net/if.h:26,
                 from pppol2tp.c:34:
/usr/include/sys/socket.h:117:47: note: expected 'socklen_t * restrict' {aka 'unsigned int * restrict'} but argument is of type 'int *'
  117 |                         socklen_t *__restrict __len) __THROW;
      |                         ~~~~~~~~~~~~~~~~~~~~~~^~~~~
pppol2tp.c:147:30: warning: pointer targets in passing argument 5 of 'getsockopt' differ in signedness [-Wpointer-sign]
  147 |                        &tmp, &tmp_len) < 0) {
      |                              ^~~~~~~~
      |                              |
      |                              int *
/usr/include/sys/socket.h:257:46: note: expected 'socklen_t * restrict' {aka 'unsigned int * restrict'} but argument is of type 'int *'
  257 |                        socklen_t *__restrict __optlen) __THROW;
      |                        ~~~~~~~~~~~~~~~~~~~~~~^~~~~~~~
pppol2tp.c:125:16: warning: unused variable 'a' [-Wunused-variable]
  125 |         char **a;
      |                ^
pppol2tp.c: In function 'send_config_pppol2tp':
pppol2tp.c:204:13: warning: unused variable 'fd' [-Wunused-variable]
  204 |         int fd;
      |             ^~
pppol2tp.c:202:22: warning: unused variable 'ifr' [-Wunused-variable]
  202 |         struct ifreq ifr;
      |                      ^~~
pppol2tp.c: In function 'pppol2tp_lcp_snoop':
pppol2tp.c:304:21: warning: variable 'snooping' set but not used [-Wunused-but-set-variable]
  304 |         static bool snooping = 1;
      |                     ^~~~~~~~
pppol2tp.c: At top level:
pppol2tp.c:483:13: warning: 'pppol2tp_cleanup' defined but not used [-Wunused-function]
  483 | static void pppol2tp_cleanup(void)
      |             ^~~~~~~~~~~~~~~~
make[2]: Leaving directory '/usr/src/RPM/BUILD/ppp-2.4.8/pppd/plugins/pppol2tp'
make[2]: Entering directory '/usr/src/RPM/BUILD/ppp-2.4.8/pppd/plugins/pppol2tp'
gcc -pipe -frecord-gcc-switches -Wall -g -O2 -flto=auto -fPIC -Wall -D_GNU_SOURCE -fno-strict-aliasing -I. -I../.. -I../../../include -fPIC -c -o openl2tp.o openl2tp.c
make[2]: Leaving directory '/usr/src/RPM/BUILD/ppp-2.4.8/pppd/plugins/pppol2tp'
make[2]: Entering directory '/usr/src/RPM/BUILD/ppp-2.4.8/pppd/plugins/pppol2tp'
gcc -pipe -frecord-gcc-switches -Wall -g -O2 -flto=auto -fPIC -Wall -D_GNU_SOURCE -fno-strict-aliasing -I. -I../.. -I../../../include -fPIC  -shared -o openl2tp.so openl2tp.o 
make[2]: Leaving directory '/usr/src/RPM/BUILD/ppp-2.4.8/pppd/plugins/pppol2tp'
make[2]: Entering directory '/usr/src/RPM/BUILD/ppp-2.4.8/pppd/plugins/pppol2tp'
gcc -pipe -frecord-gcc-switches -Wall -g -O2 -flto=auto -fPIC -Wall -D_GNU_SOURCE -fno-strict-aliasing -I. -I../.. -I../../../include -fPIC  -shared -o pppol2tp.so pppol2tp.o 
make[2]: Leaving directory '/usr/src/RPM/BUILD/ppp-2.4.8/pppd/plugins/pppol2tp'
rm pppol2tp.o openl2tp.o
make[2]: Entering directory '/usr/src/RPM/BUILD/ppp-2.4.8/pppd/plugins/radius'
make[2]: warning: -j16 forced in submake: resetting jobserver mode.
make[2]: Leaving directory '/usr/src/RPM/BUILD/ppp-2.4.8/pppd/plugins/radius'
make[2]: Entering directory '/usr/src/RPM/BUILD/ppp-2.4.8/pppd/plugins/radius'
gcc -pipe -frecord-gcc-switches -Wall -g -O2 -flto=auto -fPIC -Wall -D_GNU_SOURCE -fno-strict-aliasing -I. -I../.. -I../../../include -fPIC -DRC_LOG_FACILITY=LOG_DAEMON -DCHAPMS=1 -DMPPE=1 -DMAXOCTETS=1 -DUSE_OPENSSL=1 -c -o md5.o md5.c
md5.c: In function 'rc_md5_calc':
md5.c:14:9: warning: 'MD5_Init' is deprecated: Since OpenSSL 3.0 [-Wdeprecated-declarations]
   14 |         MD5_Init (&context);
      |         ^~~~~~~~
In file included from md5.c:5:
/usr/include/openssl/md5.h:49:27: note: declared here
   49 | OSSL_DEPRECATEDIN_3_0 int MD5_Init(MD5_CTX *c);
      |                           ^~~~~~~~
md5.c:15:9: warning: 'MD5_Update' is deprecated: Since OpenSSL 3.0 [-Wdeprecated-declarations]
   15 |         MD5_Update (&context, input, inlen);
      |         ^~~~~~~~~~
/usr/include/openssl/md5.h:50:27: note: declared here
   50 | OSSL_DEPRECATEDIN_3_0 int MD5_Update(MD5_CTX *c, const void *data, size_t len);
      |                           ^~~~~~~~~~
md5.c:16:9: warning: 'MD5_Final' is deprecated: Since OpenSSL 3.0 [-Wdeprecated-declarations]
   16 |         MD5_Final (output, &context);
      |         ^~~~~~~~~
/usr/include/openssl/md5.h:51:27: note: declared here
   51 | OSSL_DEPRECATEDIN_3_0 int MD5_Final(unsigned char *md, MD5_CTX *c);
      |                           ^~~~~~~~~
make[2]: Leaving directory '/usr/src/RPM/BUILD/ppp-2.4.8/pppd/plugins/radius'
make[2]: Entering directory '/usr/src/RPM/BUILD/ppp-2.4.8/pppd/plugins/radius'
gcc -pipe -frecord-gcc-switches -Wall -g -O2 -flto=auto -fPIC -Wall -D_GNU_SOURCE -fno-strict-aliasing -I. -I../.. -I../../../include -fPIC -DRC_LOG_FACILITY=LOG_DAEMON -DCHAPMS=1 -DMPPE=1 -DMAXOCTETS=1 -DUSE_OPENSSL=1 -c -o util.o util.c
make[2]: Leaving directory '/usr/src/RPM/BUILD/ppp-2.4.8/pppd/plugins/radius'
make[2]: Entering directory '/usr/src/RPM/BUILD/ppp-2.4.8/pppd/plugins/radius'
gcc -pipe -frecord-gcc-switches -Wall -g -O2 -flto=auto -fPIC -Wall -D_GNU_SOURCE -fno-strict-aliasing -I. -I../.. -I../../../include -fPIC -DRC_LOG_FACILITY=LOG_DAEMON -DCHAPMS=1 -DMPPE=1 -DMAXOCTETS=1 -DUSE_OPENSSL=1 -c -o radrealms.o radrealms.c
radrealms.c:17:19: warning: 'RCSID' defined but not used [-Wunused-const-variable=]
   17 | static char const RCSID[] =
      |                   ^~~~~
make[2]: Leaving directory '/usr/src/RPM/BUILD/ppp-2.4.8/pppd/plugins/radius'
make[2]: Entering directory '/usr/src/RPM/BUILD/ppp-2.4.8/pppd/plugins/radius'
gcc -pipe -frecord-gcc-switches -Wall -g -O2 -flto=auto -fPIC -Wall -D_GNU_SOURCE -fno-strict-aliasing -I. -I../.. -I../../../include -fPIC -DRC_LOG_FACILITY=LOG_DAEMON -DCHAPMS=1 -DMPPE=1 -DMAXOCTETS=1 -DUSE_OPENSSL=1 -c -o radattr.o radattr.c
radattr.c:17:19: warning: 'RCSID' defined but not used [-Wunused-const-variable=]
   17 | static char const RCSID[] =
      |                   ^~~~~
make[2]: Leaving directory '/usr/src/RPM/BUILD/ppp-2.4.8/pppd/plugins/radius'
make[2]: Entering directory '/usr/src/RPM/BUILD/ppp-2.4.8/pppd/plugins/radius'
gcc -pipe -frecord-gcc-switches -Wall -g -O2 -flto=auto -fPIC -Wall -D_GNU_SOURCE -fno-strict-aliasing -I. -I../.. -I../../../include -fPIC -DRC_LOG_FACILITY=LOG_DAEMON -DCHAPMS=1 -DMPPE=1 -DMAXOCTETS=1 -DUSE_OPENSSL=1 -c -o lock.o lock.c
make[2]: Leaving directory '/usr/src/RPM/BUILD/ppp-2.4.8/pppd/plugins/radius'
make[2]: Entering directory '/usr/src/RPM/BUILD/ppp-2.4.8/pppd/plugins/radius'
gcc -pipe -frecord-gcc-switches -Wall -g -O2 -flto=auto -fPIC -Wall -D_GNU_SOURCE -fno-strict-aliasing -I. -I../.. -I../../../include -fPIC -DRC_LOG_FACILITY=LOG_DAEMON -DCHAPMS=1 -DMPPE=1 -DMAXOCTETS=1 -DUSE_OPENSSL=1 -c -o ip_util.o ip_util.c
make[2]: Leaving directory '/usr/src/RPM/BUILD/ppp-2.4.8/pppd/plugins/radius'
make[2]: Entering directory '/usr/src/RPM/BUILD/ppp-2.4.8/pppd/plugins/radius'
gcc -pipe -frecord-gcc-switches -Wall -g -O2 -flto=auto -fPIC -Wall -D_GNU_SOURCE -fno-strict-aliasing -I. -I../.. -I../../../include -fPIC -DRC_LOG_FACILITY=LOG_DAEMON -DCHAPMS=1 -DMPPE=1 -DMAXOCTETS=1 -DUSE_OPENSSL=1 -c -o clientid.o clientid.c
make[2]: Leaving directory '/usr/src/RPM/BUILD/ppp-2.4.8/pppd/plugins/radius'
make[2]: Entering directory '/usr/src/RPM/BUILD/ppp-2.4.8/pppd/plugins/radius'
gcc -pipe -frecord-gcc-switches -Wall -g -O2 -flto=auto -fPIC -Wall -D_GNU_SOURCE -fno-strict-aliasing -I. -I../.. -I../../../include -fPIC -DRC_LOG_FACILITY=LOG_DAEMON -DCHAPMS=1 -DMPPE=1 -DMAXOCTETS=1 -DUSE_OPENSSL=1 -c -o config.o config.c
config.c: In function 'rc_find_server':
config.c:528:46: warning: argument to 'sizeof' in 'memset' call is the same expression as the destination; did you mean to provide an explicit length? [-Wsizeof-pointer-memaccess]
  528 |                 memset (secret, '\0', sizeof (secret));
      |                                              ^
config.c:455:25: warning: unused variable 'len' [-Wunused-variable]
  455 |         int             len;
      |                         ^~~
make[2]: Leaving directory '/usr/src/RPM/BUILD/ppp-2.4.8/pppd/plugins/radius'
make[2]: Entering directory '/usr/src/RPM/BUILD/ppp-2.4.8/pppd/plugins/radius'
gcc -pipe -frecord-gcc-switches -Wall -g -O2 -flto=auto -fPIC -Wall -D_GNU_SOURCE -fno-strict-aliasing -I. -I../.. -I../../../include -fPIC -DRC_LOG_FACILITY=LOG_DAEMON -DCHAPMS=1 -DMPPE=1 -DMAXOCTETS=1 -DUSE_OPENSSL=1 -c -o buildreq.o buildreq.c
buildreq.c: In function 'rc_get_seqnbr':
buildreq.c:138:9: warning: ignoring return value of 'ftruncate' declared with attribute 'warn_unused_result' [-Wunused-result]
  138 |         ftruncate(fileno(sf),0);
      |         ^~~~~~~~~~~~~~~~~~~~~~~
make[2]: Leaving directory '/usr/src/RPM/BUILD/ppp-2.4.8/pppd/plugins/radius'
make[2]: Entering directory '/usr/src/RPM/BUILD/ppp-2.4.8/pppd/plugins/radius'
gcc -pipe -frecord-gcc-switches -Wall -g -O2 -flto=auto -fPIC -Wall -D_GNU_SOURCE -fno-strict-aliasing -I. -I../.. -I../../../include -fPIC -DRC_LOG_FACILITY=LOG_DAEMON -DCHAPMS=1 -DMPPE=1 -DMAXOCTETS=1 -DUSE_OPENSSL=1 -c -o dict.o dict.c
make[2]: Leaving directory '/usr/src/RPM/BUILD/ppp-2.4.8/pppd/plugins/radius'
make[2]: Entering directory '/usr/src/RPM/BUILD/ppp-2.4.8/pppd/plugins/radius'
gcc -pipe -frecord-gcc-switches -Wall -g -O2 -flto=auto -fPIC -Wall -D_GNU_SOURCE -fno-strict-aliasing -I. -I../.. -I../../../include -fPIC -DRC_LOG_FACILITY=LOG_DAEMON -DCHAPMS=1 -DMPPE=1 -DMAXOCTETS=1 -DUSE_OPENSSL=1 -c -o avpair.o avpair.c
avpair.c: In function 'rc_avpair_assign':
avpair.c:79:36: warning: pointer targets in passing argument 1 of 'strncpy' differ in signedness [-Wpointer-sign]
   79 |                         strncpy (vp->strvalue, (char *) pval, AUTH_STRING_LEN);
      |                                  ~~^~~~~~~~~~
      |                                    |
      |                                    u_char * {aka unsigned char *}
In file included from /usr/include/features.h:491,
                 from /usr/include/sys/types.h:25,
                 from ./includes.h:17,
                 from avpair.c:17:
/usr/include/bits/string_fortified.h:92:1: note: expected 'char * restrict' but argument is of type 'u_char *' {aka 'unsigned char *'}
   92 | __NTH (strncpy (char *__restrict __dest, const char *__restrict __src,
      | ^~~~~
avpair.c: In function 'rc_avpair_gen':
avpair.c:199:42: warning: pointer targets in passing argument 1 of 'sprintf' differ in signedness [-Wpointer-sign]
  199 |                                 sprintf (hex, "%2.2X", *x_ptr);
      |                                          ^~~
      |                                          |
      |                                          unsigned char *
/usr/include/bits/stdio2.h:28:1: note: expected 'char * restrict' but argument is of type 'unsigned char *'
   28 | __NTH (sprintf (char *__restrict __s, const char *__restrict __fmt, ...))
      | ^~~~~
avpair.c:200:49: warning: pointer targets in passing argument 2 of 'strcat' differ in signedness [-Wpointer-sign]
  200 |                                 strcat (buffer, hex);
      |                                                 ^~~
      |                                                 |
      |                                                 unsigned char *
/usr/include/bits/string_fortified.h:128:1: note: expected 'const char * restrict' but argument is of type 'unsigned char *'
  128 | __NTH (strcat (char *__restrict __dest, const char *__restrict __src))
      | ^~~~~
avpair.c: In function 'rc_avpair_parse':
avpair.c:600:45: warning: pointer targets in passing argument 1 of 'strcpy' differ in signedness [-Wpointer-sign]
  600 |                                 strcpy (pair->strvalue, valstr);
      |                                         ~~~~^~~~~~~~~~
      |                                             |
      |                                             u_char * {aka unsigned char *}
/usr/include/bits/string_fortified.h:77:1: note: expected 'char * restrict' but argument is of type 'u_char *' {aka 'unsigned char *'}
   77 | __NTH (strcpy (char *__restrict __dest, const char *__restrict __src))
      | ^~~~~
avpair.c: In function 'rc_avpair_tostr':
avpair.c:724:48: warning: pointer targets in passing argument 2 of 'strncat' differ in signedness [-Wpointer-sign]
  724 |                                 strncat(value, ptr, 1);
      |                                                ^~~
      |                                                |
      |                                                unsigned char *
/usr/include/bits/string_fortified.h:135:1: note: expected 'const char * restrict' but argument is of type 'unsigned char *'
  135 | __NTH (strncat (char *__restrict __dest, const char *__restrict __src,
      | ^~~~~
make[2]: Leaving directory '/usr/src/RPM/BUILD/ppp-2.4.8/pppd/plugins/radius'
make[2]: Entering directory '/usr/src/RPM/BUILD/ppp-2.4.8/pppd/plugins/radius'
gcc -pipe -frecord-gcc-switches -Wall -g -O2 -flto=auto -fPIC -Wall -D_GNU_SOURCE -fno-strict-aliasing -I. -I../.. -I../../../include -fPIC -DRC_LOG_FACILITY=LOG_DAEMON -DCHAPMS=1 -DMPPE=1 -DMAXOCTETS=1 -DUSE_OPENSSL=1 -c -o sendserver.o sendserver.c
sendserver.c: In function 'rc_pack_list':
sendserver.c:107:28: warning: pointer targets in assignment from 'char *' to 'unsigned char *' differ in signedness [-Wpointer-sign]
  107 |                     vector = (char *)auth->vector;
      |                            ^
sendserver.c: In function 'rc_send_server':
sendserver.c:250:66: warning: pointer targets in passing argument 3 of 'getsockname' differ in signedness [-Wpointer-sign]
  250 |                    getsockname (sockfd, (struct sockaddr *) sin, &length) < 0)
      |                                                                  ^~~~~~~
      |                                                                  |
      |                                                                  int *
In file included from /usr/include/netinet/in.h:23,
                 from /usr/include/netdb.h:27,
                 from ./includes.h:22,
                 from sendserver.c:17:
/usr/include/sys/socket.h:117:47: note: expected 'socklen_t * restrict' {aka 'unsigned int * restrict'} but argument is of type 'int *'
  117 |                         socklen_t *__restrict __len) __THROW;
      |                         ~~~~~~~~~~~~~~~~~~~~~~^~~~~
sendserver.c:275:38: warning: pointer targets in passing argument 2 of 'rc_md5_calc' differ in signedness [-Wpointer-sign]
  275 |                 rc_md5_calc (vector, (char *) auth, total_length + secretlen);
      |                                      ^~~~~~~~~~~~~
      |                                      |
      |                                      char *
In file included from ./radiusclient.h:23,
                 from sendserver.c:18:
./radiusclient.h:458:40: note: expected 'unsigned char *' but argument is of type 'char *'
  458 | void rc_md5_calc __P((unsigned char *, unsigned char *, unsigned int));
      |                                        ^~~~~~~~~~~~~~~
../../pppd.h:66:19: note: in definition of macro '__P'
   66 | #define __P(args) args
      |                   ^~~~
sendserver.c:331:48: warning: pointer targets in passing argument 6 of 'recvfrom' differ in signedness [-Wpointer-sign]
  331 |                            (int) 0, &saremote, &salen);
      |                                                ^~~~~~
      |                                                |
      |                                                int *
In file included from /usr/include/sys/socket.h:343:
/usr/include/bits/socket2.h:62:56: note: expected 'socklen_t * restrict' {aka 'unsigned int * restrict'} but argument is of type 'int *'
   62 |           __SOCKADDR_ARG __addr, socklen_t *__restrict __addr_len)
      |                                  ~~~~~~~~~~~~~~~~~~~~~~^~~~~~~~~~
sendserver.c:365:39: warning: pointer targets in passing argument 2 of 'strcat' differ in signedness [-Wpointer-sign]
  365 |                         strcat(msg, vp->strvalue);
      |                                     ~~^~~~~~~~~~
      |                                       |
      |                                       u_char * {aka unsigned char *}
In file included from /usr/include/features.h:491,
                 from /usr/include/sys/types.h:25,
                 from ./includes.h:17:
/usr/include/bits/string_fortified.h:128:1: note: expected 'const char * restrict' but argument is of type 'u_char *' {aka 'unsigned char *'}
  128 | __NTH (strcat (char *__restrict __dest, const char *__restrict __src))
      | ^~~~~
sendserver.c: In function 'rc_check_reply':
sendserver.c:431:35: warning: pointer targets in passing argument 2 of 'rc_md5_calc' differ in signedness [-Wpointer-sign]
  431 |         rc_md5_calc (calc_digest, (char *) auth, totallen + secretlen);
      |                                   ^~~~~~~~~~~~~
      |                                   |
      |                                   char *
./radiusclient.h:458:40: note: expected 'unsigned char *' but argument is of type 'char *'
  458 | void rc_md5_calc __P((unsigned char *, unsigned char *, unsigned int));
      |                                        ^~~~~~~~~~~~~~~
../../pppd.h:66:19: note: in definition of macro '__P'
   66 | #define __P(args) args
      |                   ^~~~
make[2]: Leaving directory '/usr/src/RPM/BUILD/ppp-2.4.8/pppd/plugins/radius'
make[2]: Entering directory '/usr/src/RPM/BUILD/ppp-2.4.8/pppd/plugins/radius'
ar rv libradiusclient.a avpair.o buildreq.o config.o dict.o ip_util.o clientid.o sendserver.o lock.o util.o md5.o
ar: creating libradiusclient.a
a - avpair.o
a - buildreq.o
a - config.o
a - dict.o
a - ip_util.o
a - clientid.o
a - sendserver.o
a - lock.o
a - util.o
a - md5.o
make[2]: Leaving directory '/usr/src/RPM/BUILD/ppp-2.4.8/pppd/plugins/radius'
make[2]: Entering directory '/usr/src/RPM/BUILD/ppp-2.4.8/pppd/plugins/radius'
gcc -pipe -frecord-gcc-switches -Wall -g -O2 -flto=auto -fPIC -Wall -D_GNU_SOURCE -fno-strict-aliasing -I. -I../.. -I../../../include -fPIC -DRC_LOG_FACILITY=LOG_DAEMON -DCHAPMS=1 -DMPPE=1 -DMAXOCTETS=1 -DUSE_OPENSSL=1 -c -o radius.o radius.c
radius.c:209:34: warning: "/*" within comment [-Wcomment]
  209 | * worry about looking in /etc/ppp/*-secrets
      |                                   
radius.c: In function 'radius_setparams':
radius.c:600:52: warning: pointer targets in passing argument 2 of 'script_setenv' differ in signedness [-Wpointer-sign]
  600 |                script_setenv("RADIUS_FILTER_ID", vp->strvalue, 1);
      |                                                  ~~^~~~~~~~~~
      |                                                    |
      |                                                    u_char * {aka unsigned char *}
In file included from radius.c:29:
../../pppd.h:546:33: note: expected 'char *' but argument is of type 'u_char *' {aka 'unsigned char *'}
  546 | void script_setenv __P((char *, char *, int));  /* set script env var */
      |                                 ^~~~~~
../../pppd.h:66:19: note: in definition of macro '__P'
   66 | #define __P(args) args
      |                   ^~~~
radius.c:604:55: warning: pointer targets in passing argument 2 of 'script_setenv' differ in signedness [-Wpointer-sign]
  604 |                script_setenv("RADIUS_FRAMED_ROUTE", vp->strvalue, 1);
      |                                                     ~~^~~~~~~~~~
      |                                                       |
      |                                                       u_char * {aka unsigned char *}
../../pppd.h:546:33: note: expected 'char *' but argument is of type 'u_char *' {aka 'unsigned char *'}
  546 | void script_setenv __P((char *, char *, int));  /* set script env var */
      |                                 ^~~~~~
../../pppd.h:66:19: note: in definition of macro '__P'
   66 | #define __P(args) args
      |                   ^~~~
radius.c:665:64: warning: pointer targets in passing argument 1 of 'strncmp' differ in signedness [-Wpointer-sign]
  665 |                 if ((vp->lvalue != 43) || strncmp(vp->strvalue + 1, "S=", 2)) {
      |                                                   ~~~~~~~~~~~~~^~~
      |                                                                |
      |                                                                u_char * {aka unsigned char *}
In file included from radius.c:47:
/usr/include/string.h:159:33: note: expected 'const char *' but argument is of type 'u_char *' {aka 'unsigned char *'}
  159 | extern int strncmp (const char *__s1, const char *__s2, size_t __n)
      |                     ~~~~~~~~~~~~^~~~
radius.c:670:51: warning: pointer targets in passing argument 2 of 'strlcpy' differ in signedness [-Wpointer-sign]
  670 |                     strlcpy(message, vp->strvalue + 1, message_space);
      |                                      ~~~~~~~~~~~~~^~~
      |                                                   |
      |                                                   u_char * {aka unsigned char *}
In file included from /usr/include/features.h:491,
                 from /usr/include/bits/libc-header-start.h:33,
                 from /usr/include/stdio.h:27,
                 from ../../pppd.h:52:
/usr/include/bits/string_fortified.h:154:1: note: expected 'const char * restrict' but argument is of type 'u_char *' {aka 'unsigned char *'}
  154 | __NTH (strlcpy (char *__restrict __dest, const char *__restrict __src,
      | ^~~~~
radius.c: In function 'radius_setmppekeys':
radius.c:786:5: warning: 'MD5_Init' is deprecated: Since OpenSSL 3.0 [-Wdeprecated-declarations]
  786 |     MD5_Init(&Context);
      |     ^~~~~~~~
In file included from radius.c:35:
/usr/include/openssl/md5.h:49:27: note: declared here
   49 | OSSL_DEPRECATEDIN_3_0 int MD5_Init(MD5_CTX *c);
      |                           ^~~~~~~~
radius.c:787:5: warning: 'MD5_Update' is deprecated: Since OpenSSL 3.0 [-Wdeprecated-declarations]
  787 |     MD5_Update(&Context, req_info->secret, strlen(req_info->secret));
      |     ^~~~~~~~~~
/usr/include/openssl/md5.h:50:27: note: declared here
   50 | OSSL_DEPRECATEDIN_3_0 int MD5_Update(MD5_CTX *c, const void *data, size_t len);
      |                           ^~~~~~~~~~
radius.c:788:5: warning: 'MD5_Update' is deprecated: Since OpenSSL 3.0 [-Wdeprecated-declarations]
  788 |     MD5_Update(&Context, req_info->request_vector, AUTH_VECTOR_LEN);
      |     ^~~~~~~~~~
/usr/include/openssl/md5.h:50:27: note: declared here
   50 | OSSL_DEPRECATEDIN_3_0 int MD5_Update(MD5_CTX *c, const void *data, size_t len);
      |                           ^~~~~~~~~~
radius.c:789:5: warning: 'MD5_Final' is deprecated: Since OpenSSL 3.0 [-Wdeprecated-declarations]
  789 |     MD5_Final(buf, &Context);
      |     ^~~~~~~~~
/usr/include/openssl/md5.h:51:27: note: declared here
   51 | OSSL_DEPRECATEDIN_3_0 int MD5_Final(unsigned char *md, MD5_CTX *c);
      |                           ^~~~~~~~~
radius.c:794:5: warning: 'MD5_Init' is deprecated: Since OpenSSL 3.0 [-Wdeprecated-declarations]
  794 |     MD5_Init(&Context);
      |     ^~~~~~~~
/usr/include/openssl/md5.h:49:27: note: declared here
   49 | OSSL_DEPRECATEDIN_3_0 int MD5_Init(MD5_CTX *c);
      |                           ^~~~~~~~
radius.c:795:5: warning: 'MD5_Update' is deprecated: Since OpenSSL 3.0 [-Wdeprecated-declarations]
  795 |     MD5_Update(&Context, req_info->secret, strlen(req_info->secret));
      |     ^~~~~~~~~~
/usr/include/openssl/md5.h:50:27: note: declared here
   50 | OSSL_DEPRECATEDIN_3_0 int MD5_Update(MD5_CTX *c, const void *data, size_t len);
      |                           ^~~~~~~~~~
radius.c:796:5: warning: 'MD5_Update' is deprecated: Since OpenSSL 3.0 [-Wdeprecated-declarations]
  796 |     MD5_Update(&Context, vp->strvalue, 16);
      |     ^~~~~~~~~~
/usr/include/openssl/md5.h:50:27: note: declared here
   50 | OSSL_DEPRECATEDIN_3_0 int MD5_Update(MD5_CTX *c, const void *data, size_t len);
      |                           ^~~~~~~~~~
radius.c:797:5: warning: 'MD5_Final' is deprecated: Since OpenSSL 3.0 [-Wdeprecated-declarations]
  797 |     MD5_Final(buf, &Context);
      |     ^~~~~~~~~
/usr/include/openssl/md5.h:51:27: note: declared here
   51 | OSSL_DEPRECATEDIN_3_0 int MD5_Final(unsigned char *md, MD5_CTX *c);
      |                           ^~~~~~~~~
radius.c: In function 'radius_setmppekeys2':
radius.c:850:5: warning: 'MD5_Init' is deprecated: Since OpenSSL 3.0 [-Wdeprecated-declarations]
  850 |     MD5_Init(&Context);
      |     ^~~~~~~~
/usr/include/openssl/md5.h:49:27: note: declared here
   49 | OSSL_DEPRECATEDIN_3_0 int MD5_Init(MD5_CTX *c);
      |                           ^~~~~~~~
radius.c:851:5: warning: 'MD5_Update' is deprecated: Since OpenSSL 3.0 [-Wdeprecated-declarations]
  851 |     MD5_Update(&Context, req_info->secret, strlen(req_info->secret));
      |     ^~~~~~~~~~
/usr/include/openssl/md5.h:50:27: note: declared here
   50 | OSSL_DEPRECATEDIN_3_0 int MD5_Update(MD5_CTX *c, const void *data, size_t len);
      |                           ^~~~~~~~~~
radius.c:852:5: warning: 'MD5_Update' is deprecated: Since OpenSSL 3.0 [-Wdeprecated-declarations]
  852 |     MD5_Update(&Context, req_info->request_vector, AUTH_VECTOR_LEN);
      |     ^~~~~~~~~~
/usr/include/openssl/md5.h:50:27: note: declared here
   50 | OSSL_DEPRECATEDIN_3_0 int MD5_Update(MD5_CTX *c, const void *data, size_t len);
      |                           ^~~~~~~~~~
radius.c:853:5: warning: 'MD5_Update' is deprecated: Since OpenSSL 3.0 [-Wdeprecated-declarations]
  853 |     MD5_Update(&Context, salt, 2);
      |     ^~~~~~~~~~
/usr/include/openssl/md5.h:50:27: note: declared here
   50 | OSSL_DEPRECATEDIN_3_0 int MD5_Update(MD5_CTX *c, const void *data, size_t len);
      |                           ^~~~~~~~~~
radius.c:854:5: warning: 'MD5_Final' is deprecated: Since OpenSSL 3.0 [-Wdeprecated-declarations]
  854 |     MD5_Final(buf, &Context);
      |     ^~~~~~~~~
/usr/include/openssl/md5.h:51:27: note: declared here
   51 | OSSL_DEPRECATEDIN_3_0 int MD5_Final(unsigned char *md, MD5_CTX *c);
      |                           ^~~~~~~~~
radius.c:865:5: warning: 'MD5_Init' is deprecated: Since OpenSSL 3.0 [-Wdeprecated-declarations]
  865 |     MD5_Init(&Context);
      |     ^~~~~~~~
/usr/include/openssl/md5.h:49:27: note: declared here
   49 | OSSL_DEPRECATEDIN_3_0 int MD5_Init(MD5_CTX *c);
      |                           ^~~~~~~~
radius.c:866:5: warning: 'MD5_Update' is deprecated: Since OpenSSL 3.0 [-Wdeprecated-declarations]
  866 |     MD5_Update(&Context, req_info->secret, strlen(req_info->secret));
      |     ^~~~~~~~~~
/usr/include/openssl/md5.h:50:27: note: declared here
   50 | OSSL_DEPRECATEDIN_3_0 int MD5_Update(MD5_CTX *c, const void *data, size_t len);
      |                           ^~~~~~~~~~
radius.c:867:5: warning: 'MD5_Update' is deprecated: Since OpenSSL 3.0 [-Wdeprecated-declarations]
  867 |     MD5_Update(&Context, crypt, 16);
      |     ^~~~~~~~~~
/usr/include/openssl/md5.h:50:27: note: declared here
   50 | OSSL_DEPRECATEDIN_3_0 int MD5_Update(MD5_CTX *c, const void *data, size_t len);
      |                           ^~~~~~~~~~
radius.c:868:5: warning: 'MD5_Final' is deprecated: Since OpenSSL 3.0 [-Wdeprecated-declarations]
  868 |     MD5_Final(buf, &Context);
      |     ^~~~~~~~~
/usr/include/openssl/md5.h:51:27: note: declared here
   51 | OSSL_DEPRECATEDIN_3_0 int MD5_Final(unsigned char *md, MD5_CTX *c);
      |                           ^~~~~~~~~
radius.c: At top level:
radius.c:26:19: warning: 'RCSID' defined but not used [-Wunused-const-variable=]
   26 | static char const RCSID[] =
      |                   ^~~~~
make[2]: Leaving directory '/usr/src/RPM/BUILD/ppp-2.4.8/pppd/plugins/radius'
make[2]: Entering directory '/usr/src/RPM/BUILD/ppp-2.4.8/pppd/plugins/radius'
gcc -pipe -frecord-gcc-switches -Wall -g -O2 -flto=auto -fPIC -Wall -D_GNU_SOURCE -fno-strict-aliasing -I. -I../.. -I../../../include -fPIC -DRC_LOG_FACILITY=LOG_DAEMON -DCHAPMS=1 -DMPPE=1 -DMAXOCTETS=1 -DUSE_OPENSSL=1 -shared -o radattr.so radattr.o
make[2]: Leaving directory '/usr/src/RPM/BUILD/ppp-2.4.8/pppd/plugins/radius'
make[2]: Entering directory '/usr/src/RPM/BUILD/ppp-2.4.8/pppd/plugins/radius'
gcc -pipe -frecord-gcc-switches -Wall -g -O2 -flto=auto -fPIC -Wall -D_GNU_SOURCE -fno-strict-aliasing -I. -I../.. -I../../../include -fPIC -DRC_LOG_FACILITY=LOG_DAEMON -DCHAPMS=1 -DMPPE=1 -DMAXOCTETS=1 -DUSE_OPENSSL=1 -shared -o radrealms.so radrealms.o
make[2]: Leaving directory '/usr/src/RPM/BUILD/ppp-2.4.8/pppd/plugins/radius'
make[2]: Entering directory '/usr/src/RPM/BUILD/ppp-2.4.8/pppd/plugins/radius'
gcc -pipe -frecord-gcc-switches -Wall -g -O2 -flto=auto -fPIC -Wall -D_GNU_SOURCE -fno-strict-aliasing -I. -I../.. -I../../../include -fPIC -DRC_LOG_FACILITY=LOG_DAEMON -DCHAPMS=1 -DMPPE=1 -DMAXOCTETS=1 -DUSE_OPENSSL=1 -shared -o radius.so radius.o libradiusclient.a -lcrypto
make[2]: Leaving directory '/usr/src/RPM/BUILD/ppp-2.4.8/pppd/plugins/radius'
make[2]: Entering directory '/usr/src/RPM/BUILD/ppp-2.4.8/pppd/plugins/dhcp'
make[2]: warning: -j16 forced in submake: resetting jobserver mode.
make[2]: Leaving directory '/usr/src/RPM/BUILD/ppp-2.4.8/pppd/plugins/dhcp'
make[2]: Entering directory '/usr/src/RPM/BUILD/ppp-2.4.8/pppd/plugins/dhcp'
libtool --mode=compile --tag=CC gcc -I../.. -I../../../include -pipe -frecord-gcc-switches -Wall -g -O2 -flto=auto -fPIC -Wall -D_GNU_SOURCE -fno-strict-aliasing  -c options.c
libtool-default: compile:  gcc -I../.. -I../../../include -pipe -frecord-gcc-switches -Wall -g -O2 -flto=auto -fPIC -Wall -D_GNU_SOURCE -fno-strict-aliasing -c options.c  -fPIC -DPIC -o .libs/options.o
In file included from options.c:10:
options.c: In function 'get_option':
debug.h:16:34: warning: implicit declaration of function 'info' [-Wimplicit-function-declaration]
   16 | #define LOG(level, str, args...) info("DHCPC: " str, ## args)
      |                                  ^~~~
options.c:76:25: note: in expansion of macro 'LOG'
   76 |                         LOG(LOG_WARNING, "bogus packet, option fields too long.");
      |                         ^~~
options.c: In function 'add_option_string':
debug.h:9:37: warning: implicit declaration of function 'dbglog' [-Wimplicit-function-declaration]
    9 | # define DEBUG(level, str, args...) dbglog("DHCPC: " str, ## args)
      |                                     ^~~~~~
options.c:143:9: note: in expansion of macro 'DEBUG'
  143 |         DEBUG(LOG_INFO, "adding option 0x%02x", string[OPT_CODE]);
      |         ^~~~~
libtool-default: compile:  gcc -I../.. -I../../../include -pipe -frecord-gcc-switches -Wall -g -O2 -flto=auto -fPIC -Wall -D_GNU_SOURCE -fno-strict-aliasing -c options.c -o options.o >/dev/null 2>&1
make[2]: Leaving directory '/usr/src/RPM/BUILD/ppp-2.4.8/pppd/plugins/dhcp'
make[2]: Entering directory '/usr/src/RPM/BUILD/ppp-2.4.8/pppd/plugins/dhcp'
libtool --mode=compile --tag=CC gcc -I../.. -I../../../include -pipe -frecord-gcc-switches -Wall -g -O2 -flto=auto -fPIC -Wall -D_GNU_SOURCE -fno-strict-aliasing  -c socket.c
libtool-default: compile:  gcc -I../.. -I../../../include -pipe -frecord-gcc-switches -Wall -g -O2 -flto=auto -fPIC -Wall -D_GNU_SOURCE -fno-strict-aliasing -c socket.c  -fPIC -DPIC -o .libs/socket.o
In file included from socket.c:44:
socket.c: In function 'read_interface':
debug.h:9:37: warning: implicit declaration of function 'dbglog' [-Wimplicit-function-declaration]
    9 | # define DEBUG(level, str, args...) dbglog("DHCPC: " str, ## args)
      |                                     ^~~~~~
socket.c:61:33: note: in expansion of macro 'DEBUG'
   61 |                                 DEBUG(LOG_INFO, "%s (our ip) = %s", ifr.ifr_name, inet_ntoa(sin->sin_addr));
      |                                 ^~~~~
debug.h:16:34: warning: implicit declaration of function 'info' [-Wimplicit-function-declaration]
   16 | #define LOG(level, str, args...) info("DHCPC: " str, ## args)
      |                                  ^~~~
socket.c:63:33: note: in expansion of macro 'LOG'
   63 |                                 LOG(LOG_ERR, "SIOCGIFADDR failed!: %s", strerror(errno));
      |                                 ^~~
libtool-default: compile:  gcc -I../.. -I../../../include -pipe -frecord-gcc-switches -Wall -g -O2 -flto=auto -fPIC -Wall -D_GNU_SOURCE -fno-strict-aliasing -c socket.c -o socket.o >/dev/null 2>&1
make[2]: Leaving directory '/usr/src/RPM/BUILD/ppp-2.4.8/pppd/plugins/dhcp'
make[2]: Entering directory '/usr/src/RPM/BUILD/ppp-2.4.8/pppd/plugins/dhcp'
libtool --mode=compile --tag=CC gcc -I../.. -I../../../include -pipe -frecord-gcc-switches -Wall -g -O2 -flto=auto -fPIC -Wall -D_GNU_SOURCE -fno-strict-aliasing  -c packet.c
libtool-default: compile:  gcc -I../.. -I../../../include -pipe -frecord-gcc-switches -Wall -g -O2 -flto=auto -fPIC -Wall -D_GNU_SOURCE -fno-strict-aliasing -c packet.c  -fPIC -DPIC -o .libs/packet.o
In file included from packet.c:18:
packet.c: In function 'get_packet':
debug.h:9:37: warning: implicit declaration of function 'dbglog' [-Wimplicit-function-declaration]
    9 | # define DEBUG(level, str, args...) dbglog("DHCPC: " str, ## args)
      |                                     ^~~~~~
packet.c:60:17: note: in expansion of macro 'DEBUG'
   60 |                 DEBUG(LOG_INFO, "couldn't read on listening socket, ignoring");
      |                 ^~~~~
debug.h:16:34: warning: implicit declaration of function 'info' [-Wimplicit-function-declaration]
   16 | #define LOG(level, str, args...) info("DHCPC: " str, ## args)
      |                                  ^~~~
packet.c:65:17: note: in expansion of macro 'LOG'
   65 |                 LOG(LOG_ERR, "received bogus message, ignoring");
      |                 ^~~
packet.c:73:38: warning: pointer targets in passing argument 1 of 'strncmp' differ in signedness [-Wpointer-sign]
   73 |                             !strncmp(vendor, broken_vendors[i], vendor[OPT_LEN - 2])) {
      |                                      ^~~~~~
      |                                      |
      |                                      unsigned char *
In file included from packet.c:2:
/usr/include/string.h:159:33: note: expected 'const char *' but argument is of type 'unsigned char *'
  159 | extern int strncmp (const char *__s1, const char *__s2, size_t __n)
      |                     ~~~~~~~~~~~~^~~~
packet.c: In function 'raw_packet':
packet.c:121:12: warning: suggest explicit braces to avoid ambiguous 'else' [-Wdangling-else]
  121 |         if (payload->giaddr && source_port==CLIENT_PORT)
      |            ^
libtool-default: compile:  gcc -I../.. -I../../../include -pipe -frecord-gcc-switches -Wall -g -O2 -flto=auto -fPIC -Wall -D_GNU_SOURCE -fno-strict-aliasing -c packet.c -o packet.o >/dev/null 2>&1
make[2]: Leaving directory '/usr/src/RPM/BUILD/ppp-2.4.8/pppd/plugins/dhcp'
make[2]: Entering directory '/usr/src/RPM/BUILD/ppp-2.4.8/pppd/plugins/dhcp'
libtool --mode=compile --tag=CC gcc -I../.. -I../../../include -pipe -frecord-gcc-switches -Wall -g -O2 -flto=auto -fPIC -Wall -D_GNU_SOURCE -fno-strict-aliasing  -c clientpacket.c
libtool-default: compile:  gcc -I../.. -I../../../include -pipe -frecord-gcc-switches -Wall -g -O2 -flto=auto -fPIC -Wall -D_GNU_SOURCE -fno-strict-aliasing -c clientpacket.c  -fPIC -DPIC -o .libs/clientpacket.o
In file included from clientpacket.c:44:
clientpacket.c: In function 'send_discover':
debug.h:16:34: warning: implicit declaration of function 'info' [-Wimplicit-function-declaration]
   16 | #define LOG(level, str, args...) info("DHCPC: " str, ## args)
      |                                  ^~~~
clientpacket.c:109:9: note: in expansion of macro 'LOG'
  109 |         LOG(LOG_DEBUG, "Sending discover...");
      |         ^~~
clientpacket.c: In function 'get_raw_packet':
debug.h:9:37: warning: implicit declaration of function 'dbglog' [-Wimplicit-function-declaration]
    9 | # define DEBUG(level, str, args...) dbglog("DHCPC: " str, ## args)
      |                                     ^~~~~~
clientpacket.c:188:17: note: in expansion of macro 'DEBUG'
  188 |                 DEBUG(LOG_INFO, "couldn't read on raw listening socket -- ignoring");
      |                 ^~~~~
libtool-default: compile:  gcc -I../.. -I../../../include -pipe -frecord-gcc-switches -Wall -g -O2 -flto=auto -fPIC -Wall -D_GNU_SOURCE -fno-strict-aliasing -c clientpacket.c -o clientpacket.o >/dev/null 2>&1
make[2]: Leaving directory '/usr/src/RPM/BUILD/ppp-2.4.8/pppd/plugins/dhcp'
make[2]: Entering directory '/usr/src/RPM/BUILD/ppp-2.4.8/pppd/plugins/dhcp'
libtool --mode=compile --tag=CC gcc -I../.. -I../../../include -pipe -frecord-gcc-switches -Wall -g -O2 -flto=auto -fPIC -Wall -D_GNU_SOURCE -fno-strict-aliasing  -c dhcpc.c
libtool-default: compile:  gcc -I../.. -I../../../include -pipe -frecord-gcc-switches -Wall -g -O2 -flto=auto -fPIC -Wall -D_GNU_SOURCE -fno-strict-aliasing -c dhcpc.c  -fPIC -DPIC -o .libs/dhcpc.o
dhcpc.c: In function 'change_mode':
dhcpc.c:127:6: warning: suggest explicit braces to avoid ambiguous 'else' [-Wdangling-else]
  127 |   if (new_mode == LISTEN_RAW && client_config.giaddr)
      |      ^
dhcpc.c: In function 'dhcp_rx':
dhcpc.c:191:10: warning: unused variable 'now' [-Wunused-variable]
  191 |   time_t now;
      |          ^~~
dhcpc.c:190:7: warning: unused variable 'pid_fd' [-Wunused-variable]
  190 |   int pid_fd;
      |       ^~~~~~
dhcpc.c:189:18: warning: unused variable 'temp_addr' [-Wunused-variable]
  189 |   struct in_addr temp_addr;
      |                  ^~~~~~~~~
dhcpc.c:187:7: warning: unused variable 'c' [-Wunused-variable]
  187 |   int c, len;
      |       ^
dhcpc.c:185:7: warning: unused variable 'retval' [-Wunused-variable]
  185 |   int retval;
      |       ^~~~~~
dhcpc.c:183:17: warning: unused variable 't2' [-Wunused-variable]
  183 |   unsigned long t2 = 0;
      |                 ^~
dhcpc.c:182:18: warning: unused variable 'temp' [-Wunused-variable]
  182 |   unsigned char *temp, *message;
      |                  ^~~~
dhcpc.c: In function 'dhcp_request_new':
dhcpc.c:312:7: warning: unused variable 'c' [-Wunused-variable]
  312 |   int c, len;
      |       ^
dhcpc.c:308:25: warning: unused variable 't2' [-Wunused-variable]
  308 |   unsigned long t1 = 0, t2 = 0;
      |                         ^~
dhcpc.c:308:17: warning: unused variable 't1' [-Wunused-variable]
  308 |   unsigned long t1 = 0, t2 = 0;
      |                 ^~
dhcpc.c: In function 'dhcp_read_options':
dhcpc.c:514:6: warning: suggest explicit braces to avoid ambiguous 'else' [-Wdangling-else]
  514 |   if (dhcp_subnet_selection)
      |      ^
libtool-default: compile:  gcc -I../.. -I../../../include -pipe -frecord-gcc-switches -Wall -g -O2 -flto=auto -fPIC -Wall -D_GNU_SOURCE -fno-strict-aliasing -c dhcpc.c -o dhcpc.o >/dev/null 2>&1
make[2]: Leaving directory '/usr/src/RPM/BUILD/ppp-2.4.8/pppd/plugins/dhcp'
make[2]: Entering directory '/usr/src/RPM/BUILD/ppp-2.4.8/pppd/plugins/dhcp'
libtool --mode=link --tag=CC gcc -I../.. -I../../../include -pipe -frecord-gcc-switches -Wall -g -O2 -flto=auto -fPIC -Wall -D_GNU_SOURCE -fno-strict-aliasing  -o libdhcpc.la dhcpc.lo clientpacket.lo packet.lo socket.lo options.lo -shared -Wl,-soname,dhcpc.so
libtool-default: link: ar cr .libs/libdhcpc.a .libs/dhcpc.o .libs/clientpacket.o .libs/packet.o .libs/socket.o .libs/options.o 
libtool-default: link: ranlib .libs/libdhcpc.a
libtool-default: link: ( cd ".libs" && rm -f "libdhcpc.la" && ln -s "../libdhcpc.la" "libdhcpc.la" )
make[2]: Leaving directory '/usr/src/RPM/BUILD/ppp-2.4.8/pppd/plugins/dhcp'
make[2]: Entering directory '/usr/src/RPM/BUILD/ppp-2.4.8/pppd/plugins/dhcp'
gcc -o dhcpc.so .libs/dhcpc.o .libs/clientpacket.o .libs/packet.o .libs/socket.o .libs/options.o -shared -Wl,-soname,dhcpc.so
make[2]: Leaving directory '/usr/src/RPM/BUILD/ppp-2.4.8/pppd/plugins/dhcp'
cd pppd; make -w -j16 -Otarget --jobserver-auth=fifo:/usr/src/tmp/GMfifo1626401 --sync-mutex=fnm:/usr/src/tmp/GmUqeLKu all
make[1]: Entering directory '/usr/src/RPM/BUILD/ppp-2.4.8/pppd'
make[1]: warning: -j16 forced in submake: resetting jobserver mode.
make[1]: Leaving directory '/usr/src/RPM/BUILD/ppp-2.4.8/pppd'
make[1]: Entering directory '/usr/src/RPM/BUILD/ppp-2.4.8/pppd'
gcc -pipe -frecord-gcc-switches -Wall -g -O2 -flto=auto -fPIC -Wall -D_GNU_SOURCE -fno-strict-aliasing -DHAVE_PATHS_H -DIPX_CHANGE -DHAVE_MMAP -I../include '-DDESTDIR="/usr"' '-DLIBDIR="/usr/lib64"' -DCHAPMS=1 -DMPPE=1 -DUSE_OPENSSL -DUSE_EAPTLS=1 -DHAS_SHADOW -DHAVE_CRYPT_H=1 -DHAVE_LOGWTMP=1 -I/usr/include/openssl -DUSE_PAM -DHAVE_MULTILINK -DUSE_TDB=1 -DSYSTEMD=1 -DPLUGIN -DPPP_FILTER -DINET6=1 -DCBCP_SUPPORT -DMAXOCTETS   -c -o magic.o magic.c
make[1]: Leaving directory '/usr/src/RPM/BUILD/ppp-2.4.8/pppd'
make[1]: Entering directory '/usr/src/RPM/BUILD/ppp-2.4.8/pppd'
gcc -pipe -frecord-gcc-switches -Wall -g -O2 -flto=auto -fPIC -Wall -D_GNU_SOURCE -fno-strict-aliasing -DHAVE_PATHS_H -DIPX_CHANGE -DHAVE_MMAP -I../include '-DDESTDIR="/usr"' '-DLIBDIR="/usr/lib64"' -DCHAPMS=1 -DMPPE=1 -DUSE_OPENSSL -DUSE_EAPTLS=1 -DHAS_SHADOW -DHAVE_CRYPT_H=1 -DHAVE_LOGWTMP=1 -I/usr/include/openssl -DUSE_PAM -DHAVE_MULTILINK -DUSE_TDB=1 -DSYSTEMD=1 -DPLUGIN -DPPP_FILTER -DINET6=1 -DCBCP_SUPPORT -DMAXOCTETS   -c -o fsm.o fsm.c
make[1]: Leaving directory '/usr/src/RPM/BUILD/ppp-2.4.8/pppd'
make[1]: Entering directory '/usr/src/RPM/BUILD/ppp-2.4.8/pppd'
gcc -pipe -frecord-gcc-switches -Wall -g -O2 -flto=auto -fPIC -Wall -D_GNU_SOURCE -fno-strict-aliasing -DHAVE_PATHS_H -DIPX_CHANGE -DHAVE_MMAP -I../include '-DDESTDIR="/usr"' '-DLIBDIR="/usr/lib64"' -DCHAPMS=1 -DMPPE=1 -DUSE_OPENSSL -DUSE_EAPTLS=1 -DHAS_SHADOW -DHAVE_CRYPT_H=1 -DHAVE_LOGWTMP=1 -I/usr/include/openssl -DUSE_PAM -DHAVE_MULTILINK -DUSE_TDB=1 -DSYSTEMD=1 -DPLUGIN -DPPP_FILTER -DINET6=1 -DCBCP_SUPPORT -DMAXOCTETS   -c -o chap-new.o chap-new.c
make[1]: Leaving directory '/usr/src/RPM/BUILD/ppp-2.4.8/pppd'
make[1]: Entering directory '/usr/src/RPM/BUILD/ppp-2.4.8/pppd'
gcc -pipe -frecord-gcc-switches -Wall -g -O2 -flto=auto -fPIC -Wall -D_GNU_SOURCE -fno-strict-aliasing -DHAVE_PATHS_H -DIPX_CHANGE -DHAVE_MMAP -I../include '-DDESTDIR="/usr"' '-DLIBDIR="/usr/lib64"' -DCHAPMS=1 -DMPPE=1 -DUSE_OPENSSL -DUSE_EAPTLS=1 -DHAS_SHADOW -DHAVE_CRYPT_H=1 -DHAVE_LOGWTMP=1 -I/usr/include/openssl -DUSE_PAM -DHAVE_MULTILINK -DUSE_TDB=1 -DSYSTEMD=1 -DPLUGIN -DPPP_FILTER -DINET6=1 -DCBCP_SUPPORT -DMAXOCTETS   -c -o upap.o upap.c
make[1]: Leaving directory '/usr/src/RPM/BUILD/ppp-2.4.8/pppd'
make[1]: Entering directory '/usr/src/RPM/BUILD/ppp-2.4.8/pppd'
gcc -pipe -frecord-gcc-switches -Wall -g -O2 -flto=auto -fPIC -Wall -D_GNU_SOURCE -fno-strict-aliasing -DHAVE_PATHS_H -DIPX_CHANGE -DHAVE_MMAP -I../include '-DDESTDIR="/usr"' '-DLIBDIR="/usr/lib64"' -DCHAPMS=1 -DMPPE=1 -DUSE_OPENSSL -DUSE_EAPTLS=1 -DHAS_SHADOW -DHAVE_CRYPT_H=1 -DHAVE_LOGWTMP=1 -I/usr/include/openssl -DUSE_PAM -DHAVE_MULTILINK -DUSE_TDB=1 -DSYSTEMD=1 -DPLUGIN -DPPP_FILTER -DINET6=1 -DCBCP_SUPPORT -DMAXOCTETS   -c -o ecp.o ecp.c
make[1]: Leaving directory '/usr/src/RPM/BUILD/ppp-2.4.8/pppd'
make[1]: Entering directory '/usr/src/RPM/BUILD/ppp-2.4.8/pppd'
gcc -pipe -frecord-gcc-switches -Wall -g -O2 -flto=auto -fPIC -Wall -D_GNU_SOURCE -fno-strict-aliasing -DHAVE_PATHS_H -DIPX_CHANGE -DHAVE_MMAP -I../include '-DDESTDIR="/usr"' '-DLIBDIR="/usr/lib64"' -DCHAPMS=1 -DMPPE=1 -DUSE_OPENSSL -DUSE_EAPTLS=1 -DHAS_SHADOW -DHAVE_CRYPT_H=1 -DHAVE_LOGWTMP=1 -I/usr/include/openssl -DUSE_PAM -DHAVE_MULTILINK -DUSE_TDB=1 -DSYSTEMD=1 -DPLUGIN -DPPP_FILTER -DINET6=1 -DCBCP_SUPPORT -DMAXOCTETS   -c -o demand.o demand.c
make[1]: Leaving directory '/usr/src/RPM/BUILD/ppp-2.4.8/pppd'
make[1]: Entering directory '/usr/src/RPM/BUILD/ppp-2.4.8/pppd'
gcc -pipe -frecord-gcc-switches -Wall -g -O2 -flto=auto -fPIC -Wall -D_GNU_SOURCE -fno-strict-aliasing -DHAVE_PATHS_H -DIPX_CHANGE -DHAVE_MMAP -I../include '-DDESTDIR="/usr"' '-DLIBDIR="/usr/lib64"' -DCHAPMS=1 -DMPPE=1 -DUSE_OPENSSL -DUSE_EAPTLS=1 -DHAS_SHADOW -DHAVE_CRYPT_H=1 -DHAVE_LOGWTMP=1 -I/usr/include/openssl -DUSE_PAM -DHAVE_MULTILINK -DUSE_TDB=1 -DSYSTEMD=1 -DPLUGIN -DPPP_FILTER -DINET6=1 -DCBCP_SUPPORT -DMAXOCTETS   -c -o ccp.o ccp.c
make[1]: Leaving directory '/usr/src/RPM/BUILD/ppp-2.4.8/pppd'
make[1]: Entering directory '/usr/src/RPM/BUILD/ppp-2.4.8/pppd'
gcc -pipe -frecord-gcc-switches -Wall -g -O2 -flto=auto -fPIC -Wall -D_GNU_SOURCE -fno-strict-aliasing -DHAVE_PATHS_H -DIPX_CHANGE -DHAVE_MMAP -I../include '-DDESTDIR="/usr"' '-DLIBDIR="/usr/lib64"' -DCHAPMS=1 -DMPPE=1 -DUSE_OPENSSL -DUSE_EAPTLS=1 -DHAS_SHADOW -DHAVE_CRYPT_H=1 -DHAVE_LOGWTMP=1 -I/usr/include/openssl -DUSE_PAM -DHAVE_MULTILINK -DUSE_TDB=1 -DSYSTEMD=1 -DPLUGIN -DPPP_FILTER -DINET6=1 -DCBCP_SUPPORT -DMAXOCTETS   -c -o session.o session.c
make[1]: Leaving directory '/usr/src/RPM/BUILD/ppp-2.4.8/pppd'
make[1]: Entering directory '/usr/src/RPM/BUILD/ppp-2.4.8/pppd'
gcc -pipe -frecord-gcc-switches -Wall -g -O2 -flto=auto -fPIC -Wall -D_GNU_SOURCE -fno-strict-aliasing -DHAVE_PATHS_H -DIPX_CHANGE -DHAVE_MMAP -I../include '-DDESTDIR="/usr"' '-DLIBDIR="/usr/lib64"' -DCHAPMS=1 -DMPPE=1 -DUSE_OPENSSL -DUSE_EAPTLS=1 -DHAS_SHADOW -DHAVE_CRYPT_H=1 -DHAVE_LOGWTMP=1 -I/usr/include/openssl -DUSE_PAM -DHAVE_MULTILINK -DUSE_TDB=1 -DSYSTEMD=1 -DPLUGIN -DPPP_FILTER -DINET6=1 -DCBCP_SUPPORT -DMAXOCTETS   -c -o lcp.o lcp.c
make[1]: Leaving directory '/usr/src/RPM/BUILD/ppp-2.4.8/pppd'
make[1]: Entering directory '/usr/src/RPM/BUILD/ppp-2.4.8/pppd'
gcc -pipe -frecord-gcc-switches -Wall -g -O2 -flto=auto -fPIC -Wall -D_GNU_SOURCE -fno-strict-aliasing -DHAVE_PATHS_H -DIPX_CHANGE -DHAVE_MMAP -I../include '-DDESTDIR="/usr"' '-DLIBDIR="/usr/lib64"' -DCHAPMS=1 -DMPPE=1 -DUSE_OPENSSL -DUSE_EAPTLS=1 -DHAS_SHADOW -DHAVE_CRYPT_H=1 -DHAVE_LOGWTMP=1 -I/usr/include/openssl -DUSE_PAM -DHAVE_MULTILINK -DUSE_TDB=1 -DSYSTEMD=1 -DPLUGIN -DPPP_FILTER -DINET6=1 -DCBCP_SUPPORT -DMAXOCTETS   -c -o options.o options.c
make[1]: Leaving directory '/usr/src/RPM/BUILD/ppp-2.4.8/pppd'
make[1]: Entering directory '/usr/src/RPM/BUILD/ppp-2.4.8/pppd'
gcc -pipe -frecord-gcc-switches -Wall -g -O2 -flto=auto -fPIC -Wall -D_GNU_SOURCE -fno-strict-aliasing -DHAVE_PATHS_H -DIPX_CHANGE -DHAVE_MMAP -I../include '-DDESTDIR="/usr"' '-DLIBDIR="/usr/lib64"' -DCHAPMS=1 -DMPPE=1 -DUSE_OPENSSL -DUSE_EAPTLS=1 -DHAS_SHADOW -DHAVE_CRYPT_H=1 -DHAVE_LOGWTMP=1 -I/usr/include/openssl -DUSE_PAM -DHAVE_MULTILINK -DUSE_TDB=1 -DSYSTEMD=1 -DPLUGIN -DPPP_FILTER -DINET6=1 -DCBCP_SUPPORT -DMAXOCTETS   -c -o ipxcp.o ipxcp.c
make[1]: Leaving directory '/usr/src/RPM/BUILD/ppp-2.4.8/pppd'
make[1]: Entering directory '/usr/src/RPM/BUILD/ppp-2.4.8/pppd'
gcc -pipe -frecord-gcc-switches -Wall -g -O2 -flto=auto -fPIC -Wall -D_GNU_SOURCE -fno-strict-aliasing -DHAVE_PATHS_H -DIPX_CHANGE -DHAVE_MMAP -I../include '-DDESTDIR="/usr"' '-DLIBDIR="/usr/lib64"' -DCHAPMS=1 -DMPPE=1 -DUSE_OPENSSL -DUSE_EAPTLS=1 -DHAS_SHADOW -DHAVE_CRYPT_H=1 -DHAVE_LOGWTMP=1 -I/usr/include/openssl -DUSE_PAM -DHAVE_MULTILINK -DUSE_TDB=1 -DSYSTEMD=1 -DPLUGIN -DPPP_FILTER -DINET6=1 -DCBCP_SUPPORT -DMAXOCTETS   -c -o ipcp.o ipcp.c
make[1]: Leaving directory '/usr/src/RPM/BUILD/ppp-2.4.8/pppd'
make[1]: Entering directory '/usr/src/RPM/BUILD/ppp-2.4.8/pppd'
gcc -pipe -frecord-gcc-switches -Wall -g -O2 -flto=auto -fPIC -Wall -D_GNU_SOURCE -fno-strict-aliasing -DHAVE_PATHS_H -DIPX_CHANGE -DHAVE_MMAP -I../include '-DDESTDIR="/usr"' '-DLIBDIR="/usr/lib64"' -DCHAPMS=1 -DMPPE=1 -DUSE_OPENSSL -DUSE_EAPTLS=1 -DHAS_SHADOW -DHAVE_CRYPT_H=1 -DHAVE_LOGWTMP=1 -I/usr/include/openssl -DUSE_PAM -DHAVE_MULTILINK -DUSE_TDB=1 -DSYSTEMD=1 -DPLUGIN -DPPP_FILTER -DINET6=1 -DCBCP_SUPPORT -DMAXOCTETS   -c -o utils.o utils.c
utils.c: In function 'lock':
utils.c:978:5: warning: ignoring return value of 'write' declared with attribute 'warn_unused_result' [-Wunused-result]
  978 |     write (fd, lock_buffer, 11);
      |     ^~~~~~~~~~~~~~~~~~~~~~~~~~~
utils.c: In function 'relock':
utils.c:1020:5: warning: ignoring return value of 'write' declared with attribute 'warn_unused_result' [-Wunused-result]
 1020 |     write (fd, lock_buffer, 11);
      |     ^~~~~~~~~~~~~~~~~~~~~~~~~~~
make[1]: Leaving directory '/usr/src/RPM/BUILD/ppp-2.4.8/pppd'
make[1]: Entering directory '/usr/src/RPM/BUILD/ppp-2.4.8/pppd'
gcc -pipe -frecord-gcc-switches -Wall -g -O2 -flto=auto -fPIC -Wall -D_GNU_SOURCE -fno-strict-aliasing -DHAVE_PATHS_H -DIPX_CHANGE -DHAVE_MMAP -I../include '-DDESTDIR="/usr"' '-DLIBDIR="/usr/lib64"' -DCHAPMS=1 -DMPPE=1 -DUSE_OPENSSL -DUSE_EAPTLS=1 -DHAS_SHADOW -DHAVE_CRYPT_H=1 -DHAVE_LOGWTMP=1 -I/usr/include/openssl -DUSE_PAM -DHAVE_MULTILINK -DUSE_TDB=1 -DSYSTEMD=1 -DPLUGIN -DPPP_FILTER -DINET6=1 -DCBCP_SUPPORT -DMAXOCTETS   -c -o main.o main.c
main.c: In function 'main':
main.c:584:17: warning: implicit declaration of function 'tty_close_fds' [-Wimplicit-function-declaration]
  584 |                 tty_close_fds();
      |                 ^~~~~~~~~~~~~
main.c:436:5: warning: ignoring return value of 'chdir' declared with attribute 'warn_unused_result' [-Wunused-result]
  436 |     chdir("/");
      |     ^~~~~~~~~~
main.c: In function 'open_ccp':
main.c:1615:9: warning: ignoring return value of 'write' declared with attribute 'warn_unused_result' [-Wunused-result]
 1615 |         write(sigpipe[1], &sig, sizeof(sig));
      |         ^~~~~~~~~~~~~~~~~~~~~~~~~~~~~~~~~~~~
main.c: In function 'chld':
main.c:1580:9: warning: ignoring return value of 'write' declared with attribute 'warn_unused_result' [-Wunused-result]
 1580 |         write(sigpipe[1], &sig, sizeof(sig));
      |         ^~~~~~~~~~~~~~~~~~~~~~~~~~~~~~~~~~~~
main.c: In function 'term':
main.c:1566:9: warning: ignoring return value of 'write' declared with attribute 'warn_unused_result' [-Wunused-result]
 1566 |         write(sigpipe[1], &sig, sizeof(sig));
      |         ^~~~~~~~~~~~~~~~~~~~~~~~~~~~~~~~~~~~
main.c: In function 'hup':
main.c:1544:9: warning: ignoring return value of 'write' declared with attribute 'warn_unused_result' [-Wunused-result]
 1544 |         write(sigpipe[1], &sig, sizeof(sig));
      |         ^~~~~~~~~~~~~~~~~~~~~~~~~~~~~~~~~~~~
main.c: In function 'device_script':
main.c:1824:5: warning: ignoring return value of 'setgid' declared with attribute 'warn_unused_result' [-Wunused-result]
 1824 |     setgid(getgid());
      |     ^~~~~~~~~~~~~~~~
main.c:1825:5: warning: ignoring return value of 'setuid' declared with attribute 'warn_unused_result' [-Wunused-result]
 1825 |     setuid(uid);
      |     ^~~~~~~~~~~
main.c: In function 'run_program':
main.c:1935:12: warning: ignoring return value of 'chdir' declared with attribute 'warn_unused_result' [-Wunused-result]
 1935 |     (void) chdir ("/"); /* no current directory. */
      |            ^~~~~~~~~~~
main.c:1936:5: warning: ignoring return value of 'setuid' declared with attribute 'warn_unused_result' [-Wunused-result]
 1936 |     setuid(0);          /* set real UID = root */
      |     ^~~~~~~~~
main.c:1937:5: warning: ignoring return value of 'setgid' declared with attribute 'warn_unused_result' [-Wunused-result]
 1937 |     setgid(getegid());
      |     ^~~~~~~~~~~~~~~~~
make[1]: Leaving directory '/usr/src/RPM/BUILD/ppp-2.4.8/pppd'
make[1]: Entering directory '/usr/src/RPM/BUILD/ppp-2.4.8/pppd'
gcc -pipe -frecord-gcc-switches -Wall -g -O2 -flto=auto -fPIC -Wall -D_GNU_SOURCE -fno-strict-aliasing -DHAVE_PATHS_H -DIPX_CHANGE -DHAVE_MMAP -I../include '-DDESTDIR="/usr"' '-DLIBDIR="/usr/lib64"' -DCHAPMS=1 -DMPPE=1 -DUSE_OPENSSL -DUSE_EAPTLS=1 -DHAS_SHADOW -DHAVE_CRYPT_H=1 -DHAVE_LOGWTMP=1 -I/usr/include/openssl -DUSE_PAM -DHAVE_MULTILINK -DUSE_TDB=1 -DSYSTEMD=1 -DPLUGIN -DPPP_FILTER -DINET6=1 -DCBCP_SUPPORT -DMAXOCTETS   -c -o tty.o tty.c
tty.c: In function 'setup_serial':
tty.c:1241:40: warning: 'return' with a value, in function returning void [-Wreturn-type]
 1241 |                                 return -1;
      |                                        ^
tty.c:1205:6: note: declared here
 1205 | void setup_serial(char *connector)
      |      ^~~~~~~~~~~~
tty.c: In function 'start_charshunt':
tty.c:880:9: warning: ignoring return value of 'setgid' declared with attribute 'warn_unused_result' [-Wunused-result]
  880 |         setgid(getgid());
      |         ^~~~~~~~~~~~~~~~
tty.c:881:9: warning: ignoring return value of 'setuid' declared with attribute 'warn_unused_result' [-Wunused-result]
  881 |         setuid(uid);
      |         ^~~~~~~~~~~
tty.c: In function 'setup_serial':
tty.c:1228:33: warning: ignoring return value of 'seteuid' declared with attribute 'warn_unused_result' [-Wunused-result]
 1228 |                                 seteuid(uid);
      |                                 ^~~~~~~~~~~~
tty.c:1232:33: warning: ignoring return value of 'seteuid' declared with attribute 'warn_unused_result' [-Wunused-result]
 1232 |                                 seteuid(0);
      |                                 ^~~~~~~~~~
make[1]: Leaving directory '/usr/src/RPM/BUILD/ppp-2.4.8/pppd'
make[1]: Entering directory '/usr/src/RPM/BUILD/ppp-2.4.8/pppd'
gcc -pipe -frecord-gcc-switches -Wall -g -O2 -flto=auto -fPIC -Wall -D_GNU_SOURCE -fno-strict-aliasing -DHAVE_PATHS_H -DIPX_CHANGE -DHAVE_MMAP -I../include '-DDESTDIR="/usr"' '-DLIBDIR="/usr/lib64"' -DCHAPMS=1 -DMPPE=1 -DUSE_OPENSSL -DUSE_EAPTLS=1 -DHAS_SHADOW -DHAVE_CRYPT_H=1 -DHAVE_LOGWTMP=1 -I/usr/include/openssl -DUSE_PAM -DHAVE_MULTILINK -DUSE_TDB=1 -DSYSTEMD=1 -DPLUGIN -DPPP_FILTER -DINET6=1 -DCBCP_SUPPORT -DMAXOCTETS   -c -o pppcrypt.o pppcrypt.c
pppcrypt.c: In function 'MakeKey':
pppcrypt.c:67:9: warning: 'DES_set_odd_parity' is deprecated: Since OpenSSL 3.0 [-Wdeprecated-declarations]
   67 |         DES_set_odd_parity((DES_cblock *)des_key);
      |         ^~~~~~~~~~~~~~~~~~
In file included from pppcrypt.h:41,
                 from pppcrypt.c:35:
/usr/include/openssl/des.h:176:28: note: declared here
  176 | OSSL_DEPRECATEDIN_3_0 void DES_set_odd_parity(DES_cblock *key);
      |                            ^~~~~~~~~~~~~~~~~~
pppcrypt.c: In function 'DesSetkey':
pppcrypt.c:169:9: warning: 'DES_set_key' is deprecated: Since OpenSSL 3.0 [-Wdeprecated-declarations]
  169 |         DES_set_key(&des_key, &key_schedule);
      |         ^~~~~~~~~~~
/usr/include/openssl/des.h:186:5: note: declared here
  186 | int DES_set_key(const_DES_cblock *key, DES_key_schedule *schedule);
      |     ^~~~~~~~~~~
pppcrypt.c: In function 'DesEncrypt':
pppcrypt.c:178:9: warning: 'DES_ecb_encrypt' is deprecated: Since OpenSSL 3.0 [-Wdeprecated-declarations]
  178 |         DES_ecb_encrypt((DES_cblock *)clear, (DES_cblock *)cipher,
      |         ^~~~~~~~~~~~~~~
/usr/include/openssl/des.h:105:6: note: declared here
  105 | void DES_ecb_encrypt(const_DES_cblock *input, DES_cblock *output,
      |      ^~~~~~~~~~~~~~~
pppcrypt.c: In function 'DesDecrypt':
pppcrypt.c:188:9: warning: 'DES_ecb_encrypt' is deprecated: Since OpenSSL 3.0 [-Wdeprecated-declarations]
  188 |         DES_ecb_encrypt((DES_cblock *)cipher, (DES_cblock *)clear,
      |         ^~~~~~~~~~~~~~~
/usr/include/openssl/des.h:105:6: note: declared here
  105 | void DES_ecb_encrypt(const_DES_cblock *input, DES_cblock *output,
      |      ^~~~~~~~~~~~~~~
make[1]: Leaving directory '/usr/src/RPM/BUILD/ppp-2.4.8/pppd'
make[1]: Entering directory '/usr/src/RPM/BUILD/ppp-2.4.8/pppd'
gcc -pipe -frecord-gcc-switches -Wall -g -O2 -flto=auto -fPIC -Wall -D_GNU_SOURCE -fno-strict-aliasing -DHAVE_PATHS_H -DIPX_CHANGE -DHAVE_MMAP -I../include '-DDESTDIR="/usr"' '-DLIBDIR="/usr/lib64"' -DCHAPMS=1 -DMPPE=1 -DUSE_OPENSSL -DUSE_EAPTLS=1 -DHAS_SHADOW -DHAVE_CRYPT_H=1 -DHAVE_LOGWTMP=1 -I/usr/include/openssl -DUSE_PAM -DHAVE_MULTILINK -DUSE_TDB=1 -DSYSTEMD=1 -DPLUGIN -DPPP_FILTER -DINET6=1 -DCBCP_SUPPORT -DMAXOCTETS   -c -o sys-linux.o sys-linux.c
sys-linux.c: In function 'get_pty':
sys-linux.c:2965:21: warning: ignoring return value of 'fchown' declared with attribute 'warn_unused_result' [-Wunused-result]
 2965 |                     fchown(sfd, uid, -1);
      |                     ^~~~~~~~~~~~~~~~~~~~
make[1]: Leaving directory '/usr/src/RPM/BUILD/ppp-2.4.8/pppd'
make[1]: Entering directory '/usr/src/RPM/BUILD/ppp-2.4.8/pppd'
gcc -pipe -frecord-gcc-switches -Wall -g -O2 -flto=auto -fPIC -Wall -D_GNU_SOURCE -fno-strict-aliasing -DHAVE_PATHS_H -DIPX_CHANGE -DHAVE_MMAP -I../include '-DDESTDIR="/usr"' '-DLIBDIR="/usr/lib64"' -DCHAPMS=1 -DMPPE=1 -DUSE_OPENSSL -DUSE_EAPTLS=1 -DHAS_SHADOW -DHAVE_CRYPT_H=1 -DHAVE_LOGWTMP=1 -I/usr/include/openssl -DUSE_PAM -DHAVE_MULTILINK -DUSE_TDB=1 -DSYSTEMD=1 -DPLUGIN -DPPP_FILTER -DINET6=1 -DCBCP_SUPPORT -DMAXOCTETS   -c -o spinlock.o spinlock.c
make[1]: Leaving directory '/usr/src/RPM/BUILD/ppp-2.4.8/pppd'
make[1]: Entering directory '/usr/src/RPM/BUILD/ppp-2.4.8/pppd'
gcc -pipe -frecord-gcc-switches -Wall -g -O2 -flto=auto -fPIC -Wall -D_GNU_SOURCE -fno-strict-aliasing -DHAVE_PATHS_H -DIPX_CHANGE -DHAVE_MMAP -I../include '-DDESTDIR="/usr"' '-DLIBDIR="/usr/lib64"' -DCHAPMS=1 -DMPPE=1 -DUSE_OPENSSL -DUSE_EAPTLS=1 -DHAS_SHADOW -DHAVE_CRYPT_H=1 -DHAVE_LOGWTMP=1 -I/usr/include/openssl -DUSE_PAM -DHAVE_MULTILINK -DUSE_TDB=1 -DSYSTEMD=1 -DPLUGIN -DPPP_FILTER -DINET6=1 -DCBCP_SUPPORT -DMAXOCTETS   -c -o eui64.o eui64.c
make[1]: Leaving directory '/usr/src/RPM/BUILD/ppp-2.4.8/pppd'
make[1]: Entering directory '/usr/src/RPM/BUILD/ppp-2.4.8/pppd'
gcc -pipe -frecord-gcc-switches -Wall -g -O2 -flto=auto -fPIC -Wall -D_GNU_SOURCE -fno-strict-aliasing -DHAVE_PATHS_H -DIPX_CHANGE -DHAVE_MMAP -I../include '-DDESTDIR="/usr"' '-DLIBDIR="/usr/lib64"' -DCHAPMS=1 -DMPPE=1 -DUSE_OPENSSL -DUSE_EAPTLS=1 -DHAS_SHADOW -DHAVE_CRYPT_H=1 -DHAVE_LOGWTMP=1 -I/usr/include/openssl -DUSE_PAM -DHAVE_MULTILINK -DUSE_TDB=1 -DSYSTEMD=1 -DPLUGIN -DPPP_FILTER -DINET6=1 -DCBCP_SUPPORT -DMAXOCTETS   -c -o chap-md5.o chap-md5.c
chap-md5.c: In function 'chap_md5_verify_response':
chap-md5.c:79:17: warning: 'MD5_Init' is deprecated: Since OpenSSL 3.0 [-Wdeprecated-declarations]
   79 |                 MD5_Init(&ctx);
      |                 ^~~~~~~~
In file included from eap-tls.h:39,
                 from chap-md5.c:40:
/usr/include/openssl/md5.h:49:27: note: declared here
   49 | OSSL_DEPRECATEDIN_3_0 int MD5_Init(MD5_CTX *c);
      |                           ^~~~~~~~
chap-md5.c:80:17: warning: 'MD5_Update' is deprecated: Since OpenSSL 3.0 [-Wdeprecated-declarations]
   80 |                 MD5_Update(&ctx, &idbyte, 1);
      |                 ^~~~~~~~~~
/usr/include/openssl/md5.h:50:27: note: declared here
   50 | OSSL_DEPRECATEDIN_3_0 int MD5_Update(MD5_CTX *c, const void *data, size_t len);
      |                           ^~~~~~~~~~
chap-md5.c:81:17: warning: 'MD5_Update' is deprecated: Since OpenSSL 3.0 [-Wdeprecated-declarations]
   81 |                 MD5_Update(&ctx, secret, secret_len);
      |                 ^~~~~~~~~~
/usr/include/openssl/md5.h:50:27: note: declared here
   50 | OSSL_DEPRECATEDIN_3_0 int MD5_Update(MD5_CTX *c, const void *data, size_t len);
      |                           ^~~~~~~~~~
chap-md5.c:82:17: warning: 'MD5_Update' is deprecated: Since OpenSSL 3.0 [-Wdeprecated-declarations]
   82 |                 MD5_Update(&ctx, challenge, challenge_len);
      |                 ^~~~~~~~~~
/usr/include/openssl/md5.h:50:27: note: declared here
   50 | OSSL_DEPRECATEDIN_3_0 int MD5_Update(MD5_CTX *c, const void *data, size_t len);
      |                           ^~~~~~~~~~
chap-md5.c:83:17: warning: 'MD5_Final' is deprecated: Since OpenSSL 3.0 [-Wdeprecated-declarations]
   83 |                 MD5_Final(hash, &ctx);
      |                 ^~~~~~~~~
/usr/include/openssl/md5.h:51:27: note: declared here
   51 | OSSL_DEPRECATEDIN_3_0 int MD5_Final(unsigned char *md, MD5_CTX *c);
      |                           ^~~~~~~~~
chap-md5.c: In function 'chap_md5_make_response':
chap-md5.c:104:9: warning: 'MD5_Init' is deprecated: Since OpenSSL 3.0 [-Wdeprecated-declarations]
  104 |         MD5_Init(&ctx);
      |         ^~~~~~~~
/usr/include/openssl/md5.h:49:27: note: declared here
   49 | OSSL_DEPRECATEDIN_3_0 int MD5_Init(MD5_CTX *c);
      |                           ^~~~~~~~
chap-md5.c:105:9: warning: 'MD5_Update' is deprecated: Since OpenSSL 3.0 [-Wdeprecated-declarations]
  105 |         MD5_Update(&ctx, &idbyte, 1);
      |         ^~~~~~~~~~
/usr/include/openssl/md5.h:50:27: note: declared here
   50 | OSSL_DEPRECATEDIN_3_0 int MD5_Update(MD5_CTX *c, const void *data, size_t len);
      |                           ^~~~~~~~~~
chap-md5.c:106:9: warning: 'MD5_Update' is deprecated: Since OpenSSL 3.0 [-Wdeprecated-declarations]
  106 |         MD5_Update(&ctx, (u_char *)secret, secret_len);
      |         ^~~~~~~~~~
/usr/include/openssl/md5.h:50:27: note: declared here
   50 | OSSL_DEPRECATEDIN_3_0 int MD5_Update(MD5_CTX *c, const void *data, size_t len);
      |                           ^~~~~~~~~~
chap-md5.c:107:9: warning: 'MD5_Update' is deprecated: Since OpenSSL 3.0 [-Wdeprecated-declarations]
  107 |         MD5_Update(&ctx, challenge, challenge_len);
      |         ^~~~~~~~~~
/usr/include/openssl/md5.h:50:27: note: declared here
   50 | OSSL_DEPRECATEDIN_3_0 int MD5_Update(MD5_CTX *c, const void *data, size_t len);
      |                           ^~~~~~~~~~
chap-md5.c:108:9: warning: 'MD5_Final' is deprecated: Since OpenSSL 3.0 [-Wdeprecated-declarations]
  108 |         MD5_Final(&response[1], &ctx);
      |         ^~~~~~~~~
/usr/include/openssl/md5.h:51:27: note: declared here
   51 | OSSL_DEPRECATEDIN_3_0 int MD5_Final(unsigned char *md, MD5_CTX *c);
      |                           ^~~~~~~~~
make[1]: Leaving directory '/usr/src/RPM/BUILD/ppp-2.4.8/pppd'
make[1]: Entering directory '/usr/src/RPM/BUILD/ppp-2.4.8/pppd'
gcc -pipe -frecord-gcc-switches -Wall -g -O2 -flto=auto -fPIC -Wall -D_GNU_SOURCE -fno-strict-aliasing -DHAVE_PATHS_H -DIPX_CHANGE -DHAVE_MMAP -I../include '-DDESTDIR="/usr"' '-DLIBDIR="/usr/lib64"' -DCHAPMS=1 -DMPPE=1 -DUSE_OPENSSL -DUSE_EAPTLS=1 -DHAS_SHADOW -DHAVE_CRYPT_H=1 -DHAVE_LOGWTMP=1 -I/usr/include/openssl -DUSE_PAM -DHAVE_MULTILINK -DUSE_TDB=1 -DSYSTEMD=1 -DPLUGIN -DPPP_FILTER -DINET6=1 -DCBCP_SUPPORT -DMAXOCTETS   -c -o chap_ms.o chap_ms.c
chap_ms.c:517:26: warning: argument 2 of type 'u_char[16]' {aka 'unsigned char[16]'} with mismatched bound [-Warray-parameter=]
  517 |                   u_char PasswordHash[MD4_SIGNATURE_SIZE],
      |                   ~~~~~~~^~~~~~~~~~~~~~~~~~~~~~~~~~~~~~~~
In file included from chap_ms.c:89:
chap_ms.c:111:50: note: previously declared as 'u_char *' {aka 'unsigned char *'}
  111 | static void     ChallengeResponse __P((u_char *, u_char *, u_char[24]));
      |                                                  ^~~~~~~~
pppd.h:66:19: note: in definition of macro '__P'
   66 | #define __P(args) args
      |                   ^~~~
chap_ms.c: In function 'ChallengeHash':
chap_ms.c:557:5: warning: 'SHA1_Init' is deprecated: Since OpenSSL 3.0 [-Wdeprecated-declarations]
  557 |     SHA1_Init(&sha1Context);
      |     ^~~~~~~~~
In file included from chap_ms.c:98:
/usr/include/openssl/sha.h:49:27: note: declared here
   49 | OSSL_DEPRECATEDIN_3_0 int SHA1_Init(SHA_CTX *c);
      |                           ^~~~~~~~~
chap_ms.c:558:5: warning: 'SHA1_Update' is deprecated: Since OpenSSL 3.0 [-Wdeprecated-declarations]
  558 |     SHA1_Update(&sha1Context, PeerChallenge, 16);
      |     ^~~~~~~~~~~
/usr/include/openssl/sha.h:50:27: note: declared here
   50 | OSSL_DEPRECATEDIN_3_0 int SHA1_Update(SHA_CTX *c, const void *data, size_t len);
      |                           ^~~~~~~~~~~
chap_ms.c:559:5: warning: 'SHA1_Update' is deprecated: Since OpenSSL 3.0 [-Wdeprecated-declarations]
  559 |     SHA1_Update(&sha1Context, rchallenge, 16);
      |     ^~~~~~~~~~~
/usr/include/openssl/sha.h:50:27: note: declared here
   50 | OSSL_DEPRECATEDIN_3_0 int SHA1_Update(SHA_CTX *c, const void *data, size_t len);
      |                           ^~~~~~~~~~~
chap_ms.c:560:5: warning: 'SHA1_Update' is deprecated: Since OpenSSL 3.0 [-Wdeprecated-declarations]
  560 |     SHA1_Update(&sha1Context, (unsigned char *)user, strlen(user));
      |     ^~~~~~~~~~~
/usr/include/openssl/sha.h:50:27: note: declared here
   50 | OSSL_DEPRECATEDIN_3_0 int SHA1_Update(SHA_CTX *c, const void *data, size_t len);
      |                           ^~~~~~~~~~~
chap_ms.c:561:5: warning: 'SHA1_Final' is deprecated: Since OpenSSL 3.0 [-Wdeprecated-declarations]
  561 |     SHA1_Final(sha1Hash, &sha1Context);
      |     ^~~~~~~~~~
/usr/include/openssl/sha.h:51:27: note: declared here
   51 | OSSL_DEPRECATEDIN_3_0 int SHA1_Final(unsigned char *md, SHA_CTX *c);
      |                           ^~~~~~~~~~
chap_ms.c: In function 'NTPasswordHash':
chap_ms.c:594:5: warning: 'MD4_Init' is deprecated: Since OpenSSL 3.0 [-Wdeprecated-declarations]
  594 |     MD4_Init(&md4Context);
      |     ^~~~~~~~
In file included from chap_ms.c:93:
/usr/include/openssl/md4.h:50:27: note: declared here
   50 | OSSL_DEPRECATEDIN_3_0 int MD4_Init(MD4_CTX *c);
      |                           ^~~~~~~~
chap_ms.c:597:9: warning: 'MD4_Update' is deprecated: Since OpenSSL 3.0 [-Wdeprecated-declarations]
  597 |         MD4_Update(&md4Context, secret, 512);
      |         ^~~~~~~~~~
/usr/include/openssl/md4.h:51:27: note: declared here
   51 | OSSL_DEPRECATEDIN_3_0 int MD4_Update(MD4_CTX *c, const void *data, size_t len);
      |                           ^~~~~~~~~~
chap_ms.c:601:5: warning: 'MD4_Update' is deprecated: Since OpenSSL 3.0 [-Wdeprecated-declarations]
  601 |     MD4_Update(&md4Context, secret, mdlen);
      |     ^~~~~~~~~~
/usr/include/openssl/md4.h:51:27: note: declared here
   51 | OSSL_DEPRECATEDIN_3_0 int MD4_Update(MD4_CTX *c, const void *data, size_t len);
      |                           ^~~~~~~~~~
chap_ms.c:602:5: warning: 'MD4_Final' is deprecated: Since OpenSSL 3.0 [-Wdeprecated-declarations]
  602 |     MD4_Final(hash, &md4Context);
      |     ^~~~~~~~~
/usr/include/openssl/md4.h:52:27: note: declared here
   52 | OSSL_DEPRECATEDIN_3_0 int MD4_Final(unsigned char *md, MD4_CTX *c);
      |                           ^~~~~~~~~
chap_ms.c: In function 'GenerateAuthenticatorResponse':
chap_ms.c:687:5: warning: 'SHA1_Init' is deprecated: Since OpenSSL 3.0 [-Wdeprecated-declarations]
  687 |     SHA1_Init(&sha1Context);
      |     ^~~~~~~~~
/usr/include/openssl/sha.h:49:27: note: declared here
   49 | OSSL_DEPRECATEDIN_3_0 int SHA1_Init(SHA_CTX *c);
      |                           ^~~~~~~~~
chap_ms.c:688:5: warning: 'SHA1_Update' is deprecated: Since OpenSSL 3.0 [-Wdeprecated-declarations]
  688 |     SHA1_Update(&sha1Context, PasswordHashHash, MD4_SIGNATURE_SIZE);
      |     ^~~~~~~~~~~
/usr/include/openssl/sha.h:50:27: note: declared here
   50 | OSSL_DEPRECATEDIN_3_0 int SHA1_Update(SHA_CTX *c, const void *data, size_t len);
      |                           ^~~~~~~~~~~
chap_ms.c:689:5: warning: 'SHA1_Update' is deprecated: Since OpenSSL 3.0 [-Wdeprecated-declarations]
  689 |     SHA1_Update(&sha1Context, NTResponse, 24);
      |     ^~~~~~~~~~~
/usr/include/openssl/sha.h:50:27: note: declared here
   50 | OSSL_DEPRECATEDIN_3_0 int SHA1_Update(SHA_CTX *c, const void *data, size_t len);
      |                           ^~~~~~~~~~~
chap_ms.c:690:5: warning: 'SHA1_Update' is deprecated: Since OpenSSL 3.0 [-Wdeprecated-declarations]
  690 |     SHA1_Update(&sha1Context, Magic1, sizeof(Magic1));
      |     ^~~~~~~~~~~
/usr/include/openssl/sha.h:50:27: note: declared here
   50 | OSSL_DEPRECATEDIN_3_0 int SHA1_Update(SHA_CTX *c, const void *data, size_t len);
      |                           ^~~~~~~~~~~
chap_ms.c:691:5: warning: 'SHA1_Final' is deprecated: Since OpenSSL 3.0 [-Wdeprecated-declarations]
  691 |     SHA1_Final(Digest, &sha1Context);
      |     ^~~~~~~~~~
/usr/include/openssl/sha.h:51:27: note: declared here
   51 | OSSL_DEPRECATEDIN_3_0 int SHA1_Final(unsigned char *md, SHA_CTX *c);
      |                           ^~~~~~~~~~
chap_ms.c:695:5: warning: 'SHA1_Init' is deprecated: Since OpenSSL 3.0 [-Wdeprecated-declarations]
  695 |     SHA1_Init(&sha1Context);
      |     ^~~~~~~~~
/usr/include/openssl/sha.h:49:27: note: declared here
   49 | OSSL_DEPRECATEDIN_3_0 int SHA1_Init(SHA_CTX *c);
      |                           ^~~~~~~~~
chap_ms.c:696:5: warning: 'SHA1_Update' is deprecated: Since OpenSSL 3.0 [-Wdeprecated-declarations]
  696 |     SHA1_Update(&sha1Context, Digest, sizeof(Digest));
      |     ^~~~~~~~~~~
/usr/include/openssl/sha.h:50:27: note: declared here
   50 | OSSL_DEPRECATEDIN_3_0 int SHA1_Update(SHA_CTX *c, const void *data, size_t len);
      |                           ^~~~~~~~~~~
chap_ms.c:697:5: warning: 'SHA1_Update' is deprecated: Since OpenSSL 3.0 [-Wdeprecated-declarations]
  697 |     SHA1_Update(&sha1Context, Challenge, sizeof(Challenge));
      |     ^~~~~~~~~~~
/usr/include/openssl/sha.h:50:27: note: declared here
   50 | OSSL_DEPRECATEDIN_3_0 int SHA1_Update(SHA_CTX *c, const void *data, size_t len);
      |                           ^~~~~~~~~~~
chap_ms.c:698:5: warning: 'SHA1_Update' is deprecated: Since OpenSSL 3.0 [-Wdeprecated-declarations]
  698 |     SHA1_Update(&sha1Context, Magic2, sizeof(Magic2));
      |     ^~~~~~~~~~~
/usr/include/openssl/sha.h:50:27: note: declared here
   50 | OSSL_DEPRECATEDIN_3_0 int SHA1_Update(SHA_CTX *c, const void *data, size_t len);
      |                           ^~~~~~~~~~~
chap_ms.c:699:5: warning: 'SHA1_Final' is deprecated: Since OpenSSL 3.0 [-Wdeprecated-declarations]
  699 |     SHA1_Final(Digest, &sha1Context);
      |     ^~~~~~~~~~
/usr/include/openssl/sha.h:51:27: note: declared here
   51 | OSSL_DEPRECATEDIN_3_0 int SHA1_Final(unsigned char *md, SHA_CTX *c);
      |                           ^~~~~~~~~~
chap_ms.c: In function 'mppe_set_keys':
chap_ms.c:740:5: warning: 'SHA1_Init' is deprecated: Since OpenSSL 3.0 [-Wdeprecated-declarations]
  740 |     SHA1_Init(&sha1Context);
      |     ^~~~~~~~~
/usr/include/openssl/sha.h:49:27: note: declared here
   49 | OSSL_DEPRECATEDIN_3_0 int SHA1_Init(SHA_CTX *c);
      |                           ^~~~~~~~~
chap_ms.c:741:5: warning: 'SHA1_Update' is deprecated: Since OpenSSL 3.0 [-Wdeprecated-declarations]
  741 |     SHA1_Update(&sha1Context, PasswordHashHash, MD4_SIGNATURE_SIZE);
      |     ^~~~~~~~~~~
/usr/include/openssl/sha.h:50:27: note: declared here
   50 | OSSL_DEPRECATEDIN_3_0 int SHA1_Update(SHA_CTX *c, const void *data, size_t len);
      |                           ^~~~~~~~~~~
chap_ms.c:742:5: warning: 'SHA1_Update' is deprecated: Since OpenSSL 3.0 [-Wdeprecated-declarations]
  742 |     SHA1_Update(&sha1Context, PasswordHashHash, MD4_SIGNATURE_SIZE);
      |     ^~~~~~~~~~~
/usr/include/openssl/sha.h:50:27: note: declared here
   50 | OSSL_DEPRECATEDIN_3_0 int SHA1_Update(SHA_CTX *c, const void *data, size_t len);
      |                           ^~~~~~~~~~~
chap_ms.c:743:5: warning: 'SHA1_Update' is deprecated: Since OpenSSL 3.0 [-Wdeprecated-declarations]
  743 |     SHA1_Update(&sha1Context, rchallenge, 8);
      |     ^~~~~~~~~~~
/usr/include/openssl/sha.h:50:27: note: declared here
   50 | OSSL_DEPRECATEDIN_3_0 int SHA1_Update(SHA_CTX *c, const void *data, size_t len);
      |                           ^~~~~~~~~~~
chap_ms.c:744:5: warning: 'SHA1_Final' is deprecated: Since OpenSSL 3.0 [-Wdeprecated-declarations]
  744 |     SHA1_Final(Digest, &sha1Context);
      |     ^~~~~~~~~~
/usr/include/openssl/sha.h:51:27: note: declared here
   51 | OSSL_DEPRECATEDIN_3_0 int SHA1_Final(unsigned char *md, SHA_CTX *c);
      |                           ^~~~~~~~~~
chap_ms.c: In function 'mppe_set_keys2':
chap_ms.c:827:5: warning: 'SHA1_Init' is deprecated: Since OpenSSL 3.0 [-Wdeprecated-declarations]
  827 |     SHA1_Init(&sha1Context);
      |     ^~~~~~~~~
/usr/include/openssl/sha.h:49:27: note: declared here
   49 | OSSL_DEPRECATEDIN_3_0 int SHA1_Init(SHA_CTX *c);
      |                           ^~~~~~~~~
chap_ms.c:828:5: warning: 'SHA1_Update' is deprecated: Since OpenSSL 3.0 [-Wdeprecated-declarations]
  828 |     SHA1_Update(&sha1Context, PasswordHashHash, MD4_SIGNATURE_SIZE);
      |     ^~~~~~~~~~~
/usr/include/openssl/sha.h:50:27: note: declared here
   50 | OSSL_DEPRECATEDIN_3_0 int SHA1_Update(SHA_CTX *c, const void *data, size_t len);
      |                           ^~~~~~~~~~~
chap_ms.c:829:5: warning: 'SHA1_Update' is deprecated: Since OpenSSL 3.0 [-Wdeprecated-declarations]
  829 |     SHA1_Update(&sha1Context, NTResponse, 24);
      |     ^~~~~~~~~~~
/usr/include/openssl/sha.h:50:27: note: declared here
   50 | OSSL_DEPRECATEDIN_3_0 int SHA1_Update(SHA_CTX *c, const void *data, size_t len);
      |                           ^~~~~~~~~~~
chap_ms.c:830:5: warning: 'SHA1_Update' is deprecated: Since OpenSSL 3.0 [-Wdeprecated-declarations]
  830 |     SHA1_Update(&sha1Context, Magic1, sizeof(Magic1));
      |     ^~~~~~~~~~~
/usr/include/openssl/sha.h:50:27: note: declared here
   50 | OSSL_DEPRECATEDIN_3_0 int SHA1_Update(SHA_CTX *c, const void *data, size_t len);
      |                           ^~~~~~~~~~~
chap_ms.c:831:5: warning: 'SHA1_Final' is deprecated: Since OpenSSL 3.0 [-Wdeprecated-declarations]
  831 |     SHA1_Final(MasterKey, &sha1Context);
      |     ^~~~~~~~~~
/usr/include/openssl/sha.h:51:27: note: declared here
   51 | OSSL_DEPRECATEDIN_3_0 int SHA1_Final(unsigned char *md, SHA_CTX *c);
      |                           ^~~~~~~~~~
chap_ms.c:840:5: warning: 'SHA1_Init' is deprecated: Since OpenSSL 3.0 [-Wdeprecated-declarations]
  840 |     SHA1_Init(&sha1Context);
      |     ^~~~~~~~~
/usr/include/openssl/sha.h:49:27: note: declared here
   49 | OSSL_DEPRECATEDIN_3_0 int SHA1_Init(SHA_CTX *c);
      |                           ^~~~~~~~~
chap_ms.c:841:5: warning: 'SHA1_Update' is deprecated: Since OpenSSL 3.0 [-Wdeprecated-declarations]
  841 |     SHA1_Update(&sha1Context, MasterKey, 16);
      |     ^~~~~~~~~~~
/usr/include/openssl/sha.h:50:27: note: declared here
   50 | OSSL_DEPRECATEDIN_3_0 int SHA1_Update(SHA_CTX *c, const void *data, size_t len);
      |                           ^~~~~~~~~~~
chap_ms.c:842:5: warning: 'SHA1_Update' is deprecated: Since OpenSSL 3.0 [-Wdeprecated-declarations]
  842 |     SHA1_Update(&sha1Context, SHApad1, sizeof(SHApad1));
      |     ^~~~~~~~~~~
/usr/include/openssl/sha.h:50:27: note: declared here
   50 | OSSL_DEPRECATEDIN_3_0 int SHA1_Update(SHA_CTX *c, const void *data, size_t len);
      |                           ^~~~~~~~~~~
chap_ms.c:843:5: warning: 'SHA1_Update' is deprecated: Since OpenSSL 3.0 [-Wdeprecated-declarations]
  843 |     SHA1_Update(&sha1Context, s, 84);
      |     ^~~~~~~~~~~
/usr/include/openssl/sha.h:50:27: note: declared here
   50 | OSSL_DEPRECATEDIN_3_0 int SHA1_Update(SHA_CTX *c, const void *data, size_t len);
      |                           ^~~~~~~~~~~
chap_ms.c:844:5: warning: 'SHA1_Update' is deprecated: Since OpenSSL 3.0 [-Wdeprecated-declarations]
  844 |     SHA1_Update(&sha1Context, SHApad2, sizeof(SHApad2));
      |     ^~~~~~~~~~~
/usr/include/openssl/sha.h:50:27: note: declared here
   50 | OSSL_DEPRECATEDIN_3_0 int SHA1_Update(SHA_CTX *c, const void *data, size_t len);
      |                           ^~~~~~~~~~~
chap_ms.c:845:5: warning: 'SHA1_Final' is deprecated: Since OpenSSL 3.0 [-Wdeprecated-declarations]
  845 |     SHA1_Final(Digest, &sha1Context);
      |     ^~~~~~~~~~
/usr/include/openssl/sha.h:51:27: note: declared here
   51 | OSSL_DEPRECATEDIN_3_0 int SHA1_Final(unsigned char *md, SHA_CTX *c);
      |                           ^~~~~~~~~~
chap_ms.c:856:5: warning: 'SHA1_Init' is deprecated: Since OpenSSL 3.0 [-Wdeprecated-declarations]
  856 |     SHA1_Init(&sha1Context);
      |     ^~~~~~~~~
/usr/include/openssl/sha.h:49:27: note: declared here
   49 | OSSL_DEPRECATEDIN_3_0 int SHA1_Init(SHA_CTX *c);
      |                           ^~~~~~~~~
chap_ms.c:857:5: warning: 'SHA1_Update' is deprecated: Since OpenSSL 3.0 [-Wdeprecated-declarations]
  857 |     SHA1_Update(&sha1Context, MasterKey, 16);
      |     ^~~~~~~~~~~
/usr/include/openssl/sha.h:50:27: note: declared here
   50 | OSSL_DEPRECATEDIN_3_0 int SHA1_Update(SHA_CTX *c, const void *data, size_t len);
      |                           ^~~~~~~~~~~
chap_ms.c:858:5: warning: 'SHA1_Update' is deprecated: Since OpenSSL 3.0 [-Wdeprecated-declarations]
  858 |     SHA1_Update(&sha1Context, SHApad1, sizeof(SHApad1));
      |     ^~~~~~~~~~~
/usr/include/openssl/sha.h:50:27: note: declared here
   50 | OSSL_DEPRECATEDIN_3_0 int SHA1_Update(SHA_CTX *c, const void *data, size_t len);
      |                           ^~~~~~~~~~~
chap_ms.c:859:5: warning: 'SHA1_Update' is deprecated: Since OpenSSL 3.0 [-Wdeprecated-declarations]
  859 |     SHA1_Update(&sha1Context, s, 84);
      |     ^~~~~~~~~~~
/usr/include/openssl/sha.h:50:27: note: declared here
   50 | OSSL_DEPRECATEDIN_3_0 int SHA1_Update(SHA_CTX *c, const void *data, size_t len);
      |                           ^~~~~~~~~~~
chap_ms.c:860:5: warning: 'SHA1_Update' is deprecated: Since OpenSSL 3.0 [-Wdeprecated-declarations]
  860 |     SHA1_Update(&sha1Context, SHApad2, sizeof(SHApad2));
      |     ^~~~~~~~~~~
/usr/include/openssl/sha.h:50:27: note: declared here
   50 | OSSL_DEPRECATEDIN_3_0 int SHA1_Update(SHA_CTX *c, const void *data, size_t len);
      |                           ^~~~~~~~~~~
chap_ms.c:861:5: warning: 'SHA1_Final' is deprecated: Since OpenSSL 3.0 [-Wdeprecated-declarations]
  861 |     SHA1_Final(Digest, &sha1Context);
      |     ^~~~~~~~~~
/usr/include/openssl/sha.h:51:27: note: declared here
   51 | OSSL_DEPRECATEDIN_3_0 int SHA1_Final(unsigned char *md, SHA_CTX *c);
      |                           ^~~~~~~~~~
chap_ms.c: At top level:
chap_ms.c:924:16: warning: argument 7 of type 'u_char[]' {aka 'unsigned char[]'} with mismatched bound [-Warray-parameter=]
  924 |         u_char authResponse[], int authenticator)
      |         ~~~~~~~^~~~~~~~~~~~~~
chap_ms.h:92:29: note: previously declared as 'u_char[41]' {aka 'unsigned char[41]'}
   92 |                   u_char *, u_char[MS_AUTH_RESPONSE_LENGTH+1], int));
      |                             ^~~~~~~~~~~~~~~~~~~~~~~~~~~~~~~~~
pppd.h:66:19: note: in definition of macro '__P'
   66 | #define __P(args) args
      |                   ^~~~
make[1]: Leaving directory '/usr/src/RPM/BUILD/ppp-2.4.8/pppd'
make[1]: Entering directory '/usr/src/RPM/BUILD/ppp-2.4.8/pppd'
gcc -pipe -frecord-gcc-switches -Wall -g -O2 -flto=auto -fPIC -Wall -D_GNU_SOURCE -fno-strict-aliasing -DHAVE_PATHS_H -DIPX_CHANGE -DHAVE_MMAP -I../include '-DDESTDIR="/usr"' '-DLIBDIR="/usr/lib64"' -DCHAPMS=1 -DMPPE=1 -DUSE_OPENSSL -DUSE_EAPTLS=1 -DHAS_SHADOW -DHAVE_CRYPT_H=1 -DHAVE_LOGWTMP=1 -I/usr/include/openssl -DUSE_PAM -DHAVE_MULTILINK -DUSE_TDB=1 -DSYSTEMD=1 -DPLUGIN -DPPP_FILTER -DINET6=1 -DCBCP_SUPPORT -DMAXOCTETS   -c -o cbcp.o cbcp.c
cbcp.c: In function 'cbcp_input':
cbcp.c:206:27: warning: pointer targets in passing argument 2 of 'cbcp_recvresp' differ in signedness [-Wpointer-sign]
  206 |         cbcp_recvresp(us, inp, len);
      |                           ^~~
      |                           |
      |                           u_char * {aka unsigned char *}
In file included from cbcp.c:43:
cbcp.c:104:54: note: expected 'char *' but argument is of type 'u_char *' {aka 'unsigned char *'}
  104 | static void cbcp_recvresp __P((cbcp_state *us, char *pckt, int len));
      |                                                ~~~~~~^~~~
pppd.h:66:19: note: in definition of macro '__P'
   66 | #define __P(args) args
      |                   ^~~~
cbcp.c: In function 'cbcp_printpkt':
cbcp.c:297:21: warning: variable 'addrt' set but not used [-Wunused-but-set-variable]
  297 |                 int addrt;
      |                     ^~~~~
cbcp.c: In function 'cbcp_recvreq':
cbcp.c:328:27: warning: variable 'addr_type' set but not used [-Wunused-but-set-variable]
  328 |     u_char type, opt_len, addr_type;
      |                           ^~~~~~~~~
cbcp.c: In function 'cbcp_recvack':
cbcp.c:473:18: warning: variable 'addr_type' set but not used [-Wunused-but-set-variable]
  473 |     u_char type, addr_type;
      |                  ^~~~~~~~~
cbcp.c: In function 'cbcp_recvresp':
cbcp.c:662:18: warning: variable 'addr_type' set but not used [-Wunused-but-set-variable]
  662 |     u_char type, addr_type;
      |                  ^~~~~~~~~
make[1]: Leaving directory '/usr/src/RPM/BUILD/ppp-2.4.8/pppd'
make[1]: Entering directory '/usr/src/RPM/BUILD/ppp-2.4.8/pppd'
gcc -pipe -frecord-gcc-switches -Wall -g -O2 -flto=auto -fPIC -Wall -D_GNU_SOURCE -fno-strict-aliasing -DHAVE_PATHS_H -DIPX_CHANGE -DHAVE_MMAP -I../include '-DDESTDIR="/usr"' '-DLIBDIR="/usr/lib64"' -DCHAPMS=1 -DMPPE=1 -DUSE_OPENSSL -DUSE_EAPTLS=1 -DHAS_SHADOW -DHAVE_CRYPT_H=1 -DHAVE_LOGWTMP=1 -I/usr/include/openssl -DUSE_PAM -DHAVE_MULTILINK -DUSE_TDB=1 -DSYSTEMD=1 -DPLUGIN -DPPP_FILTER -DINET6=1 -DCBCP_SUPPORT -DMAXOCTETS   -c -o multilink.o multilink.c
make[1]: Leaving directory '/usr/src/RPM/BUILD/ppp-2.4.8/pppd'
make[1]: Entering directory '/usr/src/RPM/BUILD/ppp-2.4.8/pppd'
gcc -pipe -frecord-gcc-switches -Wall -g -O2 -flto=auto -fPIC -Wall -D_GNU_SOURCE -fno-strict-aliasing -DHAVE_PATHS_H -DIPX_CHANGE -DHAVE_MMAP -I../include '-DDESTDIR="/usr"' '-DLIBDIR="/usr/lib64"' -DCHAPMS=1 -DMPPE=1 -DUSE_OPENSSL -DUSE_EAPTLS=1 -DHAS_SHADOW -DHAVE_CRYPT_H=1 -DHAVE_LOGWTMP=1 -I/usr/include/openssl -DUSE_PAM -DHAVE_MULTILINK -DUSE_TDB=1 -DSYSTEMD=1 -DPLUGIN -DPPP_FILTER -DINET6=1 -DCBCP_SUPPORT -DMAXOCTETS   -c -o ipv6cp.o ipv6cp.c
make[1]: Leaving directory '/usr/src/RPM/BUILD/ppp-2.4.8/pppd'
make[1]: Entering directory '/usr/src/RPM/BUILD/ppp-2.4.8/pppd'
gcc -pipe -frecord-gcc-switches -Wall -g -O2 -flto=auto -fPIC -Wall -D_GNU_SOURCE -fno-strict-aliasing -DHAVE_PATHS_H -DIPX_CHANGE -DHAVE_MMAP -I../include '-DDESTDIR="/usr"' '-DLIBDIR="/usr/lib64"' -DCHAPMS=1 -DMPPE=1 -DUSE_OPENSSL -DUSE_EAPTLS=1 -DHAS_SHADOW -DHAVE_CRYPT_H=1 -DHAVE_LOGWTMP=1 -I/usr/include/openssl -DUSE_PAM -DHAVE_MULTILINK -DUSE_TDB=1 -DSYSTEMD=1 -DPLUGIN -DPPP_FILTER -DINET6=1 -DCBCP_SUPPORT -DMAXOCTETS   -c -o tdb.o tdb.c
make[1]: Leaving directory '/usr/src/RPM/BUILD/ppp-2.4.8/pppd'
make[1]: Entering directory '/usr/src/RPM/BUILD/ppp-2.4.8/pppd'
gcc -pipe -frecord-gcc-switches -Wall -g -O2 -flto=auto -fPIC -Wall -D_GNU_SOURCE -fno-strict-aliasing -DHAVE_PATHS_H -DIPX_CHANGE -DHAVE_MMAP -I../include '-DDESTDIR="/usr"' '-DLIBDIR="/usr/lib64"' -DCHAPMS=1 -DMPPE=1 -DUSE_OPENSSL -DUSE_EAPTLS=1 -DHAS_SHADOW -DHAVE_CRYPT_H=1 -DHAVE_LOGWTMP=1 -I/usr/include/openssl -DUSE_PAM -DHAVE_MULTILINK -DUSE_TDB=1 -DSYSTEMD=1 -DPLUGIN -DPPP_FILTER -DINET6=1 -DCBCP_SUPPORT -DMAXOCTETS   -c -o auth.o auth.c
make[1]: Leaving directory '/usr/src/RPM/BUILD/ppp-2.4.8/pppd'
make[1]: Entering directory '/usr/src/RPM/BUILD/ppp-2.4.8/pppd'
gcc -pipe -frecord-gcc-switches -Wall -g -O2 -flto=auto -fPIC -Wall -D_GNU_SOURCE -fno-strict-aliasing -DHAVE_PATHS_H -DIPX_CHANGE -DHAVE_MMAP -I../include '-DDESTDIR="/usr"' '-DLIBDIR="/usr/lib64"' -DCHAPMS=1 -DMPPE=1 -DUSE_OPENSSL -DUSE_EAPTLS=1 -DHAS_SHADOW -DHAVE_CRYPT_H=1 -DHAVE_LOGWTMP=1 -I/usr/include/openssl -DUSE_PAM -DHAVE_MULTILINK -DUSE_TDB=1 -DSYSTEMD=1 -DPLUGIN -DPPP_FILTER -DINET6=1 -DCBCP_SUPPORT -DMAXOCTETS   -c -o eap-tls.o eap-tls.c
eap-tls.c: In function 'P_hash':
eap-tls.c:137:9: warning: 'HMAC_CTX_new' is deprecated: Since OpenSSL 3.0 [-Wdeprecated-declarations]
  137 |         ctx_a = HMAC_CTX_new();
      |         ^~~~~
In file included from eap-tls.c:40:
/usr/include/openssl/hmac.h:33:33: note: declared here
   33 | OSSL_DEPRECATEDIN_3_0 HMAC_CTX *HMAC_CTX_new(void);
      |                                 ^~~~~~~~~~~~
eap-tls.c:138:9: warning: 'HMAC_CTX_new' is deprecated: Since OpenSSL 3.0 [-Wdeprecated-declarations]
  138 |         ctx_out = HMAC_CTX_new();
      |         ^~~~~~~
/usr/include/openssl/hmac.h:33:33: note: declared here
   33 | OSSL_DEPRECATEDIN_3_0 HMAC_CTX *HMAC_CTX_new(void);
      |                                 ^~~~~~~~~~~~
eap-tls.c:139:9: warning: 'HMAC_Init_ex' is deprecated: Since OpenSSL 3.0 [-Wdeprecated-declarations]
  139 |         HMAC_Init_ex(ctx_a, secret, secret_len, evp_md, NULL);
      |         ^~~~~~~~~~~~
/usr/include/openssl/hmac.h:43:27: note: declared here
   43 | OSSL_DEPRECATEDIN_3_0 int HMAC_Init_ex(HMAC_CTX *ctx, const void *key, int len,
      |                           ^~~~~~~~~~~~
eap-tls.c:140:9: warning: 'HMAC_Init_ex' is deprecated: Since OpenSSL 3.0 [-Wdeprecated-declarations]
  140 |         HMAC_Init_ex(ctx_out, secret, secret_len, evp_md, NULL);
      |         ^~~~~~~~~~~~
/usr/include/openssl/hmac.h:43:27: note: declared here
   43 | OSSL_DEPRECATEDIN_3_0 int HMAC_Init_ex(HMAC_CTX *ctx, const void *key, int len,
      |                           ^~~~~~~~~~~~
eap-tls.c:142:9: warning: 'HMAC_size' is deprecated: Since OpenSSL 3.0 [-Wdeprecated-declarations]
  142 |         size = HMAC_size(ctx_out);
      |         ^~~~
/usr/include/openssl/hmac.h:32:30: note: declared here
   32 | OSSL_DEPRECATEDIN_3_0 size_t HMAC_size(const HMAC_CTX *e);
      |                              ^~~~~~~~~
eap-tls.c:145:9: warning: 'HMAC_Update' is deprecated: Since OpenSSL 3.0 [-Wdeprecated-declarations]
  145 |         HMAC_Update(ctx_a, seed, seed_len);
      |         ^~~~~~~~~~~
/usr/include/openssl/hmac.h:45:27: note: declared here
   45 | OSSL_DEPRECATEDIN_3_0 int HMAC_Update(HMAC_CTX *ctx, const unsigned char *data,
      |                           ^~~~~~~~~~~
eap-tls.c:146:9: warning: 'HMAC_Final' is deprecated: Since OpenSSL 3.0 [-Wdeprecated-declarations]
  146 |         HMAC_Final(ctx_a, a, NULL);
      |         ^~~~~~~~~~
/usr/include/openssl/hmac.h:47:27: note: declared here
   47 | OSSL_DEPRECATEDIN_3_0 int HMAC_Final(HMAC_CTX *ctx, unsigned char *md,
      |                           ^~~~~~~~~~
eap-tls.c:150:17: warning: 'HMAC_Update' is deprecated: Since OpenSSL 3.0 [-Wdeprecated-declarations]
  150 |                 HMAC_Update(ctx_out, a, size);
      |                 ^~~~~~~~~~~
/usr/include/openssl/hmac.h:45:27: note: declared here
   45 | OSSL_DEPRECATEDIN_3_0 int HMAC_Update(HMAC_CTX *ctx, const unsigned char *data,
      |                           ^~~~~~~~~~~
eap-tls.c:151:17: warning: 'HMAC_Update' is deprecated: Since OpenSSL 3.0 [-Wdeprecated-declarations]
  151 |                 HMAC_Update(ctx_out, seed, seed_len);
      |                 ^~~~~~~~~~~
/usr/include/openssl/hmac.h:45:27: note: declared here
   45 | OSSL_DEPRECATEDIN_3_0 int HMAC_Update(HMAC_CTX *ctx, const unsigned char *data,
      |                           ^~~~~~~~~~~
eap-tls.c:155:25: warning: 'HMAC_Final' is deprecated: Since OpenSSL 3.0 [-Wdeprecated-declarations]
  155 |                         HMAC_Final(ctx_out, a, NULL);
      |                         ^~~~~~~~~~
/usr/include/openssl/hmac.h:47:27: note: declared here
   47 | OSSL_DEPRECATEDIN_3_0 int HMAC_Final(HMAC_CTX *ctx, unsigned char *md,
      |                           ^~~~~~~~~~
eap-tls.c:161:17: warning: 'HMAC_Final' is deprecated: Since OpenSSL 3.0 [-Wdeprecated-declarations]
  161 |                 HMAC_Final(ctx_out, out, NULL);
      |                 ^~~~~~~~~~
/usr/include/openssl/hmac.h:47:27: note: declared here
   47 | OSSL_DEPRECATEDIN_3_0 int HMAC_Final(HMAC_CTX *ctx, unsigned char *md,
      |                           ^~~~~~~~~~
eap-tls.c:162:17: warning: 'HMAC_Init_ex' is deprecated: Since OpenSSL 3.0 [-Wdeprecated-declarations]
  162 |                 HMAC_Init_ex(ctx_out, NULL, 0, NULL, NULL);
      |                 ^~~~~~~~~~~~
/usr/include/openssl/hmac.h:43:27: note: declared here
   43 | OSSL_DEPRECATEDIN_3_0 int HMAC_Init_ex(HMAC_CTX *ctx, const void *key, int len,
      |                           ^~~~~~~~~~~~
eap-tls.c:167:17: warning: 'HMAC_Init_ex' is deprecated: Since OpenSSL 3.0 [-Wdeprecated-declarations]
  167 |                 HMAC_Init_ex(ctx_a, NULL, 0, NULL, NULL);
      |                 ^~~~~~~~~~~~
/usr/include/openssl/hmac.h:43:27: note: declared here
   43 | OSSL_DEPRECATEDIN_3_0 int HMAC_Init_ex(HMAC_CTX *ctx, const void *key, int len,
      |                           ^~~~~~~~~~~~
eap-tls.c:168:17: warning: 'HMAC_Update' is deprecated: Since OpenSSL 3.0 [-Wdeprecated-declarations]
  168 |                 HMAC_Update(ctx_a, a, size);
      |                 ^~~~~~~~~~~
/usr/include/openssl/hmac.h:45:27: note: declared here
   45 | OSSL_DEPRECATEDIN_3_0 int HMAC_Update(HMAC_CTX *ctx, const unsigned char *data,
      |                           ^~~~~~~~~~~
eap-tls.c:169:17: warning: 'HMAC_Final' is deprecated: Since OpenSSL 3.0 [-Wdeprecated-declarations]
  169 |                 HMAC_Final(ctx_a, a, NULL);
      |                 ^~~~~~~~~~
/usr/include/openssl/hmac.h:47:27: note: declared here
   47 | OSSL_DEPRECATEDIN_3_0 int HMAC_Final(HMAC_CTX *ctx, unsigned char *md,
      |                           ^~~~~~~~~~
eap-tls.c:172:9: warning: 'HMAC_CTX_free' is deprecated: Since OpenSSL 3.0 [-Wdeprecated-declarations]
  172 |         HMAC_CTX_free(ctx_a);
      |         ^~~~~~~~~~~~~
/usr/include/openssl/hmac.h:35:28: note: declared here
   35 | OSSL_DEPRECATEDIN_3_0 void HMAC_CTX_free(HMAC_CTX *ctx);
      |                            ^~~~~~~~~~~~~
eap-tls.c:173:9: warning: 'HMAC_CTX_free' is deprecated: Since OpenSSL 3.0 [-Wdeprecated-declarations]
  173 |         HMAC_CTX_free(ctx_out);
      |         ^~~~~~~~~~~~~
/usr/include/openssl/hmac.h:35:28: note: declared here
   35 | OSSL_DEPRECATEDIN_3_0 void HMAC_CTX_free(HMAC_CTX *ctx);
      |                            ^~~~~~~~~~~~~
eap-tls.c: In function 'eaptls_ssl_load_config':
eap-tls.c:291:5: warning: 'ENGINE_load_builtin_engines' is deprecated: Since OpenSSL 3.0 [-Wdeprecated-declarations]
  291 |     ENGINE_load_builtin_engines();
      |     ^~~~~~~~~~~~~~~~~~~~~~~~~~~
In file included from eap-tls.c:39:
/usr/include/openssl/engine.h:358:28: note: declared here
  358 | OSSL_DEPRECATEDIN_3_0 void ENGINE_load_builtin_engines(void);
      |                            ^~~~~~~~~~~~~~~~~~~~~~~~~~~
eap-tls.c: In function 'eaptls_ssl_load_engine':
eap-tls.c:310:9: warning: 'ENGINE_register_all_complete' is deprecated: Since OpenSSL 3.0 [-Wdeprecated-declarations]
  310 |         ENGINE_register_all_complete();
      |         ^~~~~~~~~~~~~~~~~~~~~~~~~~~~
/usr/include/openssl/engine.h:415:27: note: declared here
  415 | OSSL_DEPRECATEDIN_3_0 int ENGINE_register_all_complete(void);
      |                           ^~~~~~~~~~~~~~~~~~~~~~~~~~~~
eap-tls.c:313:9: warning: 'ENGINE_by_id' is deprecated: Since OpenSSL 3.0 [-Wdeprecated-declarations]
  313 |         e = ENGINE_by_id( engine_name );
      |         ^
/usr/include/openssl/engine.h:336:31: note: declared here
  336 | OSSL_DEPRECATEDIN_3_0 ENGINE *ENGINE_by_id(const char *id);
      |                               ^~~~~~~~~~~~
eap-tls.c:317:17: warning: 'ENGINE_by_id' is deprecated: Since OpenSSL 3.0 [-Wdeprecated-declarations]
  317 |                 e = ENGINE_by_id( "dynamic" );
      |                 ^
/usr/include/openssl/engine.h:336:31: note: declared here
  336 | OSSL_DEPRECATEDIN_3_0 ENGINE *ENGINE_by_id(const char *id);
      |                               ^~~~~~~~~~~~
eap-tls.c:320:25: warning: 'ENGINE_ctrl_cmd_string' is deprecated: Since OpenSSL 3.0 [-Wdeprecated-declarations]
  320 |                         if (!ENGINE_ctrl_cmd_string(e, "SO_PATH", engine_name, 0)
      |                         ^~
/usr/include/openssl/engine.h:479:5: note: declared here
  479 | int ENGINE_ctrl_cmd_string(ENGINE *e, const char *cmd_name, const char *arg,
      |     ^~~~~~~~~~~~~~~~~~~~~~
eap-tls.c:321:18: warning: 'ENGINE_ctrl_cmd_string' is deprecated: Since OpenSSL 3.0 [-Wdeprecated-declarations]
  321 |                  || !ENGINE_ctrl_cmd_string(e, "LOAD", NULL, 0))
      |                  ^~
/usr/include/openssl/engine.h:479:5: note: declared here
  479 | int ENGINE_ctrl_cmd_string(ENGINE *e, const char *cmd_name, const char *arg,
      |     ^~~~~~~~~~~~~~~~~~~~~~
eap-tls.c:325:33: warning: 'ENGINE_free' is deprecated: Since OpenSSL 3.0 [-Wdeprecated-declarations]
  325 |                                 ENGINE_free(e);
      |                                 ^~~~~~~~~~~
/usr/include/openssl/engine.h:493:27: note: declared here
  493 | OSSL_DEPRECATEDIN_3_0 int ENGINE_free(ENGINE *e);
      |                           ^~~~~~~~~~~
eap-tls.c:338:17: warning: 'ENGINE_set_default' is deprecated: Since OpenSSL 3.0 [-Wdeprecated-declarations]
  338 |                 if(!ENGINE_set_default(e, ENGINE_METHOD_ALL))
      |                 ^~
/usr/include/openssl/engine.h:708:27: note: declared here
  708 | OSSL_DEPRECATEDIN_3_0 int ENGINE_set_default(ENGINE *e, unsigned int flags);
      |                           ^~~~~~~~~~~~~~~~~~
eap-tls.c:342:25: warning: 'ENGINE_free' is deprecated: Since OpenSSL 3.0 [-Wdeprecated-declarations]
  342 |                         ENGINE_free(e);
      |                         ^~~~~~~~~~~
/usr/include/openssl/engine.h:493:27: note: declared here
  493 | OSSL_DEPRECATEDIN_3_0 int ENGINE_free(ENGINE *e);
      |                           ^~~~~~~~~~~
eap-tls.c: In function 'eaptls_init_ssl':
eap-tls.c:505:17: warning: 'ENGINE_ctrl_cmd' is deprecated: Since OpenSSL 3.0 [-Wdeprecated-declarations]
  505 |                 if (!ENGINE_ctrl_cmd( cert_engine, "LOAD_CERT_CTRL", 0, &cert_info, NULL, 0 ) )
      |                 ^~
/usr/include/openssl/engine.h:450:27: note: declared here
  450 | OSSL_DEPRECATEDIN_3_0 int ENGINE_ctrl_cmd(ENGINE *e, const char *cmd_name,
      |                           ^~~~~~~~~~~~~~~
eap-tls.c:545:17: warning: 'ENGINE_load_private_key' is deprecated: Since OpenSSL 3.0 [-Wdeprecated-declarations]
  545 |                 pkey = ENGINE_load_private_key(pkey_engine, pkey_identifier, NULL, &cb_data);
      |                 ^~~~
/usr/include/openssl/engine.h:638:11: note: declared here
  638 | EVP_PKEY *ENGINE_load_private_key(ENGINE *e, const char *key_id,
      |           ^~~~~~~~~~~~~~~~~~~~~~~
make[1]: Leaving directory '/usr/src/RPM/BUILD/ppp-2.4.8/pppd'
make[1]: Entering directory '/usr/src/RPM/BUILD/ppp-2.4.8/pppd'
gcc -pipe -frecord-gcc-switches -Wall -g -O2 -flto=auto -fPIC -Wall -D_GNU_SOURCE -fno-strict-aliasing -DHAVE_PATHS_H -DIPX_CHANGE -DHAVE_MMAP -I../include '-DDESTDIR="/usr"' '-DLIBDIR="/usr/lib64"' -DCHAPMS=1 -DMPPE=1 -DUSE_OPENSSL -DUSE_EAPTLS=1 -DHAS_SHADOW -DHAVE_CRYPT_H=1 -DHAVE_LOGWTMP=1 -I/usr/include/openssl -DUSE_PAM -DHAVE_MULTILINK -DUSE_TDB=1 -DSYSTEMD=1 -DPLUGIN -DPPP_FILTER -DINET6=1 -DCBCP_SUPPORT -DMAXOCTETS   -c -o eap.o eap.c
eap.c: In function 'eap_request':
eap.c:1696:17: warning: 'MD5_Init' is deprecated: Since OpenSSL 3.0 [-Wdeprecated-declarations]
 1696 |                 MD5_Init(&mdContext);
      |                 ^~~~~~~~
In file included from eap-tls.h:39,
                 from eap.c:71:
/usr/include/openssl/md5.h:49:27: note: declared here
   49 | OSSL_DEPRECATEDIN_3_0 int MD5_Init(MD5_CTX *c);
      |                           ^~~~~~~~
eap.c:1698:17: warning: 'MD5_Update' is deprecated: Since OpenSSL 3.0 [-Wdeprecated-declarations]
 1698 |                 MD5_Update(&mdContext, &typenum, 1);
      |                 ^~~~~~~~~~
/usr/include/openssl/md5.h:50:27: note: declared here
   50 | OSSL_DEPRECATEDIN_3_0 int MD5_Update(MD5_CTX *c, const void *data, size_t len);
      |                           ^~~~~~~~~~
eap.c:1699:17: warning: 'MD5_Update' is deprecated: Since OpenSSL 3.0 [-Wdeprecated-declarations]
 1699 |                 MD5_Update(&mdContext, (u_char *)secret, secret_len);
      |                 ^~~~~~~~~~
/usr/include/openssl/md5.h:50:27: note: declared here
   50 | OSSL_DEPRECATEDIN_3_0 int MD5_Update(MD5_CTX *c, const void *data, size_t len);
      |                           ^~~~~~~~~~
eap.c:1701:17: warning: 'MD5_Update' is deprecated: Since OpenSSL 3.0 [-Wdeprecated-declarations]
 1701 |                 MD5_Update(&mdContext, inp, vallen);
      |                 ^~~~~~~~~~
/usr/include/openssl/md5.h:50:27: note: declared here
   50 | OSSL_DEPRECATEDIN_3_0 int MD5_Update(MD5_CTX *c, const void *data, size_t len);
      |                           ^~~~~~~~~~
eap.c:1702:17: warning: 'MD5_Final' is deprecated: Since OpenSSL 3.0 [-Wdeprecated-declarations]
 1702 |                 MD5_Final(hash, &mdContext);
      |                 ^~~~~~~~~
/usr/include/openssl/md5.h:51:27: note: declared here
   51 | OSSL_DEPRECATEDIN_3_0 int MD5_Final(unsigned char *md, MD5_CTX *c);
      |                           ^~~~~~~~~
eap.c: In function 'eap_response':
eap.c:2291:17: warning: 'MD5_Init' is deprecated: Since OpenSSL 3.0 [-Wdeprecated-declarations]
 2291 |                 MD5_Init(&mdContext);
      |                 ^~~~~~~~
/usr/include/openssl/md5.h:49:27: note: declared here
   49 | OSSL_DEPRECATEDIN_3_0 int MD5_Init(MD5_CTX *c);
      |                           ^~~~~~~~
eap.c:2292:17: warning: 'MD5_Update' is deprecated: Since OpenSSL 3.0 [-Wdeprecated-declarations]
 2292 |                 MD5_Update(&mdContext, &esp->es_server.ea_id, 1);
      |                 ^~~~~~~~~~
/usr/include/openssl/md5.h:50:27: note: declared here
   50 | OSSL_DEPRECATEDIN_3_0 int MD5_Update(MD5_CTX *c, const void *data, size_t len);
      |                           ^~~~~~~~~~
eap.c:2293:17: warning: 'MD5_Update' is deprecated: Since OpenSSL 3.0 [-Wdeprecated-declarations]
 2293 |                 MD5_Update(&mdContext, (u_char *)secret, secret_len);
      |                 ^~~~~~~~~~
/usr/include/openssl/md5.h:50:27: note: declared here
   50 | OSSL_DEPRECATEDIN_3_0 int MD5_Update(MD5_CTX *c, const void *data, size_t len);
      |                           ^~~~~~~~~~
eap.c:2295:17: warning: 'MD5_Update' is deprecated: Since OpenSSL 3.0 [-Wdeprecated-declarations]
 2295 |                 MD5_Update(&mdContext, esp->es_challenge, esp->es_challen);
      |                 ^~~~~~~~~~
/usr/include/openssl/md5.h:50:27: note: declared here
   50 | OSSL_DEPRECATEDIN_3_0 int MD5_Update(MD5_CTX *c, const void *data, size_t len);
      |                           ^~~~~~~~~~
eap.c:2296:17: warning: 'MD5_Final' is deprecated: Since OpenSSL 3.0 [-Wdeprecated-declarations]
 2296 |                 MD5_Final(hash, &mdContext);
      |                 ^~~~~~~~~
/usr/include/openssl/md5.h:51:27: note: declared here
   51 | OSSL_DEPRECATEDIN_3_0 int MD5_Final(unsigned char *md, MD5_CTX *c);
      |                           ^~~~~~~~~
eap.c: At top level:
eap.c:156:21: warning: 'wkmodulus' defined but not used [-Wunused-const-variable=]
  156 | static const u_char wkmodulus[] = {
      |                     ^~~~~~~~~
make[1]: Leaving directory '/usr/src/RPM/BUILD/ppp-2.4.8/pppd'
make[1]: Entering directory '/usr/src/RPM/BUILD/ppp-2.4.8/pppd'
gcc -pipe -frecord-gcc-switches -Wall -g -O2 -flto=auto -fPIC -Wall -D_GNU_SOURCE -fno-strict-aliasing -DHAVE_PATHS_H -DIPX_CHANGE -DHAVE_MMAP -I../include '-DDESTDIR="/usr"' '-DLIBDIR="/usr/lib64"' -DCHAPMS=1 -DMPPE=1 -DUSE_OPENSSL -DUSE_EAPTLS=1 -DHAS_SHADOW -DHAVE_CRYPT_H=1 -DHAVE_LOGWTMP=1 -I/usr/include/openssl -DUSE_PAM -DHAVE_MULTILINK -DUSE_TDB=1 -DSYSTEMD=1 -DPLUGIN -DPPP_FILTER -DINET6=1 -DCBCP_SUPPORT -DMAXOCTETS -pie  -Wl,-E -o pppd main.o magic.o fsm.o lcp.o ipcp.o upap.o chap-new.o ccp.o ecp.o auth.o options.o demand.o utils.o sys-linux.o ipxcp.o tty.o eap.o chap-md5.o session.o chap_ms.o eap-tls.o pppcrypt.o multilink.o tdb.o spinlock.o ipv6cp.o eui64.o cbcp.o -ludev -lcrypto -lssl -lcrypto -lcrypt -lutil -lcrypto -lpam -ldl -lsystemd -ldl -lpcap
make[1]: Leaving directory '/usr/src/RPM/BUILD/ppp-2.4.8/pppd'
cd pppstats; make -w -j16 -Otarget --jobserver-auth=fifo:/usr/src/tmp/GMfifo1626401 --sync-mutex=fnm:/usr/src/tmp/GmUqeLKu all
make[1]: Entering directory '/usr/src/RPM/BUILD/ppp-2.4.8/pppstats'
make[1]: warning: -j16 forced in submake: resetting jobserver mode.
make[1]: Leaving directory '/usr/src/RPM/BUILD/ppp-2.4.8/pppstats'
make[1]: Entering directory '/usr/src/RPM/BUILD/ppp-2.4.8/pppstats'
gcc -pipe -frecord-gcc-switches -Wall -g -O2 -flto=auto -fPIC -Wall -D_GNU_SOURCE -fno-strict-aliasing -I../include  -o pppstats pppstats.c 
pppstats.c:39:19: warning: 'rcsid' defined but not used [-Wunused-const-variable=]
   39 | static const char rcsid[] = "$Id: pppstats.c,v 1.29 2002/10/27 12:56:26 fcusack Exp $";
      |                   ^~~~~
make[1]: Leaving directory '/usr/src/RPM/BUILD/ppp-2.4.8/pppstats'
cd pppdump; make -w -j16 -Otarget --jobserver-auth=fifo:/usr/src/tmp/GMfifo1626401 --sync-mutex=fnm:/usr/src/tmp/GmUqeLKu all
make[1]: Entering directory '/usr/src/RPM/BUILD/ppp-2.4.8/pppdump'
make[1]: warning: -j16 forced in submake: resetting jobserver mode.
make[1]: Leaving directory '/usr/src/RPM/BUILD/ppp-2.4.8/pppdump'
make[1]: Entering directory '/usr/src/RPM/BUILD/ppp-2.4.8/pppdump'
gcc -I../include/net -fPIC   -c -o deflate.o deflate.c
make[1]: Leaving directory '/usr/src/RPM/BUILD/ppp-2.4.8/pppdump'
make[1]: Entering directory '/usr/src/RPM/BUILD/ppp-2.4.8/pppdump'
gcc -I../include/net -fPIC   -c -o bsd-comp.o bsd-comp.c
make[1]: Leaving directory '/usr/src/RPM/BUILD/ppp-2.4.8/pppdump'
make[1]: Entering directory '/usr/src/RPM/BUILD/ppp-2.4.8/pppdump'
gcc -I../include/net -fPIC   -c -o pppdump.o pppdump.c
make[1]: Leaving directory '/usr/src/RPM/BUILD/ppp-2.4.8/pppdump'
make[1]: Entering directory '/usr/src/RPM/BUILD/ppp-2.4.8/pppdump'
gcc -I../include/net -fPIC   -c -o zlib.o zlib.c
make[1]: Leaving directory '/usr/src/RPM/BUILD/ppp-2.4.8/pppdump'
make[1]: Entering directory '/usr/src/RPM/BUILD/ppp-2.4.8/pppdump'
gcc -I../include/net -fPIC  -o pppdump pppdump.o bsd-comp.o deflate.o zlib.o
make[1]: Leaving directory '/usr/src/RPM/BUILD/ppp-2.4.8/pppdump'
+ exit 0
Executing(%install): /bin/sh -e /usr/src/tmp/rpm-tmp.13982
+ umask 022
+ /bin/mkdir -p /usr/src/RPM/BUILD
+ cd /usr/src/RPM/BUILD
+ /bin/chmod -Rf u+rwX -- /usr/src/tmp/ppp-buildroot
+ :
+ /bin/rm -rf -- /usr/src/tmp/ppp-buildroot
+ PATH=/usr/libexec/rpm-build:/usr/src/bin:/bin:/usr/bin:/usr/X11R6/bin:/usr/games
+ cd ppp-2.4.8
+ make 'INSTALL=/usr/libexec/rpm-build/install -p' install DESTDIR=/usr/src/tmp/ppp-buildroot BINDIR=/usr/src/tmp/ppp-buildroot/usr/sbin INCDIR=/usr/src/tmp/ppp-buildroot/usr/include libdir=/usr/lib64 MANDIR=/usr/src/tmp/ppp-buildroot/usr/share/man/man8 RUNDIR=/usr/src/tmp/ppp-buildroot/var/run/ppp LOGDIR=/usr/src/tmp/ppp-buildroot/var/log/ppp
make: Entering directory '/usr/src/RPM/BUILD/ppp-2.4.8'
/usr/libexec/rpm-build/install -p -d -m 755 /usr/src/tmp/ppp-buildroot/usr/sbin
/usr/libexec/rpm-build/install -p -d -m 755 /usr/src/tmp/ppp-buildroot/var/run/ppp
/usr/libexec/rpm-build/install -p -d -m 755 /usr/src/tmp/ppp-buildroot/var/log/ppp
/usr/libexec/rpm-build/install -p -d -m 755 /usr/src/tmp/ppp-buildroot/usr/share/man/man8/man8
cd chat; make -w -Otarget install
make[1]: Entering directory '/usr/src/RPM/BUILD/ppp-2.4.8/chat'
mkdir -p /usr/src/tmp/ppp-buildroot/usr/sbin /usr/src/tmp/ppp-buildroot/usr/share/man/man8
/usr/libexec/rpm-build/install -p -m 755 chat /usr/src/tmp/ppp-buildroot/usr/sbin
/usr/libexec/rpm-build/install -p -m 644 chat.8 /usr/src/tmp/ppp-buildroot/usr/share/man/man8
make[1]: Leaving directory '/usr/src/RPM/BUILD/ppp-2.4.8/chat'
cd pppd/plugins; make -w -Otarget install
make[1]: Entering directory '/usr/src/RPM/BUILD/ppp-2.4.8/pppd/plugins'
mkdir -p /usr/src/tmp/ppp-buildroot//usr/lib64/pppd/2.4.8
/usr/libexec/rpm-build/install -p minconn.so passprompt.so passwordfd.so winbind.so /usr/src/tmp/ppp-buildroot//usr/lib64/pppd/2.4.8
for d in rp-pppoe pppoatm pppol2tp radius dhcp; do make -w -Otarget -C $d install || exit $?; done
make[2]: Entering directory '/usr/src/RPM/BUILD/ppp-2.4.8/pppd/plugins/rp-pppoe'
/usr/libexec/rpm-build/install -p -d -m 755 /usr/src/tmp/ppp-buildroot//usr/lib64/pppd/2.4.8
/usr/libexec/rpm-build/install -p -m 644 rp-pppoe.so /usr/src/tmp/ppp-buildroot//usr/lib64/pppd/2.4.8
/usr/libexec/rpm-build/install -p -d -m 755 /usr/src/tmp/ppp-buildroot/usr/sbin
/usr/libexec/rpm-build/install -p -m 755 pppoe-discovery /usr/src/tmp/ppp-buildroot/usr/sbin
/usr/libexec/rpm-build/install -p -c -m 644 pppoe-discovery.8 /usr/src/tmp/ppp-buildroot/usr/share/man/man8
make[2]: Leaving directory '/usr/src/RPM/BUILD/ppp-2.4.8/pppd/plugins/rp-pppoe'
make[2]: Entering directory '/usr/src/RPM/BUILD/ppp-2.4.8/pppd/plugins/pppoatm'
cc  -I../.. -I../../../include -fPIC -I. -c -o text2qos.o text2qos.c
cc  -I../.. -I../../../include -fPIC -I. -c -o text2atm.o text2atm.c
cc  -I../.. -I../../../include -fPIC -I. -c -o misc.o misc.c
cc  -I../.. -I../../../include -fPIC -I. -c -o ans.o ans.c
cc  -I../.. -I../../../include -fPIC -I.  -shared -o pppoatm.so pppoatm.o text2qos.o text2atm.o misc.o ans.o -lresolv
/usr/libexec/rpm-build/install -p -d -m 755 /usr/src/tmp/ppp-buildroot//usr/lib64/pppd/2.4.8
/usr/libexec/rpm-build/install -p -m 0644 pppoatm.so /usr/src/tmp/ppp-buildroot//usr/lib64/pppd/2.4.8
make[2]: Leaving directory '/usr/src/RPM/BUILD/ppp-2.4.8/pppd/plugins/pppoatm'
make[2]: Entering directory '/usr/src/RPM/BUILD/ppp-2.4.8/pppd/plugins/pppol2tp'
/usr/libexec/rpm-build/install -p -d -m 755 /usr/src/tmp/ppp-buildroot//usr/lib64/pppd/2.4.8
/usr/libexec/rpm-build/install -p -c -m 755 pppol2tp.so openl2tp.so /usr/src/tmp/ppp-buildroot//usr/lib64/pppd/2.4.8
make[2]: Leaving directory '/usr/src/RPM/BUILD/ppp-2.4.8/pppd/plugins/pppol2tp'
make[2]: Entering directory '/usr/src/RPM/BUILD/ppp-2.4.8/pppd/plugins/radius'
mkdir -p /usr/src/tmp/ppp-buildroot//usr/lib64/pppd/2.4.8
/usr/libexec/rpm-build/install -p -m 755 radius.so /usr/src/tmp/ppp-buildroot//usr/lib64/pppd/2.4.8
/usr/libexec/rpm-build/install -p -m 755 radattr.so /usr/src/tmp/ppp-buildroot//usr/lib64/pppd/2.4.8
/usr/libexec/rpm-build/install -p -m 755 radrealms.so /usr/src/tmp/ppp-buildroot//usr/lib64/pppd/2.4.8
/usr/libexec/rpm-build/install -p -m 644 pppd-radius.8 /usr/src/tmp/ppp-buildroot/usr/share/man/man8
/usr/libexec/rpm-build/install -p -m 644 pppd-radattr.8 /usr/src/tmp/ppp-buildroot/usr/share/man/man8
make[2]: Leaving directory '/usr/src/RPM/BUILD/ppp-2.4.8/pppd/plugins/radius'
make[2]: Entering directory '/usr/src/RPM/BUILD/ppp-2.4.8/pppd/plugins/dhcp'
mkdir -p /usr/src/tmp/ppp-buildroot//usr/lib64/pppd/2.4.8
/usr/libexec/rpm-build/install -p -m 755 dhcpc.so /usr/src/tmp/ppp-buildroot//usr/lib64/pppd/2.4.8
make[2]: Leaving directory '/usr/src/RPM/BUILD/ppp-2.4.8/pppd/plugins/dhcp'
make[1]: Leaving directory '/usr/src/RPM/BUILD/ppp-2.4.8/pppd/plugins'
cd pppd; make -w -Otarget install
make[1]: Entering directory '/usr/src/RPM/BUILD/ppp-2.4.8/pppd'
mkdir -p /usr/src/tmp/ppp-buildroot/usr/sbin /usr/src/tmp/ppp-buildroot/usr/share/man/man8
/usr/libexec/rpm-build/install -p -m 755 pppd /usr/src/tmp/ppp-buildroot/usr/sbin/pppd
/usr/libexec/rpm-build/install -p -m 644 pppd.8 /usr/src/tmp/ppp-buildroot/usr/share/man/man8
make[1]: Leaving directory '/usr/src/RPM/BUILD/ppp-2.4.8/pppd'
cd pppstats; make -w -Otarget install
make[1]: Entering directory '/usr/src/RPM/BUILD/ppp-2.4.8/pppstats'
mkdir -p /usr/src/tmp/ppp-buildroot/usr/share/man/man8
/usr/libexec/rpm-build/install -p -m 755 pppstats /usr/src/tmp/ppp-buildroot/usr/sbin
/usr/libexec/rpm-build/install -p -m 644 pppstats.8 /usr/src/tmp/ppp-buildroot/usr/share/man/man8
make[1]: Leaving directory '/usr/src/RPM/BUILD/ppp-2.4.8/pppstats'
cd pppdump; make -w -Otarget install
make[1]: Entering directory '/usr/src/RPM/BUILD/ppp-2.4.8/pppdump'
mkdir -p /usr/src/tmp/ppp-buildroot/usr/sbin /usr/src/tmp/ppp-buildroot/usr/share/man/man8
/usr/libexec/rpm-build/install -p -m 755 pppdump /usr/src/tmp/ppp-buildroot/usr/sbin
/usr/libexec/rpm-build/install -p -m 644 pppdump.8 /usr/src/tmp/ppp-buildroot/usr/share/man/man8
make[1]: Leaving directory '/usr/src/RPM/BUILD/ppp-2.4.8/pppdump'
cd pppd; make -w -Otarget install-devel
make[1]: Entering directory '/usr/src/RPM/BUILD/ppp-2.4.8/pppd'
mkdir -p /usr/src/tmp/ppp-buildroot/usr/include/pppd
/usr/libexec/rpm-build/install -p -m 644 ccp.h session.h chap-new.h ecp.h fsm.h ipcp.h ipxcp.h lcp.h magic.h md5.h patchlevel.h pathnames.h pppd.h upap.h eap.h cbcp.h chap_ms.h eap-tls.h pppcrypt.h tdb.h spinlock.h ipv6cp.h eui64.h /usr/src/tmp/ppp-buildroot/usr/include/pppd
make[1]: Leaving directory '/usr/src/RPM/BUILD/ppp-2.4.8/pppd'
make: Leaving directory '/usr/src/RPM/BUILD/ppp-2.4.8'
+ make 'INSTALL=/usr/libexec/rpm-build/install -p' install-etcppp INSTROOT=/usr/src/tmp/ppp-buildroot ETCDIR=/usr/src/tmp/ppp-buildroot/etc/ppp
make: Entering directory '/usr/src/RPM/BUILD/ppp-2.4.8'
/usr/libexec/rpm-build/install -p -d -m 755 /usr/src/tmp/ppp-buildroot/etc/ppp
/usr/libexec/rpm-build/install -p -c -m 644 etc.ppp/options /usr/src/tmp/ppp-buildroot/etc/ppp/options
/usr/libexec/rpm-build/install -p -c -m 600 etc.ppp/pap-secrets /usr/src/tmp/ppp-buildroot/etc/ppp/pap-secrets
/usr/libexec/rpm-build/install -p -c -m 600 etc.ppp/chap-secrets /usr/src/tmp/ppp-buildroot/etc/ppp/chap-secrets
/usr/libexec/rpm-build/install -p -c -m 600 etc.ppp/eaptls-server /usr/src/tmp/ppp-buildroot/etc/ppp/eaptls-server
/usr/libexec/rpm-build/install -p -c -m 600 etc.ppp/eaptls-client /usr/src/tmp/ppp-buildroot/etc/ppp/eaptls-client
make: Leaving directory '/usr/src/RPM/BUILD/ppp-2.4.8'
++ find scripts/ sample/ -type f
+ for f in `find scripts/ sample/ -type f`
+ chmod 644 scripts/secure-card
+ fgrep -qs /usr/local/bin/ scripts/secure-card
fgrep: warning: fgrep is obsolescent; using grep -F
+ subst -p 's|/usr/local/bin|/usr/bin|g' scripts/secure-card
+ file -b scripts/secure-card
+ fgrep -qs 'shell script'
fgrep: warning: fgrep is obsolescent; using grep -F
+ for f in `find scripts/ sample/ -type f`
+ chmod 644 scripts/redialer
+ fgrep -qs /usr/local/bin/ scripts/redialer
fgrep: warning: fgrep is obsolescent; using grep -F
+ file -b scripts/redialer
+ fgrep -qs 'shell script'
fgrep: warning: fgrep is obsolescent; using grep -F
+ chmod a+x scripts/redialer
+ for f in `find scripts/ sample/ -type f`
+ chmod 644 scripts/ppp-on-ssh
+ fgrep -qs /usr/local/bin/ scripts/ppp-on-ssh
fgrep: warning: fgrep is obsolescent; using grep -F
+ subst -p 's|/usr/local/bin|/usr/bin|g' scripts/ppp-on-ssh
+ file -b scripts/ppp-on-ssh
+ fgrep -qs 'shell script'
fgrep: warning: fgrep is obsolescent; using grep -F
+ chmod a+x scripts/ppp-on-ssh
+ for f in `find scripts/ sample/ -type f`
+ chmod 644 scripts/ppp-on-rsh
+ fgrep -qs /usr/local/bin/ scripts/ppp-on-rsh
fgrep: warning: fgrep is obsolescent; using grep -F
+ subst -p 's|/usr/local/bin|/usr/bin|g' scripts/ppp-on-rsh
+ file -b scripts/ppp-on-rsh
+ fgrep -qs 'shell script'
fgrep: warning: fgrep is obsolescent; using grep -F
+ chmod a+x scripts/ppp-on-rsh
+ for f in `find scripts/ sample/ -type f`
+ chmod 644 scripts/ppp-on-dialer
+ fgrep -qs /usr/local/bin/ scripts/ppp-on-dialer
fgrep: warning: fgrep is obsolescent; using grep -F
+ file -b scripts/ppp-on-dialer
+ fgrep -qs 'shell script'
fgrep: warning: fgrep is obsolescent; using grep -F
+ chmod a+x scripts/ppp-on-dialer
+ for f in `find scripts/ sample/ -type f`
+ chmod 644 scripts/ppp-on
+ fgrep -qs /usr/local/bin/ scripts/ppp-on
fgrep: warning: fgrep is obsolescent; using grep -F
+ file -b scripts/ppp-on
+ fgrep -qs 'shell script'
fgrep: warning: fgrep is obsolescent; using grep -F
+ chmod a+x scripts/ppp-on
+ for f in `find scripts/ sample/ -type f`
+ chmod 644 scripts/ppp-off
+ fgrep -qs /usr/local/bin/ scripts/ppp-off
fgrep: warning: fgrep is obsolescent; using grep -F
+ file -b scripts/ppp-off
+ fgrep -qs 'shell script'
fgrep: warning: fgrep is obsolescent; using grep -F
+ chmod a+x scripts/ppp-off
+ for f in `find scripts/ sample/ -type f`
+ chmod 644 scripts/pon.1
+ fgrep -qs /usr/local/bin/ scripts/pon.1
fgrep: warning: fgrep is obsolescent; using grep -F
+ file -b scripts/pon.1
+ fgrep -qs 'shell script'
fgrep: warning: fgrep is obsolescent; using grep -F
+ for f in `find scripts/ sample/ -type f`
+ chmod 644 scripts/pon
+ fgrep -qs /usr/local/bin/ scripts/pon
fgrep: warning: fgrep is obsolescent; using grep -F
+ file -b scripts/pon
+ fgrep -qs 'shell script'
fgrep: warning: fgrep is obsolescent; using grep -F
+ chmod a+x scripts/pon
+ for f in `find scripts/ sample/ -type f`
+ chmod 644 scripts/poff
+ fgrep -qs /usr/local/bin/ scripts/poff
fgrep: warning: fgrep is obsolescent; using grep -F
+ file -b scripts/poff
+ fgrep -qs 'shell script'
fgrep: warning: fgrep is obsolescent; using grep -F
+ chmod a+x scripts/poff
+ for f in `find scripts/ sample/ -type f`
+ chmod 644 scripts/plog
+ fgrep -qs /usr/local/bin/ scripts/plog
fgrep: warning: fgrep is obsolescent; using grep -F
+ file -b scripts/plog
+ fgrep -qs 'shell script'
fgrep: warning: fgrep is obsolescent; using grep -F
+ chmod a+x scripts/plog
+ for f in `find scripts/ sample/ -type f`
+ chmod 644 scripts/options-ssh-rem
+ fgrep -qs /usr/local/bin/ scripts/options-ssh-rem
fgrep: warning: fgrep is obsolescent; using grep -F
+ file -b scripts/options-ssh-rem
+ fgrep -qs 'shell script'
fgrep: warning: fgrep is obsolescent; using grep -F
+ for f in `find scripts/ sample/ -type f`
+ chmod 644 scripts/options-ssh-loc
+ fgrep -qs /usr/local/bin/ scripts/options-ssh-loc
fgrep: warning: fgrep is obsolescent; using grep -F
+ file -b scripts/options-ssh-loc
+ fgrep -qs 'shell script'
fgrep: warning: fgrep is obsolescent; using grep -F
+ for f in `find scripts/ sample/ -type f`
+ chmod 644 scripts/options-rsh-rem
+ fgrep -qs /usr/local/bin/ scripts/options-rsh-rem
fgrep: warning: fgrep is obsolescent; using grep -F
+ file -b scripts/options-rsh-rem
+ fgrep -qs 'shell script'
fgrep: warning: fgrep is obsolescent; using grep -F
+ for f in `find scripts/ sample/ -type f`
+ chmod 644 scripts/options-rsh-loc
+ fgrep -qs /usr/local/bin/ scripts/options-rsh-loc
fgrep: warning: fgrep is obsolescent; using grep -F
+ file -b scripts/options-rsh-loc
+ fgrep -qs 'shell script'
fgrep: warning: fgrep is obsolescent; using grep -F
+ for f in `find scripts/ sample/ -type f`
+ chmod 644 scripts/ipv6-up.sample
+ fgrep -qs /usr/local/bin/ scripts/ipv6-up.sample
fgrep: warning: fgrep is obsolescent; using grep -F
+ file -b scripts/ipv6-up.sample
+ fgrep -qs 'shell script'
fgrep: warning: fgrep is obsolescent; using grep -F
+ chmod a+x scripts/ipv6-up.sample
+ for f in `find scripts/ sample/ -type f`
+ chmod 644 scripts/ipv6-down.sample
+ fgrep -qs /usr/local/bin/ scripts/ipv6-down.sample
fgrep: warning: fgrep is obsolescent; using grep -F
+ file -b scripts/ipv6-down.sample
+ fgrep -qs 'shell script'
fgrep: warning: fgrep is obsolescent; using grep -F
+ chmod a+x scripts/ipv6-down.sample
+ for f in `find scripts/ sample/ -type f`
+ chmod 644 scripts/ip-up.local.add
+ fgrep -qs /usr/local/bin/ scripts/ip-up.local.add
fgrep: warning: fgrep is obsolescent; using grep -F
+ file -b scripts/ip-up.local.add
+ fgrep -qs 'shell script'
fgrep: warning: fgrep is obsolescent; using grep -F
+ for f in `find scripts/ sample/ -type f`
+ chmod 644 scripts/ip-down.local.add
+ fgrep -qs /usr/local/bin/ scripts/ip-down.local.add
fgrep: warning: fgrep is obsolescent; using grep -F
+ file -b scripts/ip-down.local.add
+ fgrep -qs 'shell script'
fgrep: warning: fgrep is obsolescent; using grep -F
+ for f in `find scripts/ sample/ -type f`
+ chmod 644 scripts/chatchat/chatchat.c
+ fgrep -qs /usr/local/bin/ scripts/chatchat/chatchat.c
fgrep: warning: fgrep is obsolescent; using grep -F
+ file -b scripts/chatchat/chatchat.c
+ fgrep -qs 'shell script'
fgrep: warning: fgrep is obsolescent; using grep -F
+ for f in `find scripts/ sample/ -type f`
+ chmod 644 scripts/chatchat/README
+ fgrep -qs /usr/local/bin/ scripts/chatchat/README
fgrep: warning: fgrep is obsolescent; using grep -F
+ file -b scripts/chatchat/README
+ fgrep -qs 'shell script'
fgrep: warning: fgrep is obsolescent; using grep -F
+ for f in `find scripts/ sample/ -type f`
+ chmod 644 scripts/chat-callback
+ fgrep -qs /usr/local/bin/ scripts/chat-callback
fgrep: warning: fgrep is obsolescent; using grep -F
+ file -b scripts/chat-callback
+ fgrep -qs 'shell script'
fgrep: warning: fgrep is obsolescent; using grep -F
+ for f in `find scripts/ sample/ -type f`
+ chmod 644 scripts/callback
+ fgrep -qs /usr/local/bin/ scripts/callback
fgrep: warning: fgrep is obsolescent; using grep -F
+ file -b scripts/callback
+ fgrep -qs 'shell script'
fgrep: warning: fgrep is obsolescent; using grep -F
+ chmod a+x scripts/callback
+ for f in `find scripts/ sample/ -type f`
+ chmod 644 scripts/autopppd
+ fgrep -qs /usr/local/bin/ scripts/autopppd
fgrep: warning: fgrep is obsolescent; using grep -F
+ file -b scripts/autopppd
+ fgrep -qs 'shell script'
fgrep: warning: fgrep is obsolescent; using grep -F
+ for f in `find scripts/ sample/ -type f`
+ chmod 644 scripts/README
+ fgrep -qs /usr/local/bin/ scripts/README
fgrep: warning: fgrep is obsolescent; using grep -F
+ file -b scripts/README
+ fgrep -qs 'shell script'
fgrep: warning: fgrep is obsolescent; using grep -F
+ for f in `find scripts/ sample/ -type f`
+ chmod 644 sample/pap-secrets
+ fgrep -qs /usr/local/bin/ sample/pap-secrets
fgrep: warning: fgrep is obsolescent; using grep -F
+ file -b sample/pap-secrets
+ fgrep -qs 'shell script'
fgrep: warning: fgrep is obsolescent; using grep -F
+ for f in `find scripts/ sample/ -type f`
+ chmod 644 sample/options.ttyXX
+ fgrep -qs /usr/local/bin/ sample/options.ttyXX
fgrep: warning: fgrep is obsolescent; using grep -F
+ file -b sample/options.ttyXX
+ fgrep -qs 'shell script'
fgrep: warning: fgrep is obsolescent; using grep -F
+ for f in `find scripts/ sample/ -type f`
+ chmod 644 sample/options
+ fgrep -qs /usr/local/bin/ sample/options
fgrep: warning: fgrep is obsolescent; using grep -F
+ file -b sample/options
+ fgrep -qs 'shell script'
fgrep: warning: fgrep is obsolescent; using grep -F
+ for f in `find scripts/ sample/ -type f`
+ chmod 644 sample/ip-up
+ fgrep -qs /usr/local/bin/ sample/ip-up
fgrep: warning: fgrep is obsolescent; using grep -F
+ file -b sample/ip-up
+ fgrep -qs 'shell script'
fgrep: warning: fgrep is obsolescent; using grep -F
+ chmod a+x sample/ip-up
+ for f in `find scripts/ sample/ -type f`
+ chmod 644 sample/ip-down
+ fgrep -qs /usr/local/bin/ sample/ip-down
fgrep: warning: fgrep is obsolescent; using grep -F
+ file -b sample/ip-down
+ fgrep -qs 'shell script'
fgrep: warning: fgrep is obsolescent; using grep -F
+ chmod a+x sample/ip-down
+ for f in `find scripts/ sample/ -type f`
+ chmod 644 sample/callback-users
+ fgrep -qs /usr/local/bin/ sample/callback-users
fgrep: warning: fgrep is obsolescent; using grep -F
+ file -b sample/callback-users
+ fgrep -qs 'shell script'
fgrep: warning: fgrep is obsolescent; using grep -F
+ for f in `find scripts/ sample/ -type f`
+ chmod 644 sample/callback-server
+ fgrep -qs /usr/local/bin/ sample/callback-server
fgrep: warning: fgrep is obsolescent; using grep -F
+ file -b sample/callback-server
+ fgrep -qs 'shell script'
fgrep: warning: fgrep is obsolescent; using grep -F
+ chmod a+x sample/callback-server
+ for f in `find scripts/ sample/ -type f`
+ chmod 644 sample/callback-client
+ fgrep -qs /usr/local/bin/ sample/callback-client
fgrep: warning: fgrep is obsolescent; using grep -F
+ file -b sample/callback-client
+ fgrep -qs 'shell script'
fgrep: warning: fgrep is obsolescent; using grep -F
+ chmod a+x sample/callback-client
+ for f in `find scripts/ sample/ -type f`
+ chmod 644 sample/auth-up
+ fgrep -qs /usr/local/bin/ sample/auth-up
fgrep: warning: fgrep is obsolescent; using grep -F
+ file -b sample/auth-up
+ fgrep -qs 'shell script'
fgrep: warning: fgrep is obsolescent; using grep -F
+ chmod a+x sample/auth-up
+ for f in `find scripts/ sample/ -type f`
+ chmod 644 sample/auth-down
+ fgrep -qs /usr/local/bin/ sample/auth-down
fgrep: warning: fgrep is obsolescent; using grep -F
+ file -b sample/auth-down
+ fgrep -qs 'shell script'
fgrep: warning: fgrep is obsolescent; using grep -F
+ chmod a+x sample/auth-down
+ install -pDm640 /usr/src/RPM/SOURCES/ppp.pamd /usr/src/tmp/ppp-buildroot/etc/pam.d/ppp
+ mkdir -p /usr/src/tmp/ppp-buildroot/etc/ppp/peers
+ install -pm600 sample/callback-client sample/callback-server sample/callback-users /usr/src/tmp/ppp-buildroot/etc/ppp/
+ mkdir -p /usr/src/tmp/ppp-buildroot/etc/ppp/radius
+ cp -a pppd/plugins/radius/etc/dictionary pppd/plugins/radius/etc/dictionary.ascend pppd/plugins/radius/etc/dictionary.compat pppd/plugins/radius/etc/dictionary.merit pppd/plugins/radius/etc/dictionary.microsoft pppd/plugins/radius/etc/issue pppd/plugins/radius/etc/port-id-map pppd/plugins/radius/etc/radiusclient.conf pppd/plugins/radius/etc/radiusclient.conf.in pppd/plugins/radius/etc/realms pppd/plugins/radius/etc/servers /usr/src/tmp/ppp-buildroot/etc/ppp/radius/
+ install -pDm755 /usr/src/RPM/SOURCES/ppp.control /usr/src/tmp/ppp-buildroot/etc/control.d/facilities/ppp
+ mkdir -p /usr/src/tmp/ppp-buildroot/var/log/ppp /usr/src/tmp/ppp-buildroot/var/run/ppp
+ touch /usr/src/tmp/ppp-buildroot/var/log/ppp/connect-errors
+ touch /usr/src/tmp/ppp-buildroot/var/run/ppp/resolv.conf
+ ln -s ../../var/log/ppp/connect-errors /usr/src/tmp/ppp-buildroot/etc/ppp/connect-errors
+ ln -s ../../var/run/ppp/resolv.conf /usr/src/tmp/ppp-buildroot/etc/ppp/resolv.conf
+ install -pDm644 /usr/src/RPM/SOURCES/ppp.tmpfiles /usr/src/tmp/ppp-buildroot//lib/tmpfiles.d/ppp.conf
+ install -pDm644 /usr/src/RPM/SOURCES/95-ppp.rules /usr/src/tmp/ppp-buildroot//lib/udev/rules.d/95-ppp.rules
+ install -pDm644 /usr/src/RPM/SOURCES/ppp.logrotate /usr/src/tmp/ppp-buildroot/etc/logrotate.d/ppp
+ install -pm600 etc.ppp/openssl.cnf /usr/src/tmp/ppp-buildroot/etc/ppp/openssl.cnf
+ /usr/lib/rpm/brp-alt
Cleaning files in /usr/src/tmp/ppp-buildroot (auto)
mode of './usr/lib64/pppd/2.4.8/dhcpc.so' changed from 0755 (rwxr-xr-x) to 0644 (rw-r--r--)
mode of './usr/lib64/pppd/2.4.8/radrealms.so' changed from 0755 (rwxr-xr-x) to 0644 (rw-r--r--)
mode of './usr/lib64/pppd/2.4.8/radattr.so' changed from 0755 (rwxr-xr-x) to 0644 (rw-r--r--)
mode of './usr/lib64/pppd/2.4.8/radius.so' changed from 0755 (rwxr-xr-x) to 0644 (rw-r--r--)
mode of './usr/lib64/pppd/2.4.8/openl2tp.so' changed from 0755 (rwxr-xr-x) to 0644 (rw-r--r--)
mode of './usr/lib64/pppd/2.4.8/pppol2tp.so' changed from 0755 (rwxr-xr-x) to 0644 (rw-r--r--)
mode of './usr/lib64/pppd/2.4.8/winbind.so' changed from 0755 (rwxr-xr-x) to 0644 (rw-r--r--)
mode of './usr/lib64/pppd/2.4.8/passwordfd.so' changed from 0755 (rwxr-xr-x) to 0644 (rw-r--r--)
mode of './usr/lib64/pppd/2.4.8/passprompt.so' changed from 0755 (rwxr-xr-x) to 0644 (rw-r--r--)
mode of './usr/lib64/pppd/2.4.8/minconn.so' changed from 0755 (rwxr-xr-x) to 0644 (rw-r--r--)
mode of './usr/sbin/pppoe-discovery' changed from 0755 (rwxr-xr-x) to 0644 (rw-r--r--)
Verifying and fixing files in /usr/src/tmp/ppp-buildroot (binconfig,pkgconfig,libtool,desktop,gnuconfig)
Checking contents of files in /usr/src/tmp/ppp-buildroot/ (default)
Compressing files in /usr/src/tmp/ppp-buildroot (auto)
Adjusting library links in /usr/src/tmp/ppp-buildroot
./lib: (from <cmdline>:0)
./usr/lib64: (from <cmdline>:0)
Verifying ELF objects in /usr/src/tmp/ppp-buildroot (arch=normal,fhs=normal,lfs=relaxed,lint=relaxed,rpath=normal,stack=normal,textrel=normal,unresolved=normal)
verify-elf: WARNING: ./usr/lib64/pppd/2.4.8/dhcpc.so: undefined symbol: peer_authname
verify-elf: WARNING: ./usr/lib64/pppd/2.4.8/dhcpc.so: undefined symbol: ip_choose_hook
verify-elf: WARNING: ./usr/lib64/pppd/2.4.8/dhcpc.so: undefined symbol: exitnotify
verify-elf: WARNING: ./usr/lib64/pppd/2.4.8/dhcpc.so: undefined symbol: untimeout
verify-elf: WARNING: ./usr/lib64/pppd/2.4.8/dhcpc.so: undefined symbol: add_options
verify-elf: WARNING: ./usr/lib64/pppd/2.4.8/dhcpc.so: undefined symbol: timeout
verify-elf: WARNING: ./usr/lib64/pppd/2.4.8/dhcpc.so: undefined symbol: dbglog
verify-elf: WARNING: ./usr/lib64/pppd/2.4.8/dhcpc.so: undefined symbol: add_notifier
verify-elf: WARNING: ./usr/lib64/pppd/2.4.8/dhcpc.so: undefined symbol: fatal
verify-elf: WARNING: ./usr/lib64/pppd/2.4.8/dhcpc.so: undefined symbol: info
verify-elf: WARNING: ./usr/lib64/pppd/2.4.8/radrealms.so: undefined symbol: radius_pre_auth_hook
verify-elf: WARNING: ./usr/lib64/pppd/2.4.8/radrealms.so: undefined symbol: option_error
verify-elf: WARNING: ./usr/lib64/pppd/2.4.8/radrealms.so: undefined symbol: add_options
verify-elf: WARNING: ./usr/lib64/pppd/2.4.8/radrealms.so: undefined symbol: info
verify-elf: WARNING: ./usr/lib64/pppd/2.4.8/radattr.so: undefined symbol: ifname
verify-elf: WARNING: ./usr/lib64/pppd/2.4.8/radattr.so: undefined symbol: exitnotify
verify-elf: WARNING: ./usr/lib64/pppd/2.4.8/radattr.so: undefined symbol: radius_attributes_hook
verify-elf: WARNING: ./usr/lib64/pppd/2.4.8/radattr.so: undefined symbol: slprintf
verify-elf: WARNING: ./usr/lib64/pppd/2.4.8/radattr.so: undefined symbol: dbglog
verify-elf: WARNING: ./usr/lib64/pppd/2.4.8/radattr.so: undefined symbol: add_notifier
verify-elf: WARNING: ./usr/lib64/pppd/2.4.8/radattr.so: undefined symbol: rc_avpair_tostr
verify-elf: WARNING: ./usr/lib64/pppd/2.4.8/radattr.so: undefined symbol: info
verify-elf: WARNING: ./usr/lib64/pppd/2.4.8/radius.so: undefined symbol: sync_serial
verify-elf: WARNING: ./usr/lib64/pppd/2.4.8/radius.so: undefined symbol: maxconnect
verify-elf: WARNING: ./usr/lib64/pppd/2.4.8/radius.so: undefined symbol: ip_choose_hook
verify-elf: WARNING: ./usr/lib64/pppd/2.4.8/radius.so: undefined symbol: hostname
verify-elf: WARNING: ./usr/lib64/pppd/2.4.8/radius.so: undefined symbol: chap_verify_hook
verify-elf: WARNING: ./usr/lib64/pppd/2.4.8/radius.so: undefined symbol: mppe_send_key
verify-elf: WARNING: ./usr/lib64/pppd/2.4.8/radius.so: undefined symbol: mppe_keys_set
verify-elf: WARNING: ./usr/lib64/pppd/2.4.8/radius.so: undefined symbol: maxoctets
verify-elf: WARNING: ./usr/lib64/pppd/2.4.8/radius.so: undefined symbol: chap_check_hook
verify-elf: WARNING: ./usr/lib64/pppd/2.4.8/radius.so: undefined symbol: ipcp_hisoptions
verify-elf: WARNING: ./usr/lib64/pppd/2.4.8/radius.so: undefined symbol: ip_down_notifier
verify-elf: WARNING: ./usr/lib64/pppd/2.4.8/radius.so: undefined symbol: ipparam
verify-elf: WARNING: ./usr/lib64/pppd/2.4.8/radius.so: undefined symbol: ipcp_allowoptions
verify-elf: WARNING: ./usr/lib64/pppd/2.4.8/radius.so: undefined symbol: ipcp_wantoptions
verify-elf: WARNING: ./usr/lib64/pppd/2.4.8/radius.so: undefined symbol: link_stats_valid
verify-elf: WARNING: ./usr/lib64/pppd/2.4.8/radius.so: undefined symbol: ifname
verify-elf: WARNING: ./usr/lib64/pppd/2.4.8/radius.so: undefined symbol: using_pty
verify-elf: WARNING: ./usr/lib64/pppd/2.4.8/radius.so: undefined symbol: status
verify-elf: WARNING: ./usr/lib64/pppd/2.4.8/radius.so: undefined symbol: allowed_address_hook
verify-elf: WARNING: ./usr/lib64/pppd/2.4.8/radius.so: undefined symbol: maxoctets_dir
verify-elf: WARNING: ./usr/lib64/pppd/2.4.8/radius.so: undefined symbol: ip_up_notifier
verify-elf: WARNING: ./usr/lib64/pppd/2.4.8/radius.so: undefined symbol: devnam
verify-elf: WARNING: ./usr/lib64/pppd/2.4.8/radius.so: undefined symbol: mppe_recv_key
verify-elf: WARNING: ./usr/lib64/pppd/2.4.8/radius.so: undefined symbol: idle_time_limit
verify-elf: WARNING: ./usr/lib64/pppd/2.4.8/radius.so: undefined symbol: link_connect_time
verify-elf: WARNING: ./usr/lib64/pppd/2.4.8/radius.so: undefined symbol: remote_number
verify-elf: WARNING: ./usr/lib64/pppd/2.4.8/radius.so: undefined symbol: pap_auth_hook
verify-elf: WARNING: ./usr/lib64/pppd/2.4.8/radius.so: undefined symbol: link_stats
verify-elf: WARNING: ./usr/lib64/pppd/2.4.8/radius.so: undefined symbol: pap_check_hook
verify-elf: WARNING: ./usr/lib64/pppd/2.4.8/radius.so: undefined symbol: novm
verify-elf: WARNING: ./usr/lib64/pppd/2.4.8/radius.so: undefined symbol: update_link_stats
verify-elf: WARNING: ./usr/lib64/pppd/2.4.8/radius.so: undefined symbol: bad_ip_adrs
verify-elf: WARNING: ./usr/lib64/pppd/2.4.8/radius.so: undefined symbol: mppe_set_keys
verify-elf: WARNING: ./usr/lib64/pppd/2.4.8/radius.so: undefined symbol: script_setenv
verify-elf: WARNING: ./usr/lib64/pppd/2.4.8/radius.so: undefined symbol: magic
verify-elf: WARNING: ./usr/lib64/pppd/2.4.8/radius.so: undefined symbol: set_mppe_enc_types
verify-elf: WARNING: ./usr/lib64/pppd/2.4.8/radius.so: undefined symbol: info
verify-elf: WARNING: ./usr/lib64/pppd/2.4.8/radius.so: undefined symbol: slprintf
verify-elf: WARNING: ./usr/lib64/pppd/2.4.8/radius.so: undefined symbol: untimeout
verify-elf: WARNING: ./usr/lib64/pppd/2.4.8/radius.so: undefined symbol: add_notifier
verify-elf: WARNING: ./usr/lib64/pppd/2.4.8/radius.so: undefined symbol: add_options
verify-elf: WARNING: ./usr/lib64/pppd/2.4.8/radius.so: undefined symbol: fatal
verify-elf: WARNING: ./usr/lib64/pppd/2.4.8/radius.so: undefined symbol: timeout
verify-elf: WARNING: ./usr/lib64/pppd/2.4.8/openl2tp.so: undefined symbol: multilink_join_hook
verify-elf: WARNING: ./usr/lib64/pppd/2.4.8/openl2tp.so: undefined symbol: ifname
verify-elf: WARNING: ./usr/lib64/pppd/2.4.8/openl2tp.so: undefined symbol: ifunit
verify-elf: WARNING: ./usr/lib64/pppd/2.4.8/openl2tp.so: undefined symbol: peer_authname
verify-elf: WARNING: ./usr/lib64/pppd/2.4.8/openl2tp.so: undefined symbol: pppol2tp_ip_updown_hook
verify-elf: WARNING: ./usr/lib64/pppd/2.4.8/openl2tp.so: undefined symbol: pppol2tp_send_accm_hook
verify-elf: WARNING: ./usr/lib64/pppd/2.4.8/openl2tp.so: undefined symbol: dbglog
verify-elf: WARNING: ./usr/lib64/pppd/2.4.8/pppol2tp.so: undefined symbol: ip_up_notifier
verify-elf: WARNING: ./usr/lib64/pppd/2.4.8/pppol2tp.so: undefined symbol: ifname
verify-elf: WARNING: ./usr/lib64/pppd/2.4.8/pppol2tp.so: undefined symbol: ip_down_notifier
verify-elf: WARNING: ./usr/lib64/pppd/2.4.8/pppol2tp.so: undefined symbol: ifunit
verify-elf: WARNING: ./usr/lib64/pppd/2.4.8/pppol2tp.so: undefined symbol: the_channel
verify-elf: WARNING: ./usr/lib64/pppd/2.4.8/pppol2tp.so: undefined symbol: snoop_send_hook
verify-elf: WARNING: ./usr/lib64/pppd/2.4.8/pppol2tp.so: undefined symbol: ipcp_allowoptions
verify-elf: WARNING: ./usr/lib64/pppd/2.4.8/pppol2tp.so: undefined symbol: lcp_allowoptions
verify-elf: WARNING: ./usr/lib64/pppd/2.4.8/pppol2tp.so: undefined symbol: snoop_recv_hook
verify-elf: WARNING: ./usr/lib64/pppd/2.4.8/pppol2tp.so: undefined symbol: ccp_allowoptions
verify-elf: WARNING: ./usr/lib64/pppd/2.4.8/pppol2tp.so: undefined symbol: ccp_wantoptions
verify-elf: WARNING: ./usr/lib64/pppd/2.4.8/pppol2tp.so: undefined symbol: ipcp_wantoptions
verify-elf: WARNING: ./usr/lib64/pppd/2.4.8/pppol2tp.so: undefined symbol: ipv6_up_notifier
verify-elf: WARNING: ./usr/lib64/pppd/2.4.8/pppol2tp.so: undefined symbol: modem
verify-elf: WARNING: ./usr/lib64/pppd/2.4.8/pppol2tp.so: undefined symbol: lcp_wantoptions
verify-elf: WARNING: ./usr/lib64/pppd/2.4.8/pppol2tp.so: undefined symbol: new_style_driver
verify-elf: WARNING: ./usr/lib64/pppd/2.4.8/pppol2tp.so: undefined symbol: ipv6_down_notifier
verify-elf: WARNING: ./usr/lib64/pppd/2.4.8/pppol2tp.so: undefined symbol: generic_establish_ppp
verify-elf: WARNING: ./usr/lib64/pppd/2.4.8/pppol2tp.so: undefined symbol: generic_disestablish_ppp
verify-elf: WARNING: ./usr/lib64/pppd/2.4.8/pppol2tp.so: undefined symbol: int_option
verify-elf: WARNING: ./usr/lib64/pppd/2.4.8/pppol2tp.so: undefined symbol: add_options
verify-elf: WARNING: ./usr/lib64/pppd/2.4.8/pppol2tp.so: undefined symbol: ppp_available
verify-elf: WARNING: ./usr/lib64/pppd/2.4.8/pppol2tp.so: undefined symbol: dbglog
verify-elf: WARNING: ./usr/lib64/pppd/2.4.8/pppol2tp.so: undefined symbol: add_notifier
verify-elf: WARNING: ./usr/lib64/pppd/2.4.8/pppol2tp.so: undefined symbol: novm
verify-elf: WARNING: ./usr/lib64/pppd/2.4.8/pppol2tp.so: undefined symbol: fatal
verify-elf: WARNING: ./usr/lib64/pppd/2.4.8/pppol2tp.so: undefined symbol: netif_set_mtu
verify-elf: WARNING: ./usr/lib64/pppd/2.4.8/pppoatm.so: undefined symbol: the_channel
verify-elf: WARNING: ./usr/lib64/pppd/2.4.8/pppoatm.so: undefined symbol: lcp_allowoptions
verify-elf: WARNING: ./usr/lib64/pppd/2.4.8/pppoatm.so: undefined symbol: devstat
verify-elf: WARNING: ./usr/lib64/pppd/2.4.8/pppoatm.so: undefined symbol: devnam
verify-elf: WARNING: ./usr/lib64/pppd/2.4.8/pppoatm.so: undefined symbol: ppp_devnam
verify-elf: WARNING: ./usr/lib64/pppd/2.4.8/pppoatm.so: undefined symbol: lcp_wantoptions
verify-elf: WARNING: ./usr/lib64/pppd/2.4.8/pppoatm.so: undefined symbol: new_style_driver
verify-elf: WARNING: ./usr/lib64/pppd/2.4.8/pppoatm.so: undefined symbol: generic_establish_ppp
verify-elf: WARNING: ./usr/lib64/pppd/2.4.8/pppoatm.so: undefined symbol: generic_disestablish_ppp
verify-elf: WARNING: ./usr/lib64/pppd/2.4.8/pppoatm.so: undefined symbol: add_options
verify-elf: WARNING: ./usr/lib64/pppd/2.4.8/pppoatm.so: undefined symbol: ppp_available
verify-elf: WARNING: ./usr/lib64/pppd/2.4.8/pppoatm.so: undefined symbol: fatal
verify-elf: WARNING: ./usr/lib64/pppd/2.4.8/pppoatm.so: undefined symbol: info
verify-elf: WARNING: ./usr/lib64/pppd/2.4.8/rp-pppoe.so: undefined symbol: the_channel
verify-elf: WARNING: ./usr/lib64/pppd/2.4.8/rp-pppoe.so: undefined symbol: debug
verify-elf: WARNING: ./usr/lib64/pppd/2.4.8/rp-pppoe.so: undefined symbol: pr_log
verify-elf: WARNING: ./usr/lib64/pppd/2.4.8/rp-pppoe.so: undefined symbol: ipcp_allowoptions
verify-elf: WARNING: ./usr/lib64/pppd/2.4.8/rp-pppoe.so: undefined symbol: ppp_session_number
verify-elf: WARNING: ./usr/lib64/pppd/2.4.8/rp-pppoe.so: undefined symbol: lcp_allowoptions
verify-elf: WARNING: ./usr/lib64/pppd/2.4.8/rp-pppoe.so: undefined symbol: ccp_allowoptions
verify-elf: WARNING: ./usr/lib64/pppd/2.4.8/rp-pppoe.so: undefined symbol: ccp_wantoptions
verify-elf: WARNING: ./usr/lib64/pppd/2.4.8/rp-pppoe.so: undefined symbol: ipcp_wantoptions
verify-elf: WARNING: ./usr/lib64/pppd/2.4.8/rp-pppoe.so: undefined symbol: devnam
verify-elf: WARNING: ./usr/lib64/pppd/2.4.8/rp-pppoe.so: undefined symbol: remote_number
verify-elf: WARNING: ./usr/lib64/pppd/2.4.8/rp-pppoe.so: undefined symbol: ppp_devnam
verify-elf: WARNING: ./usr/lib64/pppd/2.4.8/rp-pppoe.so: undefined symbol: modem
verify-elf: WARNING: ./usr/lib64/pppd/2.4.8/rp-pppoe.so: undefined symbol: lcp_wantoptions
verify-elf: WARNING: ./usr/lib64/pppd/2.4.8/rp-pppoe.so: undefined symbol: new_style_driver
verify-elf: WARNING: ./usr/lib64/pppd/2.4.8/rp-pppoe.so: undefined symbol: generic_establish_ppp
verify-elf: WARNING: ./usr/lib64/pppd/2.4.8/rp-pppoe.so: undefined symbol: generic_disestablish_ppp
verify-elf: WARNING: ./usr/lib64/pppd/2.4.8/rp-pppoe.so: undefined symbol: option_error
verify-elf: WARNING: ./usr/lib64/pppd/2.4.8/rp-pppoe.so: undefined symbol: script_setenv
verify-elf: WARNING: ./usr/lib64/pppd/2.4.8/rp-pppoe.so: undefined symbol: end_pr_log
verify-elf: WARNING: ./usr/lib64/pppd/2.4.8/rp-pppoe.so: undefined symbol: add_options
verify-elf: WARNING: ./usr/lib64/pppd/2.4.8/rp-pppoe.so: undefined symbol: ppp_available
verify-elf: WARNING: ./usr/lib64/pppd/2.4.8/rp-pppoe.so: undefined symbol: dbglog
verify-elf: WARNING: ./usr/lib64/pppd/2.4.8/rp-pppoe.so: undefined symbol: options_from_file
verify-elf: WARNING: ./usr/lib64/pppd/2.4.8/rp-pppoe.so: undefined symbol: init_pr_log
verify-elf: WARNING: ./usr/lib64/pppd/2.4.8/rp-pppoe.so: undefined symbol: novm
verify-elf: WARNING: ./usr/lib64/pppd/2.4.8/rp-pppoe.so: undefined symbol: fatal
verify-elf: WARNING: ./usr/lib64/pppd/2.4.8/rp-pppoe.so: undefined symbol: info
verify-elf: WARNING: ./usr/lib64/pppd/2.4.8/winbind.so: undefined symbol: pap_check_hook
verify-elf: WARNING: ./usr/lib64/pppd/2.4.8/winbind.so: undefined symbol: chap_check_hook
verify-elf: WARNING: ./usr/lib64/pppd/2.4.8/winbind.so: undefined symbol: chap_verify_hook
verify-elf: WARNING: ./usr/lib64/pppd/2.4.8/winbind.so: undefined symbol: allowed_address_hook
verify-elf: WARNING: ./usr/lib64/pppd/2.4.8/winbind.so: undefined symbol: ipcp_wantoptions
verify-elf: WARNING: ./usr/lib64/pppd/2.4.8/winbind.so: undefined symbol: pap_auth_hook
verify-elf: WARNING: ./usr/lib64/pppd/2.4.8/winbind.so: undefined symbol: chap_mdtype_all
verify-elf: WARNING: ./usr/lib64/pppd/2.4.8/winbind.so: undefined symbol: option_error
verify-elf: WARNING: ./usr/lib64/pppd/2.4.8/winbind.so: undefined symbol: slprintf
verify-elf: WARNING: ./usr/lib64/pppd/2.4.8/winbind.so: undefined symbol: add_options
verify-elf: WARNING: ./usr/lib64/pppd/2.4.8/winbind.so: undefined symbol: GenerateAuthenticatorResponse
verify-elf: WARNING: ./usr/lib64/pppd/2.4.8/winbind.so: undefined symbol: mppe_set_keys2
verify-elf: WARNING: ./usr/lib64/pppd/2.4.8/winbind.so: undefined symbol: safe_fork
verify-elf: WARNING: ./usr/lib64/pppd/2.4.8/winbind.so: undefined symbol: mppe_set_keys
verify-elf: WARNING: ./usr/lib64/pppd/2.4.8/winbind.so: undefined symbol: ChallengeHash
verify-elf: WARNING: ./usr/lib64/pppd/2.4.8/winbind.so: undefined symbol: novm
verify-elf: WARNING: ./usr/lib64/pppd/2.4.8/winbind.so: undefined symbol: fatal
verify-elf: WARNING: ./usr/lib64/pppd/2.4.8/winbind.so: undefined symbol: info
verify-elf: WARNING: ./usr/lib64/pppd/2.4.8/winbind.so: undefined symbol: notice
verify-elf: WARNING: ./usr/lib64/pppd/2.4.8/passwordfd.so: undefined symbol: eaptls_passwd_hook
verify-elf: WARNING: ./usr/lib64/pppd/2.4.8/passwordfd.so: undefined symbol: pap_check_hook
verify-elf: WARNING: ./usr/lib64/pppd/2.4.8/passwordfd.so: undefined symbol: chap_check_hook
verify-elf: WARNING: ./usr/lib64/pppd/2.4.8/passwordfd.so: undefined symbol: pap_passwd_hook
verify-elf: WARNING: ./usr/lib64/pppd/2.4.8/passwordfd.so: undefined symbol: chap_passwd_hook
verify-elf: WARNING: ./usr/lib64/pppd/2.4.8/passwordfd.so: undefined symbol: add_options
verify-elf: WARNING: ./usr/lib64/pppd/2.4.8/passprompt.so: undefined symbol: eaptls_passwd_hook
verify-elf: WARNING: ./usr/lib64/pppd/2.4.8/passprompt.so: undefined symbol: pap_passwd_hook
verify-elf: WARNING: ./usr/lib64/pppd/2.4.8/passprompt.so: undefined symbol: status
verify-elf: WARNING: ./usr/lib64/pppd/2.4.8/passprompt.so: undefined symbol: remote_name
verify-elf: WARNING: ./usr/lib64/pppd/2.4.8/passprompt.so: undefined symbol: add_options
verify-elf: WARNING: ./usr/lib64/pppd/2.4.8/passprompt.so: undefined symbol: sys_close
verify-elf: WARNING: ./usr/lib64/pppd/2.4.8/minconn.so: undefined symbol: idle_time_limit
verify-elf: WARNING: ./usr/lib64/pppd/2.4.8/minconn.so: undefined symbol: idle_time_hook
verify-elf: WARNING: ./usr/lib64/pppd/2.4.8/minconn.so: undefined symbol: info
verify-elf: WARNING: ./usr/lib64/pppd/2.4.8/minconn.so: undefined symbol: add_options
Processing files: ppp-2.4.8-alt3
Executing(%doc): /bin/sh -e /usr/src/tmp/rpm-tmp.71209
+ umask 022
+ /bin/mkdir -p /usr/src/RPM/BUILD
+ cd /usr/src/RPM/BUILD
+ cd ppp-2.4.8
+ DOCDIR=/usr/src/tmp/ppp-buildroot/usr/share/doc/ppp-2.4.8
+ export DOCDIR
+ rm -rf /usr/src/tmp/ppp-buildroot/usr/share/doc/ppp-2.4.8
+ /bin/mkdir -p /usr/src/tmp/ppp-buildroot/usr/share/doc/ppp-2.4.8
+ cp -prL PLUGINS SETUP FAQ README README.MPPE README.MSCHAP80 README.MSCHAP81 README.cbcp README.eap-srp README.eap-tls README.linux README.pppoe README.pppol2tp README.pwfd README.sol2 scripts sample /usr/src/tmp/ppp-buildroot/usr/share/doc/ppp-2.4.8
+ chmod -R go-w /usr/src/tmp/ppp-buildroot/usr/share/doc/ppp-2.4.8
+ chmod -R a+rX /usr/src/tmp/ppp-buildroot/usr/share/doc/ppp-2.4.8
+ exit 0
Finding Provides (using /usr/lib/rpm/find-provides)
Executing: /bin/sh -e /usr/src/tmp/rpm-tmp.3E1Hwj
find-provides: running scripts (alternatives,debuginfo,lib,pam,perl,pkgconfig,python,python3,shell)
lib.prov: /usr/src/tmp/ppp-buildroot/usr/lib64/pppd/2.4.8/minconn.so: 2 symbols, 11 bpp
lib.prov: /usr/src/tmp/ppp-buildroot/usr/lib64/pppd/2.4.8/openl2tp.so: 2 symbols, 11 bpp
lib.prov: /usr/src/tmp/ppp-buildroot/usr/lib64/pppd/2.4.8/passprompt.so: 2 symbols, 11 bpp
lib.prov: /usr/src/tmp/ppp-buildroot/usr/lib64/pppd/2.4.8/passwordfd.so: 2 symbols, 11 bpp
lib.prov: /usr/src/tmp/ppp-buildroot/usr/lib64/pppd/2.4.8/pppol2tp.so: 7 symbols, 13 bpp
lib.prov: /usr/src/tmp/ppp-buildroot/usr/lib64/pppd/2.4.8/winbind.so: 5 symbols, 13 bpp
Finding Requires (using /usr/lib/rpm/find-requires)
Executing: /bin/sh -e /usr/src/tmp/rpm-tmp.cOdWtx
find-requires: running scripts (cpp,debuginfo,files,lib,pam,perl,pkgconfig,pkgconfiglib,python,python3,rpmlib,shebang,shell,static,symlinks,systemd-services)
shebang.req.files: executable script /usr/src/tmp/ppp-buildroot/etc/ppp/callback-client is not executable
shebang.req.files: executable script /usr/src/tmp/ppp-buildroot/etc/ppp/callback-server is not executable
find-requires: FINDPACKAGE-COMMANDS: sleep
Finding Requires(pre) (using /usr/lib/rpm/find-scriptlet-requires)
Executing: /bin/sh -e /usr/src/tmp/rpm-tmp.pkGym4
Finding Requires(post) (using /usr/lib/rpm/find-scriptlet-requires)
Executing: /bin/sh -e /usr/src/tmp/rpm-tmp.bu59Dw
Provides: /usr/lib64/pppd/2.4.8/minconn.so()(64bit) = set:ecvwB6, /usr/lib64/pppd/2.4.8/openl2tp.so()(64bit) = set:ecvwB6, /usr/lib64/pppd/2.4.8/passprompt.so()(64bit) = set:ecvwB6, /usr/lib64/pppd/2.4.8/passwordfd.so()(64bit) = set:ecvwB6, /usr/lib64/pppd/2.4.8/pppol2tp.so()(64bit) = set:gdLFRUUjAiRqaCL0, /usr/lib64/pppd/2.4.8/winbind.so()(64bit) = set:gdLi4TeC5GN6, pam0(ppp)
Requires: ppp-common, libssl, kmod >= 14, udev >= 204-alt2, /bin/sh, /etc/control.d/facilities(control_fmode), /etc/control.d/facilities(new_fmode), /etc/control.d/facilities(new_help), /etc/control.d/functions, /etc/logrotate.d, /etc/pam.d, /lib/udev/rules.d, /lib64/ld-linux-x86-64.so.2, coreutils, libc.so.6()(64bit) >= set:poiedc, libc.so.6(ALT_2.24)(64bit), libc.so.6(GLIBC_2.14)(64bit), libc.so.6(GLIBC_2.15)(64bit), libc.so.6(GLIBC_2.2.5)(64bit), libc.so.6(GLIBC_2.3)(64bit), libc.so.6(GLIBC_2.3.4)(64bit), libc.so.6(GLIBC_2.33)(64bit), libc.so.6(GLIBC_2.34)(64bit), libc.so.6(GLIBC_2.4)(64bit), libc.so.6(GLIBC_2.7)(64bit), libcrypt.so.1()(64bit) >= set:ihuTa, libcrypt.so.1(XCRYPT_2.0)(64bit), libcrypto.so.3()(64bit) >= set:qkvV29JtreDN5HlasJkEbPMX922H9lrMsJanBZl5tXFL9j5mFUQy8ZFiUmvvfvsjbSdJxtv8nPTE3LDknPZ6U22um4zkMEzkMCWzFNV9fNCju6wsWa3u9wQwCkmKAWMXhmYUQXP6Nx8TUNNE13AUnq5NVKRbJAxmoxhS5k2ZewdWzgGumy3lo, libcrypto.so.3(OPENSSL_3.0.0)(64bit), libpam(include), libpam.so.0()(64bit) >= set:jfaU0elpOZaI4OMxyIgYI1, libpam.so.0(LIBPAM_1.0)(64bit), libpcap.so.0.8()(64bit) >= set:khO4qzPRREupwgY1, libssl.so.3()(64bit) >= set:nh8lne9Loq6bAYDJNOosZHkd4AZd0gxlNkX8fCp52Bg1hyZpm1dw5FJpqzJkAI3JOHSWaI0HL5Fti4ELvpXd0sLZmaZvT0xh0, libssl.so.3(OPENSSL_3.0.0)(64bit), libsystemd.so.0()(64bit) >= set:nmZGf6, libsystemd.so.0(LIBSYSTEMD_209)(64bit), libudev.so.1()(64bit) >= set:khX6Jf02g5ZgIbNol7, libudev.so.1(LIBUDEV_183)(64bit), pam0(common-login), rtld(GNU_HASH)
Requires(interp): /bin/sh
Requires(rpmlib): rpmlib(SetVersions)
Requires(pre): /bin/sh, /usr/sbin/control-dump
Requires(post): /bin/sh, /usr/sbin/control, /usr/sbin/control-restore
Obsoletes: ppp-cbcp, ppp-mppe, ppp-extra
Finding debuginfo files (using /usr/lib/rpm/find-debuginfo-files)
Executing: /bin/sh -e /usr/src/tmp/rpm-tmp.eH1pJb
Creating ppp-debuginfo package
Processing files: ppp-devel-2.4.8-alt3
Finding Provides (using /usr/lib/rpm/find-provides)
Executing: /bin/sh -e /usr/src/tmp/rpm-tmp.yZu5aA
find-provides: running scripts (alternatives,debuginfo,lib,pam,perl,pkgconfig,python,python3,shell)
Finding Requires (using /usr/lib/rpm/find-requires)
Executing: /bin/sh -e /usr/src/tmp/rpm-tmp.04N7gd
find-requires: running scripts (cpp,debuginfo,files,lib,pam,perl,pkgconfig,pkgconfiglib,python,python3,rpmlib,shebang,shell,static,symlinks,systemd-services)
/usr/src/tmp/ppp-buildroot/usr/include/pppd/eui64.h:42:2: error: #error "this file should only be included when INET6 is defined"
   42 | #error  "this file should only be included when INET6 is defined"
      |  ^~~~~
cpp.req: /usr/src/tmp/ppp-buildroot/usr/include/pppd/eui64.h: cpp failed, trying c++ mode
x86_64-alt-linux-cpp: fatal error: cannot execute 'cc1plus': execvp: No such file or directory
compilation terminated.
cpp.req: WARNING: /usr/src/tmp/ppp-buildroot/usr/include/pppd/eui64.h: cpp failed
/usr/src/tmp/ppp-buildroot/usr/include/pppd/pppcrypt.h:41:10: fatal error: des.h: No such file or directory
   41 | #include <des.h>
      |          ^~~~~~~
compilation terminated.
cpp.req: WARNING: /usr/src/tmp/ppp-buildroot/usr/include/pppd/pppcrypt.h: cpp failed
Requires: ppp = 2.4.8-alt3, libssl-devel
Processing files: ppp-radius-2.4.8-alt3
Finding Provides (using /usr/lib/rpm/find-provides)
Executing: /bin/sh -e /usr/src/tmp/rpm-tmp.5EE7aT
find-provides: running scripts (alternatives,debuginfo,lib,pam,perl,pkgconfig,python,python3,shell)
lib.prov: /usr/src/tmp/ppp-buildroot/usr/lib64/pppd/2.4.8/radattr.so: 2 symbols, 11 bpp
lib.prov: /usr/src/tmp/ppp-buildroot/usr/lib64/pppd/2.4.8/radius.so: 54 symbols, 16 bpp
lib.prov: /usr/src/tmp/ppp-buildroot/usr/lib64/pppd/2.4.8/radrealms.so: 3 symbols, 12 bpp
Finding Requires (using /usr/lib/rpm/find-requires)
Executing: /bin/sh -e /usr/src/tmp/rpm-tmp.5wFQ5F
find-requires: running scripts (cpp,debuginfo,files,lib,pam,perl,pkgconfig,pkgconfiglib,python,python3,rpmlib,shebang,shell,static,symlinks,systemd-services)
Provides: /usr/lib64/pppd/2.4.8/radattr.so()(64bit) = set:ecvwB6, /usr/lib64/pppd/2.4.8/radius.so()(64bit) = set:jdEZ0hTcGQPRu11RZmOT2lCSTBktszQZcXPkvevCzv9B6ZfrVP9WZ42zhVgGOSuOg6uIVCk6bIGQMgmkZj81mGS4ZyhfksoVcFAF6KNEIpuYp2, /usr/lib64/pppd/2.4.8/radrealms.so()(64bit) = set:fdvwBeFq
Requires: ppp = 2.4.8-alt3, libc.so.6()(64bit) >= set:poiedc, libc.so.6(ALT_2.24)(64bit), libc.so.6(GLIBC_2.14)(64bit), libc.so.6(GLIBC_2.15)(64bit), libc.so.6(GLIBC_2.2.5)(64bit), libc.so.6(GLIBC_2.3)(64bit), libc.so.6(GLIBC_2.3.4)(64bit), libc.so.6(GLIBC_2.4)(64bit), libc.so.6(GLIBC_2.7)(64bit), libcrypto.so.3()(64bit) >= set:qoRmGPiyXFOpk0, libcrypto.so.3(OPENSSL_3.0.0)(64bit), rtld(GNU_HASH)
Requires(rpmlib): rpmlib(SetVersions)
Finding debuginfo files (using /usr/lib/rpm/find-debuginfo-files)
Executing: /bin/sh -e /usr/src/tmp/rpm-tmp.upUqLU
Creating ppp-radius-debuginfo package
Processing files: ppp-pppoatm-2.4.8-alt3
Finding Provides (using /usr/lib/rpm/find-provides)
Executing: /bin/sh -e /usr/src/tmp/rpm-tmp.csNYiL
find-provides: running scripts (alternatives,debuginfo,lib,pam,perl,pkgconfig,python,python3,shell)
lib.prov: /usr/src/tmp/ppp-buildroot/usr/lib64/pppd/2.4.8/pppoatm.so: 11 symbols, 14 bpp
Finding Requires (using /usr/lib/rpm/find-requires)
Executing: /bin/sh -e /usr/src/tmp/rpm-tmp.YEN0VD
find-requires: running scripts (cpp,debuginfo,files,lib,pam,perl,pkgconfig,pkgconfiglib,python,python3,rpmlib,shebang,shell,static,symlinks,systemd-services)
Provides: /usr/lib64/pppd/2.4.8/pppoatm.so()(64bit) = set:hdnWBliaZJVhPzQ8szZ285di1
Requires: ppp = 2.4.8-alt3, libc.so.6(ALT_2.24)(64bit), libc.so.6(GLIBC_2.14)(64bit), libc.so.6(GLIBC_2.2.5)(64bit), libc.so.6(GLIBC_2.3)(64bit), libc.so.6(GLIBC_2.34)(64bit), libc.so.6(GLIBC_2.4)(64bit), libc.so.6(GLIBC_2.7)(64bit), rtld(GNU_HASH)
Finding debuginfo files (using /usr/lib/rpm/find-debuginfo-files)
Executing: /bin/sh -e /usr/src/tmp/rpm-tmp.d82XKu
Creating ppp-pppoatm-debuginfo package
Processing files: ppp-pppoe-2.4.8-alt3
Finding Provides (using /usr/lib/rpm/find-provides)
Executing: /bin/sh -e /usr/src/tmp/rpm-tmp.MJZyi8
find-provides: running scripts (alternatives,debuginfo,lib,pam,perl,pkgconfig,python,python3,shell)
lib.prov: /usr/src/tmp/ppp-buildroot/usr/lib64/pppd/2.4.8/rp-pppoe.so: 19 symbols, 15 bpp
Finding Requires (using /usr/lib/rpm/find-requires)
Executing: /bin/sh -e /usr/src/tmp/rpm-tmp.e4WMGY
find-requires: running scripts (cpp,debuginfo,files,lib,pam,perl,pkgconfig,pkgconfiglib,python,python3,rpmlib,shebang,shell,static,symlinks,systemd-services)
Provides: /usr/lib64/pppd/2.4.8/rp-pppoe.so()(64bit) = set:idsHZJQIK09eSoyBLUucKy92rv0HwqaVQZfaKOz9f
Requires: ppp = 2.4.8-alt3, libc.so.6(ALT_2.24)(64bit), libc.so.6(GLIBC_2.14)(64bit), libc.so.6(GLIBC_2.15)(64bit), libc.so.6(GLIBC_2.2.5)(64bit), libc.so.6(GLIBC_2.3)(64bit), libc.so.6(GLIBC_2.3.4)(64bit), libc.so.6(GLIBC_2.4)(64bit), libc.so.6(GLIBC_2.7)(64bit), libudev.so.1()(64bit) >= set:khX6Jf02g5ZgIbNol7, libudev.so.1(LIBUDEV_183)(64bit), rtld(GNU_HASH)
Requires(rpmlib): rpmlib(SetVersions)
Finding debuginfo files (using /usr/lib/rpm/find-debuginfo-files)
Executing: /bin/sh -e /usr/src/tmp/rpm-tmp.cJkMce
Creating ppp-pppoe-debuginfo package
Processing files: ppp-dhcp-2.4.8-alt3
Executing(%doc): /bin/sh -e /usr/src/tmp/rpm-tmp.80692
+ umask 022
+ /bin/mkdir -p /usr/src/RPM/BUILD
+ cd /usr/src/RPM/BUILD
+ cd ppp-2.4.8
+ DOCDIR=/usr/src/tmp/ppp-buildroot/usr/share/doc/ppp-dhcp-2.4.8
+ export DOCDIR
+ rm -rf /usr/src/tmp/ppp-buildroot/usr/share/doc/ppp-dhcp-2.4.8
+ /bin/mkdir -p /usr/src/tmp/ppp-buildroot/usr/share/doc/ppp-dhcp-2.4.8
+ cp -prL pppd/plugins/dhcp/README /usr/src/tmp/ppp-buildroot/usr/share/doc/ppp-dhcp-2.4.8
+ chmod -R go-w /usr/src/tmp/ppp-buildroot/usr/share/doc/ppp-dhcp-2.4.8
+ chmod -R a+rX /usr/src/tmp/ppp-buildroot/usr/share/doc/ppp-dhcp-2.4.8
+ cp -prL pppd/plugins/dhcp/AUTHORS /usr/src/tmp/ppp-buildroot/usr/share/doc/ppp-dhcp-2.4.8
+ chmod -R go-w /usr/src/tmp/ppp-buildroot/usr/share/doc/ppp-dhcp-2.4.8
+ chmod -R a+rX /usr/src/tmp/ppp-buildroot/usr/share/doc/ppp-dhcp-2.4.8
+ cp -prL pppd/plugins/dhcp/COPYING /usr/src/tmp/ppp-buildroot/usr/share/doc/ppp-dhcp-2.4.8
+ chmod -R go-w /usr/src/tmp/ppp-buildroot/usr/share/doc/ppp-dhcp-2.4.8
+ chmod -R a+rX /usr/src/tmp/ppp-buildroot/usr/share/doc/ppp-dhcp-2.4.8
+ exit 0
Finding Provides (using /usr/lib/rpm/find-provides)
Executing: /bin/sh -e /usr/src/tmp/rpm-tmp.1aynbn
find-provides: running scripts (alternatives,debuginfo,lib,pam,perl,pkgconfig,python,python3,shell)
lib.prov: /usr/src/tmp/ppp-buildroot/usr/lib64/pppd/2.4.8/dhcpc.so: 37 symbols, 16 bpp
Finding Requires (using /usr/lib/rpm/find-requires)
Executing: /bin/sh -e /usr/src/tmp/rpm-tmp.q7wKh4
find-requires: running scripts (cpp,debuginfo,files,lib,pam,perl,pkgconfig,pkgconfiglib,python,python3,rpmlib,shebang,shell,static,symlinks,systemd-services)
Provides: /usr/lib64/pppd/2.4.8/dhcpc.so()(64bit) = set:jdRhg2HGhYaI9TK34mgtn7m8N85C4k0miH5GGQfP3D2iOvKSdFKg91mnCYoXWucK0UE8TnWIkppTU0
Requires: ppp = 2.4.8-alt3, libc.so.6(GLIBC_2.15)(64bit), libc.so.6(GLIBC_2.2.5)(64bit), libc.so.6(GLIBC_2.3.4)(64bit), libc.so.6(GLIBC_2.4)(64bit), rtld(GNU_HASH)
Finding debuginfo files (using /usr/lib/rpm/find-debuginfo-files)
Executing: /bin/sh -e /usr/src/tmp/rpm-tmp.P7NicB
Creating ppp-dhcp-debuginfo package
Processing files: ppp-debuginfo-2.4.8-alt3
Finding Provides (using /usr/lib/rpm/find-provides)
Executing: /bin/sh -e /usr/src/tmp/rpm-tmp.hkIaTq
find-provides: running scripts (debuginfo)
Finding Requires (using /usr/lib/rpm/find-requires)
Executing: /bin/sh -e /usr/src/tmp/rpm-tmp.KB8mB0
find-requires: running scripts (debuginfo)
Requires: ppp = 2.4.8-alt3, /usr/lib/debug/lib64/ld-linux-x86-64.so.2.debug, debug64(libc.so.6), debug64(libcrypt.so.1), debug64(libcrypto.so.3), debug64(libpam.so.0), debug64(libpcap.so.0.8), debug64(libssl.so.3), debug64(libsystemd.so.0), debug64(libudev.so.1)
Processing files: ppp-radius-debuginfo-2.4.8-alt3
Finding Provides (using /usr/lib/rpm/find-provides)
Executing: /bin/sh -e /usr/src/tmp/rpm-tmp.l1ZE72
find-provides: running scripts (debuginfo)
Finding Requires (using /usr/lib/rpm/find-requires)
Executing: /bin/sh -e /usr/src/tmp/rpm-tmp.pDoKLJ
find-requires: running scripts (debuginfo)
Requires: ppp-radius = 2.4.8-alt3, debug64(libc.so.6), debug64(libcrypto.so.3)
Processing files: ppp-pppoatm-debuginfo-2.4.8-alt3
Finding Provides (using /usr/lib/rpm/find-provides)
Executing: /bin/sh -e /usr/src/tmp/rpm-tmp.xqhZtG
find-provides: running scripts (debuginfo)
Finding Requires (using /usr/lib/rpm/find-requires)
Executing: /bin/sh -e /usr/src/tmp/rpm-tmp.3fgPSh
find-requires: running scripts (debuginfo)
Requires: ppp-pppoatm = 2.4.8-alt3, debug64(libc.so.6)
Processing files: ppp-pppoe-debuginfo-2.4.8-alt3
Finding Provides (using /usr/lib/rpm/find-provides)
Executing: /bin/sh -e /usr/src/tmp/rpm-tmp.ne9t9c
find-provides: running scripts (debuginfo)
Finding Requires (using /usr/lib/rpm/find-requires)
Executing: /bin/sh -e /usr/src/tmp/rpm-tmp.qbeIIb
find-requires: running scripts (debuginfo)
Requires: ppp-pppoe = 2.4.8-alt3, debug64(libc.so.6), debug64(libudev.so.1)
Processing files: ppp-dhcp-debuginfo-2.4.8-alt3
Finding Provides (using /usr/lib/rpm/find-provides)
Executing: /bin/sh -e /usr/src/tmp/rpm-tmp.jfMmmt
find-provides: running scripts (debuginfo)
Finding Requires (using /usr/lib/rpm/find-requires)
Executing: /bin/sh -e /usr/src/tmp/rpm-tmp.RRkKzA
find-requires: running scripts (debuginfo)
Requires: ppp-dhcp = 2.4.8-alt3, debug64(libc.so.6)
Adding to ppp-devel a strict dependency on ppp
Adding to ppp-radius a strict dependency on ppp
Adding to ppp-pppoatm a strict dependency on ppp
Adding to ppp-pppoe a strict dependency on ppp
Adding to ppp-dhcp a strict dependency on ppp
Adding to ppp-debuginfo a strict dependency on ppp
Adding to ppp-radius-debuginfo a strict dependency on ppp-radius
Adding to ppp-pppoatm-debuginfo a strict dependency on ppp-pppoatm
Adding to ppp-pppoe-debuginfo a strict dependency on ppp-pppoe
Adding to ppp-dhcp-debuginfo a strict dependency on ppp-dhcp
Adding to ppp-radius-debuginfo a strict dependency on ppp-debuginfo
Removing from ppp-radius-debuginfo 5 sources provided by ppp-debuginfo
Adding to ppp-pppoatm-debuginfo a strict dependency on ppp-debuginfo
Removing from ppp-pppoatm-debuginfo 2 sources provided by ppp-debuginfo
Adding to ppp-pppoe-debuginfo a strict dependency on ppp-debuginfo
Removing from ppp-pppoe-debuginfo 4 sources provided by ppp-debuginfo
Adding to ppp-dhcp-debuginfo a strict dependency on ppp-debuginfo
Removing from ppp-dhcp-debuginfo 1 sources provided by ppp-debuginfo
Removing 13 extra deps from ppp-radius due to repentancy on ppp
Removing 8 extra deps from ppp-pppoatm due to repentancy on ppp
Removing 12 extra deps from ppp-pppoe due to repentancy on ppp
Removing 5 extra deps from ppp-dhcp due to repentancy on ppp
Removing 2 extra deps from ppp-radius-debuginfo due to repentancy on ppp-debuginfo
Removing 1 extra deps from ppp-pppoatm-debuginfo due to repentancy on ppp-debuginfo
Removing 2 extra deps from ppp-pppoe-debuginfo due to repentancy on ppp-debuginfo
Removing 1 extra deps from ppp-dhcp-debuginfo due to repentancy on ppp-debuginfo
Wrote: /usr/src/RPM/RPMS/x86_64/ppp-2.4.8-alt3.x86_64.rpm (w2.lzdio)
Wrote: /usr/src/RPM/RPMS/noarch/ppp-devel-2.4.8-alt3.noarch.rpm (w2.lzdio)
Wrote: /usr/src/RPM/RPMS/x86_64/ppp-radius-2.4.8-alt3.x86_64.rpm (w2.lzdio)
Wrote: /usr/src/RPM/RPMS/x86_64/ppp-pppoatm-2.4.8-alt3.x86_64.rpm (w2.lzdio)
Wrote: /usr/src/RPM/RPMS/x86_64/ppp-pppoe-2.4.8-alt3.x86_64.rpm (w2.lzdio)
Wrote: /usr/src/RPM/RPMS/x86_64/ppp-dhcp-2.4.8-alt3.x86_64.rpm (w2.lzdio)
Wrote: /usr/src/RPM/RPMS/x86_64/ppp-debuginfo-2.4.8-alt3.x86_64.rpm (w2.lzdio)
Wrote: /usr/src/RPM/RPMS/x86_64/ppp-radius-debuginfo-2.4.8-alt3.x86_64.rpm (w2.lzdio)
Wrote: /usr/src/RPM/RPMS/x86_64/ppp-pppoatm-debuginfo-2.4.8-alt3.x86_64.rpm (w2.lzdio)
Wrote: /usr/src/RPM/RPMS/x86_64/ppp-pppoe-debuginfo-2.4.8-alt3.x86_64.rpm (w2.lzdio)
Wrote: /usr/src/RPM/RPMS/x86_64/ppp-dhcp-debuginfo-2.4.8-alt3.x86_64.rpm (w2.lzdio)
13.88user 12.24system 0:38.33elapsed 68%CPU (0avgtext+0avgdata 70868maxresident)k
0inputs+0outputs (0major+2165391minor)pagefaults 0swaps
/.out/ppp-devel-2.4.8-alt3.noarch.rpm: license not found in '/usr/share/license' directory: distributable
/.out/ppp-2.4.8-alt3.x86_64.rpm: license not found in '/usr/share/license' directory: distributable
/.out/ppp-radius-2.4.8-alt3.x86_64.rpm: license not found in '/usr/share/license' directory: distributable
/.out/ppp-pppoatm-2.4.8-alt3.x86_64.rpm: license not found in '/usr/share/license' directory: distributable
/.out/ppp-pppoe-2.4.8-alt3.x86_64.rpm: license not found in '/usr/share/license' directory: distributable
/.out/ppp-dhcp-2.4.8-alt3.x86_64.rpm: license not found in '/usr/share/license' directory: distributable
/.out/ppp-debuginfo-2.4.8-alt3.x86_64.rpm: license not found in '/usr/share/license' directory: distributable
/.out/ppp-radius-debuginfo-2.4.8-alt3.x86_64.rpm: license not found in '/usr/share/license' directory: distributable
/.out/ppp-pppoatm-debuginfo-2.4.8-alt3.x86_64.rpm: license not found in '/usr/share/license' directory: distributable
/.out/ppp-pppoe-debuginfo-2.4.8-alt3.x86_64.rpm: license not found in '/usr/share/license' directory: distributable
/.out/ppp-dhcp-debuginfo-2.4.8-alt3.x86_64.rpm: license not found in '/usr/share/license' directory: distributable
3.00user 1.68system 0:46.85elapsed 10%CPU (0avgtext+0avgdata 126208maxresident)k
88inputs+0outputs (0major+217786minor)pagefaults 0swaps
--- ppp-2.4.8-alt3.x86_64.rpm.repo	2023-07-29 23:34:45.000000000 +0000
+++ ppp-2.4.8-alt3.x86_64.rpm.hasher	2023-08-06 06:17:16.684883315 +0000
@@ -170,12 +170,12 @@
 File: /usr/lib64/pppd/2.4.8	40755	root:root		
-File: /usr/lib64/pppd/2.4.8/minconn.so	100644	root:root	13210da901d7b5c154a728347739298c	
-File: /usr/lib64/pppd/2.4.8/openl2tp.so	100644	root:root	eb7a2ab970286890de1159b2f6d4cb41	
-File: /usr/lib64/pppd/2.4.8/passprompt.so	100644	root:root	49a36ff3fe808b4160c9afaf10568c7c	
-File: /usr/lib64/pppd/2.4.8/passwordfd.so	100644	root:root	fddb9df090ea72366c9faef23ec76093	
-File: /usr/lib64/pppd/2.4.8/pppol2tp.so	100644	root:root	b24c0b6ac9a2b16b6d33d2f09d3aef1f	
-File: /usr/lib64/pppd/2.4.8/winbind.so	100644	root:root	db88220f79f0f7fadd2a0999ffedbd55	
-File: /usr/sbin/chat	100711	root:root	e6abf4451998d35cc4b884ce19c0f2e4	
-File: /usr/sbin/pppd	100711	root:root	4ddb47987ba965578e248808ddd6bc02	
-File: /usr/sbin/pppdump	100711	root:root	c14412da72a82354834c356204b2e06e	
-File: /usr/sbin/pppstats	100711	root:root	924518784c66ff746165b08662f1090b	
+File: /usr/lib64/pppd/2.4.8/minconn.so	100644	root:root	3f6a8cebfa6e94bec2d813d9a56432bf	
+File: /usr/lib64/pppd/2.4.8/openl2tp.so	100644	root:root	db6f4d68ca3d1caf51a82298221927d1	
+File: /usr/lib64/pppd/2.4.8/passprompt.so	100644	root:root	7b561f5281e6d2c28045c3e9f725c1ea	
+File: /usr/lib64/pppd/2.4.8/passwordfd.so	100644	root:root	caa3de963ed3cafcd25071deac0b668f	
+File: /usr/lib64/pppd/2.4.8/pppol2tp.so	100644	root:root	9bf182fc4a2cdd6b57e499ec08b7362e	
+File: /usr/lib64/pppd/2.4.8/winbind.so	100644	root:root	df3ade49cdcb22bcc2c5f04eaa588d5c	
+File: /usr/sbin/chat	100711	root:root	8c0a276d5a5fc9fe67120174a1501df5	
+File: /usr/sbin/pppd	100711	root:root	9de3b614ededab043f61a3ed1ce51e14	
+File: /usr/sbin/pppdump	100711	root:root	9aeaf9cd020039c5282aaa0e76139ec9	
+File: /usr/sbin/pppstats	100711	root:root	49ff72f7ce7c0926ea3129fb6d3a09c5	
 File: /usr/share/doc/ppp-2.4.8	40755	root:root		
@@ -242,2 +242,2 @@
 File: /var/run/ppp/resolv.conf	100644	root:root		
-RPMIdentity: 4aae05d156ab9c9a6ba7324431343a9449a2d147b1c1e47543534d38250805b4b74653d9bf1b947f888c48dd4fa832fb58632907ee2d92ead667ce0ce1f82170
+RPMIdentity: 5096f3b56febebd20318e70d134880cad38153699915afd5fd4cea88f36eafd64f8b87a28878b7edb9d0366b8626bbfd8d20235b585e662598d195d0650acc6c
--- ppp-debuginfo-2.4.8-alt3.x86_64.rpm.repo	2023-07-29 23:34:44.000000000 +0000
+++ ppp-debuginfo-2.4.8-alt3.x86_64.rpm.hasher	2023-08-06 06:17:16.768885019 +0000
@@ -1,30 +1,30 @@
-/usr/lib/debug/.build-id/28	40755	root:root	
-/usr/lib/debug/.build-id/28/56bb7233e6832f116e3c09bf1564774388b1cb	120777	root:root	../../../../lib64/pppd/2.4.8/pppol2tp.so
-/usr/lib/debug/.build-id/28/56bb7233e6832f116e3c09bf1564774388b1cb.debug	120777	root:root	../../usr/lib64/pppd/2.4.8/pppol2tp.so.debug
-/usr/lib/debug/.build-id/2c	40755	root:root	
-/usr/lib/debug/.build-id/2c/5682d0ccc40f137c39b3ea069e1c10fef67140	120777	root:root	../../../../lib64/pppd/2.4.8/minconn.so
-/usr/lib/debug/.build-id/2c/5682d0ccc40f137c39b3ea069e1c10fef67140.debug	120777	root:root	../../usr/lib64/pppd/2.4.8/minconn.so.debug
-/usr/lib/debug/.build-id/36	40755	root:root	
-/usr/lib/debug/.build-id/36/42a2bff7865081a8a98db6e1e5c78fed515fb2	120777	root:root	../../../../lib64/pppd/2.4.8/winbind.so
-/usr/lib/debug/.build-id/36/42a2bff7865081a8a98db6e1e5c78fed515fb2.debug	120777	root:root	../../usr/lib64/pppd/2.4.8/winbind.so.debug
-/usr/lib/debug/.build-id/46	40755	root:root	
-/usr/lib/debug/.build-id/46/bc4f3b2a6e53d489954bbd801a55e11b7b086b	120777	root:root	../../../../sbin/chat
-/usr/lib/debug/.build-id/46/bc4f3b2a6e53d489954bbd801a55e11b7b086b.debug	120777	root:root	../../usr/sbin/chat.debug
-/usr/lib/debug/.build-id/46/d03f792c74396e07b4294cea1702d1f753b675	120777	root:root	../../../../sbin/pppdump
-/usr/lib/debug/.build-id/46/d03f792c74396e07b4294cea1702d1f753b675.debug	120777	root:root	../../usr/sbin/pppdump.debug
-/usr/lib/debug/.build-id/68	40755	root:root	
-/usr/lib/debug/.build-id/68/4dc073a6651f75e361957a5e36fe05fec72a75	120777	root:root	../../../../sbin/pppd
-/usr/lib/debug/.build-id/68/4dc073a6651f75e361957a5e36fe05fec72a75.debug	120777	root:root	../../usr/sbin/pppd.debug
-/usr/lib/debug/.build-id/70	40755	root:root	
-/usr/lib/debug/.build-id/70/cb08e99342d2fc9d157a6952d01d900fe61355	120777	root:root	../../../../lib64/pppd/2.4.8/passprompt.so
-/usr/lib/debug/.build-id/70/cb08e99342d2fc9d157a6952d01d900fe61355.debug	120777	root:root	../../usr/lib64/pppd/2.4.8/passprompt.so.debug
-/usr/lib/debug/.build-id/98	40755	root:root	
-/usr/lib/debug/.build-id/98/22c1075c78ba6be3754e89e9abdf398fdddaa0	120777	root:root	../../../../sbin/pppstats
-/usr/lib/debug/.build-id/98/22c1075c78ba6be3754e89e9abdf398fdddaa0.debug	120777	root:root	../../usr/sbin/pppstats.debug
-/usr/lib/debug/.build-id/d2	40755	root:root	
-/usr/lib/debug/.build-id/d2/3c622d21d53af67140b24a9bf68fa2b3574b38	120777	root:root	../../../../lib64/pppd/2.4.8/openl2tp.so
-/usr/lib/debug/.build-id/d2/3c622d21d53af67140b24a9bf68fa2b3574b38.debug	120777	root:root	../../usr/lib64/pppd/2.4.8/openl2tp.so.debug
-/usr/lib/debug/.build-id/e9	40755	root:root	
-/usr/lib/debug/.build-id/e9/faf548ba91d41ddf9738366108c60325159535	120777	root:root	../../../../lib64/pppd/2.4.8/passwordfd.so
-/usr/lib/debug/.build-id/e9/faf548ba91d41ddf9738366108c60325159535.debug	120777	root:root	../../usr/lib64/pppd/2.4.8/passwordfd.so.debug
+/usr/lib/debug/.build-id/21	40755	root:root	
+/usr/lib/debug/.build-id/21/8c1a45a23c66e006cb05cd767f83c1b32d17e6	120777	root:root	../../../../sbin/chat
+/usr/lib/debug/.build-id/21/8c1a45a23c66e006cb05cd767f83c1b32d17e6.debug	120777	root:root	../../usr/sbin/chat.debug
+/usr/lib/debug/.build-id/2e	40755	root:root	
+/usr/lib/debug/.build-id/2e/f543400ee90cb1eae9b86c8fc663d99b347613	120777	root:root	../../../../lib64/pppd/2.4.8/openl2tp.so
+/usr/lib/debug/.build-id/2e/f543400ee90cb1eae9b86c8fc663d99b347613.debug	120777	root:root	../../usr/lib64/pppd/2.4.8/openl2tp.so.debug
+/usr/lib/debug/.build-id/39	40755	root:root	
+/usr/lib/debug/.build-id/39/34327a6d7e98ed7ec5528b53a49f3bb338d942	120777	root:root	../../../../lib64/pppd/2.4.8/winbind.so
+/usr/lib/debug/.build-id/39/34327a6d7e98ed7ec5528b53a49f3bb338d942.debug	120777	root:root	../../usr/lib64/pppd/2.4.8/winbind.so.debug
+/usr/lib/debug/.build-id/4a	40755	root:root	
+/usr/lib/debug/.build-id/4a/cb496748f571239a7562f2a9f4f5f09eab504c	120777	root:root	../../../../sbin/pppd
+/usr/lib/debug/.build-id/4a/cb496748f571239a7562f2a9f4f5f09eab504c.debug	120777	root:root	../../usr/sbin/pppd.debug
+/usr/lib/debug/.build-id/7a	40755	root:root	
+/usr/lib/debug/.build-id/7a/fec795d28e285a130e2b680c94000eb9968e17	120777	root:root	../../../../lib64/pppd/2.4.8/pppol2tp.so
+/usr/lib/debug/.build-id/7a/fec795d28e285a130e2b680c94000eb9968e17.debug	120777	root:root	../../usr/lib64/pppd/2.4.8/pppol2tp.so.debug
+/usr/lib/debug/.build-id/aa	40755	root:root	
+/usr/lib/debug/.build-id/aa/da1fe0547f6f2c48248b7a85c26f24c55daae7	120777	root:root	../../../../sbin/pppdump
+/usr/lib/debug/.build-id/aa/da1fe0547f6f2c48248b7a85c26f24c55daae7.debug	120777	root:root	../../usr/sbin/pppdump.debug
+/usr/lib/debug/.build-id/b0	40755	root:root	
+/usr/lib/debug/.build-id/b0/e172e97490c2294f0e8dc56e988622a61c6d69	120777	root:root	../../../../lib64/pppd/2.4.8/passprompt.so
+/usr/lib/debug/.build-id/b0/e172e97490c2294f0e8dc56e988622a61c6d69.debug	120777	root:root	../../usr/lib64/pppd/2.4.8/passprompt.so.debug
+/usr/lib/debug/.build-id/cd	40755	root:root	
+/usr/lib/debug/.build-id/cd/6682094c9f2eb86c4980f04c211948b441aa58	120777	root:root	../../../../lib64/pppd/2.4.8/passwordfd.so
+/usr/lib/debug/.build-id/cd/6682094c9f2eb86c4980f04c211948b441aa58.debug	120777	root:root	../../usr/lib64/pppd/2.4.8/passwordfd.so.debug
+/usr/lib/debug/.build-id/e6	40755	root:root	
+/usr/lib/debug/.build-id/e6/2bbf2b4e4ef19c3877ac00b46a2451eb391184	120777	root:root	../../../../lib64/pppd/2.4.8/minconn.so
+/usr/lib/debug/.build-id/e6/2bbf2b4e4ef19c3877ac00b46a2451eb391184.debug	120777	root:root	../../usr/lib64/pppd/2.4.8/minconn.so.debug
+/usr/lib/debug/.build-id/e6/e5ba2b40c9c5ca0b22ade407e5c1472c7a9f3e	120777	root:root	../../../../sbin/pppstats
+/usr/lib/debug/.build-id/e6/e5ba2b40c9c5ca0b22ade407e5c1472c7a9f3e.debug	120777	root:root	../../usr/sbin/pppstats.debug
 /usr/lib/debug/usr/lib64/pppd	40755	root:root	
@@ -123,43 +123,43 @@
 Provides: ppp-debuginfo = 2.4.8-alt3:sisyphus+326048.1700.1.1
-File: /usr/lib/debug/.build-id/28	40755	root:root		
-File: /usr/lib/debug/.build-id/28/56bb7233e6832f116e3c09bf1564774388b1cb	120777	root:root		../../../../lib64/pppd/2.4.8/pppol2tp.so
-File: /usr/lib/debug/.build-id/28/56bb7233e6832f116e3c09bf1564774388b1cb.debug	120777	root:root		../../usr/lib64/pppd/2.4.8/pppol2tp.so.debug
-File: /usr/lib/debug/.build-id/2c	40755	root:root		
-File: /usr/lib/debug/.build-id/2c/5682d0ccc40f137c39b3ea069e1c10fef67140	120777	root:root		../../../../lib64/pppd/2.4.8/minconn.so
-File: /usr/lib/debug/.build-id/2c/5682d0ccc40f137c39b3ea069e1c10fef67140.debug	120777	root:root		../../usr/lib64/pppd/2.4.8/minconn.so.debug
-File: /usr/lib/debug/.build-id/36	40755	root:root		
-File: /usr/lib/debug/.build-id/36/42a2bff7865081a8a98db6e1e5c78fed515fb2	120777	root:root		../../../../lib64/pppd/2.4.8/winbind.so
-File: /usr/lib/debug/.build-id/36/42a2bff7865081a8a98db6e1e5c78fed515fb2.debug	120777	root:root		../../usr/lib64/pppd/2.4.8/winbind.so.debug
-File: /usr/lib/debug/.build-id/46	40755	root:root		
-File: /usr/lib/debug/.build-id/46/bc4f3b2a6e53d489954bbd801a55e11b7b086b	120777	root:root		../../../../sbin/chat
-File: /usr/lib/debug/.build-id/46/bc4f3b2a6e53d489954bbd801a55e11b7b086b.debug	120777	root:root		../../usr/sbin/chat.debug
-File: /usr/lib/debug/.build-id/46/d03f792c74396e07b4294cea1702d1f753b675	120777	root:root		../../../../sbin/pppdump
-File: /usr/lib/debug/.build-id/46/d03f792c74396e07b4294cea1702d1f753b675.debug	120777	root:root		../../usr/sbin/pppdump.debug
-File: /usr/lib/debug/.build-id/68	40755	root:root		
-File: /usr/lib/debug/.build-id/68/4dc073a6651f75e361957a5e36fe05fec72a75	120777	root:root		../../../../sbin/pppd
-File: /usr/lib/debug/.build-id/68/4dc073a6651f75e361957a5e36fe05fec72a75.debug	120777	root:root		../../usr/sbin/pppd.debug
-File: /usr/lib/debug/.build-id/70	40755	root:root		
-File: /usr/lib/debug/.build-id/70/cb08e99342d2fc9d157a6952d01d900fe61355	120777	root:root		../../../../lib64/pppd/2.4.8/passprompt.so
-File: /usr/lib/debug/.build-id/70/cb08e99342d2fc9d157a6952d01d900fe61355.debug	120777	root:root		../../usr/lib64/pppd/2.4.8/passprompt.so.debug
-File: /usr/lib/debug/.build-id/98	40755	root:root		
-File: /usr/lib/debug/.build-id/98/22c1075c78ba6be3754e89e9abdf398fdddaa0	120777	root:root		../../../../sbin/pppstats
-File: /usr/lib/debug/.build-id/98/22c1075c78ba6be3754e89e9abdf398fdddaa0.debug	120777	root:root		../../usr/sbin/pppstats.debug
-File: /usr/lib/debug/.build-id/d2	40755	root:root		
-File: /usr/lib/debug/.build-id/d2/3c622d21d53af67140b24a9bf68fa2b3574b38	120777	root:root		../../../../lib64/pppd/2.4.8/openl2tp.so
-File: /usr/lib/debug/.build-id/d2/3c622d21d53af67140b24a9bf68fa2b3574b38.debug	120777	root:root		../../usr/lib64/pppd/2.4.8/openl2tp.so.debug
-File: /usr/lib/debug/.build-id/e9	40755	root:root		
-File: /usr/lib/debug/.build-id/e9/faf548ba91d41ddf9738366108c60325159535	120777	root:root		../../../../lib64/pppd/2.4.8/passwordfd.so
-File: /usr/lib/debug/.build-id/e9/faf548ba91d41ddf9738366108c60325159535.debug	120777	root:root		../../usr/lib64/pppd/2.4.8/passwordfd.so.debug
+File: /usr/lib/debug/.build-id/21	40755	root:root		
+File: /usr/lib/debug/.build-id/21/8c1a45a23c66e006cb05cd767f83c1b32d17e6	120777	root:root		../../../../sbin/chat
+File: /usr/lib/debug/.build-id/21/8c1a45a23c66e006cb05cd767f83c1b32d17e6.debug	120777	root:root		../../usr/sbin/chat.debug
+File: /usr/lib/debug/.build-id/2e	40755	root:root		
+File: /usr/lib/debug/.build-id/2e/f543400ee90cb1eae9b86c8fc663d99b347613	120777	root:root		../../../../lib64/pppd/2.4.8/openl2tp.so
+File: /usr/lib/debug/.build-id/2e/f543400ee90cb1eae9b86c8fc663d99b347613.debug	120777	root:root		../../usr/lib64/pppd/2.4.8/openl2tp.so.debug
+File: /usr/lib/debug/.build-id/39	40755	root:root		
+File: /usr/lib/debug/.build-id/39/34327a6d7e98ed7ec5528b53a49f3bb338d942	120777	root:root		../../../../lib64/pppd/2.4.8/winbind.so
+File: /usr/lib/debug/.build-id/39/34327a6d7e98ed7ec5528b53a49f3bb338d942.debug	120777	root:root		../../usr/lib64/pppd/2.4.8/winbind.so.debug
+File: /usr/lib/debug/.build-id/4a	40755	root:root		
+File: /usr/lib/debug/.build-id/4a/cb496748f571239a7562f2a9f4f5f09eab504c	120777	root:root		../../../../sbin/pppd
+File: /usr/lib/debug/.build-id/4a/cb496748f571239a7562f2a9f4f5f09eab504c.debug	120777	root:root		../../usr/sbin/pppd.debug
+File: /usr/lib/debug/.build-id/7a	40755	root:root		
+File: /usr/lib/debug/.build-id/7a/fec795d28e285a130e2b680c94000eb9968e17	120777	root:root		../../../../lib64/pppd/2.4.8/pppol2tp.so
+File: /usr/lib/debug/.build-id/7a/fec795d28e285a130e2b680c94000eb9968e17.debug	120777	root:root		../../usr/lib64/pppd/2.4.8/pppol2tp.so.debug
+File: /usr/lib/debug/.build-id/aa	40755	root:root		
+File: /usr/lib/debug/.build-id/aa/da1fe0547f6f2c48248b7a85c26f24c55daae7	120777	root:root		../../../../sbin/pppdump
+File: /usr/lib/debug/.build-id/aa/da1fe0547f6f2c48248b7a85c26f24c55daae7.debug	120777	root:root		../../usr/sbin/pppdump.debug
+File: /usr/lib/debug/.build-id/b0	40755	root:root		
+File: /usr/lib/debug/.build-id/b0/e172e97490c2294f0e8dc56e988622a61c6d69	120777	root:root		../../../../lib64/pppd/2.4.8/passprompt.so
+File: /usr/lib/debug/.build-id/b0/e172e97490c2294f0e8dc56e988622a61c6d69.debug	120777	root:root		../../usr/lib64/pppd/2.4.8/passprompt.so.debug
+File: /usr/lib/debug/.build-id/cd	40755	root:root		
+File: /usr/lib/debug/.build-id/cd/6682094c9f2eb86c4980f04c211948b441aa58	120777	root:root		../../../../lib64/pppd/2.4.8/passwordfd.so
+File: /usr/lib/debug/.build-id/cd/6682094c9f2eb86c4980f04c211948b441aa58.debug	120777	root:root		../../usr/lib64/pppd/2.4.8/passwordfd.so.debug
+File: /usr/lib/debug/.build-id/e6	40755	root:root		
+File: /usr/lib/debug/.build-id/e6/2bbf2b4e4ef19c3877ac00b46a2451eb391184	120777	root:root		../../../../lib64/pppd/2.4.8/minconn.so
+File: /usr/lib/debug/.build-id/e6/2bbf2b4e4ef19c3877ac00b46a2451eb391184.debug	120777	root:root		../../usr/lib64/pppd/2.4.8/minconn.so.debug
+File: /usr/lib/debug/.build-id/e6/e5ba2b40c9c5ca0b22ade407e5c1472c7a9f3e	120777	root:root		../../../../sbin/pppstats
+File: /usr/lib/debug/.build-id/e6/e5ba2b40c9c5ca0b22ade407e5c1472c7a9f3e.debug	120777	root:root		../../usr/sbin/pppstats.debug
 File: /usr/lib/debug/usr/lib64/pppd	40755	root:root		
 File: /usr/lib/debug/usr/lib64/pppd/2.4.8	40755	root:root		
-File: /usr/lib/debug/usr/lib64/pppd/2.4.8/minconn.so.debug	100644	root:root	10ec91ab221756ff5634272802e0c52f	
-File: /usr/lib/debug/usr/lib64/pppd/2.4.8/openl2tp.so.debug	100644	root:root	a9f89e27a8b56d11dabece48e4d9e4fb	
-File: /usr/lib/debug/usr/lib64/pppd/2.4.8/passprompt.so.debug	100644	root:root	fcb837a1f71ce2e7f08b7b7a3e9cd4ea	
-File: /usr/lib/debug/usr/lib64/pppd/2.4.8/passwordfd.so.debug	100644	root:root	a3dbbb8d249baff83baf988cfa24142e	
-File: /usr/lib/debug/usr/lib64/pppd/2.4.8/pppol2tp.so.debug	100644	root:root	63c6f9adcd956de3c52f5d607c3467d2	
-File: /usr/lib/debug/usr/lib64/pppd/2.4.8/winbind.so.debug	100644	root:root	c8ec9ba1d86f07d81b7cd0ee95943141	
-File: /usr/lib/debug/usr/sbin/chat.debug	100644	root:root	f7d60e009b318f725ac82fb610e83f0c	
-File: /usr/lib/debug/usr/sbin/pppd.debug	100644	root:root	38c79052d86e5580b1d389e3ec26ebdc	
-File: /usr/lib/debug/usr/sbin/pppdump.debug	100644	root:root	b7e9b9397074d8cca10780adde25ef55	
-File: /usr/lib/debug/usr/sbin/pppstats.debug	100644	root:root	ff0a68f91febfaf1924e5da7b9a05444	
+File: /usr/lib/debug/usr/lib64/pppd/2.4.8/minconn.so.debug	100644	root:root	7a15d27f19ca1ad8f6f1238e4573c384	
+File: /usr/lib/debug/usr/lib64/pppd/2.4.8/openl2tp.so.debug	100644	root:root	208fe621cb2c9f48abf90c014572c92b	
+File: /usr/lib/debug/usr/lib64/pppd/2.4.8/passprompt.so.debug	100644	root:root	dd87a61371ca72cbb4a3e4fba1a96055	
+File: /usr/lib/debug/usr/lib64/pppd/2.4.8/passwordfd.so.debug	100644	root:root	9b8f2f760a7bab416b7fbc855fd634e3	
+File: /usr/lib/debug/usr/lib64/pppd/2.4.8/pppol2tp.so.debug	100644	root:root	bc824e0d4a54d2c44ce89fc24c924158	
+File: /usr/lib/debug/usr/lib64/pppd/2.4.8/winbind.so.debug	100644	root:root	e3fbde136c6a0c14e735960e162eea38	
+File: /usr/lib/debug/usr/sbin/chat.debug	100644	root:root	dfbc43c571308730f5b50eb387b47af2	
+File: /usr/lib/debug/usr/sbin/pppd.debug	100644	root:root	79bf1d4502c96667e4e329cd03bded87	
+File: /usr/lib/debug/usr/sbin/pppdump.debug	100644	root:root	9e42d877a6d9f6bea14c8240e3ff0e98	
+File: /usr/lib/debug/usr/sbin/pppstats.debug	100644	root:root	d17fae73dbd6bffa0809e08178119731	
 File: /usr/src/debug/ppp-2.4.8	40755	root:root		
@@ -234,2 +234,2 @@
 File: /usr/src/debug/ppp-2.4.8/pppstats/pppstats.c	100644	root:root	7437f3a0a5493f48465c83d264637655	
-RPMIdentity: 2ebe34eb0ab10f1dd2bbd240a6f2a4eb932fdc487677cd55c27ac0d0d600583661ab96ba71db4c16f8449214ad369be2b0734b08b4b10e39e30aee05580e0a46
+RPMIdentity: 6d38dd0f0451838e30c0d70f14337899d459c2112b9f9c1e7ede801fd504c593d851d4308e4627b78fd6592cad1a5bd766ba870ed3107f41d39eaf4cc4b0b74e
--- ppp-dhcp-2.4.8-alt3.x86_64.rpm.repo	2023-07-29 23:34:44.000000000 +0000
+++ ppp-dhcp-2.4.8-alt3.x86_64.rpm.hasher	2023-08-06 06:17:16.900887697 +0000
@@ -9,3 +9,3 @@
 Provides: ppp-dhcp = 2.4.8-alt3:sisyphus+326048.1700.1.1
-File: /usr/lib64/pppd/2.4.8/dhcpc.so	100644	root:root	7fb9e830de6b478aad5b00818959d960	
+File: /usr/lib64/pppd/2.4.8/dhcpc.so	100644	root:root	5e92fb891bc3a665b468a06f27934001	
 File: /usr/share/doc/ppp-dhcp-2.4.8	40755	root:root		
@@ -14,2 +14,2 @@
 File: /usr/share/doc/ppp-dhcp-2.4.8/README	100644	root:root	f5cb1aad349c5935679ee65a8157706d	
-RPMIdentity: b95ab057bc8dfe84501cb450d5b6e05ab7abd2e69703cb13dda315bd7e207d8b381a9439f993fb9f8e0cafed16ac39af421c2bfff8a1b67876e4ba84ab436270
+RPMIdentity: 2bd9931d93cf77744cefc091b3fcd8abb18c95bc72b6f42e9ff967fd2fa9760ac52c63282988dbb2471a8bcc26ba1ef39733184e12b3757458d551be8272f3ac
--- ppp-dhcp-debuginfo-2.4.8-alt3.x86_64.rpm.repo	2023-07-29 23:34:45.000000000 +0000
+++ ppp-dhcp-debuginfo-2.4.8-alt3.x86_64.rpm.hasher	2023-08-06 06:17:16.970889118 +0000
@@ -1,4 +1,4 @@
-/usr/lib/debug/.build-id/4c	40755	root:root	
-/usr/lib/debug/.build-id/4c/1439f4b291fa802323228115b98fe1fb8e62a6	120777	root:root	../../../../lib64/pppd/2.4.8/dhcpc.so
-/usr/lib/debug/.build-id/4c/1439f4b291fa802323228115b98fe1fb8e62a6.debug	120777	root:root	../../usr/lib64/pppd/2.4.8/dhcpc.so.debug
+/usr/lib/debug/.build-id/3c	40755	root:root	
+/usr/lib/debug/.build-id/3c/a58c43f13bb270ec8fd91d117e0fd0eb8e32c8	120777	root:root	../../../../lib64/pppd/2.4.8/dhcpc.so
+/usr/lib/debug/.build-id/3c/a58c43f13bb270ec8fd91d117e0fd0eb8e32c8.debug	120777	root:root	../../usr/lib64/pppd/2.4.8/dhcpc.so.debug
 /usr/lib/debug/usr/lib64/pppd	40755	root:root	
@@ -25,8 +25,8 @@
 Provides: ppp-dhcp-debuginfo = 2.4.8-alt3:sisyphus+326048.1700.1.1
-File: /usr/lib/debug/.build-id/4c	40755	root:root		
-File: /usr/lib/debug/.build-id/4c/1439f4b291fa802323228115b98fe1fb8e62a6	120777	root:root		../../../../lib64/pppd/2.4.8/dhcpc.so
-File: /usr/lib/debug/.build-id/4c/1439f4b291fa802323228115b98fe1fb8e62a6.debug	120777	root:root		../../usr/lib64/pppd/2.4.8/dhcpc.so.debug
+File: /usr/lib/debug/.build-id/3c	40755	root:root		
+File: /usr/lib/debug/.build-id/3c/a58c43f13bb270ec8fd91d117e0fd0eb8e32c8	120777	root:root		../../../../lib64/pppd/2.4.8/dhcpc.so
+File: /usr/lib/debug/.build-id/3c/a58c43f13bb270ec8fd91d117e0fd0eb8e32c8.debug	120777	root:root		../../usr/lib64/pppd/2.4.8/dhcpc.so.debug
 File: /usr/lib/debug/usr/lib64/pppd	40755	root:root		
 File: /usr/lib/debug/usr/lib64/pppd/2.4.8	40755	root:root		
-File: /usr/lib/debug/usr/lib64/pppd/2.4.8/dhcpc.so.debug	100644	root:root	686fb3d9f35c41aa0db4ae07a0e36fc4	
+File: /usr/lib/debug/usr/lib64/pppd/2.4.8/dhcpc.so.debug	100644	root:root	37702ce080a4f66357a6b56ebce0c867	
 File: /usr/src/debug/ppp-2.4.8	40755	root:root		
@@ -46,2 +46,2 @@
 File: /usr/src/debug/ppp-2.4.8/pppd/plugins/dhcp/socket.h	100644	root:root	f0fe895a76193aeba4a17f467f71cf84	
-RPMIdentity: 874b5f2dcb495445526d05e5abe45d2cd9d5bc53e5ff0f2cb38bd8785c00035b24c2e936ba5466b1b579ffa6a628507ebcfd094f19d2009f10f2691ce094b0f4
+RPMIdentity: 7b9adbadd697affffe6feb7fd329d945ac3adc2029426e228cb43d4fcf7ec8d2c17a602d3804ff5c6fe3671f4788e466e6b9f1e06e255afce7286655fc7c3e72
--- ppp-pppoatm-2.4.8-alt3.x86_64.rpm.repo	2023-07-29 23:34:46.000000000 +0000
+++ ppp-pppoatm-2.4.8-alt3.x86_64.rpm.hasher	2023-08-06 06:17:17.051890761 +0000
@@ -5,3 +5,3 @@
 Provides: ppp-pppoatm = 2.4.8-alt3:sisyphus+326048.1700.1.1
-File: /usr/lib64/pppd/2.4.8/pppoatm.so	100644	root:root	13fac255085a1034b8df05f00d3539a2	
-RPMIdentity: 4dd353539673c10f8e10ea72b04a01088d4a73b2298cf0395a8cad35685790394142b8e58fbdbfbfa172e6c36106f768dc5350c66cdea4d9e959080e8f23843d
+File: /usr/lib64/pppd/2.4.8/pppoatm.so	100644	root:root	58bca5a2afeb9a2914d53fdb2c5fdc6d	
+RPMIdentity: 2acdadf877b10ead4783330729a956858beb3ba14fa97911cf9a00be4ff61a8b3f2214d267bb0d6cfba99f3f8e372008041a91513eb6193d3d837f4db3ab692d
--- ppp-pppoatm-debuginfo-2.4.8-alt3.x86_64.rpm.repo	2023-07-29 23:34:45.000000000 +0000
+++ ppp-pppoatm-debuginfo-2.4.8-alt3.x86_64.rpm.hasher	2023-08-06 06:17:17.224894271 +0000
@@ -1,4 +1,4 @@
-/usr/lib/debug/.build-id/76	40755	root:root	
-/usr/lib/debug/.build-id/76/bef4deff6d5e4f37a5fa0e3fb7401a0ab59826	120777	root:root	../../../../lib64/pppd/2.4.8/pppoatm.so
-/usr/lib/debug/.build-id/76/bef4deff6d5e4f37a5fa0e3fb7401a0ab59826.debug	120777	root:root	../../usr/lib64/pppd/2.4.8/pppoatm.so.debug
+/usr/lib/debug/.build-id/a8	40755	root:root	
+/usr/lib/debug/.build-id/a8/c494415a75aff8f07ececc5e2b7910ff572bd5	120777	root:root	../../../../lib64/pppd/2.4.8/pppoatm.so
+/usr/lib/debug/.build-id/a8/c494415a75aff8f07ececc5e2b7910ff572bd5.debug	120777	root:root	../../usr/lib64/pppd/2.4.8/pppoatm.so.debug
 /usr/lib/debug/usr/lib64/pppd	40755	root:root	
@@ -15,8 +15,8 @@
 Provides: ppp-pppoatm-debuginfo = 2.4.8-alt3:sisyphus+326048.1700.1.1
-File: /usr/lib/debug/.build-id/76	40755	root:root		
-File: /usr/lib/debug/.build-id/76/bef4deff6d5e4f37a5fa0e3fb7401a0ab59826	120777	root:root		../../../../lib64/pppd/2.4.8/pppoatm.so
-File: /usr/lib/debug/.build-id/76/bef4deff6d5e4f37a5fa0e3fb7401a0ab59826.debug	120777	root:root		../../usr/lib64/pppd/2.4.8/pppoatm.so.debug
+File: /usr/lib/debug/.build-id/a8	40755	root:root		
+File: /usr/lib/debug/.build-id/a8/c494415a75aff8f07ececc5e2b7910ff572bd5	120777	root:root		../../../../lib64/pppd/2.4.8/pppoatm.so
+File: /usr/lib/debug/.build-id/a8/c494415a75aff8f07ececc5e2b7910ff572bd5.debug	120777	root:root		../../usr/lib64/pppd/2.4.8/pppoatm.so.debug
 File: /usr/lib/debug/usr/lib64/pppd	40755	root:root		
 File: /usr/lib/debug/usr/lib64/pppd/2.4.8	40755	root:root		
-File: /usr/lib/debug/usr/lib64/pppd/2.4.8/pppoatm.so.debug	100644	root:root	0cd2bc437ed239f9d00b1dd2d46c4a49	
+File: /usr/lib/debug/usr/lib64/pppd/2.4.8/pppoatm.so.debug	100644	root:root	e3d8d203ee686eb196c9c182468d21b5	
 File: /usr/src/debug/ppp-2.4.8	40755	root:root		
@@ -26,2 +26,2 @@
 File: /usr/src/debug/ppp-2.4.8/pppd/plugins/pppoatm/pppoatm.c	100644	root:root	f1678fb1a2e32edaf00bddaf81805d09	
-RPMIdentity: 3ef05d80ff8daa9d051cdd9870b3a139c58cfb840234b719d853a18bc639dc3adf95f3bb3be77f9c8b7ea3271d4cadf3ef6d9e31956b7deefc3d45fdb6c5e1c1
+RPMIdentity: abdb46e0907f50758b93cc8d8afb667db2f1f47be5daf90a01ad0f17cce39a3845d2daa9685aabb2c572b289a70e892a9a955f18e7346f93990a525d3960dc50
--- ppp-pppoe-2.4.8-alt3.x86_64.rpm.repo	2023-07-29 23:34:45.000000000 +0000
+++ ppp-pppoe-2.4.8-alt3.x86_64.rpm.hasher	2023-08-06 06:17:17.313896076 +0000
@@ -7,5 +7,5 @@
 Provides: ppp-pppoe = 2.4.8-alt3:sisyphus+326048.1700.1.1
-File: /usr/lib64/pppd/2.4.8/rp-pppoe.so	100644	root:root	a4934b248608783cb4067294495013ea	
-File: /usr/sbin/pppoe-discovery	100755	root:root	e7f8760c087a23966d25174efd956dea	
+File: /usr/lib64/pppd/2.4.8/rp-pppoe.so	100644	root:root	753a9ee475a640cd21ad36ca13fda2e3	
+File: /usr/sbin/pppoe-discovery	100755	root:root	0054a9c8baa2fe2af1ee3fd4ecde71cb	
 File: /usr/share/man/man8/pppoe-discovery.8.xz	100644	root:root	4f8700b570b6ec364a19c0677742a5d4	
-RPMIdentity: f0789a23c8fb673914100d2bc80045b3d68cb13c6109af163a39d1f6f378c0ed47e52e9b83958bcaaaf831685e795b23b9ed22d9a876024221f67929585e0917
+RPMIdentity: 3efaae75b915b88c8d7252bac5798d66db77f9a4fd927b41b6fda6c3ead40080510e46af34f8117f5bf542a30fb04b1ea73e814b20073154839d54fb81bc2bb4
--- ppp-pppoe-debuginfo-2.4.8-alt3.x86_64.rpm.repo	2023-07-29 23:34:44.000000000 +0000
+++ ppp-pppoe-debuginfo-2.4.8-alt3.x86_64.rpm.hasher	2023-08-06 06:17:17.443898714 +0000
@@ -1,7 +1,7 @@
-/usr/lib/debug/.build-id/15	40755	root:root	
-/usr/lib/debug/.build-id/15/9f9558792e9772e8b7f5e46339093669c98827	120777	root:root	../../../../sbin/pppoe-discovery
-/usr/lib/debug/.build-id/15/9f9558792e9772e8b7f5e46339093669c98827.debug	120777	root:root	../../usr/sbin/pppoe-discovery.debug
-/usr/lib/debug/.build-id/a0	40755	root:root	
-/usr/lib/debug/.build-id/a0/078851f219334e2d210b16ac47650c5f62c80d	120777	root:root	../../../../lib64/pppd/2.4.8/rp-pppoe.so
-/usr/lib/debug/.build-id/a0/078851f219334e2d210b16ac47650c5f62c80d.debug	120777	root:root	../../usr/lib64/pppd/2.4.8/rp-pppoe.so.debug
+/usr/lib/debug/.build-id/36	40755	root:root	
+/usr/lib/debug/.build-id/36/fdd614bacce76e399698d5a1acd30c04a08507	120777	root:root	../../../../lib64/pppd/2.4.8/rp-pppoe.so
+/usr/lib/debug/.build-id/36/fdd614bacce76e399698d5a1acd30c04a08507.debug	120777	root:root	../../usr/lib64/pppd/2.4.8/rp-pppoe.so.debug
+/usr/lib/debug/.build-id/a5	40755	root:root	
+/usr/lib/debug/.build-id/a5/ad22fd65ab263b1ed6460568be4596b13f846a	120777	root:root	../../../../sbin/pppoe-discovery
+/usr/lib/debug/.build-id/a5/ad22fd65ab263b1ed6460568be4596b13f846a.debug	120777	root:root	../../usr/sbin/pppoe-discovery.debug
 /usr/lib/debug/usr/lib64/pppd	40755	root:root	
@@ -25,12 +25,12 @@
 Provides: ppp-pppoe-debuginfo = 2.4.8-alt3:sisyphus+326048.1700.1.1
-File: /usr/lib/debug/.build-id/15	40755	root:root		
-File: /usr/lib/debug/.build-id/15/9f9558792e9772e8b7f5e46339093669c98827	120777	root:root		../../../../sbin/pppoe-discovery
-File: /usr/lib/debug/.build-id/15/9f9558792e9772e8b7f5e46339093669c98827.debug	120777	root:root		../../usr/sbin/pppoe-discovery.debug
-File: /usr/lib/debug/.build-id/a0	40755	root:root		
-File: /usr/lib/debug/.build-id/a0/078851f219334e2d210b16ac47650c5f62c80d	120777	root:root		../../../../lib64/pppd/2.4.8/rp-pppoe.so
-File: /usr/lib/debug/.build-id/a0/078851f219334e2d210b16ac47650c5f62c80d.debug	120777	root:root		../../usr/lib64/pppd/2.4.8/rp-pppoe.so.debug
+File: /usr/lib/debug/.build-id/36	40755	root:root		
+File: /usr/lib/debug/.build-id/36/fdd614bacce76e399698d5a1acd30c04a08507	120777	root:root		../../../../lib64/pppd/2.4.8/rp-pppoe.so
+File: /usr/lib/debug/.build-id/36/fdd614bacce76e399698d5a1acd30c04a08507.debug	120777	root:root		../../usr/lib64/pppd/2.4.8/rp-pppoe.so.debug
+File: /usr/lib/debug/.build-id/a5	40755	root:root		
+File: /usr/lib/debug/.build-id/a5/ad22fd65ab263b1ed6460568be4596b13f846a	120777	root:root		../../../../sbin/pppoe-discovery
+File: /usr/lib/debug/.build-id/a5/ad22fd65ab263b1ed6460568be4596b13f846a.debug	120777	root:root		../../usr/sbin/pppoe-discovery.debug
 File: /usr/lib/debug/usr/lib64/pppd	40755	root:root		
 File: /usr/lib/debug/usr/lib64/pppd/2.4.8	40755	root:root		
-File: /usr/lib/debug/usr/lib64/pppd/2.4.8/rp-pppoe.so.debug	100644	root:root	d0a39e8b00151cda0daedfd9acbb2a5b	
-File: /usr/lib/debug/usr/sbin/pppoe-discovery.debug	100644	root:root	f32baff0cc6a61719bc0b40c8e5ad76a	
+File: /usr/lib/debug/usr/lib64/pppd/2.4.8/rp-pppoe.so.debug	100644	root:root	c9b3caa039123f3d03ca8c4d91aae0af	
+File: /usr/lib/debug/usr/sbin/pppoe-discovery.debug	100644	root:root	8252155b7112868266fec079f3ffc914	
 File: /usr/src/debug/ppp-2.4.8	40755	root:root		
@@ -46,2 +46,2 @@
 File: /usr/src/debug/ppp-2.4.8/pppd/plugins/rp-pppoe/pppoe.h	100644	root:root	7acb6dfd8937a778601193d0c38341ef	
-RPMIdentity: e1cacbb935d068e41435b1c1c957998a2ad8fbfc93177554ee42f034f25cc4ba9067f2bc47910e14516c114ae4e30e9ae468cdbd54154ba0a7e6e736bc9c1bd5
+RPMIdentity: 0754f0c32ce67da0ad22638894621c292cb7bf019c6afd3c18ef9838b5cb2858f6e5a5d4143b2d03308556ef439a720743bbc034340adb584b6dc1f34a2776cb
--- ppp-radius-2.4.8-alt3.x86_64.rpm.repo	2023-07-29 23:34:45.000000000 +0000
+++ ppp-radius-2.4.8-alt3.x86_64.rpm.hasher	2023-08-06 06:17:17.501899891 +0000
@@ -35,7 +35,7 @@
 File: /etc/ppp/radius/servers	100644	root:root	d04ebe819296aad1a8f67b4823be6e64	
-File: /usr/lib64/pppd/2.4.8/radattr.so	100644	root:root	ff1299965163eb96937b41848c25fac6	
-File: /usr/lib64/pppd/2.4.8/radius.so	100644	root:root	f0ddae837102398395c4a0d8b12f17e8	
-File: /usr/lib64/pppd/2.4.8/radrealms.so	100644	root:root	92359f0719c88a99754e48648c0c2e60	
+File: /usr/lib64/pppd/2.4.8/radattr.so	100644	root:root	a858dcf64c31e267dacdaed86f80624b	
+File: /usr/lib64/pppd/2.4.8/radius.so	100644	root:root	5853508f440ed4a5a8c4d69875e38cb4	
+File: /usr/lib64/pppd/2.4.8/radrealms.so	100644	root:root	199f6756506e109dfabb4c89802067a9	
 File: /usr/share/man/man8/pppd-radattr.8.xz	100644	root:root	16004a98df311ca44a09d89cf72a0fbd	
 File: /usr/share/man/man8/pppd-radius.8.xz	100644	root:root	7d16442725f52cfb86f9421844dab956	
-RPMIdentity: c3fed68d2ee48bbbb9274a962abf4ac52abae69a0a3dcf79b24ca84dcef55e07e08ca61f8b1add0c65d7d7a4402901dc05d2643caac5adcca37b703d5942d1f7
+RPMIdentity: 7f8af91d23264830077b70880db8d3336cc99dc705bd1fc20ae4d67ea3b3f66e059db224219090faed8294b35d7a1e237a07d882e8ce18ced7d9339df74a0a2e
--- ppp-radius-debuginfo-2.4.8-alt3.x86_64.rpm.repo	2023-07-29 23:34:45.000000000 +0000
+++ ppp-radius-debuginfo-2.4.8-alt3.x86_64.rpm.hasher	2023-08-06 06:17:17.580901493 +0000
@@ -1,10 +1,10 @@
-/usr/lib/debug/.build-id/5b	40755	root:root	
-/usr/lib/debug/.build-id/5b/423727a36f1128983ecd8bcb2c8960b1e28a99	120777	root:root	../../../../lib64/pppd/2.4.8/radattr.so
-/usr/lib/debug/.build-id/5b/423727a36f1128983ecd8bcb2c8960b1e28a99.debug	120777	root:root	../../usr/lib64/pppd/2.4.8/radattr.so.debug
-/usr/lib/debug/.build-id/61	40755	root:root	
-/usr/lib/debug/.build-id/61/2505201ae5738c0ab624168a2ac281f52a3d06	120777	root:root	../../../../lib64/pppd/2.4.8/radius.so
-/usr/lib/debug/.build-id/61/2505201ae5738c0ab624168a2ac281f52a3d06.debug	120777	root:root	../../usr/lib64/pppd/2.4.8/radius.so.debug
-/usr/lib/debug/.build-id/e4	40755	root:root	
-/usr/lib/debug/.build-id/e4/878be8c569cba6a96b9c52a960d0a21f3c3ced	120777	root:root	../../../../lib64/pppd/2.4.8/radrealms.so
-/usr/lib/debug/.build-id/e4/878be8c569cba6a96b9c52a960d0a21f3c3ced.debug	120777	root:root	../../usr/lib64/pppd/2.4.8/radrealms.so.debug
+/usr/lib/debug/.build-id/32	40755	root:root	
+/usr/lib/debug/.build-id/32/b97e15f192ed9e446ae69a114f1e4b6e521c7f	120777	root:root	../../../../lib64/pppd/2.4.8/radrealms.so
+/usr/lib/debug/.build-id/32/b97e15f192ed9e446ae69a114f1e4b6e521c7f.debug	120777	root:root	../../usr/lib64/pppd/2.4.8/radrealms.so.debug
+/usr/lib/debug/.build-id/51	40755	root:root	
+/usr/lib/debug/.build-id/51/12e6ea3e7f590a32071790d4146eaa11c96825	120777	root:root	../../../../lib64/pppd/2.4.8/radattr.so
+/usr/lib/debug/.build-id/51/12e6ea3e7f590a32071790d4146eaa11c96825.debug	120777	root:root	../../usr/lib64/pppd/2.4.8/radattr.so.debug
+/usr/lib/debug/.build-id/b2	40755	root:root	
+/usr/lib/debug/.build-id/b2/392b9bc06287167e7e8f1d4269046599760fa6	120777	root:root	../../../../lib64/pppd/2.4.8/radius.so
+/usr/lib/debug/.build-id/b2/392b9bc06287167e7e8f1d4269046599760fa6.debug	120777	root:root	../../usr/lib64/pppd/2.4.8/radius.so.debug
 /usr/lib/debug/usr/lib64/pppd	40755	root:root	
@@ -38,16 +38,16 @@
 Provides: ppp-radius-debuginfo = 2.4.8-alt3:sisyphus+326048.1700.1.1
-File: /usr/lib/debug/.build-id/5b	40755	root:root		
-File: /usr/lib/debug/.build-id/5b/423727a36f1128983ecd8bcb2c8960b1e28a99	120777	root:root		../../../../lib64/pppd/2.4.8/radattr.so
-File: /usr/lib/debug/.build-id/5b/423727a36f1128983ecd8bcb2c8960b1e28a99.debug	120777	root:root		../../usr/lib64/pppd/2.4.8/radattr.so.debug
-File: /usr/lib/debug/.build-id/61	40755	root:root		
-File: /usr/lib/debug/.build-id/61/2505201ae5738c0ab624168a2ac281f52a3d06	120777	root:root		../../../../lib64/pppd/2.4.8/radius.so
-File: /usr/lib/debug/.build-id/61/2505201ae5738c0ab624168a2ac281f52a3d06.debug	120777	root:root		../../usr/lib64/pppd/2.4.8/radius.so.debug
-File: /usr/lib/debug/.build-id/e4	40755	root:root		
-File: /usr/lib/debug/.build-id/e4/878be8c569cba6a96b9c52a960d0a21f3c3ced	120777	root:root		../../../../lib64/pppd/2.4.8/radrealms.so
-File: /usr/lib/debug/.build-id/e4/878be8c569cba6a96b9c52a960d0a21f3c3ced.debug	120777	root:root		../../usr/lib64/pppd/2.4.8/radrealms.so.debug
+File: /usr/lib/debug/.build-id/32	40755	root:root		
+File: /usr/lib/debug/.build-id/32/b97e15f192ed9e446ae69a114f1e4b6e521c7f	120777	root:root		../../../../lib64/pppd/2.4.8/radrealms.so
+File: /usr/lib/debug/.build-id/32/b97e15f192ed9e446ae69a114f1e4b6e521c7f.debug	120777	root:root		../../usr/lib64/pppd/2.4.8/radrealms.so.debug
+File: /usr/lib/debug/.build-id/51	40755	root:root		
+File: /usr/lib/debug/.build-id/51/12e6ea3e7f590a32071790d4146eaa11c96825	120777	root:root		../../../../lib64/pppd/2.4.8/radattr.so
+File: /usr/lib/debug/.build-id/51/12e6ea3e7f590a32071790d4146eaa11c96825.debug	120777	root:root		../../usr/lib64/pppd/2.4.8/radattr.so.debug
+File: /usr/lib/debug/.build-id/b2	40755	root:root		
+File: /usr/lib/debug/.build-id/b2/392b9bc06287167e7e8f1d4269046599760fa6	120777	root:root		../../../../lib64/pppd/2.4.8/radius.so
+File: /usr/lib/debug/.build-id/b2/392b9bc06287167e7e8f1d4269046599760fa6.debug	120777	root:root		../../usr/lib64/pppd/2.4.8/radius.so.debug
 File: /usr/lib/debug/usr/lib64/pppd	40755	root:root		
 File: /usr/lib/debug/usr/lib64/pppd/2.4.8	40755	root:root		
-File: /usr/lib/debug/usr/lib64/pppd/2.4.8/radattr.so.debug	100644	root:root	9a7e7017afbc755795eb6fc669c601a1	
-File: /usr/lib/debug/usr/lib64/pppd/2.4.8/radius.so.debug	100644	root:root	29c31fd74e636e0ee9e8158668b63373	
-File: /usr/lib/debug/usr/lib64/pppd/2.4.8/radrealms.so.debug	100644	root:root	2859f0e245e8464e5bd27eea93483ea7	
+File: /usr/lib/debug/usr/lib64/pppd/2.4.8/radattr.so.debug	100644	root:root	d70190eddf9db48d8a4a3cd26acce822	
+File: /usr/lib/debug/usr/lib64/pppd/2.4.8/radius.so.debug	100644	root:root	01676a54de54407c91134869376fc282	
+File: /usr/lib/debug/usr/lib64/pppd/2.4.8/radrealms.so.debug	100644	root:root	bd6c030512ad52ed480d833fdbb2ff7c	
 File: /usr/src/debug/ppp-2.4.8	40755	root:root		
@@ -72,2 +72,2 @@
 File: /usr/src/debug/ppp-2.4.8/pppd/plugins/radius/util.c	100644	root:root	ca0b824866a7b18cc44abc334ae5978b	
-RPMIdentity: eb1bda42ccad60382810f1c5740493171bf7e5783d1ed29b8c3abf6ee59499da879ddd41ed72d863668346672dac751b04b44764ed6ba8ac89b9653f6bdaa4f6
+RPMIdentity: 753c784ccd0368da95fd47f498012023f2e293f7ff8cc048e68fc12a6f51d48214dd3ca5ae0ec6843266ab7f61fdc4958255c78beff2723f30a7ade0efe66e4b