<86>Jun 23 02:53:43 userdel[112766]: delete user 'rooter'
<86>Jun 23 02:53:43 userdel[112766]: removed group 'rooter' owned by 'rooter'
<86>Jun 23 02:53:43 userdel[112766]: removed shadow group 'rooter' owned by 'rooter'
<86>Jun 23 02:53:43 groupadd[112787]: group added to /etc/group: name=rooter, GID=1817
<86>Jun 23 02:53:43 groupadd[112787]: group added to /etc/gshadow: name=rooter
<86>Jun 23 02:53:43 groupadd[112787]: new group: name=rooter, GID=1817
<86>Jun 23 02:53:43 useradd[112798]: new user: name=rooter, UID=1817, GID=1817, home=/root, shell=/bin/bash, from=none
<86>Jun 23 02:53:43 userdel[112811]: delete user 'builder'
<86>Jun 23 02:53:43 userdel[112811]: removed group 'builder' owned by 'builder'
<86>Jun 23 02:53:43 userdel[112811]: removed shadow group 'builder' owned by 'builder'
<86>Jun 23 02:53:43 groupadd[112820]: group added to /etc/group: name=builder, GID=1818
<86>Jun 23 02:53:43 groupadd[112820]: group added to /etc/gshadow: name=builder
<86>Jun 23 02:53:43 groupadd[112820]: new group: name=builder, GID=1818
<86>Jun 23 02:53:43 useradd[112826]: new user: name=builder, UID=1818, GID=1818, home=/usr/src, shell=/bin/bash, from=none
<13>Jun 23 02:53:45 rpmi: libgmp-devel-6.2.1-alt5 sisyphus+309797.200.2.1 1668090171 installed
<13>Jun 23 02:53:45 rpmi: libopenblas-0.3.23-alt1.1 sisyphus+323359.100.1.1 1687257417 installed
<13>Jun 23 02:53:45 rpmi: libgmpxx4-6.2.1-alt5 sisyphus+309797.200.2.1 1668090171 installed
<13>Jun 23 02:53:45 rpmi: libgmpxx-devel-6.2.1-alt5 sisyphus+309797.200.2.1 1668090171 installed
<13>Jun 23 02:53:45 rpmi: libgivaro9-4.2.0-alt3 sisyphus+323494.100.1.1 1687432926 installed
<13>Jun 23 02:53:45 rpmi: libgivaro-devel-4.2.0-alt3 sisyphus+323494.100.1.1 1687432926 installed
<13>Jun 23 02:53:45 rpmi: libopenblas-devel-0.3.23-alt1.1 sisyphus+323359.100.1.1 1687257417 installed
<13>Jun 23 02:53:45 rpmi: libiml0-1.0.5-alt3 sisyphus+288111.200.2.1 1635171491 installed
<13>Jun 23 02:53:45 rpmi: libmpfr-devel-4.2.0-alt1 sisyphus+322962.100.1.1 1686690859 installed
<13>Jun 23 02:53:45 rpmi: libtinyxml2.9-9.0.0-alt1 sisyphus+292842.100.1.1 1640972758 installed
<13>Jun 23 02:53:45 rpmi: libpng16-1.6.39-alt1 sisyphus+310490.100.1.1 1669195200 installed
<13>Jun 23 02:53:45 rpmi: libm4ri-20200125-alt1 sisyphus+288111.240.3.1 1635171833 installed
<13>Jun 23 02:53:45 rpmi: libm4ri-devel-20200125-alt1 sisyphus+288111.240.3.1 1635171833 installed
<13>Jun 23 02:53:45 rpmi: libm4rie0-20200125-alt1 sisyphus+289879.100.1.1 1637059812 installed
<13>Jun 23 02:53:45 rpmi: libgf2x3-1.3.0-alt1 sisyphus+287577.40.3.1 1634585838 installed
<13>Jun 23 02:53:45 rpmi: libntl44-11.5.1-alt1.1 sisyphus+293694.100.1.1 1642508908 installed
<13>Jun 23 02:53:45 rpmi: libblas3gf-3.9.2-alt3 sisyphus+279348.100.1.2 1626513216 installed
<13>Jun 23 02:53:46 rpmi: libflint2-17-2.9.0-alt1 sisyphus+319185.100.1.1 1682327955 installed
<13>Jun 23 02:53:46 rpmi: gcc-c++-common-1.4.27-alt1 sisyphus+278099.1300.1.1 1626028636 installed
<13>Jun 23 02:53:46 rpmi: libstdc++13-devel-13.1.1-alt1 sisyphus+323337.100.1.1 1687259761 installed
<13>Jun 23 02:53:46 rpmi: gcc13-c++-13.1.1-alt1 sisyphus+323337.100.1.1 1687259761 installed
<13>Jun 23 02:53:46 rpmi: gcc-c++-13-alt1 sisyphus+323337.300.1.1 1687267966 installed
<13>Jun 23 02:53:46 rpmi: libflint2-devel-2.9.0-alt1 sisyphus+319185.100.1.1 1682327955 installed
<13>Jun 23 02:53:47 rpmi: libntl-devel-11.5.1-alt1.1 sisyphus+293694.100.1.1 1642508908 installed
<13>Jun 23 02:53:47 rpmi: libm4rie-devel-20200125-alt1 sisyphus+289879.100.1.1 1637059812 installed
<13>Jun 23 02:53:47 rpmi: libtinyxml2-devel-9.0.0-alt1 sisyphus+292842.100.1.1 1640972758 installed
<13>Jun 23 02:53:47 rpmi: libiml-devel-1.0.5-alt3 sisyphus+288111.200.2.1 1635171491 installed
<13>Jun 23 02:53:47 rpmi: fflas-ffpack-devel-2.5.0-alt1 sisyphus+303984.200.2.1 1658240608 installed
Building target platforms: x86_64
Building for target x86_64
Wrote: /usr/src/in/nosrpm/linbox-1.7.0-alt1.nosrc.rpm (w1.gzdio)
Installing linbox-1.7.0-alt1.src.rpm
Building target platforms: x86_64
Building for target x86_64
Executing(%prep): /bin/sh -e /usr/src/tmp/rpm-tmp.2816
+ umask 022
+ /bin/mkdir -p /usr/src/RPM/BUILD
+ cd /usr/src/RPM/BUILD
+ cd /usr/src/RPM/BUILD
+ rm -rf linbox-1.7.0
+ echo 'Source #0 (linbox-1.7.0.tar.gz):'
Source #0 (linbox-1.7.0.tar.gz):
+ /bin/gzip -dc /usr/src/RPM/SOURCES/linbox-1.7.0.tar.gz
+ /bin/tar -xf -
+ cd linbox-1.7.0
+ /bin/chmod -c -Rf u+rwX,go-w .
+ exit 0
Executing(%build): /bin/sh -e /usr/src/tmp/rpm-tmp.2816
+ umask 022
+ /bin/mkdir -p /usr/src/RPM/BUILD
+ cd /usr/src/RPM/BUILD
+ cd linbox-1.7.0
+ export 'LIBS+=-L/usr/lib64 -lgivaro -lopenblas -lgmp'
+ LIBS+='-L/usr/lib64 -lgivaro -lopenblas -lgmp'
+ autoreconf -fisv
autoreconf-default: Entering directory `.'
autoreconf-default: configure.ac: not using Gettext
autoreconf-default: running: aclocal --force -I macros
autoreconf-default: configure.ac: tracing
autoreconf-default: configure.ac: creating directory build-aux
autoreconf-default: running: libtoolize --force --install
libtoolize-default: putting auxiliary files in AC_CONFIG_AUX_DIR, 'build-aux'.
libtoolize-default: linking file 'build-aux/config.guess'
libtoolize-default: linking file 'build-aux/config.sub'
libtoolize-default: linking file 'build-aux/install-sh'
libtoolize-default: linking file 'build-aux/ltmain.sh'
libtoolize-default: putting macros in AC_CONFIG_MACRO_DIRS, 'macros'.
libtoolize-default: linking file 'macros/libtool.m4'
libtoolize-default: linking file 'macros/ltoptions.m4'
libtoolize-default: linking file 'macros/ltsugar.m4'
libtoolize-default: linking file 'macros/ltversion.m4'
libtoolize-default: linking file 'macros/lt~obsolete.m4'
autoreconf-default: configure.ac: not using Intltool
autoreconf-default: configure.ac: not using gtk-doc
autoreconf-default: running: /usr/bin/autoconf-2.60 --force
autoreconf-default: running: /usr/bin/autoheader-2.60 --force
autoreconf-default: running: automake --add-missing --force-missing
configure.ac:46: installing 'build-aux/ar-lib'
configure.ac:46: installing 'build-aux/compile'
configure.ac:33: installing 'build-aux/missing'
benchmarks/Makefile.am: installing 'build-aux/depcomp'
parallel-tests: installing 'build-aux/test-driver'
tests/Makefile.am:383: warning: variable 'checker_SOURCES' is defined but no program or
tests/Makefile.am:383: library has 'checker' as canonical name (possible typo)
autoreconf-default: Leaving directory `.'
+ CFLAGS='-pipe -frecord-gcc-switches -Wall -g -O2 -flto=auto'
+ export CFLAGS
+ CXXFLAGS='-pipe -frecord-gcc-switches -Wall -g -O2 -flto=auto'
+ export CXXFLAGS
+ FFLAGS='-pipe -frecord-gcc-switches -Wall -g -O2 -flto=auto'
+ export FFLAGS
+ FCFLAGS='-pipe -frecord-gcc-switches -Wall -g -O2 -flto=auto'
+ export FCFLAGS
+ '[' -n '' ']'
++ printf %s '-pipe -frecord-gcc-switches -Wall -g -O2 -flto=auto'
++ sed -r 's/(^|[[:space:]]+)-[^m][^[:space:]]*//g'
+ ASFLAGS=
+ export ASFLAGS
+ export lt_cv_deplibs_check_method=pass_all
+ lt_cv_deplibs_check_method=pass_all
+ readlink -e -- ./configure
+ xargs -ri dirname -- '{}'
+ xargs -ri find '{}' -type f '(' -name config.sub -or -name config.guess ')' -printf '%h/\n'
+ sort -u
+ xargs -rn1 install -pm755 -- /usr/share/gnu-config/config.sub /usr/share/gnu-config/config.guess
+ ./configure --build=x86_64-alt-linux --host=x86_64-alt-linux --prefix=/usr --exec-prefix=/usr --bindir=/usr/bin --sbindir=/usr/sbin --sysconfdir=/etc --datadir=/usr/share --includedir=/usr/include --libdir=/usr/lib64 --libexecdir=/usr/lib --localstatedir=/var/lib --sharedstatedir=/var/lib --mandir=/usr/share/man --infodir=/usr/share/info --disable-dependency-tracking --disable-silent-rules --without-included-gettext --disable-static --disable-sse3 --disable-ssse3 --disable-sse41 --disable-sse42 --disable-avx --disable-avx2 --disable-fma --disable-fma4 --enable-gmp=yes --enable-openblas=yes '--with-blas-libs= -lopenblas'
configure: WARNING: unrecognized options: --without-included-gettext, --disable-sse3, --disable-ssse3, --disable-sse41, --disable-sse42, --disable-avx, --disable-avx2, --disable-fma, --disable-fma4, --enable-gmp, --enable-openblas, --with-blas-libs
checking build system type... x86_64-alt-linux-gnu
checking host system type... x86_64-alt-linux-gnu
checking target system type... x86_64-alt-linux-gnu
checking for a BSD-compatible install... /bin/install -c
checking whether build environment is sane... yes
checking for a thread-safe mkdir -p... /bin/mkdir -p
checking for gawk... gawk
checking whether make sets $(MAKE)... yes
checking whether make supports nested variables... yes
checking for x86_64-alt-linux-g++... x86_64-alt-linux-g++
checking whether the C++ compiler works... yes
checking for C++ compiler default output file name... a.out
checking for suffix of executables... 
checking whether we are cross compiling... no
checking for suffix of object files... o
checking whether we are using the GNU C++ compiler... yes
checking whether x86_64-alt-linux-g++ accepts -g... yes
checking whether make supports the include directive... yes (GNU style)
checking dependency style of x86_64-alt-linux-g++... none
checking for x86_64-alt-linux-gcc... x86_64-alt-linux-gcc
checking whether we are using the GNU C compiler... yes
checking whether x86_64-alt-linux-gcc accepts -g... yes
checking for x86_64-alt-linux-gcc option to accept ISO C89... none needed
checking whether x86_64-alt-linux-gcc understands -c and -o together... yes
checking dependency style of x86_64-alt-linux-gcc... none
checking for x86_64-alt-linux-ar... no
checking for x86_64-alt-linux-lib... no
checking for x86_64-alt-linux-link... no
checking for ar... ar
checking the archiver (ar) interface... ar
checking how to print strings... printf
checking for a sed that does not truncate output... /bin/sed
checking for grep that handles long lines and -e... /bin/grep
checking for egrep... /bin/grep -E
checking for fgrep... /bin/grep -F
checking for ld used by x86_64-alt-linux-gcc... /usr/bin/ld
checking if the linker (/usr/bin/ld) is GNU ld... yes
checking for BSD- or MS-compatible name lister (nm)... /usr/bin/nm -B
checking the name lister (/usr/bin/nm -B) interface... BSD nm
checking whether ln -s works... yes
checking the maximum length of command line arguments... 1572864
checking how to convert x86_64-alt-linux-gnu file names to x86_64-alt-linux-gnu format... func_convert_file_noop
checking how to convert x86_64-alt-linux-gnu file names to toolchain format... func_convert_file_noop
checking for /usr/bin/ld option to reload object files... -r
checking for x86_64-alt-linux-file... no
checking for file... file
checking for x86_64-alt-linux-objdump... no
checking for objdump... objdump
checking how to recognize dependent libraries... (cached) pass_all
checking for x86_64-alt-linux-dlltool... no
checking for dlltool... no
checking how to associate runtime and link libraries... printf %s\n
checking for x86_64-alt-linux-ar... ar
checking for archiver @FILE support... @
checking for x86_64-alt-linux-strip... no
checking for strip... strip
checking for x86_64-alt-linux-ranlib... no
checking for ranlib... ranlib
checking command to parse /usr/bin/nm -B output from x86_64-alt-linux-gcc object... ok
checking for sysroot... no
checking for a working dd... /bin/dd
checking how to truncate binary pipes... /bin/dd bs=4096 count=1
checking for x86_64-alt-linux-mt... no
checking for mt... no
checking if : is a manifest tool... no
checking how to run the C preprocessor... x86_64-alt-linux-gcc -E
checking for ANSI C header files... yes
checking for sys/types.h... yes
checking for sys/stat.h... yes
checking for stdlib.h... yes
checking for string.h... yes
checking for memory.h... yes
checking for strings.h... yes
checking for inttypes.h... yes
checking for stdint.h... yes
checking for unistd.h... yes
checking for dlfcn.h... yes
checking for objdir... .libs
checking if x86_64-alt-linux-gcc supports -fno-rtti -fno-exceptions... no
checking for x86_64-alt-linux-gcc option to produce PIC... -fPIC -DPIC
checking if x86_64-alt-linux-gcc PIC flag -fPIC -DPIC works... yes
checking if x86_64-alt-linux-gcc static flag -static works... no
checking if x86_64-alt-linux-gcc supports -c -o file.o... yes
checking if x86_64-alt-linux-gcc supports -c -o file.o... (cached) yes
checking whether the x86_64-alt-linux-gcc linker (/usr/bin/ld -m elf_x86_64) supports shared libraries... yes
checking whether -lc should be explicitly linked in... no
checking dynamic linker characteristics... GNU/Linux ld.so
checking how to hardcode library paths into programs... immediate
checking whether stripping libraries is possible... yes
checking if libtool supports shared libraries... yes
checking whether to build shared libraries... yes
checking whether to build static libraries... no
checking how to run the C++ preprocessor... x86_64-alt-linux-g++ -E
checking for ld used by x86_64-alt-linux-g++... /usr/bin/ld -m elf_x86_64
checking if the linker (/usr/bin/ld -m elf_x86_64) is GNU ld... yes
checking whether the x86_64-alt-linux-g++ linker (/usr/bin/ld -m elf_x86_64) supports shared libraries... yes
checking for x86_64-alt-linux-g++ option to produce PIC... -fPIC -DPIC
checking if x86_64-alt-linux-g++ PIC flag -fPIC -DPIC works... yes
checking if x86_64-alt-linux-g++ static flag -static works... no
checking if x86_64-alt-linux-g++ supports -c -o file.o... yes
checking if x86_64-alt-linux-g++ supports -c -o file.o... (cached) yes
checking whether the x86_64-alt-linux-g++ linker (/usr/bin/ld -m elf_x86_64) supports shared libraries... yes
checking dynamic linker characteristics... (cached) GNU/Linux ld.so
checking how to hardcode library paths into programs... immediate
checking for ANSI C header files... (cached) yes
checking float.h usability... yes
checking float.h presence... yes
checking for float.h... yes
checking limits.h usability... yes
checking limits.h presence... yes
checking for limits.h... yes
checking stddef.h usability... yes
checking stddef.h presence... yes
checking for stddef.h... yes
checking for stdlib.h... (cached) yes
checking for string.h... (cached) yes
checking sys/time.h usability... yes
checking sys/time.h presence... yes
checking for sys/time.h... yes
checking for stdint.h... (cached) yes
checking pthread.h usability... yes
checking pthread.h presence... yes
checking for pthread.h... yes
checking for egrep... (cached) /bin/grep -E
checking for a sed that does not truncate output... (cached) /bin/sed
## --------------------------------------- ##
##           START LINBOX CONFIG           ##
## --------------------------------------- ##
checking for family name of compiler... gcc
checking whether x86_64-alt-linux-g++ supports C++11 features by default... yes
---------------------------------------
checking whether to enable debugging options in the library... no
checking whether to enable profiling everything in the library... no
checking whether to enable warnings when compiling the library... no
checking whether C++ compiler accepts -march=native... yes
configure: "Adding '-march=native' to OPTIM_FLAGS"
---------------------------------------
checking size of char... 1
checking size of short... 2
checking size of int... 4
checking size of long... 8
checking size of long long... 8
checking size of __int64_t... 8
checking for __int128_t... yes
checking whether byte ordering is bigendian... no
---------------------------------------
Default path = /usr /usr/local 
checking whether to compile the drivers... no
checking for x86_64-alt-linux-pkg-config... no
checking for pkg-config... /usr/bin/pkg-config
checking pkg-config is at least version 0.9.0... yes
checking for fflas-ffpack >= 2.5.0... yes
---------------------------------------
checking for LAPACK in fflas-ffpack... no
checking for NTL >= 5.0... found
checking for MPFR... found
checking for FPLLL >= 4.0.1... not found
checking for IML... found
checking for FLINT... found
---------------------------------------
checking whether gnuplot works... no

You must have gnuplot installed to create benchmark  
graphics for LinBox. Download the appropriate package
for your distribution, or get the source tarball from
http://www.gnuplot.info/download.html                
checking whether ps2pdf works... no

You must have ps2pdf installed to create pdf benchmarks
graphics for LinBox. Download the appropriate package  
for your distribution, or get the source tarball from  
http://pages.cs.wisc.edu/~ghost/                       
checking if tinyxml2 is available... yes
checking whether to build documentation... no
checking whether dot works... no
---------------------------------------
checking for OpenCL... not found
checking for MPI... not found
---------------------------------------
---------------------------------------
LINBOX_CXXFLAGS =  -O2 -march=native -Wall -DNDEBUG -UDEBUG
## --------------------------------------- ##
##            END LINBOX CONFIG            ##
## --------------------------------------- ##
checking that generated files are newer than configure... done
configure: creating ./config.status
config.status: creating Makefile
config.status: creating linbox-config
config.status: creating examples/Makefile
config.status: creating examples/data/Makefile
config.status: creating doc/Makefile
config.status: creating linbox/Makefile
config.status: creating linbox/algorithms/Makefile
config.status: creating linbox/algorithms/dixon-solver/Makefile
config.status: creating linbox/algorithms/gauss/Makefile
config.status: creating linbox/algorithms/matrix-blas3/Makefile
config.status: creating linbox/algorithms/opencl-kernels/Makefile
config.status: creating linbox/algorithms/polynomial-matrix/Makefile
config.status: creating linbox/blackbox/Makefile
config.status: creating linbox/element/Makefile
config.status: creating linbox/field/Makefile
config.status: creating linbox/matrix/Makefile
config.status: creating linbox/matrix/sparsematrix/Makefile
config.status: creating linbox/matrix/densematrix/Makefile
config.status: creating linbox/matrix/matrixdomain/Makefile
config.status: creating linbox/matrix/sliced3/Makefile
config.status: creating linbox/randiter/Makefile
config.status: creating linbox/ring/Makefile
config.status: creating linbox/ring/ntl/Makefile
config.status: creating linbox/ring/modular/Makefile
config.status: creating linbox/solutions/Makefile
config.status: creating linbox/solutions/solve/Makefile
config.status: creating linbox/solutions/echelon/Makefile
config.status: creating linbox/util/Makefile
config.status: creating linbox/util/formats/Makefile
config.status: creating linbox/vector/Makefile
config.status: creating linbox/polynomial/Makefile
config.status: creating tests/Makefile
config.status: creating tests/data/Makefile
config.status: creating tests/matrix/Makefile
config.status: creating interfaces/Makefile
config.status: creating interfaces/driver/Makefile
config.status: creating interfaces/maple/Makefile
config.status: creating interfaces/kaapi/Makefile
config.status: creating benchmarks/Makefile
config.status: creating benchmarks/data/Makefile
config.status: creating benchmarks/matrix/Makefile
config.status: creating linbox.pc
config.status: creating config.h
config.status: executing linbox/config.h commands
config.status: creating linbox/config.h - prefix __LINBOX for config.h defines
config.status: executing depfiles commands
config.status: executing libtool commands
configure: WARNING: unrecognized options: --without-included-gettext, --disable-sse3, --disable-ssse3, --disable-sse41, --disable-sse42, --disable-avx, --disable-avx2, --disable-fma, --disable-fma4, --enable-gmp, --enable-openblas, --with-blas-libs
+ make -j16
make  all-recursive
Making all in linbox
Making all in util
Making all in formats
make[4]: Nothing to be done for 'all'.
make[4]: Entering directory '/usr/src/RPM/BUILD/linbox-1.7.0/linbox/util'
/bin/sh ../../libtool  --tag=CXX   --mode=compile x86_64-alt-linux-g++ -DHAVE_CONFIG_H -I. -I../..  -I../..  -O2 -march=native -Wall -DNDEBUG -UDEBUG  -pthread      -pipe -frecord-gcc-switches -Wall -g -O2 -flto=auto -c -o error.lo error.C
libtool: compile:  x86_64-alt-linux-g++ -DHAVE_CONFIG_H -I. -I../.. -I../.. -O2 -march=native -Wall -DNDEBUG -UDEBUG -pthread -pipe -frecord-gcc-switches -Wall -g -O2 -flto=auto -c error.C  -fPIC -DPIC -o .libs/error.o
make[4]: Leaving directory '/usr/src/RPM/BUILD/linbox-1.7.0/linbox/util'
make[4]: Entering directory '/usr/src/RPM/BUILD/linbox-1.7.0/linbox/util'
/bin/sh ../../libtool  --tag=CXX   --mode=compile x86_64-alt-linux-g++ -DHAVE_CONFIG_H -I. -I../..  -I../..  -O2 -march=native -Wall -DNDEBUG -UDEBUG  -pthread      -pipe -frecord-gcc-switches -Wall -g -O2 -flto=auto -c -o debug.lo debug.C
libtool: compile:  x86_64-alt-linux-g++ -DHAVE_CONFIG_H -I. -I../.. -I../.. -O2 -march=native -Wall -DNDEBUG -UDEBUG -pthread -pipe -frecord-gcc-switches -Wall -g -O2 -flto=auto -c debug.C  -fPIC -DPIC -o .libs/debug.o
make[4]: Leaving directory '/usr/src/RPM/BUILD/linbox-1.7.0/linbox/util'
make[4]: Entering directory '/usr/src/RPM/BUILD/linbox-1.7.0/linbox/util'
/bin/sh ../../libtool  --tag=CXX   --mode=link x86_64-alt-linux-g++ -O2 -march=native -Wall -DNDEBUG -UDEBUG  -pthread      -pipe -frecord-gcc-switches -Wall -g -O2 -flto=auto   -o libutil.la  error.lo debug.lo  -L/usr/lib64 -lgivaro -lopenblas -lgmp
libtool: link: ar cr .libs/libutil.a .libs/error.o .libs/debug.o 
libtool: link: ranlib .libs/libutil.a
libtool: link: ( cd ".libs" && rm -f "libutil.la" && ln -s "../libutil.la" "libutil.la" )
make[4]: Leaving directory '/usr/src/RPM/BUILD/linbox-1.7.0/linbox/util'
Making all in element
make[3]: Nothing to be done for 'all'.
Making all in field
make[3]: Nothing to be done for 'all'.
Making all in randiter
make[3]: Entering directory '/usr/src/RPM/BUILD/linbox-1.7.0/linbox/randiter'
/bin/sh ../../libtool  --tag=CXX   --mode=compile x86_64-alt-linux-g++ -DHAVE_CONFIG_H -I. -I../..  -I../..  -O2 -march=native -Wall -DNDEBUG -UDEBUG  -pthread      -pipe -frecord-gcc-switches -Wall -g -O2 -flto=auto -c -o mersenne-twister.lo mersenne-twister.C
libtool: compile:  x86_64-alt-linux-g++ -DHAVE_CONFIG_H -I. -I../.. -I../.. -O2 -march=native -Wall -DNDEBUG -UDEBUG -pthread -pipe -frecord-gcc-switches -Wall -g -O2 -flto=auto -c mersenne-twister.C  -fPIC -DPIC -o .libs/mersenne-twister.o
make[3]: Leaving directory '/usr/src/RPM/BUILD/linbox-1.7.0/linbox/randiter'
make[3]: Entering directory '/usr/src/RPM/BUILD/linbox-1.7.0/linbox/randiter'
/bin/sh ../../libtool  --tag=CXX   --mode=link x86_64-alt-linux-g++ -O2 -march=native -Wall -DNDEBUG -UDEBUG  -pthread      -pipe -frecord-gcc-switches -Wall -g -O2 -flto=auto   -o libranditer.la  mersenne-twister.lo  -L/usr/lib64 -lgivaro -lopenblas -lgmp
libtool: link: ar cr .libs/libranditer.a .libs/mersenne-twister.o 
libtool: link: ranlib .libs/libranditer.a
libtool: link: ( cd ".libs" && rm -f "libranditer.la" && ln -s "../libranditer.la" "libranditer.la" )
make[3]: Leaving directory '/usr/src/RPM/BUILD/linbox-1.7.0/linbox/randiter'
Making all in vector
make[3]: Nothing to be done for 'all'.
Making all in matrix
Making all in sparsematrix
make[4]: Nothing to be done for 'all'.
Making all in densematrix
make[4]: Nothing to be done for 'all'.
Making all in matrixdomain
make[4]: Nothing to be done for 'all'.
Making all in sliced3
make[4]: Nothing to be done for 'all'.
make[4]: Nothing to be done for 'all-am'.
Making all in blackbox
make[3]: Nothing to be done for 'all'.
Making all in algorithms
Making all in dixon-solver
make[4]: Nothing to be done for 'all'.
Making all in gauss
make[4]: Nothing to be done for 'all'.
Making all in opencl-kernels
make[4]: Nothing to be done for 'all'.
Making all in matrix-blas3
make[4]: Nothing to be done for 'all'.
Making all in polynomial-matrix
make[4]: Nothing to be done for 'all'.
make[4]: Entering directory '/usr/src/RPM/BUILD/linbox-1.7.0/linbox/algorithms'
/bin/sh ../../libtool  --tag=CXX   --mode=compile x86_64-alt-linux-g++ -DHAVE_CONFIG_H -I. -I../..  -I../..  -O2 -march=native -Wall -DNDEBUG -UDEBUG  -pthread      -pipe -frecord-gcc-switches -Wall -g -O2 -flto=auto -c -o diophantine-solver.lo diophantine-solver.C
libtool: compile:  x86_64-alt-linux-g++ -DHAVE_CONFIG_H -I. -I../.. -I../.. -O2 -march=native -Wall -DNDEBUG -UDEBUG -pthread -pipe -frecord-gcc-switches -Wall -g -O2 -flto=auto -c diophantine-solver.C  -fPIC -DPIC -o .libs/diophantine-solver.o
In file included from ../../linbox/matrix/dense-matrix.h:37,
                 from ../../linbox/solutions/methods.h:26,
                 from ../../linbox/algorithms/rational-solver.h:41,
                 from ../../linbox/algorithms/diophantine-solver.h:29,
                 from diophantine-solver.C:26:
../../linbox/vector/vector-traits.h:153:29: warning: 'template<class _Arg1, class _Arg2, class _Result> struct std::binary_function' is deprecated [-Wdeprecated-declarations]
  153 |                 public std::binary_function<const std::pair<size_t, Element>&, const std::pair<size_t, Element>&, bool > {
      |                             ^~~~~~~~~~~~~~~
In file included from /usr/include/c++/13/string:49,
                 from /usr/include/c++/13/bits/locale_classes.h:40,
                 from /usr/include/c++/13/bits/ios_base.h:41,
                 from /usr/include/c++/13/ios:44,
                 from /usr/include/c++/13/ostream:40,
                 from /usr/include/c++/13/iostream:41,
                 from ../../linbox/linbox-config.h:45,
                 from diophantine-solver.C:25:
/usr/include/c++/13/bits/stl_function.h:131:12: note: declared here
  131 |     struct binary_function
      |            ^~~~~~~~~~~~~~~
In file included from ../../linbox/vector/bit-vector.h:191,
                 from ../../linbox/field/gf2.h:39,
                 from ../../linbox/vector/stream-gf2.h:77,
                 from ../../linbox/vector/stream.h:872,
                 from ../../linbox/matrix/densematrix/blas-matrix.h:43,
                 from ../../linbox/matrix/dense-matrix.h:85:
../../linbox/vector/bit-vector.inl:342:55: warning: 'template<class _Category, class _Tp, class _Distance, class _Pointer, class _Reference> struct std::iterator' is deprecated [-Wdeprecated-declarations]
  342 |         class BitVector::const_iterator : public std::iterator <std::random_access_iterator_tag, bool> {
      |                                                       ^~~~~~~~
In file included from /usr/include/c++/13/bits/stl_algobase.h:65,
                 from /usr/include/c++/13/bits/specfun.h:43,
                 from /usr/include/c++/13/cmath:3699,
                 from ../../linbox/linbox-config.h:42:
/usr/include/c++/13/bits/stl_iterator_base_types.h:127:34: note: declared here
  127 |     struct _GLIBCXX17_DEPRECATED iterator
      |                                  ^~~~~~~~
make[4]: Leaving directory '/usr/src/RPM/BUILD/linbox-1.7.0/linbox/algorithms'
make[4]: Entering directory '/usr/src/RPM/BUILD/linbox-1.7.0/linbox/algorithms'
/bin/sh ../../libtool  --tag=CXX   --mode=link x86_64-alt-linux-g++ -O2 -march=native -Wall -DNDEBUG -UDEBUG  -pthread      -pipe -frecord-gcc-switches -Wall -g -O2 -flto=auto   -o libalgorithms.la  diophantine-solver.lo  -L/usr/lib64 -lgivaro -lopenblas -lgmp
libtool: link: ar cr .libs/libalgorithms.a .libs/diophantine-solver.o 
libtool: link: ranlib .libs/libalgorithms.a
libtool: link: ( cd ".libs" && rm -f "libalgorithms.la" && ln -s "../libalgorithms.la" "libalgorithms.la" )
make[4]: Leaving directory '/usr/src/RPM/BUILD/linbox-1.7.0/linbox/algorithms'
Making all in solutions
Making all in solve
make[4]: Nothing to be done for 'all'.
Making all in echelon
make[4]: Nothing to be done for 'all'.
make[4]: Nothing to be done for 'all-am'.
Making all in ring
Making all in ntl
make[4]: Nothing to be done for 'all'.
Making all in modular
make[4]: Nothing to be done for 'all'.
make[4]: Nothing to be done for 'all-am'.
Making all in polynomial
make[3]: Nothing to be done for 'all'.
make[3]: Entering directory '/usr/src/RPM/BUILD/linbox-1.7.0/linbox'
/bin/sh ../libtool  --tag=CXX   --mode=compile x86_64-alt-linux-g++ -DHAVE_CONFIG_H -I. -I..  -I../linbox  -O2 -march=native -Wall -DNDEBUG -UDEBUG  -pthread      -pipe -frecord-gcc-switches -Wall -g -O2 -flto=auto -c -o dummy.lo dummy.C
libtool: compile:  x86_64-alt-linux-g++ -DHAVE_CONFIG_H -I. -I.. -I../linbox -O2 -march=native -Wall -DNDEBUG -UDEBUG -pthread -pipe -frecord-gcc-switches -Wall -g -O2 -flto=auto -c dummy.C  -fPIC -DPIC -o .libs/dummy.o
make[3]: Leaving directory '/usr/src/RPM/BUILD/linbox-1.7.0/linbox'
make[3]: Entering directory '/usr/src/RPM/BUILD/linbox-1.7.0/linbox'
/bin/sh ../libtool  --tag=CXX   --mode=link x86_64-alt-linux-g++ -O2 -march=native -Wall -DNDEBUG -UDEBUG  -pthread      -pipe -frecord-gcc-switches -Wall -g -O2 -flto=auto   -o liblinbox.la -rpath /usr/lib64 dummy.lo util/libutil.la randiter/libranditer.la algorithms/libalgorithms.la -lntl -lmpfr  -liml -lflint  -L/usr/lib64 -lgivaro -lopenblas -lgmp
libtool: link: x86_64-alt-linux-g++  -fPIC -DPIC -shared -nostdlib /usr/lib64/gcc/x86_64-alt-linux/13/../../../../lib64/crti.o /usr/lib64/gcc/x86_64-alt-linux/13/crtbeginS.o  .libs/dummy.o  -Wl,--whole-archive util/.libs/libutil.a randiter/.libs/libranditer.a algorithms/.libs/libalgorithms.a -Wl,--no-whole-archive  -L/usr/lib64 -lntl -lmpfr -liml -lflint -lgivaro -lopenblas -lgmp -L/usr/lib64/gcc/x86_64-alt-linux/13 -L/usr/lib64/gcc/x86_64-alt-linux/13/../../../../lib64 -L/lib/../lib64 -L/usr/lib/../lib64 -L/usr/lib64/gcc/x86_64-alt-linux/13/../../.. -lstdc++ -lm -lc -lgcc_s /usr/lib64/gcc/x86_64-alt-linux/13/crtendS.o /usr/lib64/gcc/x86_64-alt-linux/13/../../../../lib64/crtn.o  -O2 -march=native -g -O2 -flto=auto   -pthread -Wl,-soname -Wl,liblinbox.so.0 -o .libs/liblinbox.so.0.0.0
In function 'fflas_new',
    inlined from 'cyclic_shift_row' at /usr/include/fflas-ffpack/ffpack/ffpack_permutation.inl:698:62,
    inlined from 'PLUQ_basecaseCrout' at /usr/include/fflas-ffpack/ffpack/ffpack_pluq.inl:388:37,
    inlined from '_PLUQ.constprop' at /usr/include/fflas-ffpack/ffpack/ffpack_pluq.inl:482:38:
/usr/include/fflas-ffpack/utils/fflas_memory.h:64:20: warning: argument 1 value '18446744073709551615' exceeds maximum object size 9223372036854775807 [-Walloc-size-larger-than=]
   64 |             return new typename Field::Element[m];
      |                    ^
/usr/include/c++/13/new: In function '_PLUQ.constprop':
/usr/include/c++/13/new:128:26: note: in a call to allocation function 'operator new []' declared here
  128 | _GLIBCXX_NODISCARD void* operator new[](std::size_t) _GLIBCXX_THROW (std::bad_alloc)
      |                          ^
libtool: link: (cd ".libs" && rm -f "liblinbox.so.0" && ln -s "liblinbox.so.0.0.0" "liblinbox.so.0")
libtool: link: (cd ".libs" && rm -f "liblinbox.so" && ln -s "liblinbox.so.0.0.0" "liblinbox.so")
libtool: link: ( cd ".libs" && rm -f "liblinbox.la" && ln -s "../liblinbox.la" "liblinbox.la" )
make[3]: Leaving directory '/usr/src/RPM/BUILD/linbox-1.7.0/linbox'
Making all in benchmarks
Making all in data
make[3]: Nothing to be done for 'all'.
Making all in matrix
make[3]: Nothing to be done for 'all'.
make[3]: Entering directory '/usr/src/RPM/BUILD/linbox-1.7.0/benchmarks'
/bin/sh ../libtool  --tag=CXX   --mode=compile x86_64-alt-linux-g++ -DHAVE_CONFIG_H -I. -I..  -I.. -DDISABLE_COMMENTATOR -DLinBoxSrcOnly  -O2 -march=native -Wall -DNDEBUG -UDEBUG  -pthread      -pipe -frecord-gcc-switches -Wall -g -O2 -flto=auto -c -o benchmark.lo benchmark.C
libtool: compile:  x86_64-alt-linux-g++ -DHAVE_CONFIG_H -I. -I.. -I.. -DDISABLE_COMMENTATOR -DLinBoxSrcOnly -O2 -march=native -Wall -DNDEBUG -UDEBUG -pthread -pipe -frecord-gcc-switches -Wall -g -O2 -flto=auto -c benchmark.C  -fPIC -DPIC -o .libs/benchmark.o
In file included from ../linbox/vector/vector-domain.h:67,
                 from ../tests/test-common.h:46,
                 from benchmark.h:50,
                 from benchmark.C:36:
../linbox/vector/vector-traits.h:153:29: warning: 'template<class _Arg1, class _Arg2, class _Result> struct std::binary_function' is deprecated [-Wdeprecated-declarations]
  153 |                 public std::binary_function<const std::pair<size_t, Element>&, const std::pair<size_t, Element>&, bool > {
      |                             ^~~~~~~~~~~~~~~
In file included from /usr/include/c++/13/string:49,
                 from /usr/include/c++/13/bits/locale_classes.h:40,
                 from /usr/include/c++/13/bits/ios_base.h:41,
                 from /usr/include/c++/13/ios:44,
                 from /usr/include/c++/13/ostream:40,
                 from /usr/include/c++/13/iostream:41,
                 from ../linbox/linbox-config.h:45,
                 from benchmark.C:34:
/usr/include/c++/13/bits/stl_function.h:131:12: note: declared here
  131 |     struct binary_function
      |            ^~~~~~~~~~~~~~~
In file included from ../linbox/vector/bit-vector.h:191,
                 from ../linbox/field/gf2.h:39,
                 from ../linbox/vector/vector-domain-gf2.h:59,
                 from ../linbox/vector/vector-domain.h:1336:
../linbox/vector/bit-vector.inl:342:55: warning: 'template<class _Category, class _Tp, class _Distance, class _Pointer, class _Reference> struct std::iterator' is deprecated [-Wdeprecated-declarations]
  342 |         class BitVector::const_iterator : public std::iterator <std::random_access_iterator_tag, bool> {
      |                                                       ^~~~~~~~
In file included from /usr/include/c++/13/bits/stl_algobase.h:65,
                 from /usr/include/c++/13/bits/specfun.h:43,
                 from /usr/include/c++/13/cmath:3699,
                 from ../linbox/linbox-config.h:42:
/usr/include/c++/13/bits/stl_iterator_base_types.h:127:34: note: declared here
  127 |     struct _GLIBCXX17_DEPRECATED iterator
      |                                  ^~~~~~~~
make[3]: Leaving directory '/usr/src/RPM/BUILD/linbox-1.7.0/benchmarks'
make[3]: Entering directory '/usr/src/RPM/BUILD/linbox-1.7.0/benchmarks'
/bin/sh ../libtool  --tag=CXX   --mode=link x86_64-alt-linux-g++ -O2 -march=native -Wall -DNDEBUG -UDEBUG  -pthread      -pipe -frecord-gcc-switches -Wall -g -O2 -flto=auto   -o libbenchmarks.la  benchmark.lo  -L/usr/lib64 -lgivaro -lopenblas -lgmp
libtool: link: ar cr .libs/libbenchmarks.a .libs/benchmark.o 
libtool: link: ranlib .libs/libbenchmarks.a
libtool: link: ( cd ".libs" && rm -f "libbenchmarks.la" && ln -s "../libbenchmarks.la" "libbenchmarks.la" )
make[3]: Leaving directory '/usr/src/RPM/BUILD/linbox-1.7.0/benchmarks'
Making all in tests
Making all in data
make[3]: Nothing to be done for 'all'.
Making all in matrix
make[3]: Nothing to be done for 'all'.
make[3]: Nothing to be done for 'all-am'.
Making all in interfaces
Making all in driver
make[3]: Nothing to be done for 'all'.
Making all in kaapi
make[3]: Nothing to be done for 'all'.
Making all in maple
make[3]: Nothing to be done for 'all'.
make[3]: Nothing to be done for 'all-am'.
Making all in doc
make[2]: Nothing to be done for 'all'.
Making all in examples
Making all in data
make[3]: Nothing to be done for 'all'.
make[3]: Nothing to be done for 'all-am'.
+ exit 0
Executing(%install): /bin/sh -e /usr/src/tmp/rpm-tmp.88808
+ umask 022
+ /bin/mkdir -p /usr/src/RPM/BUILD
+ cd /usr/src/RPM/BUILD
+ /bin/chmod -Rf u+rwX -- /usr/src/tmp/linbox-buildroot
+ :
+ /bin/rm -rf -- /usr/src/tmp/linbox-buildroot
+ PATH=/usr/libexec/rpm-build:/usr/src/bin:/bin:/usr/bin:/usr/X11R6/bin:/usr/games
+ cd linbox-1.7.0
+ make 'INSTALL=/usr/libexec/rpm-build/install -p' install DESTDIR=/usr/src/tmp/linbox-buildroot
make: Entering directory '/usr/src/RPM/BUILD/linbox-1.7.0'
Making install in linbox
make[1]: Entering directory '/usr/src/RPM/BUILD/linbox-1.7.0/linbox'
Making install in util
make[2]: Entering directory '/usr/src/RPM/BUILD/linbox-1.7.0/linbox/util'
Making install in formats
make[3]: Entering directory '/usr/src/RPM/BUILD/linbox-1.7.0/linbox/util/formats'
make[4]: Entering directory '/usr/src/RPM/BUILD/linbox-1.7.0/linbox/util/formats'
make[4]: Nothing to be done for 'install-exec-am'.
 /bin/mkdir -p '/usr/src/tmp/linbox-buildroot/usr/include/linbox/util/formats'
 /usr/libexec/rpm-build/install -p -m 644 generic-dense.h maple.h matrix-market.h sms.h matrix-stream-readers.h sparse-row.h '/usr/src/tmp/linbox-buildroot/usr/include/linbox/util/formats'
make[4]: Leaving directory '/usr/src/RPM/BUILD/linbox-1.7.0/linbox/util/formats'
make[3]: Leaving directory '/usr/src/RPM/BUILD/linbox-1.7.0/linbox/util/formats'
make[3]: Entering directory '/usr/src/RPM/BUILD/linbox-1.7.0/linbox/util'
make[4]: Entering directory '/usr/src/RPM/BUILD/linbox-1.7.0/linbox/util'
make[4]: Nothing to be done for 'install-exec-am'.
 /bin/mkdir -p '/usr/src/tmp/linbox-buildroot/usr/include/linbox/util'
 /usr/libexec/rpm-build/install -p -m 644 args-parser.h commentator.h commentator.inl contracts.h debug.h error.h field-axpy.h iml_wrapper.h matrix-stream.h matrix-stream.inl mpicpp.h mpicpp.inl prime-stream.h serialization.h serialization.inl timer.h write-mm.h '/usr/src/tmp/linbox-buildroot/usr/include/linbox/util'
make[4]: Leaving directory '/usr/src/RPM/BUILD/linbox-1.7.0/linbox/util'
make[3]: Leaving directory '/usr/src/RPM/BUILD/linbox-1.7.0/linbox/util'
make[2]: Leaving directory '/usr/src/RPM/BUILD/linbox-1.7.0/linbox/util'
Making install in element
make[2]: Entering directory '/usr/src/RPM/BUILD/linbox-1.7.0/linbox/element'
make[3]: Entering directory '/usr/src/RPM/BUILD/linbox-1.7.0/linbox/element'
make[3]: Nothing to be done for 'install-exec-am'.
 /bin/mkdir -p '/usr/src/tmp/linbox-buildroot/usr/include/linbox/element'
 /usr/libexec/rpm-build/install -p -m 644 abstract.h archetype.h envelope.h gmp-rational.h '/usr/src/tmp/linbox-buildroot/usr/include/linbox/element'
make[3]: Leaving directory '/usr/src/RPM/BUILD/linbox-1.7.0/linbox/element'
make[2]: Leaving directory '/usr/src/RPM/BUILD/linbox-1.7.0/linbox/element'
Making install in field
make[2]: Entering directory '/usr/src/RPM/BUILD/linbox-1.7.0/linbox/field'
make[3]: Entering directory '/usr/src/RPM/BUILD/linbox-1.7.0/linbox/field'
make[3]: Nothing to be done for 'install-exec-am'.
 /bin/mkdir -p '/usr/src/tmp/linbox-buildroot/usr/include/linbox/field'
 /usr/libexec/rpm-build/install -p -m 644 field-documentation.h field-traits.h rebind.h abstract.h archetype.h envelope.h param-fuzzy.h gmp-rational.h gf2.h gf2.inl hom.h map.h multimod-field.h '/usr/src/tmp/linbox-buildroot/usr/include/linbox/field'
make[3]: Leaving directory '/usr/src/RPM/BUILD/linbox-1.7.0/linbox/field'
make[2]: Leaving directory '/usr/src/RPM/BUILD/linbox-1.7.0/linbox/field'
Making install in randiter
make[2]: Entering directory '/usr/src/RPM/BUILD/linbox-1.7.0/linbox/randiter'
make[3]: Entering directory '/usr/src/RPM/BUILD/linbox-1.7.0/linbox/randiter'
make[3]: Nothing to be done for 'install-exec-am'.
 /bin/mkdir -p '/usr/src/tmp/linbox-buildroot/usr/include/linbox/randiter'
 /usr/libexec/rpm-build/install -p -m 644 abstract.h archetype.h envelope.h gmp-rational.h param-fuzzy.h modular-balanced.h modular-crooked.h gf2.h mersenne-twister.h random-prime.h gmp-random-prime.h random-fftprime.h multimod-randomprime.h ntl-zz.h '/usr/src/tmp/linbox-buildroot/usr/include/linbox/randiter'
make[3]: Leaving directory '/usr/src/RPM/BUILD/linbox-1.7.0/linbox/randiter'
make[2]: Leaving directory '/usr/src/RPM/BUILD/linbox-1.7.0/linbox/randiter'
Making install in vector
make[2]: Entering directory '/usr/src/RPM/BUILD/linbox-1.7.0/linbox/vector'
make[3]: Entering directory '/usr/src/RPM/BUILD/linbox-1.7.0/linbox/vector'
make[3]: Nothing to be done for 'install-exec-am'.
 /bin/mkdir -p '/usr/src/tmp/linbox-buildroot/usr/include/linbox/vector'
 /usr/libexec/rpm-build/install -p -m 644 pair.h light_container.h sparse.h vector-traits.h vector.h subvector.h subiterator.h reverse.h random.h stream.h stream-gf2.h bit-vector.h bit-vector.inl blas-vector.h blas-subvector.h vector-domain.h vector-domain-gf2.h vector-domain.inl vector-domain-gf2.inl '/usr/src/tmp/linbox-buildroot/usr/include/linbox/vector'
make[3]: Leaving directory '/usr/src/RPM/BUILD/linbox-1.7.0/linbox/vector'
make[2]: Leaving directory '/usr/src/RPM/BUILD/linbox-1.7.0/linbox/vector'
Making install in matrix
make[2]: Entering directory '/usr/src/RPM/BUILD/linbox-1.7.0/linbox/matrix'
Making install in sparsematrix
make[3]: Entering directory '/usr/src/RPM/BUILD/linbox-1.7.0/linbox/matrix/sparsematrix'
make[4]: Entering directory '/usr/src/RPM/BUILD/linbox-1.7.0/linbox/matrix/sparsematrix'
make[4]: Nothing to be done for 'install-exec-am'.
 /bin/mkdir -p '/usr/src/tmp/linbox-buildroot/usr/include/linbox/matrix/sparsematrix'
 /usr/libexec/rpm-build/install -p -m 644 sparse-associative-vector.h sparse-associative-vector.inl sparse-coo-matrix.h sparse-coo-implicit-matrix.h sparse-csr-matrix.h sparse-domain.h sparse-ell-matrix.h sparse-ellr-matrix.h sparse-generic.h sparse-generic.inl sparse-hyb-matrix.h sparse-map-map-matrix.h sparse-map-map-matrix.inl sparse-parallel-vector.h sparse-parallel-vector.inl sparse-sequence-vector.h sparse-sequence-vector.inl sparse-tpl-matrix.h sparse-tpl-matrix.inl sparse-tpl-matrix-omp.h sparse-tpl-matrix-omp.inl read-write-sparse.h triples-coord.h read-write-sparse.inl '/usr/src/tmp/linbox-buildroot/usr/include/linbox/matrix/sparsematrix'
make[4]: Leaving directory '/usr/src/RPM/BUILD/linbox-1.7.0/linbox/matrix/sparsematrix'
make[3]: Leaving directory '/usr/src/RPM/BUILD/linbox-1.7.0/linbox/matrix/sparsematrix'
Making install in densematrix
make[3]: Entering directory '/usr/src/RPM/BUILD/linbox-1.7.0/linbox/matrix/densematrix'
make[4]: Entering directory '/usr/src/RPM/BUILD/linbox-1.7.0/linbox/matrix/densematrix'
make[4]: Nothing to be done for 'install-exec-am'.
 /bin/mkdir -p '/usr/src/tmp/linbox-buildroot/usr/include/linbox/matrix/densematrix'
 /usr/libexec/rpm-build/install -p -m 644 blas-matrix.h blas-matrix.inl blas-matrix-iterator.h blas-submatrix.h blas-submatrix.inl blas-transposed-matrix.h blas-matrix-multimod.h '/usr/src/tmp/linbox-buildroot/usr/include/linbox/matrix/densematrix'
make[4]: Leaving directory '/usr/src/RPM/BUILD/linbox-1.7.0/linbox/matrix/densematrix'
make[3]: Leaving directory '/usr/src/RPM/BUILD/linbox-1.7.0/linbox/matrix/densematrix'
Making install in matrixdomain
make[3]: Entering directory '/usr/src/RPM/BUILD/linbox-1.7.0/linbox/matrix/matrixdomain'
make[4]: Entering directory '/usr/src/RPM/BUILD/linbox-1.7.0/linbox/matrix/matrixdomain'
make[4]: Nothing to be done for 'install-exec-am'.
 /bin/mkdir -p '/usr/src/tmp/linbox-buildroot/usr/include/linbox/matrix/matrixdomain'
 /usr/libexec/rpm-build/install -p -m 644 matrix-domain.h matrix-domain.inl matrix-domain-gf2.h blas-matrix-domain.h blas-matrix-domain-mul.inl blas-matrix-domain.inl plain-domain.h opencl-domain.h opencl-domain.inl opencl-domain-util.inl opencl-domain-memory.inl opencl-domain-factory.h '/usr/src/tmp/linbox-buildroot/usr/include/linbox/matrix/matrixdomain'
make[4]: Leaving directory '/usr/src/RPM/BUILD/linbox-1.7.0/linbox/matrix/matrixdomain'
make[3]: Leaving directory '/usr/src/RPM/BUILD/linbox-1.7.0/linbox/matrix/matrixdomain'
Making install in sliced3
make[3]: Entering directory '/usr/src/RPM/BUILD/linbox-1.7.0/linbox/matrix/sliced3'
make[4]: Entering directory '/usr/src/RPM/BUILD/linbox-1.7.0/linbox/matrix/sliced3'
make[4]: Nothing to be done for 'install-exec-am'.
 /bin/mkdir -p '/usr/src/tmp/linbox-buildroot/usr/include/linbox/matrix/sliced3'
 /usr/libexec/rpm-build/install -p -m 644 dense-matrix.h dense-sliced.h dense-sliced.inl sliced-domain.h sliced-stepper.h submat-iterator.h '/usr/src/tmp/linbox-buildroot/usr/include/linbox/matrix/sliced3'
make[4]: Leaving directory '/usr/src/RPM/BUILD/linbox-1.7.0/linbox/matrix/sliced3'
make[3]: Leaving directory '/usr/src/RPM/BUILD/linbox-1.7.0/linbox/matrix/sliced3'
make[3]: Entering directory '/usr/src/RPM/BUILD/linbox-1.7.0/linbox/matrix'
make[4]: Entering directory '/usr/src/RPM/BUILD/linbox-1.7.0/linbox/matrix'
make[4]: Nothing to be done for 'install-exec-am'.
 /bin/mkdir -p '/usr/src/tmp/linbox-buildroot/usr/include/linbox/matrix'
 /usr/libexec/rpm-build/install -p -m 644 archetype.h matrix-category.h matrix-traits.h transpose-matrix.h plain-matrix.h dense-matrix.h matrix-domain.h sparse-matrix.h sparse-formats.h factorized-matrix.h factorized-matrix.inl permutation-matrix.h permutation-matrix.inl abnormal-matrix.h abnormal-helpers.h random-matrix.h random-matrix.inl sliced3.h polynomial-matrix.h '/usr/src/tmp/linbox-buildroot/usr/include/linbox/matrix'
make[4]: Leaving directory '/usr/src/RPM/BUILD/linbox-1.7.0/linbox/matrix'
make[3]: Leaving directory '/usr/src/RPM/BUILD/linbox-1.7.0/linbox/matrix'
make[2]: Leaving directory '/usr/src/RPM/BUILD/linbox-1.7.0/linbox/matrix'
Making install in blackbox
make[2]: Entering directory '/usr/src/RPM/BUILD/linbox-1.7.0/linbox/blackbox'
make[3]: Entering directory '/usr/src/RPM/BUILD/linbox-1.7.0/linbox/blackbox'
make[3]: Nothing to be done for 'install-exec-am'.
 /bin/mkdir -p '/usr/src/tmp/linbox-buildroot/usr/include/linbox/blackbox'
 /usr/libexec/rpm-build/install -p -m 644 apply.h archetype.h bb.h blackbox.h blackbox-interface.h blockbb.h block-hankel.h block-hankel-inverse.h block-compose.h block-toeplitz.h butterfly.h butterfly.inl companion.h compose.h csf.h csf.inl diagonal-gf2.h diagonal.h dif.h direct-sum.h factory.h fflas-csr.h fibb.h fibb-product.h frobenius.h hilbert.h inverse.h jit-matrix.h lambda-sparse.h matrix-blackbox.h moore-penrose.h null-matrix.h pascal.h permutation.h polynomial.h quad-matrix.h random-matrix.h random-matrix-traits.h rational-matrix-factory.h scalar-matrix.h '/usr/src/tmp/linbox-buildroot/usr/include/linbox/blackbox'
 /usr/libexec/rpm-build/install -p -m 644 scompose.h squarize.h submatrix.h submatrix-traits.h sum.h toeplitz.h toeplitz.inl transpose.h triangular-fibb.h zero-one.h zero-one.inl zo-gf2.h zo-gf2.inl zo.h zoi.inl zo.inl ntl-hankel.h ntl-hankel.inl ntl-sylvester.h ntl-sylvester.inl '/usr/src/tmp/linbox-buildroot/usr/include/linbox/blackbox'
make[3]: Leaving directory '/usr/src/RPM/BUILD/linbox-1.7.0/linbox/blackbox'
make[2]: Leaving directory '/usr/src/RPM/BUILD/linbox-1.7.0/linbox/blackbox'
Making install in algorithms
make[2]: Entering directory '/usr/src/RPM/BUILD/linbox-1.7.0/linbox/algorithms'
Making install in dixon-solver
make[3]: Entering directory '/usr/src/RPM/BUILD/linbox-1.7.0/linbox/algorithms/dixon-solver'
make[4]: Entering directory '/usr/src/RPM/BUILD/linbox-1.7.0/linbox/algorithms/dixon-solver'
make[4]: Nothing to be done for 'install-exec-am'.
 /bin/mkdir -p '/usr/src/tmp/linbox-buildroot/usr/include/linbox/algorithms/dixon-solver'
 /usr/libexec/rpm-build/install -p -m 644 dixon-solver-dense.h dixon-solver-dense.inl dixon-solver-symbolic-numeric.h '/usr/src/tmp/linbox-buildroot/usr/include/linbox/algorithms/dixon-solver'
make[4]: Leaving directory '/usr/src/RPM/BUILD/linbox-1.7.0/linbox/algorithms/dixon-solver'
make[3]: Leaving directory '/usr/src/RPM/BUILD/linbox-1.7.0/linbox/algorithms/dixon-solver'
Making install in gauss
make[3]: Entering directory '/usr/src/RPM/BUILD/linbox-1.7.0/linbox/algorithms/gauss'
make[4]: Entering directory '/usr/src/RPM/BUILD/linbox-1.7.0/linbox/algorithms/gauss'
make[4]: Nothing to be done for 'install-exec-am'.
 /bin/mkdir -p '/usr/src/tmp/linbox-buildroot/usr/include/linbox/algorithms/gauss'
 /usr/libexec/rpm-build/install -p -m 644 gauss.inl gauss-det.inl gauss-rank.inl gauss-solve.inl gauss-nullspace.inl gauss-elim.inl gauss-pivot.inl gauss-gf2.inl gauss-elim-gf2.inl gauss-det-gf2.inl gauss-rank-gf2.inl gauss-pivot-gf2.inl gauss-solve-gf2.inl '/usr/src/tmp/linbox-buildroot/usr/include/linbox/algorithms/gauss'
make[4]: Leaving directory '/usr/src/RPM/BUILD/linbox-1.7.0/linbox/algorithms/gauss'
make[3]: Leaving directory '/usr/src/RPM/BUILD/linbox-1.7.0/linbox/algorithms/gauss'
Making install in opencl-kernels
make[3]: Entering directory '/usr/src/RPM/BUILD/linbox-1.7.0/linbox/algorithms/opencl-kernels'
make[4]: Entering directory '/usr/src/RPM/BUILD/linbox-1.7.0/linbox/algorithms/opencl-kernels'
make[4]: Nothing to be done for 'install-exec-am'.
make[4]: Leaving directory '/usr/src/RPM/BUILD/linbox-1.7.0/linbox/algorithms/opencl-kernels'
make[3]: Leaving directory '/usr/src/RPM/BUILD/linbox-1.7.0/linbox/algorithms/opencl-kernels'
Making install in matrix-blas3
make[3]: Entering directory '/usr/src/RPM/BUILD/linbox-1.7.0/linbox/algorithms/matrix-blas3'
make[4]: Entering directory '/usr/src/RPM/BUILD/linbox-1.7.0/linbox/algorithms/matrix-blas3'
make[4]: Nothing to be done for 'install-exec-am'.
 /bin/mkdir -p '/usr/src/tmp/linbox-buildroot/usr/include/linbox/algorithms/matrix-blas3'
 /usr/libexec/rpm-build/install -p -m 644 mul.h mul-naive.inl mul-flint.inl mul-cra.inl mul-toomcook.inl '/usr/src/tmp/linbox-buildroot/usr/include/linbox/algorithms/matrix-blas3'
make[4]: Leaving directory '/usr/src/RPM/BUILD/linbox-1.7.0/linbox/algorithms/matrix-blas3'
make[3]: Leaving directory '/usr/src/RPM/BUILD/linbox-1.7.0/linbox/algorithms/matrix-blas3'
Making install in polynomial-matrix
make[3]: Entering directory '/usr/src/RPM/BUILD/linbox-1.7.0/linbox/algorithms/polynomial-matrix'
make[4]: Entering directory '/usr/src/RPM/BUILD/linbox-1.7.0/linbox/algorithms/polynomial-matrix'
make[4]: Nothing to be done for 'install-exec-am'.
 /bin/mkdir -p '/usr/src/tmp/linbox-buildroot/usr/include/linbox/algorithms/polynomial-matrix'
 /usr/libexec/rpm-build/install -p -m 644 matpoly-add-domain.h matpoly-mult-naive.h matpoly-mult-fft.h matpoly-mult-kara.h matpoly-mult-fft-wordsize.inl matpoly-mult-fft-wordsize-fast.inl matpoly-mult-fft-wordsize-three-primes.inl matpoly-mult-fft-multiprecision.inl matpoly-mult-fft-recint.inl polynomial-matrix-domain.h fft.h fft-utils.h fft-floating.inl fft-integral.inl fft-simd.h order-basis.h '/usr/src/tmp/linbox-buildroot/usr/include/linbox/algorithms/polynomial-matrix'
make[4]: Leaving directory '/usr/src/RPM/BUILD/linbox-1.7.0/linbox/algorithms/polynomial-matrix'
make[3]: Leaving directory '/usr/src/RPM/BUILD/linbox-1.7.0/linbox/algorithms/polynomial-matrix'
make[3]: Entering directory '/usr/src/RPM/BUILD/linbox-1.7.0/linbox/algorithms'
make[4]: Entering directory '/usr/src/RPM/BUILD/linbox-1.7.0/linbox/algorithms'
make[4]: Nothing to be done for 'install-exec-am'.
 /bin/mkdir -p '/usr/src/tmp/linbox-buildroot/usr/include/linbox/algorithms'
 /usr/libexec/rpm-build/install -p -m 644 alt-blackbox-block-container.h bbcharpoly.h bitonic-sort.h blackbox-block-container-base.h blackbox-block-container.h blackbox-container-base.h blackbox-container.h blackbox-container-symmetric.h blackbox-container-symmetrize.h block-coppersmith-domain.h block-lanczos.h block-lanczos.inl block-massey-domain.h block-wiedemann.h charpoly-rational.h cia.h classic-rational-reconstruction.h coppersmith.h coppersmith-invariant-factors.h cra-domain.h cra-domain-omp.h cra-domain-sequential.h cra-builder-early-multip.h cra-builder-full-multip-fixed.h cra-builder-full-multip.h cra-givrnsfixed.h cra-kaapi.h cra-distributed.h cra-builder-single.h default.h dense-container.h dense-nullspace.h dense-nullspace.inl det-rational.h diophantine-solver.h diophantine-solver.inl double-det.h dyadic-to-rational.h eliminator.h eliminator.inl '/usr/src/tmp/linbox-buildroot/usr/include/linbox/algorithms'
 /usr/libexec/rpm-build/install -p -m 644 fast-rational-reconstruction.h frobenius-large.h frobenius-small.h gauss-gf2.h gauss.h hybrid-det.h invariant-factors.h invert-tb.h la-block-lanczos.h la-block-lanczos.inl lanczos.h lanczos.inl last-invariant-factor.h lattice.h lattice.inl lazy-product.h lifting-container.h massey-domain.h matpoly-mult.h matrix-hom.h matrix-inverse.h mg-block-lanczos.h mg-block-lanczos.inl minpoly-integer.h minpoly-rational.h numeric-solver-lapack.h one-invariant-factor.h poly-det.h poly-dixon.h poly-interpolation.h poly-smith-form.h poly-smith-form-local-x.h rational-cra-var-prec.h rational-cra-builder-early-multip.h rational-cra-builder-early-single.h rational-cra-builder-full-multip.h rational-cra.h rational-reconstruction2.h rational-reconstruction-base.h rational-reconstruction.h '/usr/src/tmp/linbox-buildroot/usr/include/linbox/algorithms'
 /usr/libexec/rpm-build/install -p -m 644 rational-solver-adaptive.h rational-solver.h rational-solver.inl rational-solver-sn.h rational-solver-sn.inl rns.h rns.inl short-vector.h sigma-basis.h signature.h smith-form-adaptive.h smith-form-adaptive.inl smith-form-binary.h smith-form-iliopoulos.h smith-form-kannan-bachem.h smith-form-local2.inl smith-form-local.h smith-form-valence.h smith-form-sparseelim-local.h smith-form-sparseelim-poweroftwo.h toeplitz-det.h triangular-solve-gf2.h triangular-solve.h cra-builder-var-prec-early-multip.h cra-builder-var-prec-early-single.h vector-fraction.h weak-popov-form.h whisart_trace.h wiedemann.h wiedemann.inl opencl-resource-controller.h opencl-environ.h '/usr/src/tmp/linbox-buildroot/usr/include/linbox/algorithms'
make[4]: Leaving directory '/usr/src/RPM/BUILD/linbox-1.7.0/linbox/algorithms'
make[3]: Leaving directory '/usr/src/RPM/BUILD/linbox-1.7.0/linbox/algorithms'
make[2]: Leaving directory '/usr/src/RPM/BUILD/linbox-1.7.0/linbox/algorithms'
Making install in solutions
make[2]: Entering directory '/usr/src/RPM/BUILD/linbox-1.7.0/linbox/solutions'
Making install in solve
make[3]: Entering directory '/usr/src/RPM/BUILD/linbox-1.7.0/linbox/solutions/solve'
make[4]: Entering directory '/usr/src/RPM/BUILD/linbox-1.7.0/linbox/solutions/solve'
make[4]: Nothing to be done for 'install-exec-am'.
 /bin/mkdir -p '/usr/src/tmp/linbox-buildroot/usr/include/linbox/solutions/solve'
 /usr/libexec/rpm-build/install -p -m 644 solve-auto.h solve-blackbox.h solve-cra.h solve-dense-elimination.h solve-dixon.h solve-elimination.h solve-lanczos.h solve-numeric-symbolic.h solve-sparse-elimination.h solve-wiedemann.h '/usr/src/tmp/linbox-buildroot/usr/include/linbox/solutions/solve'
make[4]: Leaving directory '/usr/src/RPM/BUILD/linbox-1.7.0/linbox/solutions/solve'
make[3]: Leaving directory '/usr/src/RPM/BUILD/linbox-1.7.0/linbox/solutions/solve'
Making install in echelon
make[3]: Entering directory '/usr/src/RPM/BUILD/linbox-1.7.0/linbox/solutions/echelon'
make[4]: Entering directory '/usr/src/RPM/BUILD/linbox-1.7.0/linbox/solutions/echelon'
make[4]: Nothing to be done for 'install-exec-am'.
 /bin/mkdir -p '/usr/src/tmp/linbox-buildroot/usr/include/linbox/solutions/echelon'
 /usr/libexec/rpm-build/install -p -m 644 echelon-auto.h echelon-dense-elimination.h '/usr/src/tmp/linbox-buildroot/usr/include/linbox/solutions/echelon'
make[4]: Leaving directory '/usr/src/RPM/BUILD/linbox-1.7.0/linbox/solutions/echelon'
make[3]: Leaving directory '/usr/src/RPM/BUILD/linbox-1.7.0/linbox/solutions/echelon'
make[3]: Entering directory '/usr/src/RPM/BUILD/linbox-1.7.0/linbox/solutions'
make[4]: Entering directory '/usr/src/RPM/BUILD/linbox-1.7.0/linbox/solutions'
make[4]: Nothing to be done for 'install-exec-am'.
 /bin/mkdir -p '/usr/src/tmp/linbox-buildroot/usr/include/linbox/solutions'
 /usr/libexec/rpm-build/install -p -m 644 charpoly.h det.h echelon.h getentry.h getentry.inl is-positive-definite.h is-positive-semidefinite.h methods.h minpoly.h nullspace.h rank.h rank.inl smith-form.h solve.h trace.h trace.inl valence.h hadamard-bound.h constants.h solution-tags.h '/usr/src/tmp/linbox-buildroot/usr/include/linbox/solutions'
make[4]: Leaving directory '/usr/src/RPM/BUILD/linbox-1.7.0/linbox/solutions'
make[3]: Leaving directory '/usr/src/RPM/BUILD/linbox-1.7.0/linbox/solutions'
make[2]: Leaving directory '/usr/src/RPM/BUILD/linbox-1.7.0/linbox/solutions'
Making install in ring
make[2]: Entering directory '/usr/src/RPM/BUILD/linbox-1.7.0/linbox/ring'
Making install in ntl
make[3]: Entering directory '/usr/src/RPM/BUILD/linbox-1.7.0/linbox/ring/ntl'
make[4]: Entering directory '/usr/src/RPM/BUILD/linbox-1.7.0/linbox/ring/ntl'
make[4]: Nothing to be done for 'install-exec-am'.
 /bin/mkdir -p '/usr/src/tmp/linbox-buildroot/usr/include/linbox/ring/ntl'
 /usr/libexec/rpm-build/install -p -m 644 ntl-rr.h ntl-zz_p.h ntl-zz_pe.h ntl-zz_px.h ntl-zz.h ntl-lzz_p.h ntl-lzz_pe.h ntl-lzz_px.h ntl-lzz_pex.h ntl-gf2e.h '/usr/src/tmp/linbox-buildroot/usr/include/linbox/ring/ntl'
make[4]: Leaving directory '/usr/src/RPM/BUILD/linbox-1.7.0/linbox/ring/ntl'
make[3]: Leaving directory '/usr/src/RPM/BUILD/linbox-1.7.0/linbox/ring/ntl'
Making install in modular
make[3]: Entering directory '/usr/src/RPM/BUILD/linbox-1.7.0/linbox/ring/modular'
make[4]: Entering directory '/usr/src/RPM/BUILD/linbox-1.7.0/linbox/ring/modular'
make[4]: Nothing to be done for 'install-exec-am'.
 /bin/mkdir -p '/usr/src/tmp/linbox-buildroot/usr/include/linbox/ring/modular'
 /usr/libexec/rpm-build/install -p -m 644 modular-unsigned.h modular-int32.h modular-int64.h modular-short.h modular-byte.h modular-balanced-double.h modular-balanced-float.h modular-balanced-int32.h modular-balanced-int64.h modular-double.h modular-float.h '/usr/src/tmp/linbox-buildroot/usr/include/linbox/ring/modular'
make[4]: Leaving directory '/usr/src/RPM/BUILD/linbox-1.7.0/linbox/ring/modular'
make[3]: Leaving directory '/usr/src/RPM/BUILD/linbox-1.7.0/linbox/ring/modular'
make[3]: Entering directory '/usr/src/RPM/BUILD/linbox-1.7.0/linbox/ring'
make[4]: Entering directory '/usr/src/RPM/BUILD/linbox-1.7.0/linbox/ring'
make[4]: Nothing to be done for 'install-exec-am'.
 /bin/mkdir -p '/usr/src/tmp/linbox-buildroot/usr/include/linbox/ring'
 /usr/libexec/rpm-build/install -p -m 644 ring-interface.h polynomial-ring.h modular.h local-pir-modular.h pir-modular-int32.h local2_32.h abstract.h archetype.h envelope.h polynomial-local-x.h ntl.h pid-ntl-zz_p.h pir-ntl-zz_p.h '/usr/src/tmp/linbox-buildroot/usr/include/linbox/ring'
make[4]: Leaving directory '/usr/src/RPM/BUILD/linbox-1.7.0/linbox/ring'
make[3]: Leaving directory '/usr/src/RPM/BUILD/linbox-1.7.0/linbox/ring'
make[2]: Leaving directory '/usr/src/RPM/BUILD/linbox-1.7.0/linbox/ring'
Making install in polynomial
make[2]: Entering directory '/usr/src/RPM/BUILD/linbox-1.7.0/linbox/polynomial'
make[3]: Entering directory '/usr/src/RPM/BUILD/linbox-1.7.0/linbox/polynomial'
make[3]: Nothing to be done for 'install-exec-am'.
 /bin/mkdir -p '/usr/src/tmp/linbox-buildroot/usr/include/linbox/polynomial'
 /usr/libexec/rpm-build/install -p -m 644 dense-polynomial.h '/usr/src/tmp/linbox-buildroot/usr/include/linbox/polynomial'
make[3]: Leaving directory '/usr/src/RPM/BUILD/linbox-1.7.0/linbox/polynomial'
make[2]: Leaving directory '/usr/src/RPM/BUILD/linbox-1.7.0/linbox/polynomial'
make[2]: Entering directory '/usr/src/RPM/BUILD/linbox-1.7.0/linbox'
make[3]: Entering directory '/usr/src/RPM/BUILD/linbox-1.7.0/linbox'
 /bin/mkdir -p '/usr/src/tmp/linbox-buildroot/usr/lib64'
 /bin/sh ../libtool   --mode=install /usr/libexec/rpm-build/install -p   liblinbox.la '/usr/src/tmp/linbox-buildroot/usr/lib64'
libtool: install: /usr/libexec/rpm-build/install -p .libs/liblinbox.so.0.0.0 /usr/src/tmp/linbox-buildroot/usr/lib64/liblinbox.so.0.0.0
libtool: install: (cd /usr/src/tmp/linbox-buildroot/usr/lib64 && { ln -s -f liblinbox.so.0.0.0 liblinbox.so.0 || { rm -f liblinbox.so.0 && ln -s liblinbox.so.0.0.0 liblinbox.so.0; }; })
libtool: install: (cd /usr/src/tmp/linbox-buildroot/usr/lib64 && { ln -s -f liblinbox.so.0.0.0 liblinbox.so || { rm -f liblinbox.so && ln -s liblinbox.so.0.0.0 liblinbox.so; }; })
libtool: install: /usr/libexec/rpm-build/install -p .libs/liblinbox.lai /usr/src/tmp/linbox-buildroot/usr/lib64/liblinbox.la
libtool: warning: remember to run 'libtool --finish /usr/lib64'
 /bin/mkdir -p '/usr/src/tmp/linbox-buildroot/usr/include/linbox'
 /usr/libexec/rpm-build/install -p -m 644 linbox-config.h config.h config-blas.h integer.h linbox-tags.h '/usr/src/tmp/linbox-buildroot/usr/include/linbox'
make[3]: Leaving directory '/usr/src/RPM/BUILD/linbox-1.7.0/linbox'
make[2]: Leaving directory '/usr/src/RPM/BUILD/linbox-1.7.0/linbox'
make[1]: Leaving directory '/usr/src/RPM/BUILD/linbox-1.7.0/linbox'
Making install in benchmarks
make[1]: Entering directory '/usr/src/RPM/BUILD/linbox-1.7.0/benchmarks'
Making install in data
make[2]: Entering directory '/usr/src/RPM/BUILD/linbox-1.7.0/benchmarks/data'
make[3]: Entering directory '/usr/src/RPM/BUILD/linbox-1.7.0/benchmarks/data'
make[3]: Nothing to be done for 'install-exec-am'.
make[3]: Nothing to be done for 'install-data-am'.
make[3]: Leaving directory '/usr/src/RPM/BUILD/linbox-1.7.0/benchmarks/data'
make[2]: Leaving directory '/usr/src/RPM/BUILD/linbox-1.7.0/benchmarks/data'
Making install in matrix
make[2]: Entering directory '/usr/src/RPM/BUILD/linbox-1.7.0/benchmarks/matrix'
make[3]: Entering directory '/usr/src/RPM/BUILD/linbox-1.7.0/benchmarks/matrix'
make[3]: Nothing to be done for 'install-exec-am'.
make[3]: Nothing to be done for 'install-data-am'.
make[3]: Leaving directory '/usr/src/RPM/BUILD/linbox-1.7.0/benchmarks/matrix'
make[2]: Leaving directory '/usr/src/RPM/BUILD/linbox-1.7.0/benchmarks/matrix'
make[2]: Entering directory '/usr/src/RPM/BUILD/linbox-1.7.0/benchmarks'
make[3]: Entering directory '/usr/src/RPM/BUILD/linbox-1.7.0/benchmarks'
make[3]: Nothing to be done for 'install-exec-am'.
 /bin/mkdir -p '/usr/src/tmp/linbox-buildroot/usr/include/linbox'
 /usr/libexec/rpm-build/install -p -m 644 optimizer.h benchmark-utils.h benchmark-utils.C benchmark-metadata.h benchmark-metadata.C benchmark.h benchmark.C benchmark.inl '/usr/src/tmp/linbox-buildroot/usr/include/linbox'
make[3]: Leaving directory '/usr/src/RPM/BUILD/linbox-1.7.0/benchmarks'
make[2]: Leaving directory '/usr/src/RPM/BUILD/linbox-1.7.0/benchmarks'
make[1]: Leaving directory '/usr/src/RPM/BUILD/linbox-1.7.0/benchmarks'
Making install in tests
make[1]: Entering directory '/usr/src/RPM/BUILD/linbox-1.7.0/tests'
Making install in data
make[2]: Entering directory '/usr/src/RPM/BUILD/linbox-1.7.0/tests/data'
make[3]: Entering directory '/usr/src/RPM/BUILD/linbox-1.7.0/tests/data'
make[3]: Nothing to be done for 'install-exec-am'.
make[3]: Nothing to be done for 'install-data-am'.
make[3]: Leaving directory '/usr/src/RPM/BUILD/linbox-1.7.0/tests/data'
make[2]: Leaving directory '/usr/src/RPM/BUILD/linbox-1.7.0/tests/data'
Making install in matrix
make[2]: Entering directory '/usr/src/RPM/BUILD/linbox-1.7.0/tests/matrix'
make[3]: Entering directory '/usr/src/RPM/BUILD/linbox-1.7.0/tests/matrix'
make[3]: Nothing to be done for 'install-exec-am'.
make[3]: Nothing to be done for 'install-data-am'.
make[3]: Leaving directory '/usr/src/RPM/BUILD/linbox-1.7.0/tests/matrix'
make[2]: Leaving directory '/usr/src/RPM/BUILD/linbox-1.7.0/tests/matrix'
make[2]: Entering directory '/usr/src/RPM/BUILD/linbox-1.7.0/tests'
make[3]: Entering directory '/usr/src/RPM/BUILD/linbox-1.7.0/tests'
make[3]: Nothing to be done for 'install-exec-am'.
make[3]: Nothing to be done for 'install-data-am'.
make[3]: Leaving directory '/usr/src/RPM/BUILD/linbox-1.7.0/tests'
make[2]: Leaving directory '/usr/src/RPM/BUILD/linbox-1.7.0/tests'
make[1]: Leaving directory '/usr/src/RPM/BUILD/linbox-1.7.0/tests'
Making install in interfaces
make[1]: Entering directory '/usr/src/RPM/BUILD/linbox-1.7.0/interfaces'
Making install in driver
make[2]: Entering directory '/usr/src/RPM/BUILD/linbox-1.7.0/interfaces/driver'
make[3]: Entering directory '/usr/src/RPM/BUILD/linbox-1.7.0/interfaces/driver'
make[3]: Leaving directory '/usr/src/RPM/BUILD/linbox-1.7.0/interfaces/driver'
make[2]: Leaving directory '/usr/src/RPM/BUILD/linbox-1.7.0/interfaces/driver'
Making install in kaapi
make[2]: Entering directory '/usr/src/RPM/BUILD/linbox-1.7.0/interfaces/kaapi'
make[3]: Entering directory '/usr/src/RPM/BUILD/linbox-1.7.0/interfaces/kaapi'
make[3]: Nothing to be done for 'install-exec-am'.
 /bin/mkdir -p '/usr/src/tmp/linbox-buildroot/usr/include/linbox/kaapi'
 /usr/libexec/rpm-build/install -p -m 644 communicate.h '/usr/src/tmp/linbox-buildroot/usr/include/linbox/kaapi'
make[3]: Leaving directory '/usr/src/RPM/BUILD/linbox-1.7.0/interfaces/kaapi'
make[2]: Leaving directory '/usr/src/RPM/BUILD/linbox-1.7.0/interfaces/kaapi'
Making install in maple
make[2]: Entering directory '/usr/src/RPM/BUILD/linbox-1.7.0/interfaces/maple'
make[3]: Entering directory '/usr/src/RPM/BUILD/linbox-1.7.0/interfaces/maple'
make  install-data-hook
make[4]: Entering directory '/usr/src/RPM/BUILD/linbox-1.7.0/interfaces/maple'
make[4]: Nothing to be done for 'install-data-hook'.
make[4]: Leaving directory '/usr/src/RPM/BUILD/linbox-1.7.0/interfaces/maple'
make[3]: Leaving directory '/usr/src/RPM/BUILD/linbox-1.7.0/interfaces/maple'
make[2]: Leaving directory '/usr/src/RPM/BUILD/linbox-1.7.0/interfaces/maple'
make[2]: Entering directory '/usr/src/RPM/BUILD/linbox-1.7.0/interfaces'
make[3]: Entering directory '/usr/src/RPM/BUILD/linbox-1.7.0/interfaces'
make[3]: Nothing to be done for 'install-exec-am'.
make[3]: Nothing to be done for 'install-data-am'.
make[3]: Leaving directory '/usr/src/RPM/BUILD/linbox-1.7.0/interfaces'
make[2]: Leaving directory '/usr/src/RPM/BUILD/linbox-1.7.0/interfaces'
make[1]: Leaving directory '/usr/src/RPM/BUILD/linbox-1.7.0/interfaces'
Making install in doc
make[1]: Entering directory '/usr/src/RPM/BUILD/linbox-1.7.0/doc'
make[2]: Entering directory '/usr/src/RPM/BUILD/linbox-1.7.0/doc'
make[2]: Nothing to be done for 'install-exec-am'.
 /bin/mkdir -p '/usr/src/tmp/linbox-buildroot/usr/share/man/man1'
 /usr/libexec/rpm-build/install -p -m 644 linbox-config.1 '/usr/src/tmp/linbox-buildroot/usr/share/man/man1'
make[2]: Leaving directory '/usr/src/RPM/BUILD/linbox-1.7.0/doc'
make[1]: Leaving directory '/usr/src/RPM/BUILD/linbox-1.7.0/doc'
Making install in examples
make[1]: Entering directory '/usr/src/RPM/BUILD/linbox-1.7.0/examples'
Making install in data
make[2]: Entering directory '/usr/src/RPM/BUILD/linbox-1.7.0/examples/data'
make[3]: Entering directory '/usr/src/RPM/BUILD/linbox-1.7.0/examples/data'
make[3]: Nothing to be done for 'install-exec-am'.
make[3]: Nothing to be done for 'install-data-am'.
make[3]: Leaving directory '/usr/src/RPM/BUILD/linbox-1.7.0/examples/data'
make[2]: Leaving directory '/usr/src/RPM/BUILD/linbox-1.7.0/examples/data'
make[2]: Entering directory '/usr/src/RPM/BUILD/linbox-1.7.0/examples'
make[3]: Entering directory '/usr/src/RPM/BUILD/linbox-1.7.0/examples'
make[3]: Nothing to be done for 'install-exec-am'.
make[3]: Nothing to be done for 'install-data-am'.
make[3]: Leaving directory '/usr/src/RPM/BUILD/linbox-1.7.0/examples'
make[2]: Leaving directory '/usr/src/RPM/BUILD/linbox-1.7.0/examples'
make[1]: Leaving directory '/usr/src/RPM/BUILD/linbox-1.7.0/examples'
make[1]: Entering directory '/usr/src/RPM/BUILD/linbox-1.7.0'
make[2]: Entering directory '/usr/src/RPM/BUILD/linbox-1.7.0'
 /bin/mkdir -p '/usr/src/tmp/linbox-buildroot/usr/bin'
 /usr/libexec/rpm-build/install -p linbox-config '/usr/src/tmp/linbox-buildroot/usr/bin'
 /bin/mkdir -p '/usr/src/tmp/linbox-buildroot/usr/lib64/pkgconfig'
 /usr/libexec/rpm-build/install -p -m 644 linbox.pc '/usr/src/tmp/linbox-buildroot/usr/lib64/pkgconfig'
make[2]: Leaving directory '/usr/src/RPM/BUILD/linbox-1.7.0'
make[1]: Leaving directory '/usr/src/RPM/BUILD/linbox-1.7.0'
make: Leaving directory '/usr/src/RPM/BUILD/linbox-1.7.0'
+ rm -f /usr/src/tmp/linbox-buildroot//usr/lib64/liblinbox.la
+ /usr/lib/rpm/brp-alt
Cleaning files in /usr/src/tmp/linbox-buildroot (auto)
mode of './usr/lib64/liblinbox.so.0.0.0' changed from 0755 (rwxr-xr-x) to 0644 (rw-r--r--)
Verifying and fixing files in /usr/src/tmp/linbox-buildroot (binconfig,pkgconfig,libtool,desktop,gnuconfig)
/usr/bin/linbox-config:
75c75
< 	echo -I${includedir}  -pthread      
---
> 	echo   -pthread      
/usr/lib64/pkgconfig/linbox.pc: Cflags: '-I${includedir} -DDISABLE_COMMENTATOR -pthread      ' --> '-DDISABLE_COMMENTATOR -pthread'
/usr/lib64/pkgconfig/linbox.pc: Libs: '-L${libdir} -llinbox -lntl -lmpfr  -liml -lflint ' --> '-llinbox -lntl -lmpfr -liml -lflint'
Checking contents of files in /usr/src/tmp/linbox-buildroot/ (default)
Compressing files in /usr/src/tmp/linbox-buildroot (auto)
Adjusting library links in /usr/src/tmp/linbox-buildroot
./usr/lib64: (from <cmdline>:0)
	liblinbox.so.0 -> liblinbox.so.0.0.0
Verifying ELF objects in /usr/src/tmp/linbox-buildroot (arch=normal,fhs=normal,lfs=relaxed,lint=relaxed,rpath=normal,stack=normal,textrel=normal,unresolved=normal)
Processing files: liblinbox0-1.7.0-alt1
Finding Provides (using /usr/lib/rpm/find-provides)
Executing: /bin/sh -e /usr/src/tmp/rpm-tmp.lEIhEr
find-provides: running scripts (debuginfo,lib,pam,perl,pkgconfig,python,python3,shell)
lib.prov: /usr/src/tmp/linbox-buildroot/usr/lib64/liblinbox.so.0: 143 symbols, 18 bpp
Finding Requires (using /usr/lib/rpm/find-requires)
Executing: /bin/sh -e /usr/src/tmp/rpm-tmp.rxSiSs
find-requires: running scripts (cpp,debuginfo,files,lib,pam,perl,pkgconfig,pkgconfiglib,python,python3,rpmlib,shebang,shell,static,symlinks,systemd-services)
Provides: liblinbox.so.0()(64bit) = set:ldE5Z6vksbRZzbZgtXfgEZh9DQg76IpArZtycEJsDq9BQRpgafwqY6Zeuj4NYCy2xiAdsA4AzmeXfid9Lqoep8OZbVckgEv5VTHuhRAv24DB7eE7C3xQDiuEGqgnxMZejzWbxxpRBpPZwEFjXEhhYo8Jr38aAftIbAfRsyTA4GtTZsAmOh0010WG0AUwxS8OxegnJhm0PpGpcZmZ0cgqZvS25O7cfZKyzOWw1Z1c0L3svO23joQDWPj0Sj06acvUCPHah9QAcelL8UMt31f11Pa7NtEchWVwmBajOmQ7133Vf
Requires: libc.so.6(GLIBC_2.14)(64bit), libc.so.6(GLIBC_2.2.5)(64bit), libc.so.6(GLIBC_2.4)(64bit), libgcc_s.so.1(GCC_3.0)(64bit), libgcc_s.so.1(GCC_3.3.1)(64bit), libgivaro.so.9()(64bit) >= set:ngZyZeKeytUjCinu6s6CWhSmYTYUirADAIvKNwLEqEHMCFKQ3mA2VKFg1ZLyxPlyfmDNidUfCopYhZ5V7imMtI1ig0wGU4wLcfjqWTnCZy05fQc4k67HZlB76Yyf2ZsXftHEEW4QRdb4JLNxxXDGdFGUqzeGfGGrS1o5HqekaEFuyKvaVGZgKnpnUYRUqaXa0p1faLVV447mKxZnZeKv7WvLh40, libgmp.so.10()(64bit) >= set:miCwMXpmtqxisZh206Ic75liMUIJL9h, libm.so.6(GLIBC_2.2.5)(64bit), libm.so.6(GLIBC_2.29)(64bit), libntl.so.44()(64bit) >= set:pmOFtsjPprpbYjozZsFkLpr, libopenblas.so.0()(64bit) >= set:rnTlw9LhXXZzjJRD18qNs5X8U9FfuUg4ZocE6643, libstdc++.so.6(CXXABI_1.3)(64bit), libstdc++.so.6(CXXABI_1.3.9)(64bit), libstdc++.so.6(GLIBCXX_3.4)(64bit), libstdc++.so.6(GLIBCXX_3.4.11)(64bit), libstdc++.so.6(GLIBCXX_3.4.15)(64bit), libstdc++.so.6(GLIBCXX_3.4.20)(64bit), libstdc++.so.6(GLIBCXX_3.4.21)(64bit), libstdc++.so.6(GLIBCXX_3.4.29)(64bit), libstdc++.so.6(GLIBCXX_3.4.32)(64bit), libstdc++.so.6(GLIBCXX_3.4.9)(64bit), rtld(GNU_HASH)
Requires(rpmlib): rpmlib(SetVersions)
Finding debuginfo files (using /usr/lib/rpm/find-debuginfo-files)
Executing: /bin/sh -e /usr/src/tmp/rpm-tmp.Jjrzip
Creating liblinbox0-debuginfo package
Processing files: liblinbox-devel-1.7.0-alt1
Executing(%doc): /bin/sh -e /usr/src/tmp/rpm-tmp.8172
+ umask 022
+ /bin/mkdir -p /usr/src/RPM/BUILD
+ cd /usr/src/RPM/BUILD
+ cd linbox-1.7.0
+ DOCDIR=/usr/src/tmp/linbox-buildroot/usr/share/doc/liblinbox-devel-1.7.0
+ export DOCDIR
+ rm -rf /usr/src/tmp/linbox-buildroot/usr/share/doc/liblinbox-devel-1.7.0
+ /bin/mkdir -p /usr/src/tmp/linbox-buildroot/usr/share/doc/liblinbox-devel-1.7.0
+ cp -prL COPYING COPYING.LESSER /usr/src/tmp/linbox-buildroot/usr/share/doc/liblinbox-devel-1.7.0
+ chmod -R go-w /usr/src/tmp/linbox-buildroot/usr/share/doc/liblinbox-devel-1.7.0
+ chmod -R a+rX /usr/src/tmp/linbox-buildroot/usr/share/doc/liblinbox-devel-1.7.0
+ exit 0
Finding Provides (using /usr/lib/rpm/find-provides)
Executing: /bin/sh -e /usr/src/tmp/rpm-tmp.aoXUkz
find-provides: running scripts (debuginfo,lib,pam,perl,pkgconfig,python,python3,shell)
Finding Requires (using /usr/lib/rpm/find-requires)
Executing: /bin/sh -e /usr/src/tmp/rpm-tmp.Pv8JcC
find-requires: running scripts (cpp,debuginfo,files,lib,pam,perl,pkgconfig,pkgconfiglib,python,python3,rpmlib,shebang,shell,static,symlinks,systemd-services)
cpp.req.files: /usr/src/tmp/linbox-buildroot/usr/include/linbox/algorithms/matpoly-mult.h:  data
In file included from /usr/src/tmp/linbox-buildroot/usr/include/linbox/integer.h:44:
/usr/include/givaro/givconfig.h:280:10: fatal error: limits: No such file or directory
  280 | #include <limits>
      |          ^~~~~~~~
compilation terminated.
cpp.req: /usr/src/tmp/linbox-buildroot/usr/include/linbox/integer.h: cpp failed, trying c++ mode
/usr/src/tmp/linbox-buildroot/usr/include/linbox/benchmark.h:50:10: fatal error: tests/test-common.h: No such file or directory
   50 | #include "tests/test-common.h"
      |          ^~~~~~~~~~~~~~~~~~~~~
compilation terminated.
cpp.req: WARNING: /usr/src/tmp/linbox-buildroot/usr/include/linbox/benchmark.h: cpp failed
/usr/src/tmp/linbox-buildroot/usr/include/linbox/util/iml_wrapper.h:108:2: error: #error "you are using IML wrapper without IML available in LinBox."
  108 | #error "you are using IML wrapper without IML available in LinBox."
      |  ^~~~~
cpp.req: WARNING: /usr/src/tmp/linbox-buildroot/usr/include/linbox/util/iml_wrapper.h: cpp failed
In file included from /usr/src/tmp/linbox-buildroot/usr/include/linbox/ring/pid-ntl-zz_p.h:29:
/usr/src/tmp/linbox-buildroot/usr/include/linbox/ring/ntl/ntl-lzz_p.h:41:2: error: #error "you need NTL here"
   41 | #error "you need NTL here"
      |  ^~~~~
cpp.req: WARNING: /usr/src/tmp/linbox-buildroot/usr/include/linbox/ring/pid-ntl-zz_p.h: cpp failed
/usr/src/tmp/linbox-buildroot/usr/include/linbox/kaapi/communicate.h:29:10: fatal error: athapascan-1: No such file or directory
   29 | #include <athapascan-1>
      |          ^~~~~~~~~~~~~~
compilation terminated.
cpp.req: WARNING: /usr/src/tmp/linbox-buildroot/usr/include/linbox/kaapi/communicate.h: cpp failed
/usr/src/tmp/linbox-buildroot/usr/include/linbox/randiter/gmp-random-prime.h:23:2: error: #error "deprecated and not tested"
   23 | #error "deprecated and not tested"
      |  ^~~~~
cpp.req: WARNING: /usr/src/tmp/linbox-buildroot/usr/include/linbox/randiter/gmp-random-prime.h: cpp failed
/usr/src/tmp/linbox-buildroot/usr/include/linbox/solutions/nullspace.h:38:2: error: #error "you don't want to include this file for now."
   38 | #error "you don't want to include this file for now."
      |  ^~~~~
cpp.req: WARNING: /usr/src/tmp/linbox-buildroot/usr/include/linbox/solutions/nullspace.h: cpp failed
In file included from /usr/src/tmp/linbox-buildroot/usr/include/linbox/algorithms/cra-kaapi.h:43:
/usr/src/tmp/linbox-buildroot/usr/include/linbox/kaapi/communicate.h:29:10: fatal error: athapascan-1: No such file or directory
   29 | #include <athapascan-1>
      |          ^~~~~~~~~~~~~~
compilation terminated.
cpp.req: WARNING: /usr/src/tmp/linbox-buildroot/usr/include/linbox/algorithms/cra-kaapi.h: cpp failed
/usr/src/tmp/linbox-buildroot/usr/include/linbox/algorithms/short-vector.h:49:2: error: #error "you need fplll here"
   49 | #error "you need fplll here"
      |  ^~~~~
cpp.req: WARNING: /usr/src/tmp/linbox-buildroot/usr/include/linbox/algorithms/short-vector.h: cpp failed
/usr/src/tmp/linbox-buildroot/usr/include/linbox/algorithms/cra-domain-omp.h:39:10: fatal error: omp.h: No such file or directory
   39 | #include <omp.h>
      |          ^~~~~~~
compilation terminated.
cpp.req: WARNING: /usr/src/tmp/linbox-buildroot/usr/include/linbox/algorithms/cra-domain-omp.h: cpp failed
/usr/src/tmp/linbox-buildroot/usr/include/linbox/algorithms/opencl-environ.h:35:10: fatal error: CL/cl.h: No such file or directory
   35 | #include <CL/cl.h>
      |          ^~~~~~~~~
compilation terminated.
cpp.req: WARNING: /usr/src/tmp/linbox-buildroot/usr/include/linbox/algorithms/opencl-environ.h: cpp failed
/usr/src/tmp/linbox-buildroot/usr/include/linbox/algorithms/opencl-resource-controller.h:39:10: fatal error: CL/cl.h: No such file or directory
   39 | #include <CL/cl.h>
      |          ^~~~~~~~~
compilation terminated.
cpp.req: WARNING: /usr/src/tmp/linbox-buildroot/usr/include/linbox/algorithms/opencl-resource-controller.h: cpp failed
/usr/src/tmp/linbox-buildroot/usr/include/linbox/algorithms/coppersmith-invariant-factors.h:34:10: fatal error: linbox/ring/givaro-poly.h: No such file or directory
   34 | #include <linbox/ring/givaro-poly.h>
      |          ^~~~~~~~~~~~~~~~~~~~~~~~~~~
compilation terminated.
cpp.req: WARNING: /usr/src/tmp/linbox-buildroot/usr/include/linbox/algorithms/coppersmith-invariant-factors.h: cpp failed
/usr/src/tmp/linbox-buildroot/usr/include/linbox/ring/modular/modular-balanced-int32.h:44:10: fatal error: linbox/field/modular/modular-int32.h: No such file or directory
   44 | #include "linbox/field/modular/modular-int32.h"
      |          ^~~~~~~~~~~~~~~~~~~~~~~~~~~~~~~~~~~~~~
compilation terminated.
cpp.req: WARNING: /usr/src/tmp/linbox-buildroot/usr/include/linbox/ring/modular/modular-balanced-int32.h: cpp failed
/usr/src/tmp/linbox-buildroot/usr/include/linbox/ring/modular/modular-balanced-int64.h:43:10: fatal error: linbox/field/modular/modular-int64.h: No such file or directory
   43 | #include "linbox/field/modular/modular-int64.h"
      |          ^~~~~~~~~~~~~~~~~~~~~~~~~~~~~~~~~~~~~~
compilation terminated.
cpp.req: WARNING: /usr/src/tmp/linbox-buildroot/usr/include/linbox/ring/modular/modular-balanced-int64.h: cpp failed
/usr/src/tmp/linbox-buildroot/usr/include/linbox/matrix/sliced3/sliced-stepper.h:6:10: fatal error: linbox/field/modular.h: No such file or directory
    6 | #include <linbox/field/modular.h>
      |          ^~~~~~~~~~~~~~~~~~~~~~~~
compilation terminated.
cpp.req: WARNING: /usr/src/tmp/linbox-buildroot/usr/include/linbox/matrix/sliced3/sliced-stepper.h: cpp failed
/usr/src/tmp/linbox-buildroot/usr/include/linbox/matrix/matrixdomain/opencl-domain-factory.h:41:10: fatal error: CL/cl.h: No such file or directory
   41 | #include <CL/cl.h>
      |          ^~~~~~~~~
compilation terminated.
cpp.req: WARNING: /usr/src/tmp/linbox-buildroot/usr/include/linbox/matrix/matrixdomain/opencl-domain-factory.h: cpp failed
In file included from /usr/src/tmp/linbox-buildroot/usr/include/linbox/matrix/sparsematrix/sparse-tpl-matrix-omp.h:410:
/usr/src/tmp/linbox-buildroot/usr/include/linbox/matrix/sparsematrix/sparse-tpl-matrix-omp.inl:34:10: fatal error: omp.h: No such file or directory
   34 | #include <omp.h>
      |          ^~~~~~~
compilation terminated.
cpp.req: WARNING: /usr/src/tmp/linbox-buildroot/usr/include/linbox/matrix/sparsematrix/sparse-tpl-matrix-omp.h: cpp failed
find-requires: FINDPACKAGE-COMMANDS: cat
Provides: pkgconfig(linbox) = 1.7.0
Requires: /bin/bash, /usr/lib64/liblinbox.so.0.0.0, /usr/lib64/pkgconfig, coreutils, fflas-ffpack-devel, libflint2-devel, libgivaro-devel, libgmp-devel, libiml-devel, libmpfr-devel, libntl-devel, pkgconfig(fflas-ffpack) >= 2.5.0
Finding debuginfo files (using /usr/lib/rpm/find-debuginfo-files)
Executing: /bin/sh -e /usr/src/tmp/rpm-tmp.TQlxPL
Processing files: liblinbox0-debuginfo-1.7.0-alt1
Finding Provides (using /usr/lib/rpm/find-provides)
Executing: /bin/sh -e /usr/src/tmp/rpm-tmp.ZkEZiB
find-provides: running scripts (debuginfo)
Finding Requires (using /usr/lib/rpm/find-requires)
Executing: /bin/sh -e /usr/src/tmp/rpm-tmp.64RTtF
find-requires: running scripts (debuginfo)
Provides: debug64(liblinbox.so.0)
Requires: liblinbox0 = 1.7.0-alt1, debug64(libc.so.6), debug64(libgcc_s.so.1), debug64(libgivaro.so.9), debug64(libgmp.so.10), debug64(libm.so.6), debug64(libntl.so.44), debug64(libopenblas.so.0), debug64(libstdc++.so.6)
Adding to liblinbox0-debuginfo a strict dependency on liblinbox0
Adding to liblinbox-devel a strict dependency on liblinbox0
Removing 1 extra deps from liblinbox-devel due to dependency on liblinbox0
Wrote: /usr/src/RPM/RPMS/x86_64/liblinbox0-1.7.0-alt1.x86_64.rpm (w2.lzdio)
Wrote: /usr/src/RPM/RPMS/x86_64/liblinbox-devel-1.7.0-alt1.x86_64.rpm (w2.lzdio)
Wrote: /usr/src/RPM/RPMS/x86_64/liblinbox0-debuginfo-1.7.0-alt1.x86_64.rpm (w2.lzdio)
52.54user 15.10system 1:07.72elapsed 99%CPU (0avgtext+0avgdata 590772maxresident)k
0inputs+0outputs (0major+4807147minor)pagefaults 0swaps
1.93user 1.44system 1:15.65elapsed 4%CPU (0avgtext+0avgdata 111324maxresident)k
12720inputs+0outputs (0major+211293minor)pagefaults 0swaps
--- liblinbox0-1.7.0-alt1.x86_64.rpm.repo	2022-07-19 14:24:40.000000000 +0000
+++ liblinbox0-1.7.0-alt1.x86_64.rpm.hasher	2023-06-23 02:54:57.075140636 +0000
@@ -22,2 +22,3 @@
 Requires: libstdc++.so.6(GLIBCXX_3.4.29)(64bit)  
+Requires: libstdc++.so.6(GLIBCXX_3.4.32)(64bit)  
 Requires: libstdc++.so.6(GLIBCXX_3.4.9)(64bit)  
@@ -28,3 +29,3 @@
 File: /usr/lib64/liblinbox.so.0	120777	root:root		liblinbox.so.0.0.0
-File: /usr/lib64/liblinbox.so.0.0.0	100644	root:root	9392f3ead478d425a0c277961059d5c5	
-RPMIdentity: 571049b5010e6985faa303a1ca9ccb2db9da68bd17e646d78a2ff92020a4a5336787ebe09388f7f048ac15056d4ce17ec7776e4379afb7b6a81cba13a44f6d3c
+File: /usr/lib64/liblinbox.so.0.0.0	100644	root:root	8e805be035d87ac42ce3d3e74d56400d	
+RPMIdentity: 5ac1c694902d25274bea1bfcb4afdaf4a3c7b1ff891190c724778b8c53c09d18243dcf92e6dbdf999db550bd0032f0ff5bed37529c208c1f98473eaa3579d3af
--- liblinbox0-debuginfo-1.7.0-alt1.x86_64.rpm.repo	2022-07-19 14:24:40.000000000 +0000
+++ liblinbox0-debuginfo-1.7.0-alt1.x86_64.rpm.hasher	2023-06-23 02:54:57.148141539 +0000
@@ -1,4 +1,4 @@
-/usr/lib/debug/.build-id/37	40755	root:root	
-/usr/lib/debug/.build-id/37/04c7840bc680215d109630c95d866697f22c86	120777	root:root	../../../../lib64/liblinbox.so.0.0.0
-/usr/lib/debug/.build-id/37/04c7840bc680215d109630c95d866697f22c86.debug	120777	root:root	../../usr/lib64/liblinbox.so.0.0.0.debug
+/usr/lib/debug/.build-id/70	40755	root:root	
+/usr/lib/debug/.build-id/70/f13fd45f9df7a83b625d21423794234b490f8b	120777	root:root	../../../../lib64/liblinbox.so.0.0.0
+/usr/lib/debug/.build-id/70/f13fd45f9df7a83b625d21423794234b490f8b.debug	120777	root:root	../../usr/lib64/liblinbox.so.0.0.0.debug
 /usr/lib/debug/usr/lib64/liblinbox.so.0.0.0.debug	100644	root:root	
@@ -83,6 +83,6 @@
 Provides: liblinbox0-debuginfo = 1.7.0-alt1:sisyphus+303984.240.2.1
-File: /usr/lib/debug/.build-id/37	40755	root:root		
-File: /usr/lib/debug/.build-id/37/04c7840bc680215d109630c95d866697f22c86	120777	root:root		../../../../lib64/liblinbox.so.0.0.0
-File: /usr/lib/debug/.build-id/37/04c7840bc680215d109630c95d866697f22c86.debug	120777	root:root		../../usr/lib64/liblinbox.so.0.0.0.debug
-File: /usr/lib/debug/usr/lib64/liblinbox.so.0.0.0.debug	100644	root:root	405f314cd383e7566429e42abad1fd28	
+File: /usr/lib/debug/.build-id/70	40755	root:root		
+File: /usr/lib/debug/.build-id/70/f13fd45f9df7a83b625d21423794234b490f8b	120777	root:root		../../../../lib64/liblinbox.so.0.0.0
+File: /usr/lib/debug/.build-id/70/f13fd45f9df7a83b625d21423794234b490f8b.debug	120777	root:root		../../usr/lib64/liblinbox.so.0.0.0.debug
+File: /usr/lib/debug/usr/lib64/liblinbox.so.0.0.0.debug	100644	root:root	5095e726ddf0448cf6ec9d3e44c0774e	
 File: /usr/lib/debug/usr/lib64/liblinbox.so.0.debug	120777	root:root		liblinbox.so.0.0.0.debug
@@ -154,2 +154,2 @@
 File: /usr/src/debug/linbox-1.7.0/linbox/vector/vector-domain.h	100644	root:root	6da8d22478047605dbc763cf678fddfc	
-RPMIdentity: a74e4bfbc8297667ed5e991dad5529956a9950fd317d4f5810cdd54fce112be44d3de667f0a577603d60a75e93e977a46434fadb26917c9cae35b919553996ab
+RPMIdentity: 4b8d5fc962830b42ab46cab899e68b2e91f834daf36483af536f95230114ed9097de9332c5f661ebeb7234468aac21d6edfabd826a1245fe64d2314d93e0ee30