<86>May 29 02:30:55 userdel[1815341]: delete user 'rooter'
<86>May 29 02:30:55 userdel[1815341]: removed group 'rooter' owned by 'rooter'
<86>May 29 02:30:55 userdel[1815341]: removed shadow group 'rooter' owned by 'rooter'
<86>May 29 02:30:55 groupadd[1815387]: group added to /etc/group: name=rooter, GID=1871
<86>May 29 02:30:55 groupadd[1815387]: group added to /etc/gshadow: name=rooter
<86>May 29 02:30:55 groupadd[1815387]: new group: name=rooter, GID=1871
<86>May 29 02:30:55 useradd[1815411]: new user: name=rooter, UID=1871, GID=1871, home=/root, shell=/bin/bash, from=none
<86>May 29 02:30:55 userdel[1815475]: delete user 'builder'
<86>May 29 02:30:55 userdel[1815475]: removed group 'builder' owned by 'builder'
<86>May 29 02:30:55 userdel[1815475]: removed shadow group 'builder' owned by 'builder'
<86>May 29 02:30:55 groupadd[1815524]: group added to /etc/group: name=builder, GID=1872
<86>May 29 02:30:55 groupadd[1815524]: group added to /etc/gshadow: name=builder
<86>May 29 02:30:55 groupadd[1815524]: new group: name=builder, GID=1872
<86>May 29 02:30:55 useradd[1815542]: new user: name=builder, UID=1872, GID=1872, home=/usr/src, shell=/bin/bash, from=none
<13>May 29 02:30:57 rpmi: rpm-macros-cmake-3.23.2-alt3 sisyphus+318864.100.1.1 1681931983 installed
<13>May 29 02:30:58 rpmi: libidn2-2.3.4-alt1 sisyphus+309023.100.1.1 1666791084 installed
<13>May 29 02:30:58 rpmi: libnettle8-3.9.0-alt1 sisyphus+321863.100.1.1 1685032076 installed
<13>May 29 02:30:58 rpmi: libuv-1.44.2-alt1 sisyphus+303845.100.1.1 1658053885 installed
<13>May 29 02:30:58 rpmi: libjsoncpp24-1.9.4-alt2 sisyphus+286441.100.1.1 1633444232 installed
<13>May 29 02:30:58 rpmi: libexpat-2.5.0-alt1 sisyphus+309227.100.1.1 1667075764 installed
<13>May 29 02:30:58 rpmi: libp11-kit-0.24.1-alt1 sisyphus+293720.100.1.1 1642535264 installed
<13>May 29 02:30:58 rpmi: libtasn1-4.19.0-alt1 sisyphus+305700.100.1.1 1661359624 installed
<13>May 29 02:30:58 rpmi: libhogweed6-3.9.0-alt1 sisyphus+321863.100.1.1 1685032076 installed
<13>May 29 02:30:58 rpmi: libgnutls30-3.7.9-alt1 sisyphus+315353.100.1.1 1676639068 installed
<13>May 29 02:30:58 rpmi: libngtcp2-0.15.0-alt1 sisyphus+321126.100.1.1 1684414014 installed
<13>May 29 02:30:58 rpmi: libfmt9-1:9.1.0-alt1.1 sisyphus+321141.100.1.1 1684399972 installed
<13>May 29 02:30:58 rpmi: libbenchmark-1.7.1-alt1.1 sisyphus+319757.100.1.1 1683102327 installed
<13>May 29 02:30:58 rpmi: gcc-c++-common-1.4.27-alt1 sisyphus+278099.1300.1.1 1626028636 installed
<13>May 29 02:30:58 rpmi: libstdc++12-devel-12.2.1-alt2 sisyphus+317777.100.2.2 1682562822 installed
<13>May 29 02:30:59 rpmi: gcc12-c++-12.2.1-alt2 sisyphus+317777.100.2.2 1682562822 installed
<13>May 29 02:30:59 rpmi: cmake-modules-3.23.2-alt3 sisyphus+318864.100.1.1 1681931983 installed
<13>May 29 02:30:59 rpmi: librhash-1.3.5-alt3 sisyphus+286141.40.2.1 1632982456 installed
<13>May 29 02:30:59 rpmi: publicsuffix-list-dafsa-20230404-alt1 sisyphus+318117.100.1.1 1680769734 installed
<13>May 29 02:30:59 rpmi: libpsl-0.21.2-alt1 sisyphus+312536.100.1.1 1672131178 installed
<13>May 29 02:30:59 rpmi: libnghttp3-0.9.0-alt1 sisyphus+317166.100.1.1 1679409330 installed
<13>May 29 02:30:59 rpmi: libnghttp2-1.53.0-alt1 sisyphus+320325.100.1.1 1683872090 installed
<13>May 29 02:30:59 rpmi: openldap-common-2.6.4-alt1 sisyphus+321176.240.10.2 1684802269 installed
<13>May 29 02:30:59 rpmi: libntlm-1.5-alt1 sisyphus+278100.3300.1.1 1626058899 installed
<13>May 29 02:30:59 rpmi: libidn-1.37-alt2 sisyphus+300849.100.1.1 1653769687 installed
<13>May 29 02:30:59 rpmi: libverto-0.3.2-alt1_1 sisyphus+321176.2200.10.2 1684803947 installed
<13>May 29 02:30:59 rpmi: liblmdb-0.9.29-alt1.1 sisyphus+306630.100.1.1 1663072360 installed
<13>May 29 02:30:59 rpmi: libkeyutils-1.6.3-alt1 sisyphus+266061.100.1.1 1612919566 installed
<13>May 29 02:30:59 rpmi: libcom_err-1.46.4.0.5.4cda-alt1 sisyphus+283826.100.1.1 1629975345 installed
<13>May 29 02:30:59 rpmi: libbrotlicommon-1.0.9-alt2 sisyphus+278430.100.1.2 1626213212 installed
<13>May 29 02:30:59 rpmi: libbrotlidec-1.0.9-alt2 sisyphus+278430.100.1.2 1626213212 installed
<13>May 29 02:30:59 rpmi: rpm-macros-alternatives-0.5.2-alt2 sisyphus+315270.200.2.1 1676457367 installed
<13>May 29 02:30:59 rpmi: alternatives-0.5.2-alt2 sisyphus+315270.200.2.1 1676457367 installed
<13>May 29 02:30:59 rpmi: ca-certificates-2022.12.14-alt1 sisyphus+311754.200.1.1 1671046143 installed
<13>May 29 02:30:59 rpmi: ca-trust-0.1.4-alt1 sisyphus+308690.100.1.1 1666182992 installed
<13>May 29 02:30:59 rpmi: p11-kit-trust-0.24.1-alt1 sisyphus+293720.100.1.1 1642535264 installed
<13>May 29 02:30:59 rpmi: libcrypto1.1-1.1.1t-alt3 sisyphus+321595.100.1.1 1684740492 installed
<13>May 29 02:30:59 rpmi: libssl1.1-1.1.1t-alt3 sisyphus+321595.100.1.1 1684740492 installed
<86>May 29 02:30:59 groupadd[1836250]: group added to /etc/group: name=_keytab, GID=999
<86>May 29 02:30:59 groupadd[1836250]: group added to /etc/gshadow: name=_keytab
<86>May 29 02:30:59 groupadd[1836250]: new group: name=_keytab, GID=999
<13>May 29 02:30:59 rpmi: libkrb5-1.20.1-alt1 sisyphus+306946.1000.5.2 1677793877 installed
<13>May 29 02:30:59 rpmi: libgsasl-1.8.0-alt3 sisyphus+275307.100.1.2 1624478543 installed
<86>May 29 02:30:59 groupadd[1836464]: group added to /etc/group: name=sasl, GID=998
<86>May 29 02:30:59 groupadd[1836464]: group added to /etc/gshadow: name=sasl
<86>May 29 02:30:59 groupadd[1836464]: new group: name=sasl, GID=998
<13>May 29 02:30:59 rpmi: libsasl2-3-2.1.27-alt2.2 sisyphus+306372.1000.8.1 1663097224 installed
<13>May 29 02:30:59 rpmi: libldap2-2.6.4-alt1 sisyphus+321176.240.10.2 1684802269 installed
<13>May 29 02:30:59 rpmi: libarchive13-3.6.1-alt2 sisyphus+311213.100.1.1 1670244620 installed
<13>May 29 02:30:59 rpmi: libssh2-1.10.0-alt1 sisyphus+289470.100.1.1 1636752293 installed
<13>May 29 02:30:59 rpmi: libcurl-8.1.0-alt2 sisyphus+321174.100.1.1 1684432266 installed
<13>May 29 02:31:00 rpmi: cmake-3.23.2-alt3 sisyphus+318864.100.1.1 1681931983 installed
<13>May 29 02:31:00 rpmi: ctest-3.23.2-alt3 sisyphus+318864.100.1.1 1681931983 installed
<13>May 29 02:31:00 rpmi: gcc-c++-12-alt1 sisyphus+300988.300.1.1 1654033053 installed
<13>May 29 02:31:00 rpmi: libbenchmark-devel-1.7.1-alt1.1 sisyphus+319757.100.1.1 1683102327 installed
<13>May 29 02:31:00 rpmi: libfmt-devel-1:9.1.0-alt1.1 sisyphus+321141.100.1.1 1684399972 installed
Building target platforms: x86_64
Building for target x86_64
Wrote: /usr/src/in/nosrpm/spdlog-1.10.0-alt1.nosrc.rpm (w1.gzdio)
Installing spdlog-1.10.0-alt1.src.rpm
Building target platforms: x86_64
Building for target x86_64
Executing(%prep): /bin/sh -e /usr/src/tmp/rpm-tmp.15326
+ umask 022
+ /bin/mkdir -p /usr/src/RPM/BUILD
+ cd /usr/src/RPM/BUILD
+ cd /usr/src/RPM/BUILD
+ rm -rf spdlog-1.10.0
+ echo 'Source #0 (spdlog-1.10.0.tar):'
Source #0 (spdlog-1.10.0.tar):
+ /bin/tar -xf /usr/src/RPM/SOURCES/spdlog-1.10.0.tar
+ cd spdlog-1.10.0
+ /bin/chmod -c -Rf u+rwX,go-w .
+ rm -rfv include/spdlog/fmt/bundled/
removed 'include/spdlog/fmt/bundled/xchar.h'
removed 'include/spdlog/fmt/bundled/ranges.h'
removed 'include/spdlog/fmt/bundled/printf.h'
removed 'include/spdlog/fmt/bundled/ostream.h'
removed 'include/spdlog/fmt/bundled/os.h'
removed 'include/spdlog/fmt/bundled/locale.h'
removed 'include/spdlog/fmt/bundled/format.h'
removed 'include/spdlog/fmt/bundled/format-inl.h'
removed 'include/spdlog/fmt/bundled/fmt.license.rst'
removed 'include/spdlog/fmt/bundled/core.h'
removed 'include/spdlog/fmt/bundled/compile.h'
removed 'include/spdlog/fmt/bundled/color.h'
removed 'include/spdlog/fmt/bundled/chrono.h'
removed 'include/spdlog/fmt/bundled/args.h'
removed directory 'include/spdlog/fmt/bundled/'
+ exit 0
Executing(%build): /bin/sh -e /usr/src/tmp/rpm-tmp.15326
+ umask 022
+ /bin/mkdir -p /usr/src/RPM/BUILD
+ cd /usr/src/RPM/BUILD
+ cd spdlog-1.10.0
+ mkdir -p x86_64-alt-linux
+ cmake -DCMAKE_SKIP_INSTALL_RPATH:BOOL=yes '-DCMAKE_C_FLAGS:STRING=-pipe -frecord-gcc-switches -Wall -g -O2 -flto=auto' '-DCMAKE_CXX_FLAGS:STRING=-pipe -frecord-gcc-switches -Wall -g -O2 -flto=auto' '-DCMAKE_Fortran_FLAGS:STRING=-pipe -frecord-gcc-switches -Wall -g -O2 -flto=auto' -DCMAKE_INSTALL_PREFIX=/usr -DINCLUDE_INSTALL_DIR:PATH=/usr/include -DLIB_INSTALL_DIR:PATH=/usr/lib64 -DSYSCONF_INSTALL_DIR:PATH=/etc -DSHARE_INSTALL_PREFIX:PATH=/usr/share -DLIB_DESTINATION=lib64 -DLIB_SUFFIX=64 -S . -B x86_64-alt-linux -DSPDLOG_BUILD_SHARED=ON -DSPDLOG_FMT_EXTERNAL=ON -DSPDLOG_BUILD_TESTS=ON
-- The CXX compiler identification is GNU 12.2.1
-- Detecting CXX compiler ABI info
-- Detecting CXX compiler ABI info - done
-- Check for working CXX compiler: /usr/bin/c++ - skipped
-- Detecting CXX compile features
-- Detecting CXX compile features - done
-- Build spdlog: 1.10.0
-- Looking for C++ include pthread.h
-- Looking for C++ include pthread.h - found
-- Performing Test CMAKE_HAVE_LIBC_PTHREAD
-- Performing Test CMAKE_HAVE_LIBC_PTHREAD - Success
-- Found Threads: TRUE  
-- Build type: Release
-- Generating example(s)
-- Generating tests
-- Found PkgConfig: /usr/bin/pkg-config (found version "0.29.2") 
-- Checking for module 'libsystemd'
--   No package 'libsystemd' found
-- Generating install
-- Configuring done
-- Generating done
CMake Warning:
  Manually-specified variables were not used by the project:

    CMAKE_C_FLAGS
    CMAKE_Fortran_FLAGS
    INCLUDE_INSTALL_DIR
    LIB_DESTINATION
    LIB_INSTALL_DIR
    LIB_SUFFIX
    SHARE_INSTALL_PREFIX
    SYSCONF_INSTALL_DIR


-- Build files have been written to: /usr/src/RPM/BUILD/spdlog-1.10.0/x86_64-alt-linux
+ cmake --build x86_64-alt-linux --verbose --parallel 16
gmake: Entering directory '/usr/src/RPM/BUILD/spdlog-1.10.0/x86_64-alt-linux'
/usr/bin/cmake -S/usr/src/RPM/BUILD/spdlog-1.10.0 -B/usr/src/RPM/BUILD/spdlog-1.10.0/x86_64-alt-linux --check-build-system CMakeFiles/Makefile.cmake 0
gmake: Leaving directory '/usr/src/RPM/BUILD/spdlog-1.10.0/x86_64-alt-linux'
gmake: Entering directory '/usr/src/RPM/BUILD/spdlog-1.10.0/x86_64-alt-linux'
/usr/bin/cmake -E cmake_progress_start /usr/src/RPM/BUILD/spdlog-1.10.0/x86_64-alt-linux/CMakeFiles /usr/src/RPM/BUILD/spdlog-1.10.0/x86_64-alt-linux//CMakeFiles/progress.marks
gmake: Leaving directory '/usr/src/RPM/BUILD/spdlog-1.10.0/x86_64-alt-linux'
/usr/bin/gmake  -f CMakeFiles/Makefile2 all
/usr/bin/gmake  -f CMakeFiles/spdlog.dir/build.make CMakeFiles/spdlog.dir/depend
gmake[2]: Entering directory '/usr/src/RPM/BUILD/spdlog-1.10.0/x86_64-alt-linux'
cd /usr/src/RPM/BUILD/spdlog-1.10.0/x86_64-alt-linux && /usr/bin/cmake -E cmake_depends "Unix Makefiles" /usr/src/RPM/BUILD/spdlog-1.10.0 /usr/src/RPM/BUILD/spdlog-1.10.0 /usr/src/RPM/BUILD/spdlog-1.10.0/x86_64-alt-linux /usr/src/RPM/BUILD/spdlog-1.10.0/x86_64-alt-linux /usr/src/RPM/BUILD/spdlog-1.10.0/x86_64-alt-linux/CMakeFiles/spdlog.dir/DependInfo.cmake --color=
gmake[2]: Leaving directory '/usr/src/RPM/BUILD/spdlog-1.10.0/x86_64-alt-linux'
/usr/bin/gmake  -f CMakeFiles/spdlog.dir/build.make CMakeFiles/spdlog.dir/build
gmake[2]: Entering directory '/usr/src/RPM/BUILD/spdlog-1.10.0/x86_64-alt-linux'
[ 12%] Building CXX object CMakeFiles/spdlog.dir/src/file_sinks.cpp.o
/usr/bin/c++ -DFMT_SHARED -DSPDLOG_COMPILED_LIB -DSPDLOG_FMT_EXTERNAL -DSPDLOG_SHARED_LIB -Dspdlog_EXPORTS -I/usr/src/RPM/BUILD/spdlog-1.10.0/include -pipe -frecord-gcc-switches -Wall -g -O2 -flto=auto -O2 -DNDEBUG -fPIC -std=c++11 -MD -MT CMakeFiles/spdlog.dir/src/file_sinks.cpp.o -MF CMakeFiles/spdlog.dir/src/file_sinks.cpp.o.d -o CMakeFiles/spdlog.dir/src/file_sinks.cpp.o -c /usr/src/RPM/BUILD/spdlog-1.10.0/src/file_sinks.cpp
gmake[2]: Leaving directory '/usr/src/RPM/BUILD/spdlog-1.10.0/x86_64-alt-linux'
gmake[2]: Entering directory '/usr/src/RPM/BUILD/spdlog-1.10.0/x86_64-alt-linux'
[ 19%] Building CXX object CMakeFiles/spdlog.dir/src/cfg.cpp.o
/usr/bin/c++ -DFMT_SHARED -DSPDLOG_COMPILED_LIB -DSPDLOG_FMT_EXTERNAL -DSPDLOG_SHARED_LIB -Dspdlog_EXPORTS -I/usr/src/RPM/BUILD/spdlog-1.10.0/include -pipe -frecord-gcc-switches -Wall -g -O2 -flto=auto -O2 -DNDEBUG -fPIC -std=c++11 -MD -MT CMakeFiles/spdlog.dir/src/cfg.cpp.o -MF CMakeFiles/spdlog.dir/src/cfg.cpp.o.d -o CMakeFiles/spdlog.dir/src/cfg.cpp.o -c /usr/src/RPM/BUILD/spdlog-1.10.0/src/cfg.cpp
gmake[2]: Leaving directory '/usr/src/RPM/BUILD/spdlog-1.10.0/x86_64-alt-linux'
gmake[2]: Entering directory '/usr/src/RPM/BUILD/spdlog-1.10.0/x86_64-alt-linux'
[ 16%] Building CXX object CMakeFiles/spdlog.dir/src/async.cpp.o
/usr/bin/c++ -DFMT_SHARED -DSPDLOG_COMPILED_LIB -DSPDLOG_FMT_EXTERNAL -DSPDLOG_SHARED_LIB -Dspdlog_EXPORTS -I/usr/src/RPM/BUILD/spdlog-1.10.0/include -pipe -frecord-gcc-switches -Wall -g -O2 -flto=auto -O2 -DNDEBUG -fPIC -std=c++11 -MD -MT CMakeFiles/spdlog.dir/src/async.cpp.o -MF CMakeFiles/spdlog.dir/src/async.cpp.o.d -o CMakeFiles/spdlog.dir/src/async.cpp.o -c /usr/src/RPM/BUILD/spdlog-1.10.0/src/async.cpp
/usr/src/RPM/BUILD/spdlog-1.10.0/src/async.cpp:13:44: warning: type attributes ignored after type is already defined [-Wattributes]
   13 | template class SPDLOG_API spdlog::details::mpmc_blocking_queue<spdlog::details::async_msg>;
      |                                            ^~~~~~~~~~~~~~~~~~~~~~~~~~~~~~~~~~~~~~~~~~~~~~~
gmake[2]: Leaving directory '/usr/src/RPM/BUILD/spdlog-1.10.0/x86_64-alt-linux'
gmake[2]: Entering directory '/usr/src/RPM/BUILD/spdlog-1.10.0/x86_64-alt-linux'
[  6%] Building CXX object CMakeFiles/spdlog.dir/src/stdout_sinks.cpp.o
/usr/bin/c++ -DFMT_SHARED -DSPDLOG_COMPILED_LIB -DSPDLOG_FMT_EXTERNAL -DSPDLOG_SHARED_LIB -Dspdlog_EXPORTS -I/usr/src/RPM/BUILD/spdlog-1.10.0/include -pipe -frecord-gcc-switches -Wall -g -O2 -flto=auto -O2 -DNDEBUG -fPIC -std=c++11 -MD -MT CMakeFiles/spdlog.dir/src/stdout_sinks.cpp.o -MF CMakeFiles/spdlog.dir/src/stdout_sinks.cpp.o.d -o CMakeFiles/spdlog.dir/src/stdout_sinks.cpp.o -c /usr/src/RPM/BUILD/spdlog-1.10.0/src/stdout_sinks.cpp
gmake[2]: Leaving directory '/usr/src/RPM/BUILD/spdlog-1.10.0/x86_64-alt-linux'
gmake[2]: Entering directory '/usr/src/RPM/BUILD/spdlog-1.10.0/x86_64-alt-linux'
[  9%] Building CXX object CMakeFiles/spdlog.dir/src/color_sinks.cpp.o
/usr/bin/c++ -DFMT_SHARED -DSPDLOG_COMPILED_LIB -DSPDLOG_FMT_EXTERNAL -DSPDLOG_SHARED_LIB -Dspdlog_EXPORTS -I/usr/src/RPM/BUILD/spdlog-1.10.0/include -pipe -frecord-gcc-switches -Wall -g -O2 -flto=auto -O2 -DNDEBUG -fPIC -std=c++11 -MD -MT CMakeFiles/spdlog.dir/src/color_sinks.cpp.o -MF CMakeFiles/spdlog.dir/src/color_sinks.cpp.o.d -o CMakeFiles/spdlog.dir/src/color_sinks.cpp.o -c /usr/src/RPM/BUILD/spdlog-1.10.0/src/color_sinks.cpp
gmake[2]: Leaving directory '/usr/src/RPM/BUILD/spdlog-1.10.0/x86_64-alt-linux'
gmake[2]: Entering directory '/usr/src/RPM/BUILD/spdlog-1.10.0/x86_64-alt-linux'
[  6%] Building CXX object CMakeFiles/spdlog.dir/src/spdlog.cpp.o
/usr/bin/c++ -DFMT_SHARED -DSPDLOG_COMPILED_LIB -DSPDLOG_FMT_EXTERNAL -DSPDLOG_SHARED_LIB -Dspdlog_EXPORTS -I/usr/src/RPM/BUILD/spdlog-1.10.0/include -pipe -frecord-gcc-switches -Wall -g -O2 -flto=auto -O2 -DNDEBUG -fPIC -std=c++11 -MD -MT CMakeFiles/spdlog.dir/src/spdlog.cpp.o -MF CMakeFiles/spdlog.dir/src/spdlog.cpp.o.d -o CMakeFiles/spdlog.dir/src/spdlog.cpp.o -c /usr/src/RPM/BUILD/spdlog-1.10.0/src/spdlog.cpp
gmake[2]: Leaving directory '/usr/src/RPM/BUILD/spdlog-1.10.0/x86_64-alt-linux'
gmake[2]: Entering directory '/usr/src/RPM/BUILD/spdlog-1.10.0/x86_64-alt-linux'
[ 22%] Linking CXX shared library libspdlog.so
/usr/bin/cmake -E cmake_link_script CMakeFiles/spdlog.dir/link.txt --verbose=1
/usr/bin/c++ -fPIC -pipe -frecord-gcc-switches -Wall -g -O2 -flto=auto -O2 -DNDEBUG -shared -Wl,-soname,libspdlog.so.1 -o libspdlog.so.1.10.0 CMakeFiles/spdlog.dir/src/spdlog.cpp.o CMakeFiles/spdlog.dir/src/stdout_sinks.cpp.o CMakeFiles/spdlog.dir/src/color_sinks.cpp.o CMakeFiles/spdlog.dir/src/file_sinks.cpp.o CMakeFiles/spdlog.dir/src/async.cpp.o CMakeFiles/spdlog.dir/src/cfg.cpp.o  /usr/lib64/libfmt.so.9.1.0 
/usr/bin/cmake -E cmake_symlink_library libspdlog.so.1.10.0 libspdlog.so.1 libspdlog.so
gmake[2]: Leaving directory '/usr/src/RPM/BUILD/spdlog-1.10.0/x86_64-alt-linux'
gmake[1]: Entering directory '/usr/src/RPM/BUILD/spdlog-1.10.0/x86_64-alt-linux'
[ 22%] Built target spdlog
gmake[1]: Leaving directory '/usr/src/RPM/BUILD/spdlog-1.10.0/x86_64-alt-linux'
/usr/bin/gmake  -f example/CMakeFiles/example.dir/build.make example/CMakeFiles/example.dir/depend
/usr/bin/gmake  -f tests/CMakeFiles/spdlog-utests.dir/build.make tests/CMakeFiles/spdlog-utests.dir/depend
gmake[2]: Entering directory '/usr/src/RPM/BUILD/spdlog-1.10.0/x86_64-alt-linux'
cd /usr/src/RPM/BUILD/spdlog-1.10.0/x86_64-alt-linux && /usr/bin/cmake -E cmake_depends "Unix Makefiles" /usr/src/RPM/BUILD/spdlog-1.10.0 /usr/src/RPM/BUILD/spdlog-1.10.0/tests /usr/src/RPM/BUILD/spdlog-1.10.0/x86_64-alt-linux /usr/src/RPM/BUILD/spdlog-1.10.0/x86_64-alt-linux/tests /usr/src/RPM/BUILD/spdlog-1.10.0/x86_64-alt-linux/tests/CMakeFiles/spdlog-utests.dir/DependInfo.cmake --color=
gmake[2]: Leaving directory '/usr/src/RPM/BUILD/spdlog-1.10.0/x86_64-alt-linux'
/usr/bin/gmake  -f tests/CMakeFiles/spdlog-utests.dir/build.make tests/CMakeFiles/spdlog-utests.dir/build
gmake[2]: Entering directory '/usr/src/RPM/BUILD/spdlog-1.10.0/x86_64-alt-linux'
cd /usr/src/RPM/BUILD/spdlog-1.10.0/x86_64-alt-linux && /usr/bin/cmake -E cmake_depends "Unix Makefiles" /usr/src/RPM/BUILD/spdlog-1.10.0 /usr/src/RPM/BUILD/spdlog-1.10.0/example /usr/src/RPM/BUILD/spdlog-1.10.0/x86_64-alt-linux /usr/src/RPM/BUILD/spdlog-1.10.0/x86_64-alt-linux/example /usr/src/RPM/BUILD/spdlog-1.10.0/x86_64-alt-linux/example/CMakeFiles/example.dir/DependInfo.cmake --color=
gmake[2]: Leaving directory '/usr/src/RPM/BUILD/spdlog-1.10.0/x86_64-alt-linux'
/usr/bin/gmake  -f example/CMakeFiles/example.dir/build.make example/CMakeFiles/example.dir/build
gmake[2]: Entering directory '/usr/src/RPM/BUILD/spdlog-1.10.0/x86_64-alt-linux'
[ 41%] Building CXX object tests/CMakeFiles/spdlog-utests.dir/test_eventlog.cpp.o
cd /usr/src/RPM/BUILD/spdlog-1.10.0/x86_64-alt-linux/tests && /usr/bin/c++ -DFMT_SHARED -DSPDLOG_COMPILED_LIB -DSPDLOG_FMT_EXTERNAL -DSPDLOG_SHARED_LIB -I/usr/src/RPM/BUILD/spdlog-1.10.0/include -pipe -frecord-gcc-switches -Wall -g -O2 -flto=auto -O2 -DNDEBUG -std=c++11 -MD -MT tests/CMakeFiles/spdlog-utests.dir/test_eventlog.cpp.o -MF CMakeFiles/spdlog-utests.dir/test_eventlog.cpp.o.d -o CMakeFiles/spdlog-utests.dir/test_eventlog.cpp.o -c /usr/src/RPM/BUILD/spdlog-1.10.0/tests/test_eventlog.cpp
gmake[2]: Leaving directory '/usr/src/RPM/BUILD/spdlog-1.10.0/x86_64-alt-linux'
gmake[2]: Entering directory '/usr/src/RPM/BUILD/spdlog-1.10.0/x86_64-alt-linux'
[ 48%] Building CXX object tests/CMakeFiles/spdlog-utests.dir/utils.cpp.o
cd /usr/src/RPM/BUILD/spdlog-1.10.0/x86_64-alt-linux/tests && /usr/bin/c++ -DFMT_SHARED -DSPDLOG_COMPILED_LIB -DSPDLOG_FMT_EXTERNAL -DSPDLOG_SHARED_LIB -I/usr/src/RPM/BUILD/spdlog-1.10.0/include -pipe -frecord-gcc-switches -Wall -g -O2 -flto=auto -O2 -DNDEBUG -std=c++11 -MD -MT tests/CMakeFiles/spdlog-utests.dir/utils.cpp.o -MF CMakeFiles/spdlog-utests.dir/utils.cpp.o.d -o CMakeFiles/spdlog-utests.dir/utils.cpp.o -c /usr/src/RPM/BUILD/spdlog-1.10.0/tests/utils.cpp
gmake[2]: Leaving directory '/usr/src/RPM/BUILD/spdlog-1.10.0/x86_64-alt-linux'
gmake[2]: Entering directory '/usr/src/RPM/BUILD/spdlog-1.10.0/x86_64-alt-linux'
[ 74%] Building CXX object tests/CMakeFiles/spdlog-utests.dir/test_stdout_api.cpp.o
cd /usr/src/RPM/BUILD/spdlog-1.10.0/x86_64-alt-linux/tests && /usr/bin/c++ -DFMT_SHARED -DSPDLOG_COMPILED_LIB -DSPDLOG_FMT_EXTERNAL -DSPDLOG_SHARED_LIB -I/usr/src/RPM/BUILD/spdlog-1.10.0/include -pipe -frecord-gcc-switches -Wall -g -O2 -flto=auto -O2 -DNDEBUG -std=c++11 -MD -MT tests/CMakeFiles/spdlog-utests.dir/test_stdout_api.cpp.o -MF CMakeFiles/spdlog-utests.dir/test_stdout_api.cpp.o.d -o CMakeFiles/spdlog-utests.dir/test_stdout_api.cpp.o -c /usr/src/RPM/BUILD/spdlog-1.10.0/tests/test_stdout_api.cpp
gmake[2]: Leaving directory '/usr/src/RPM/BUILD/spdlog-1.10.0/x86_64-alt-linux'
gmake[2]: Entering directory '/usr/src/RPM/BUILD/spdlog-1.10.0/x86_64-alt-linux'
[ 64%] Building CXX object tests/CMakeFiles/spdlog-utests.dir/test_mpmc_q.cpp.o
cd /usr/src/RPM/BUILD/spdlog-1.10.0/x86_64-alt-linux/tests && /usr/bin/c++ -DFMT_SHARED -DSPDLOG_COMPILED_LIB -DSPDLOG_FMT_EXTERNAL -DSPDLOG_SHARED_LIB -I/usr/src/RPM/BUILD/spdlog-1.10.0/include -pipe -frecord-gcc-switches -Wall -g -O2 -flto=auto -O2 -DNDEBUG -std=c++11 -MD -MT tests/CMakeFiles/spdlog-utests.dir/test_mpmc_q.cpp.o -MF CMakeFiles/spdlog-utests.dir/test_mpmc_q.cpp.o.d -o CMakeFiles/spdlog-utests.dir/test_mpmc_q.cpp.o -c /usr/src/RPM/BUILD/spdlog-1.10.0/tests/test_mpmc_q.cpp
gmake[2]: Leaving directory '/usr/src/RPM/BUILD/spdlog-1.10.0/x86_64-alt-linux'
gmake[2]: Entering directory '/usr/src/RPM/BUILD/spdlog-1.10.0/x86_64-alt-linux'
[ 67%] Building CXX object tests/CMakeFiles/spdlog-utests.dir/test_dup_filter.cpp.o
cd /usr/src/RPM/BUILD/spdlog-1.10.0/x86_64-alt-linux/tests && /usr/bin/c++ -DFMT_SHARED -DSPDLOG_COMPILED_LIB -DSPDLOG_FMT_EXTERNAL -DSPDLOG_SHARED_LIB -I/usr/src/RPM/BUILD/spdlog-1.10.0/include -pipe -frecord-gcc-switches -Wall -g -O2 -flto=auto -O2 -DNDEBUG -std=c++11 -MD -MT tests/CMakeFiles/spdlog-utests.dir/test_dup_filter.cpp.o -MF CMakeFiles/spdlog-utests.dir/test_dup_filter.cpp.o.d -o CMakeFiles/spdlog-utests.dir/test_dup_filter.cpp.o -c /usr/src/RPM/BUILD/spdlog-1.10.0/tests/test_dup_filter.cpp
gmake[2]: Leaving directory '/usr/src/RPM/BUILD/spdlog-1.10.0/x86_64-alt-linux'
gmake[2]: Entering directory '/usr/src/RPM/BUILD/spdlog-1.10.0/x86_64-alt-linux'
[ 54%] Building CXX object tests/CMakeFiles/spdlog-utests.dir/test_registry.cpp.o
cd /usr/src/RPM/BUILD/spdlog-1.10.0/x86_64-alt-linux/tests && /usr/bin/c++ -DFMT_SHARED -DSPDLOG_COMPILED_LIB -DSPDLOG_FMT_EXTERNAL -DSPDLOG_SHARED_LIB -I/usr/src/RPM/BUILD/spdlog-1.10.0/include -pipe -frecord-gcc-switches -Wall -g -O2 -flto=auto -O2 -DNDEBUG -std=c++11 -MD -MT tests/CMakeFiles/spdlog-utests.dir/test_registry.cpp.o -MF CMakeFiles/spdlog-utests.dir/test_registry.cpp.o.d -o CMakeFiles/spdlog-utests.dir/test_registry.cpp.o -c /usr/src/RPM/BUILD/spdlog-1.10.0/tests/test_registry.cpp
gmake[2]: Leaving directory '/usr/src/RPM/BUILD/spdlog-1.10.0/x86_64-alt-linux'
gmake[2]: Entering directory '/usr/src/RPM/BUILD/spdlog-1.10.0/x86_64-alt-linux'
[ 77%] Building CXX object tests/CMakeFiles/spdlog-utests.dir/test_fmt_helper.cpp.o
cd /usr/src/RPM/BUILD/spdlog-1.10.0/x86_64-alt-linux/tests && /usr/bin/c++ -DFMT_SHARED -DSPDLOG_COMPILED_LIB -DSPDLOG_FMT_EXTERNAL -DSPDLOG_SHARED_LIB -I/usr/src/RPM/BUILD/spdlog-1.10.0/include -pipe -frecord-gcc-switches -Wall -g -O2 -flto=auto -O2 -DNDEBUG -std=c++11 -MD -MT tests/CMakeFiles/spdlog-utests.dir/test_fmt_helper.cpp.o -MF CMakeFiles/spdlog-utests.dir/test_fmt_helper.cpp.o.d -o CMakeFiles/spdlog-utests.dir/test_fmt_helper.cpp.o -c /usr/src/RPM/BUILD/spdlog-1.10.0/tests/test_fmt_helper.cpp
gmake[2]: Leaving directory '/usr/src/RPM/BUILD/spdlog-1.10.0/x86_64-alt-linux'
gmake[2]: Entering directory '/usr/src/RPM/BUILD/spdlog-1.10.0/x86_64-alt-linux'
[ 35%] Building CXX object tests/CMakeFiles/spdlog-utests.dir/test_file_helper.cpp.o
cd /usr/src/RPM/BUILD/spdlog-1.10.0/x86_64-alt-linux/tests && /usr/bin/c++ -DFMT_SHARED -DSPDLOG_COMPILED_LIB -DSPDLOG_FMT_EXTERNAL -DSPDLOG_SHARED_LIB -I/usr/src/RPM/BUILD/spdlog-1.10.0/include -pipe -frecord-gcc-switches -Wall -g -O2 -flto=auto -O2 -DNDEBUG -std=c++11 -MD -MT tests/CMakeFiles/spdlog-utests.dir/test_file_helper.cpp.o -MF CMakeFiles/spdlog-utests.dir/test_file_helper.cpp.o.d -o CMakeFiles/spdlog-utests.dir/test_file_helper.cpp.o -c /usr/src/RPM/BUILD/spdlog-1.10.0/tests/test_file_helper.cpp
gmake[2]: Leaving directory '/usr/src/RPM/BUILD/spdlog-1.10.0/x86_64-alt-linux'
gmake[2]: Entering directory '/usr/src/RPM/BUILD/spdlog-1.10.0/x86_64-alt-linux'
[ 35%] Building CXX object tests/CMakeFiles/spdlog-utests.dir/test_file_logging.cpp.o
cd /usr/src/RPM/BUILD/spdlog-1.10.0/x86_64-alt-linux/tests && /usr/bin/c++ -DFMT_SHARED -DSPDLOG_COMPILED_LIB -DSPDLOG_FMT_EXTERNAL -DSPDLOG_SHARED_LIB -I/usr/src/RPM/BUILD/spdlog-1.10.0/include -pipe -frecord-gcc-switches -Wall -g -O2 -flto=auto -O2 -DNDEBUG -std=c++11 -MD -MT tests/CMakeFiles/spdlog-utests.dir/test_file_logging.cpp.o -MF CMakeFiles/spdlog-utests.dir/test_file_logging.cpp.o.d -o CMakeFiles/spdlog-utests.dir/test_file_logging.cpp.o -c /usr/src/RPM/BUILD/spdlog-1.10.0/tests/test_file_logging.cpp
gmake[2]: Leaving directory '/usr/src/RPM/BUILD/spdlog-1.10.0/x86_64-alt-linux'
gmake[2]: Entering directory '/usr/src/RPM/BUILD/spdlog-1.10.0/x86_64-alt-linux'
[ 54%] Building CXX object tests/CMakeFiles/spdlog-utests.dir/test_macros.cpp.o
cd /usr/src/RPM/BUILD/spdlog-1.10.0/x86_64-alt-linux/tests && /usr/bin/c++ -DFMT_SHARED -DSPDLOG_COMPILED_LIB -DSPDLOG_FMT_EXTERNAL -DSPDLOG_SHARED_LIB -I/usr/src/RPM/BUILD/spdlog-1.10.0/include -pipe -frecord-gcc-switches -Wall -g -O2 -flto=auto -O2 -DNDEBUG -std=c++11 -MD -MT tests/CMakeFiles/spdlog-utests.dir/test_macros.cpp.o -MF CMakeFiles/spdlog-utests.dir/test_macros.cpp.o.d -o CMakeFiles/spdlog-utests.dir/test_macros.cpp.o -c /usr/src/RPM/BUILD/spdlog-1.10.0/tests/test_macros.cpp
gmake[2]: Leaving directory '/usr/src/RPM/BUILD/spdlog-1.10.0/x86_64-alt-linux'
gmake[2]: Entering directory '/usr/src/RPM/BUILD/spdlog-1.10.0/x86_64-alt-linux'
[ 70%] Building CXX object tests/CMakeFiles/spdlog-utests.dir/test_backtrace.cpp.o
cd /usr/src/RPM/BUILD/spdlog-1.10.0/x86_64-alt-linux/tests && /usr/bin/c++ -DFMT_SHARED -DSPDLOG_COMPILED_LIB -DSPDLOG_FMT_EXTERNAL -DSPDLOG_SHARED_LIB -I/usr/src/RPM/BUILD/spdlog-1.10.0/include -pipe -frecord-gcc-switches -Wall -g -O2 -flto=auto -O2 -DNDEBUG -std=c++11 -MD -MT tests/CMakeFiles/spdlog-utests.dir/test_backtrace.cpp.o -MF CMakeFiles/spdlog-utests.dir/test_backtrace.cpp.o.d -o CMakeFiles/spdlog-utests.dir/test_backtrace.cpp.o -c /usr/src/RPM/BUILD/spdlog-1.10.0/tests/test_backtrace.cpp
gmake[2]: Leaving directory '/usr/src/RPM/BUILD/spdlog-1.10.0/x86_64-alt-linux'
gmake[2]: Entering directory '/usr/src/RPM/BUILD/spdlog-1.10.0/x86_64-alt-linux'
[ 80%] Building CXX object tests/CMakeFiles/spdlog-utests.dir/test_create_dir.cpp.o
cd /usr/src/RPM/BUILD/spdlog-1.10.0/x86_64-alt-linux/tests && /usr/bin/c++ -DFMT_SHARED -DSPDLOG_COMPILED_LIB -DSPDLOG_FMT_EXTERNAL -DSPDLOG_SHARED_LIB -I/usr/src/RPM/BUILD/spdlog-1.10.0/include -pipe -frecord-gcc-switches -Wall -g -O2 -flto=auto -O2 -DNDEBUG -std=c++11 -MD -MT tests/CMakeFiles/spdlog-utests.dir/test_create_dir.cpp.o -MF CMakeFiles/spdlog-utests.dir/test_create_dir.cpp.o.d -o CMakeFiles/spdlog-utests.dir/test_create_dir.cpp.o -c /usr/src/RPM/BUILD/spdlog-1.10.0/tests/test_create_dir.cpp
gmake[2]: Leaving directory '/usr/src/RPM/BUILD/spdlog-1.10.0/x86_64-alt-linux'
gmake[2]: Entering directory '/usr/src/RPM/BUILD/spdlog-1.10.0/x86_64-alt-linux'
[ 45%] Building CXX object tests/CMakeFiles/spdlog-utests.dir/test_async.cpp.o
cd /usr/src/RPM/BUILD/spdlog-1.10.0/x86_64-alt-linux/tests && /usr/bin/c++ -DFMT_SHARED -DSPDLOG_COMPILED_LIB -DSPDLOG_FMT_EXTERNAL -DSPDLOG_SHARED_LIB -I/usr/src/RPM/BUILD/spdlog-1.10.0/include -pipe -frecord-gcc-switches -Wall -g -O2 -flto=auto -O2 -DNDEBUG -std=c++11 -MD -MT tests/CMakeFiles/spdlog-utests.dir/test_async.cpp.o -MF CMakeFiles/spdlog-utests.dir/test_async.cpp.o.d -o CMakeFiles/spdlog-utests.dir/test_async.cpp.o -c /usr/src/RPM/BUILD/spdlog-1.10.0/tests/test_async.cpp
gmake[2]: Leaving directory '/usr/src/RPM/BUILD/spdlog-1.10.0/x86_64-alt-linux'
gmake[2]: Entering directory '/usr/src/RPM/BUILD/spdlog-1.10.0/x86_64-alt-linux'
[ 87%] Building CXX object tests/CMakeFiles/spdlog-utests.dir/test_time_point.cpp.o
cd /usr/src/RPM/BUILD/spdlog-1.10.0/x86_64-alt-linux/tests && /usr/bin/c++ -DFMT_SHARED -DSPDLOG_COMPILED_LIB -DSPDLOG_FMT_EXTERNAL -DSPDLOG_SHARED_LIB -I/usr/src/RPM/BUILD/spdlog-1.10.0/include -pipe -frecord-gcc-switches -Wall -g -O2 -flto=auto -O2 -DNDEBUG -std=c++11 -MD -MT tests/CMakeFiles/spdlog-utests.dir/test_time_point.cpp.o -MF CMakeFiles/spdlog-utests.dir/test_time_point.cpp.o.d -o CMakeFiles/spdlog-utests.dir/test_time_point.cpp.o -c /usr/src/RPM/BUILD/spdlog-1.10.0/tests/test_time_point.cpp
gmake[2]: Leaving directory '/usr/src/RPM/BUILD/spdlog-1.10.0/x86_64-alt-linux'
gmake[2]: Entering directory '/usr/src/RPM/BUILD/spdlog-1.10.0/x86_64-alt-linux'
[ 29%] Building CXX object tests/CMakeFiles/spdlog-utests.dir/test_misc.cpp.o
cd /usr/src/RPM/BUILD/spdlog-1.10.0/x86_64-alt-linux/tests && /usr/bin/c++ -DFMT_SHARED -DSPDLOG_COMPILED_LIB -DSPDLOG_FMT_EXTERNAL -DSPDLOG_SHARED_LIB -I/usr/src/RPM/BUILD/spdlog-1.10.0/include -pipe -frecord-gcc-switches -Wall -g -O2 -flto=auto -O2 -DNDEBUG -std=c++11 -MD -MT tests/CMakeFiles/spdlog-utests.dir/test_misc.cpp.o -MF CMakeFiles/spdlog-utests.dir/test_misc.cpp.o.d -o CMakeFiles/spdlog-utests.dir/test_misc.cpp.o -c /usr/src/RPM/BUILD/spdlog-1.10.0/tests/test_misc.cpp
gmake[2]: Leaving directory '/usr/src/RPM/BUILD/spdlog-1.10.0/x86_64-alt-linux'
gmake[2]: Entering directory '/usr/src/RPM/BUILD/spdlog-1.10.0/x86_64-alt-linux'
[ 83%] Building CXX object tests/CMakeFiles/spdlog-utests.dir/test_cfg.cpp.o
cd /usr/src/RPM/BUILD/spdlog-1.10.0/x86_64-alt-linux/tests && /usr/bin/c++ -DFMT_SHARED -DSPDLOG_COMPILED_LIB -DSPDLOG_FMT_EXTERNAL -DSPDLOG_SHARED_LIB -I/usr/src/RPM/BUILD/spdlog-1.10.0/include -pipe -frecord-gcc-switches -Wall -g -O2 -flto=auto -O2 -DNDEBUG -std=c++11 -MD -MT tests/CMakeFiles/spdlog-utests.dir/test_cfg.cpp.o -MF CMakeFiles/spdlog-utests.dir/test_cfg.cpp.o.d -o CMakeFiles/spdlog-utests.dir/test_cfg.cpp.o -c /usr/src/RPM/BUILD/spdlog-1.10.0/tests/test_cfg.cpp
gmake[2]: Leaving directory '/usr/src/RPM/BUILD/spdlog-1.10.0/x86_64-alt-linux'
gmake[2]: Entering directory '/usr/src/RPM/BUILD/spdlog-1.10.0/x86_64-alt-linux'
[ 58%] Building CXX object tests/CMakeFiles/spdlog-utests.dir/test_pattern_formatter.cpp.o
cd /usr/src/RPM/BUILD/spdlog-1.10.0/x86_64-alt-linux/tests && /usr/bin/c++ -DFMT_SHARED -DSPDLOG_COMPILED_LIB -DSPDLOG_FMT_EXTERNAL -DSPDLOG_SHARED_LIB -I/usr/src/RPM/BUILD/spdlog-1.10.0/include -pipe -frecord-gcc-switches -Wall -g -O2 -flto=auto -O2 -DNDEBUG -std=c++11 -MD -MT tests/CMakeFiles/spdlog-utests.dir/test_pattern_formatter.cpp.o -MF CMakeFiles/spdlog-utests.dir/test_pattern_formatter.cpp.o.d -o CMakeFiles/spdlog-utests.dir/test_pattern_formatter.cpp.o -c /usr/src/RPM/BUILD/spdlog-1.10.0/tests/test_pattern_formatter.cpp
gmake[2]: Leaving directory '/usr/src/RPM/BUILD/spdlog-1.10.0/x86_64-alt-linux'
gmake[2]: Entering directory '/usr/src/RPM/BUILD/spdlog-1.10.0/x86_64-alt-linux'
[ 38%] Building CXX object example/CMakeFiles/example.dir/example.cpp.o
cd /usr/src/RPM/BUILD/spdlog-1.10.0/x86_64-alt-linux/example && /usr/bin/c++ -DFMT_SHARED -DSPDLOG_COMPILED_LIB -DSPDLOG_FMT_EXTERNAL -DSPDLOG_SHARED_LIB -I/usr/src/RPM/BUILD/spdlog-1.10.0/include -pipe -frecord-gcc-switches -Wall -g -O2 -flto=auto -O2 -DNDEBUG -std=c++11 -MD -MT example/CMakeFiles/example.dir/example.cpp.o -MF CMakeFiles/example.dir/example.cpp.o.d -o CMakeFiles/example.dir/example.cpp.o -c /usr/src/RPM/BUILD/spdlog-1.10.0/example/example.cpp
gmake[2]: Leaving directory '/usr/src/RPM/BUILD/spdlog-1.10.0/x86_64-alt-linux'
gmake[2]: Entering directory '/usr/src/RPM/BUILD/spdlog-1.10.0/x86_64-alt-linux'
[ 90%] Building CXX object tests/CMakeFiles/spdlog-utests.dir/test_stopwatch.cpp.o
cd /usr/src/RPM/BUILD/spdlog-1.10.0/x86_64-alt-linux/tests && /usr/bin/c++ -DFMT_SHARED -DSPDLOG_COMPILED_LIB -DSPDLOG_FMT_EXTERNAL -DSPDLOG_SHARED_LIB -I/usr/src/RPM/BUILD/spdlog-1.10.0/include -pipe -frecord-gcc-switches -Wall -g -O2 -flto=auto -O2 -DNDEBUG -std=c++11 -MD -MT tests/CMakeFiles/spdlog-utests.dir/test_stopwatch.cpp.o -MF CMakeFiles/spdlog-utests.dir/test_stopwatch.cpp.o.d -o CMakeFiles/spdlog-utests.dir/test_stopwatch.cpp.o -c /usr/src/RPM/BUILD/spdlog-1.10.0/tests/test_stopwatch.cpp
gmake[2]: Leaving directory '/usr/src/RPM/BUILD/spdlog-1.10.0/x86_64-alt-linux'
gmake[2]: Entering directory '/usr/src/RPM/BUILD/spdlog-1.10.0/x86_64-alt-linux'
[ 93%] Building CXX object tests/CMakeFiles/spdlog-utests.dir/test_errors.cpp.o
cd /usr/src/RPM/BUILD/spdlog-1.10.0/x86_64-alt-linux/tests && /usr/bin/c++ -DFMT_SHARED -DSPDLOG_COMPILED_LIB -DSPDLOG_FMT_EXTERNAL -DSPDLOG_SHARED_LIB -I/usr/src/RPM/BUILD/spdlog-1.10.0/include -pipe -frecord-gcc-switches -Wall -g -O2 -flto=auto -O2 -DNDEBUG -std=c++11 -MD -MT tests/CMakeFiles/spdlog-utests.dir/test_errors.cpp.o -MF CMakeFiles/spdlog-utests.dir/test_errors.cpp.o.d -o CMakeFiles/spdlog-utests.dir/test_errors.cpp.o -c /usr/src/RPM/BUILD/spdlog-1.10.0/tests/test_errors.cpp
gmake[2]: Leaving directory '/usr/src/RPM/BUILD/spdlog-1.10.0/x86_64-alt-linux'
gmake[2]: Entering directory '/usr/src/RPM/BUILD/spdlog-1.10.0/x86_64-alt-linux'
[ 29%] Building CXX object tests/CMakeFiles/spdlog-utests.dir/test_daily_logger.cpp.o
cd /usr/src/RPM/BUILD/spdlog-1.10.0/x86_64-alt-linux/tests && /usr/bin/c++ -DFMT_SHARED -DSPDLOG_COMPILED_LIB -DSPDLOG_FMT_EXTERNAL -DSPDLOG_SHARED_LIB -I/usr/src/RPM/BUILD/spdlog-1.10.0/include -pipe -frecord-gcc-switches -Wall -g -O2 -flto=auto -O2 -DNDEBUG -std=c++11 -MD -MT tests/CMakeFiles/spdlog-utests.dir/test_daily_logger.cpp.o -MF CMakeFiles/spdlog-utests.dir/test_daily_logger.cpp.o.d -o CMakeFiles/spdlog-utests.dir/test_daily_logger.cpp.o -c /usr/src/RPM/BUILD/spdlog-1.10.0/tests/test_daily_logger.cpp
gmake[2]: Leaving directory '/usr/src/RPM/BUILD/spdlog-1.10.0/x86_64-alt-linux'
gmake[2]: Entering directory '/usr/src/RPM/BUILD/spdlog-1.10.0/x86_64-alt-linux'
[ 96%] Linking CXX executable example
cd /usr/src/RPM/BUILD/spdlog-1.10.0/x86_64-alt-linux/example && /usr/bin/cmake -E cmake_link_script CMakeFiles/example.dir/link.txt --verbose=1
/usr/bin/c++ -pipe -frecord-gcc-switches -Wall -g -O2 -flto=auto -O2 -DNDEBUG CMakeFiles/example.dir/example.cpp.o -o example  -Wl,-rpath,/usr/src/RPM/BUILD/spdlog-1.10.0/x86_64-alt-linux ../libspdlog.so.1.10.0 /usr/lib64/libfmt.so.9.1.0 
gmake[2]: Leaving directory '/usr/src/RPM/BUILD/spdlog-1.10.0/x86_64-alt-linux'
gmake[1]: Entering directory '/usr/src/RPM/BUILD/spdlog-1.10.0/x86_64-alt-linux'
[ 96%] Built target example
gmake[1]: Leaving directory '/usr/src/RPM/BUILD/spdlog-1.10.0/x86_64-alt-linux'
gmake[2]: Entering directory '/usr/src/RPM/BUILD/spdlog-1.10.0/x86_64-alt-linux'
[ 61%] Building CXX object tests/CMakeFiles/spdlog-utests.dir/main.cpp.o
cd /usr/src/RPM/BUILD/spdlog-1.10.0/x86_64-alt-linux/tests && /usr/bin/c++ -DFMT_SHARED -DSPDLOG_COMPILED_LIB -DSPDLOG_FMT_EXTERNAL -DSPDLOG_SHARED_LIB -I/usr/src/RPM/BUILD/spdlog-1.10.0/include -pipe -frecord-gcc-switches -Wall -g -O2 -flto=auto -O2 -DNDEBUG -std=c++11 -MD -MT tests/CMakeFiles/spdlog-utests.dir/main.cpp.o -MF CMakeFiles/spdlog-utests.dir/main.cpp.o.d -o CMakeFiles/spdlog-utests.dir/main.cpp.o -c /usr/src/RPM/BUILD/spdlog-1.10.0/tests/main.cpp
gmake[2]: Leaving directory '/usr/src/RPM/BUILD/spdlog-1.10.0/x86_64-alt-linux'
gmake[2]: Entering directory '/usr/src/RPM/BUILD/spdlog-1.10.0/x86_64-alt-linux'
[100%] Linking CXX executable spdlog-utests
cd /usr/src/RPM/BUILD/spdlog-1.10.0/x86_64-alt-linux/tests && /usr/bin/cmake -E cmake_link_script CMakeFiles/spdlog-utests.dir/link.txt --verbose=1
/usr/bin/c++ -pipe -frecord-gcc-switches -Wall -g -O2 -flto=auto -O2 -DNDEBUG "CMakeFiles/spdlog-utests.dir/test_file_helper.cpp.o" "CMakeFiles/spdlog-utests.dir/test_file_logging.cpp.o" "CMakeFiles/spdlog-utests.dir/test_daily_logger.cpp.o" "CMakeFiles/spdlog-utests.dir/test_misc.cpp.o" "CMakeFiles/spdlog-utests.dir/test_eventlog.cpp.o" "CMakeFiles/spdlog-utests.dir/test_pattern_formatter.cpp.o" "CMakeFiles/spdlog-utests.dir/test_async.cpp.o" "CMakeFiles/spdlog-utests.dir/test_registry.cpp.o" "CMakeFiles/spdlog-utests.dir/test_macros.cpp.o" "CMakeFiles/spdlog-utests.dir/utils.cpp.o" "CMakeFiles/spdlog-utests.dir/main.cpp.o" "CMakeFiles/spdlog-utests.dir/test_mpmc_q.cpp.o" "CMakeFiles/spdlog-utests.dir/test_dup_filter.cpp.o" "CMakeFiles/spdlog-utests.dir/test_fmt_helper.cpp.o" "CMakeFiles/spdlog-utests.dir/test_stdout_api.cpp.o" "CMakeFiles/spdlog-utests.dir/test_backtrace.cpp.o" "CMakeFiles/spdlog-utests.dir/test_create_dir.cpp.o" "CMakeFiles/spdlog-utests.dir/test_cfg.cpp.o" "CMakeFiles/spdlog-utests.dir/test_time_point.cpp.o" "CMakeFiles/spdlog-utests.dir/test_stopwatch.cpp.o" "CMakeFiles/spdlog-utests.dir/test_errors.cpp.o" -o spdlog-utests  -Wl,-rpath,/usr/src/RPM/BUILD/spdlog-1.10.0/x86_64-alt-linux ../libspdlog.so.1.10.0 /usr/lib64/libfmt.so.9.1.0 
gmake[2]: Leaving directory '/usr/src/RPM/BUILD/spdlog-1.10.0/x86_64-alt-linux'
gmake[1]: Entering directory '/usr/src/RPM/BUILD/spdlog-1.10.0/x86_64-alt-linux'
[100%] Built target spdlog-utests
gmake[1]: Leaving directory '/usr/src/RPM/BUILD/spdlog-1.10.0/x86_64-alt-linux'
gmake: Entering directory '/usr/src/RPM/BUILD/spdlog-1.10.0/x86_64-alt-linux'
/usr/bin/cmake -E cmake_progress_start /usr/src/RPM/BUILD/spdlog-1.10.0/x86_64-alt-linux/CMakeFiles 0
gmake: Leaving directory '/usr/src/RPM/BUILD/spdlog-1.10.0/x86_64-alt-linux'
+ exit 0
Executing(%install): /bin/sh -e /usr/src/tmp/rpm-tmp.72948
+ umask 022
+ /bin/mkdir -p /usr/src/RPM/BUILD
+ cd /usr/src/RPM/BUILD
+ /bin/chmod -Rf u+rwX -- /usr/src/tmp/spdlog-buildroot
+ :
+ /bin/rm -rf -- /usr/src/tmp/spdlog-buildroot
+ PATH=/usr/libexec/rpm-build:/usr/src/bin:/bin:/usr/bin:/usr/X11R6/bin:/usr/games
+ cd spdlog-1.10.0
+ DESTDIR=/usr/src/tmp/spdlog-buildroot
+ cmake --install x86_64-alt-linux --verbose
-- Install configuration: "Release"
-- Installing: /usr/src/tmp/spdlog-buildroot/usr/include
-- Installing: /usr/src/tmp/spdlog-buildroot/usr/include/spdlog
-- Installing: /usr/src/tmp/spdlog-buildroot/usr/include/spdlog/version.h
-- Installing: /usr/src/tmp/spdlog-buildroot/usr/include/spdlog/tweakme.h
-- Installing: /usr/src/tmp/spdlog-buildroot/usr/include/spdlog/stopwatch.h
-- Installing: /usr/src/tmp/spdlog-buildroot/usr/include/spdlog/spdlog.h
-- Installing: /usr/src/tmp/spdlog-buildroot/usr/include/spdlog/spdlog-inl.h
-- Installing: /usr/src/tmp/spdlog-buildroot/usr/include/spdlog/sinks
-- Installing: /usr/src/tmp/spdlog-buildroot/usr/include/spdlog/sinks/wincolor_sink.h
-- Installing: /usr/src/tmp/spdlog-buildroot/usr/include/spdlog/sinks/wincolor_sink-inl.h
-- Installing: /usr/src/tmp/spdlog-buildroot/usr/include/spdlog/sinks/win_eventlog_sink.h
-- Installing: /usr/src/tmp/spdlog-buildroot/usr/include/spdlog/sinks/udp_sink.h
-- Installing: /usr/src/tmp/spdlog-buildroot/usr/include/spdlog/sinks/tcp_sink.h
-- Installing: /usr/src/tmp/spdlog-buildroot/usr/include/spdlog/sinks/systemd_sink.h
-- Installing: /usr/src/tmp/spdlog-buildroot/usr/include/spdlog/sinks/syslog_sink.h
-- Installing: /usr/src/tmp/spdlog-buildroot/usr/include/spdlog/sinks/stdout_sinks.h
-- Installing: /usr/src/tmp/spdlog-buildroot/usr/include/spdlog/sinks/stdout_sinks-inl.h
-- Installing: /usr/src/tmp/spdlog-buildroot/usr/include/spdlog/sinks/stdout_color_sinks.h
-- Installing: /usr/src/tmp/spdlog-buildroot/usr/include/spdlog/sinks/stdout_color_sinks-inl.h
-- Installing: /usr/src/tmp/spdlog-buildroot/usr/include/spdlog/sinks/sink.h
-- Installing: /usr/src/tmp/spdlog-buildroot/usr/include/spdlog/sinks/sink-inl.h
-- Installing: /usr/src/tmp/spdlog-buildroot/usr/include/spdlog/sinks/rotating_file_sink.h
-- Installing: /usr/src/tmp/spdlog-buildroot/usr/include/spdlog/sinks/rotating_file_sink-inl.h
-- Installing: /usr/src/tmp/spdlog-buildroot/usr/include/spdlog/sinks/ringbuffer_sink.h
-- Installing: /usr/src/tmp/spdlog-buildroot/usr/include/spdlog/sinks/qt_sinks.h
-- Installing: /usr/src/tmp/spdlog-buildroot/usr/include/spdlog/sinks/ostream_sink.h
-- Installing: /usr/src/tmp/spdlog-buildroot/usr/include/spdlog/sinks/null_sink.h
-- Installing: /usr/src/tmp/spdlog-buildroot/usr/include/spdlog/sinks/msvc_sink.h
-- Installing: /usr/src/tmp/spdlog-buildroot/usr/include/spdlog/sinks/mongo_sink.h
-- Installing: /usr/src/tmp/spdlog-buildroot/usr/include/spdlog/sinks/hourly_file_sink.h
-- Installing: /usr/src/tmp/spdlog-buildroot/usr/include/spdlog/sinks/dup_filter_sink.h
-- Installing: /usr/src/tmp/spdlog-buildroot/usr/include/spdlog/sinks/dist_sink.h
-- Installing: /usr/src/tmp/spdlog-buildroot/usr/include/spdlog/sinks/daily_file_sink.h
-- Installing: /usr/src/tmp/spdlog-buildroot/usr/include/spdlog/sinks/basic_file_sink.h
-- Installing: /usr/src/tmp/spdlog-buildroot/usr/include/spdlog/sinks/basic_file_sink-inl.h
-- Installing: /usr/src/tmp/spdlog-buildroot/usr/include/spdlog/sinks/base_sink.h
-- Installing: /usr/src/tmp/spdlog-buildroot/usr/include/spdlog/sinks/base_sink-inl.h
-- Installing: /usr/src/tmp/spdlog-buildroot/usr/include/spdlog/sinks/ansicolor_sink.h
-- Installing: /usr/src/tmp/spdlog-buildroot/usr/include/spdlog/sinks/ansicolor_sink-inl.h
-- Installing: /usr/src/tmp/spdlog-buildroot/usr/include/spdlog/sinks/android_sink.h
-- Installing: /usr/src/tmp/spdlog-buildroot/usr/include/spdlog/pattern_formatter.h
-- Installing: /usr/src/tmp/spdlog-buildroot/usr/include/spdlog/pattern_formatter-inl.h
-- Installing: /usr/src/tmp/spdlog-buildroot/usr/include/spdlog/logger.h
-- Installing: /usr/src/tmp/spdlog-buildroot/usr/include/spdlog/logger-inl.h
-- Installing: /usr/src/tmp/spdlog-buildroot/usr/include/spdlog/fwd.h
-- Installing: /usr/src/tmp/spdlog-buildroot/usr/include/spdlog/formatter.h
-- Installing: /usr/src/tmp/spdlog-buildroot/usr/include/spdlog/fmt
-- Installing: /usr/src/tmp/spdlog-buildroot/usr/include/spdlog/fmt/xchar.h
-- Installing: /usr/src/tmp/spdlog-buildroot/usr/include/spdlog/fmt/ranges.h
-- Installing: /usr/src/tmp/spdlog-buildroot/usr/include/spdlog/fmt/ostr.h
-- Installing: /usr/src/tmp/spdlog-buildroot/usr/include/spdlog/fmt/fmt.h
-- Installing: /usr/src/tmp/spdlog-buildroot/usr/include/spdlog/fmt/compile.h
-- Installing: /usr/src/tmp/spdlog-buildroot/usr/include/spdlog/fmt/chrono.h
-- Installing: /usr/src/tmp/spdlog-buildroot/usr/include/spdlog/fmt/bin_to_hex.h
-- Installing: /usr/src/tmp/spdlog-buildroot/usr/include/spdlog/details
-- Installing: /usr/src/tmp/spdlog-buildroot/usr/include/spdlog/details/windows_include.h
-- Installing: /usr/src/tmp/spdlog-buildroot/usr/include/spdlog/details/udp_client.h
-- Installing: /usr/src/tmp/spdlog-buildroot/usr/include/spdlog/details/udp_client-windows.h
-- Installing: /usr/src/tmp/spdlog-buildroot/usr/include/spdlog/details/thread_pool.h
-- Installing: /usr/src/tmp/spdlog-buildroot/usr/include/spdlog/details/thread_pool-inl.h
-- Installing: /usr/src/tmp/spdlog-buildroot/usr/include/spdlog/details/tcp_client.h
-- Installing: /usr/src/tmp/spdlog-buildroot/usr/include/spdlog/details/tcp_client-windows.h
-- Installing: /usr/src/tmp/spdlog-buildroot/usr/include/spdlog/details/synchronous_factory.h
-- Installing: /usr/src/tmp/spdlog-buildroot/usr/include/spdlog/details/registry.h
-- Installing: /usr/src/tmp/spdlog-buildroot/usr/include/spdlog/details/registry-inl.h
-- Installing: /usr/src/tmp/spdlog-buildroot/usr/include/spdlog/details/periodic_worker.h
-- Installing: /usr/src/tmp/spdlog-buildroot/usr/include/spdlog/details/periodic_worker-inl.h
-- Installing: /usr/src/tmp/spdlog-buildroot/usr/include/spdlog/details/os.h
-- Installing: /usr/src/tmp/spdlog-buildroot/usr/include/spdlog/details/os-inl.h
-- Installing: /usr/src/tmp/spdlog-buildroot/usr/include/spdlog/details/null_mutex.h
-- Installing: /usr/src/tmp/spdlog-buildroot/usr/include/spdlog/details/mpmc_blocking_q.h
-- Installing: /usr/src/tmp/spdlog-buildroot/usr/include/spdlog/details/log_msg_buffer.h
-- Installing: /usr/src/tmp/spdlog-buildroot/usr/include/spdlog/details/log_msg_buffer-inl.h
-- Installing: /usr/src/tmp/spdlog-buildroot/usr/include/spdlog/details/log_msg.h
-- Installing: /usr/src/tmp/spdlog-buildroot/usr/include/spdlog/details/log_msg-inl.h
-- Installing: /usr/src/tmp/spdlog-buildroot/usr/include/spdlog/details/fmt_helper.h
-- Installing: /usr/src/tmp/spdlog-buildroot/usr/include/spdlog/details/file_helper.h
-- Installing: /usr/src/tmp/spdlog-buildroot/usr/include/spdlog/details/file_helper-inl.h
-- Installing: /usr/src/tmp/spdlog-buildroot/usr/include/spdlog/details/console_globals.h
-- Installing: /usr/src/tmp/spdlog-buildroot/usr/include/spdlog/details/circular_q.h
-- Installing: /usr/src/tmp/spdlog-buildroot/usr/include/spdlog/details/backtracer.h
-- Installing: /usr/src/tmp/spdlog-buildroot/usr/include/spdlog/details/backtracer-inl.h
-- Installing: /usr/src/tmp/spdlog-buildroot/usr/include/spdlog/common.h
-- Installing: /usr/src/tmp/spdlog-buildroot/usr/include/spdlog/common-inl.h
-- Installing: /usr/src/tmp/spdlog-buildroot/usr/include/spdlog/cfg
-- Installing: /usr/src/tmp/spdlog-buildroot/usr/include/spdlog/cfg/helpers.h
-- Installing: /usr/src/tmp/spdlog-buildroot/usr/include/spdlog/cfg/helpers-inl.h
-- Installing: /usr/src/tmp/spdlog-buildroot/usr/include/spdlog/cfg/env.h
-- Installing: /usr/src/tmp/spdlog-buildroot/usr/include/spdlog/cfg/argv.h
-- Installing: /usr/src/tmp/spdlog-buildroot/usr/include/spdlog/async_logger.h
-- Installing: /usr/src/tmp/spdlog-buildroot/usr/include/spdlog/async_logger-inl.h
-- Installing: /usr/src/tmp/spdlog-buildroot/usr/include/spdlog/async.h
-- Installing: /usr/src/tmp/spdlog-buildroot/usr/lib64/libspdlog.so.1.10.0
-- Installing: /usr/src/tmp/spdlog-buildroot/usr/lib64/libspdlog.so.1
-- Installing: /usr/src/tmp/spdlog-buildroot/usr/lib64/libspdlog.so
-- Installing: /usr/src/tmp/spdlog-buildroot/usr/lib64/pkgconfig/spdlog.pc
-- Installing: /usr/src/tmp/spdlog-buildroot/usr/lib64/cmake/spdlog/spdlogConfigTargets.cmake
-- Installing: /usr/src/tmp/spdlog-buildroot/usr/lib64/cmake/spdlog/spdlogConfigTargets-release.cmake
-- Installing: /usr/src/tmp/spdlog-buildroot/usr/lib64/cmake/spdlog/spdlogConfig.cmake
-- Installing: /usr/src/tmp/spdlog-buildroot/usr/lib64/cmake/spdlog/spdlogConfigVersion.cmake
+ /usr/bin/subst 's|// #define SPDLOG_FMT_EXTERNAL|#define SPDLOG_FMT_EXTERNAL|' /usr/src/tmp/spdlog-buildroot/usr/include/spdlog/tweakme.h
+ /usr/lib/rpm/brp-alt
Cleaning files in /usr/src/tmp/spdlog-buildroot (auto)
mode of './usr/lib64/libspdlog.so.1.10.0' changed from 0755 (rwxr-xr-x) to 0644 (rw-r--r--)
Verifying and fixing files in /usr/src/tmp/spdlog-buildroot (binconfig,pkgconfig,libtool,desktop,gnuconfig)
/usr/lib64/pkgconfig/spdlog.pc: Libs: '-L${libdir} -lspdlog -pthread' --> '-lspdlog -pthread'
Checking contents of files in /usr/src/tmp/spdlog-buildroot/ (default)
Compressing files in /usr/src/tmp/spdlog-buildroot (auto)
Adjusting library links in /usr/src/tmp/spdlog-buildroot
./usr/lib64: (from <cmdline>:0)
	libspdlog.so.1 -> libspdlog.so.1.10.0
Verifying ELF objects in /usr/src/tmp/spdlog-buildroot (arch=normal,fhs=normal,lfs=relaxed,lint=relaxed,rpath=normal,stack=normal,textrel=normal,unresolved=normal)
Executing(%check): /bin/sh -e /usr/src/tmp/rpm-tmp.29266
+ umask 022
+ /bin/mkdir -p /usr/src/RPM/BUILD
+ cd /usr/src/RPM/BUILD
+ cd spdlog-1.10.0
++ pwd
+ export LD_LIBRARY_PATH=/usr/src/RPM/BUILD/spdlog-1.10.0/x86_64-alt-linux
+ LD_LIBRARY_PATH=/usr/src/RPM/BUILD/spdlog-1.10.0/x86_64-alt-linux
+ cmake --build x86_64-alt-linux --verbose --parallel 16 --target test
gmake: Entering directory '/usr/src/RPM/BUILD/spdlog-1.10.0/x86_64-alt-linux'
Running tests...
/usr/bin/ctest --force-new-ctest-process 
Test project /usr/src/RPM/BUILD/spdlog-1.10.0/x86_64-alt-linux
    Start 1: spdlog-utests
1/1 Test #1: spdlog-utests ....................   Passed    4.79 sec

100% tests passed, 0 tests failed out of 1

Total Test time (real) =   4.80 sec
gmake: Leaving directory '/usr/src/RPM/BUILD/spdlog-1.10.0/x86_64-alt-linux'
+ exit 0
Processing files: libspdlog-1.10.0-alt1
Finding Provides (using /usr/lib/rpm/find-provides)
Executing: /bin/sh -e /usr/src/tmp/rpm-tmp.WzXoK7
find-provides: running scripts (alternatives,debuginfo,lib,pam,perl,pkgconfig,python,python3,shell)
lib.prov: /usr/src/tmp/spdlog-buildroot/usr/lib64/libspdlog.so.1: 508 symbols, 19 bpp
Finding Requires (using /usr/lib/rpm/find-requires)
Executing: /bin/sh -e /usr/src/tmp/rpm-tmp.yhOob9
find-requires: running scripts (cpp,debuginfo,files,lib,pam,perl,pkgconfig,pkgconfiglib,python,python3,rpmlib,shebang,shell,static,symlinks,systemd-services)
Provides: libspdlog.so.1()(64bit) = set:mdZ2imu7VMdGCKNWvj8IaUuQ2Xkjf4TsPr8scEKIm32JybNCakkxfGlqo2nTaOZuIJHUpzC5mpGaISabl0PHXRlgUUaFeEYHCvOrc5AOiO90tPXW6jZ3ArmwfwXEhEbRTMzyruepu8tqXqv7DAIeztQBjCFdxQPNZ7ntyFIfXwTjpVbsKncT6aBzPizwEV7xv0F23hFF5Tao9QH2fnAEv0VdjcMjshIuQ34a2cjirwXM5o9NUpwerr6fdSYma6zIZnZJxwZB3SpCoUm4Ktlwxt8Xu4amSBPl3qoEUj8ceuFQ9yRGUXdCdq6OgQSERuYipHkmIN7KIpbpJcO9OHqJqp9jg44iH786hrtrHtZ7xt9BLrbVLermeUFZCbMi9uo9qEQX2Ze7Rsu1j2s5CeKdbjoo7tqauyt0NNDcoFY331Z8uvlIh43gP5SFduxGASJEKS9EQGEo0TdAKXga2Ds1DVULQEVBbwqlzCfJmKeKAxm6GeS6PeXLi43meNDL727jwCD14m3jqVVunxpioPx4jc1cGmqByDufN22bJJZcZhB9yCQS9nQpySDzapI3yyZxeNztI850nf1Z9Hk0yZmhrS4wKtJLWXNNaLVFJRyGeJ3vBuoxidaMraKbeTCdLVEi6sa5e2opDzYwjUdhjCeMfqZmveIZHP5PvmF9Gjd9lzOPda4mSmGa89YP72yZBGo7h9IpOG9Z0VxmzbGC43xZByktVpFEVLFMcdss3ZyxmwCyZBOeuAEMo2oXFZiG4jDZ0xwUQOI6c4a2C15yoFVZCyegua2IKOdvFF3isaP4SP2OZmtZBZIBeZmBuiSoLBljxkZKrjWpP8215EhvUJalZGAMgpskgUutiAFGzkQn2LOuqyc4mgN0wnwRX0S89hshOYKsR1lMlCzSWIz4kQwtdY4C9iwEzpEByGfqaqapPvOmqVrqO78Sa1GM0FFxCQjhffRLXjZ6HsZx8yLtb1ZEuqPMtBtOzYZL5lZh
Requires: ld-linux-x86-64.so.2()(64bit) >= set:jiids, ld-linux-x86-64.so.2(GLIBC_2.3)(64bit), libc.so.6(GLIBC_2.14)(64bit), libc.so.6(GLIBC_2.2.5)(64bit), libc.so.6(GLIBC_2.3.4)(64bit), libc.so.6(GLIBC_2.32)(64bit), libc.so.6(GLIBC_2.33)(64bit), libc.so.6(GLIBC_2.34)(64bit), libc.so.6(GLIBC_2.4)(64bit), libfmt.so.9()(64bit) >= set:jfakJDfiqftrPDjan5ZsAMe4RZ2F, libgcc_s.so.1(GCC_3.0)(64bit), libgcc_s.so.1(GCC_3.3.1)(64bit), libstdc++.so.6(CXXABI_1.3)(64bit), libstdc++.so.6(CXXABI_1.3.5)(64bit), libstdc++.so.6(GLIBCXX_3.4)(64bit), libstdc++.so.6(GLIBCXX_3.4.11)(64bit), libstdc++.so.6(GLIBCXX_3.4.14)(64bit), libstdc++.so.6(GLIBCXX_3.4.15)(64bit), libstdc++.so.6(GLIBCXX_3.4.18)(64bit), libstdc++.so.6(GLIBCXX_3.4.19)(64bit), libstdc++.so.6(GLIBCXX_3.4.20)(64bit), libstdc++.so.6(GLIBCXX_3.4.21)(64bit), libstdc++.so.6(GLIBCXX_3.4.22)(64bit), libstdc++.so.6(GLIBCXX_3.4.29)(64bit), libstdc++.so.6(GLIBCXX_3.4.30)(64bit), rtld(GNU_HASH)
Requires(rpmlib): rpmlib(SetVersions)
Finding debuginfo files (using /usr/lib/rpm/find-debuginfo-files)
Executing: /bin/sh -e /usr/src/tmp/rpm-tmp.Nx0C7u
Creating libspdlog-debuginfo package
Processing files: libspdlog-devel-1.10.0-alt1
Executing(%doc): /bin/sh -e /usr/src/tmp/rpm-tmp.55484
+ umask 022
+ /bin/mkdir -p /usr/src/RPM/BUILD
+ cd /usr/src/RPM/BUILD
+ cd spdlog-1.10.0
+ DOCDIR=/usr/src/tmp/spdlog-buildroot/usr/share/doc/libspdlog-devel-1.10.0
+ export DOCDIR
+ rm -rf /usr/src/tmp/spdlog-buildroot/usr/share/doc/libspdlog-devel-1.10.0
+ /bin/mkdir -p /usr/src/tmp/spdlog-buildroot/usr/share/doc/libspdlog-devel-1.10.0
+ cp -prL README.md example/ /usr/src/tmp/spdlog-buildroot/usr/share/doc/libspdlog-devel-1.10.0
+ chmod -R go-w /usr/src/tmp/spdlog-buildroot/usr/share/doc/libspdlog-devel-1.10.0
+ chmod -R a+rX /usr/src/tmp/spdlog-buildroot/usr/share/doc/libspdlog-devel-1.10.0
+ cp -prL LICENSE /usr/src/tmp/spdlog-buildroot/usr/share/doc/libspdlog-devel-1.10.0
+ chmod -R go-w /usr/src/tmp/spdlog-buildroot/usr/share/doc/libspdlog-devel-1.10.0
+ chmod -R a+rX /usr/src/tmp/spdlog-buildroot/usr/share/doc/libspdlog-devel-1.10.0
+ exit 0
Finding Provides (using /usr/lib/rpm/find-provides)
Executing: /bin/sh -e /usr/src/tmp/rpm-tmp.jqXjMc
find-provides: running scripts (alternatives,debuginfo,lib,pam,perl,pkgconfig,python,python3,shell)
Finding Requires (using /usr/lib/rpm/find-requires)
Executing: /bin/sh -e /usr/src/tmp/rpm-tmp.CclWcN
find-requires: running scripts (cpp,debuginfo,files,lib,pam,perl,pkgconfig,pkgconfiglib,python,python3,rpmlib,shebang,shell,static,symlinks,systemd-services)
In file included from /usr/src/tmp/spdlog-buildroot/usr/include/spdlog/common.h:7,
                 from /usr/src/tmp/spdlog-buildroot/usr/include/spdlog/logger.h:17,
                 from /usr/src/tmp/spdlog-buildroot/usr/include/spdlog/async_logger.h:17,
                 from /usr/src/tmp/spdlog-buildroot/usr/include/spdlog/async.h:17:
/usr/src/tmp/spdlog-buildroot/usr/include/spdlog/details/null_mutex.h:6:10: fatal error: atomic: No such file or directory
    6 | #include <atomic>
      |          ^~~~~~~~
compilation terminated.
cpp.req: /usr/src/tmp/spdlog-buildroot/usr/include/spdlog/async.h: cpp failed, trying c++ mode
/usr/src/tmp/spdlog-buildroot/usr/include/spdlog/sinks/qt_sinks.h:16:10: fatal error: QTextEdit: No such file or directory
   16 | #include <QTextEdit>
      |          ^~~~~~~~~~~
compilation terminated.
cpp.req: WARNING: /usr/src/tmp/spdlog-buildroot/usr/include/spdlog/sinks/qt_sinks.h: cpp failed
/usr/src/tmp/spdlog-buildroot/usr/include/spdlog/sinks/mongo_sink.h:18:10: fatal error: bsoncxx/builder/stream/document.hpp: No such file or directory
   18 | #include <bsoncxx/builder/stream/document.hpp>
      |          ^~~~~~~~~~~~~~~~~~~~~~~~~~~~~~~~~~~~~
compilation terminated.
cpp.req: WARNING: /usr/src/tmp/spdlog-buildroot/usr/include/spdlog/sinks/mongo_sink.h: cpp failed
/usr/src/tmp/spdlog-buildroot/usr/include/spdlog/sinks/systemd_sink.h:14:10: fatal error: systemd/sd-journal.h: No such file or directory
   14 | #include <systemd/sd-journal.h>
      |          ^~~~~~~~~~~~~~~~~~~~~~
compilation terminated.
cpp.req: WARNING: /usr/src/tmp/spdlog-buildroot/usr/include/spdlog/sinks/systemd_sink.h: cpp failed
In file included from /usr/src/tmp/spdlog-buildroot/usr/include/spdlog/sinks/win_eventlog_sink.h:36:
/usr/src/tmp/spdlog-buildroot/usr/include/spdlog/details/windows_include.h:11:10: fatal error: windows.h: No such file or directory
   11 | #include <windows.h>
      |          ^~~~~~~~~~~
compilation terminated.
cpp.req: WARNING: /usr/src/tmp/spdlog-buildroot/usr/include/spdlog/sinks/win_eventlog_sink.h: cpp failed
In file included from /usr/src/tmp/spdlog-buildroot/usr/include/spdlog/sinks/wincolor_sink-inl.h:10:
/usr/src/tmp/spdlog-buildroot/usr/include/spdlog/details/windows_include.h:11:10: fatal error: windows.h: No such file or directory
   11 | #include <windows.h>
      |          ^~~~~~~~~~~
compilation terminated.
cpp.req: WARNING: /usr/src/tmp/spdlog-buildroot/usr/include/spdlog/sinks/wincolor_sink-inl.h: cpp failed
/usr/src/tmp/spdlog-buildroot/usr/include/spdlog/details/windows_include.h:11:10: fatal error: windows.h: No such file or directory
   11 | #include <windows.h>
      |          ^~~~~~~~~~~
compilation terminated.
cpp.req: WARNING: /usr/src/tmp/spdlog-buildroot/usr/include/spdlog/details/windows_include.h: cpp failed
/usr/src/tmp/spdlog-buildroot/usr/include/spdlog/details/tcp_client-windows.h:11:10: fatal error: winsock2.h: No such file or directory
   11 | #include <winsock2.h>
      |          ^~~~~~~~~~~~
compilation terminated.
cpp.req: WARNING: /usr/src/tmp/spdlog-buildroot/usr/include/spdlog/details/tcp_client-windows.h: cpp failed
In file included from /usr/src/tmp/spdlog-buildroot/usr/include/spdlog/details/udp_client-windows.h:11:
/usr/src/tmp/spdlog-buildroot/usr/include/spdlog/details/windows_include.h:11:10: fatal error: windows.h: No such file or directory
   11 | #include <windows.h>
      |          ^~~~~~~~~~~
compilation terminated.
cpp.req: WARNING: /usr/src/tmp/spdlog-buildroot/usr/include/spdlog/details/udp_client-windows.h: cpp failed
Provides: pkgconfig(spdlog) = 1.10.0
Requires: libspdlog = 1.10.0-alt1, /usr/lib64/libspdlog.so.1, /usr/lib64/pkgconfig, libfmt-devel, pkgconfig(fmt)
Finding debuginfo files (using /usr/lib/rpm/find-debuginfo-files)
Executing: /bin/sh -e /usr/src/tmp/rpm-tmp.78lsPf
Processing files: libspdlog-debuginfo-1.10.0-alt1
Finding Provides (using /usr/lib/rpm/find-provides)
Executing: /bin/sh -e /usr/src/tmp/rpm-tmp.cSNOeO
find-provides: running scripts (debuginfo)
Finding Requires (using /usr/lib/rpm/find-requires)
Executing: /bin/sh -e /usr/src/tmp/rpm-tmp.jRSlXO
find-requires: running scripts (debuginfo)
Provides: debug64(libspdlog.so.1)
Requires: libspdlog = 1.10.0-alt1, debug64(ld-linux-x86-64.so.2), debug64(libc.so.6), debug64(libfmt.so.9), debug64(libgcc_s.so.1), debug64(libstdc++.so.6)
Adding to libspdlog-devel a strict dependency on libspdlog
Adding to libspdlog-debuginfo a strict dependency on libspdlog
Removing 1 extra deps from libspdlog-devel due to dependency on libspdlog
Wrote: /usr/src/RPM/RPMS/x86_64/libspdlog-1.10.0-alt1.x86_64.rpm (w2.lzdio)
Wrote: /usr/src/RPM/RPMS/x86_64/libspdlog-devel-1.10.0-alt1.x86_64.rpm (w2.lzdio)
Wrote: /usr/src/RPM/RPMS/x86_64/libspdlog-debuginfo-1.10.0-alt1.x86_64.rpm (w2.lzdio)
107.62user 10.98system 0:40.78elapsed 290%CPU (0avgtext+0avgdata 537284maxresident)k
0inputs+0outputs (0major+3344013minor)pagefaults 0swaps
2.71user 1.55system 0:49.67elapsed 8%CPU (0avgtext+0avgdata 111044maxresident)k
1680inputs+0outputs (0major+272614minor)pagefaults 0swaps
--- libspdlog-1.10.0-alt1.x86_64.rpm.repo	2022-07-25 10:55:00.000000000 +0000
+++ libspdlog-1.10.0-alt1.x86_64.rpm.hasher	2023-05-29 02:31:43.719298455 +0000
@@ -30,6 +30,6 @@
 Requires: rpmlib(PayloadIsLzma)  
-Provides: libspdlog.so.1()(64bit) = set:mdZ2imu7VMdGCKNWvj8IaUuQ2Xkjf4TsPr8scEKIm32JybNCakkxfGlqo2nTaOZuIJHUpzC5mpGaISabeoTHHwMNlitgVndZAuzFwkmie1ErunToGv8TI0v0ThzgnGLx75TYsOYgWQSRZuUAARpIzKsOcJ9AueKZKGjcBZ9tMXFIY5eTbCr3BONpFhgQYzMfwkxxEQQyr5I4WlxDbiQfwYC96U9K8mfW1251C9FdMtU2IAoYcgDJdzD6rub5zhmZHZKgMZG1Xcjcsb2TKaMMeAtf25bXOVG1dckY9467LkW4NqlYZ6crQcAxEJhHZ8narBOydZgnSIBIm6V4VlJmJIA9822FR34zEJKJRKZrMKAOTJBYnDdb7YQvr1maN3bh3BunETfGVY2C4UactsrmCMMeWQkY4X0yzfpMiV762WhLLaS8y1EV2XQ6LgliXmknX4kqlkcwX6iTt85xjKwPsYnqQYO5gJGhPDmbn7nOgb3l7rzpDZ7B86Isyfvf4eC0df38I6CQOPZeacj2reAoy9whRiHkYQX9mgoFJJDZ3aj4dFJjKEP4Jf7lOo745Zzsy7Xoha0Ku2WPla0hvbqPC0QJHZ5ZdzzluPjrH5ltq7ZqQ3bkGh1ujNtNVSIVd7lOwjFMh0bXsA7s2L9qOQ1ZhdvXPxZftKoZjHQ4RFCAGhVV652brbl5A4Zpf44ZHkNeyioPAljWxYgHN5ljyxMZyhGKYIkQYTkoC6eKxv9Q2QkYLAtY8hxN4MSjZ5k9CeXxggsqpm36251Pw2hIQYvjQ1OjhwRlKVbdtgyjpCMumgSTWZrZpbtYJif9rITOGFgGvvrifr6h8E0dW3LlFWn9xxOUEwMZajycltAyZixnpfdh62bEo0MbMWt0rAA8K8punKWwaUaPhrtShQQtdY4C9iwEzpEByGfqaqapPvOmqVrqO78Sa1GM0FFxCQjhffRLXjZ6HsZx8yLtb1ZEuqPMtBtOzYZL5lZh
+Provides: libspdlog.so.1()(64bit) = set:mdZ2imu7VMdGCKNWvj8IaUuQ2Xkjf4TsPr8scEKIm32JybNCakkxfGlqo2nTaOZuIJHUpzC5mpGaISabl0PHXRlgUUaFeEYHCvOrc5AOiO90tPXW6jZ3ArmwfwXEhEbRTMzyruepu8tqXqv7DAIeztQBjCFdxQPNZ7ntyFIfXwTjpVbsKncT6aBzPizwEV7xv0F23hFF5Tao9QH2fnAEv0VdjcMjshIuQ34a2cjirwXM5o9NUpwerr6fdSYma6zIZnZJxwZB3SpCoUm4Ktlwxt8Xu4amSBPl3qoEUj8ceuFQ9yRGUXdCdq6OgQSERuYipHkmIN7KIpbpJcO9OHqJqp9jg44iH786hrtrHtZ7xt9BLrbVLermeUFZCbMi9uo9qEQX2Ze7Rsu1j2s5CeKdbjoo7tqauyt0NNDcoFY331Z8uvlIh43gP5SFduxGASJEKS9EQGEo0TdAKXga2Ds1DVULQEVBbwqlzCfJmKeKAxm6GeS6PeXLi43meNDL727jwCD14m3jqVVunxpioPx4jc1cGmqByDufN22bJJZcZhB9yCQS9nQpySDzapI3yyZxeNztI850nf1Z9Hk0yZmhrS4wKtJLWXNNaLVFJRyGeJ3vBuoxidaMraKbeTCdLVEi6sa5e2opDzYwjUdhjCeMfqZmveIZHP5PvmF9Gjd9lzOPda4mSmGa89YP72yZBGo7h9IpOG9Z0VxmzbGC43xZByktVpFEVLFMcdss3ZyxmwCyZBOeuAEMo2oXFZiG4jDZ0xwUQOI6c4a2C15yoFVZCyegua2IKOdvFF3isaP4SP2OZmtZBZIBeZmBuiSoLBljxkZKrjWpP8215EhvUJalZGAMgpskgUutiAFGzkQn2LOuqyc4mgN0wnwRX0S89hshOYKsR1lMlCzSWIz4kQwtdY4C9iwEzpEByGfqaqapPvOmqVrqO78Sa1GM0FFxCQjhffRLXjZ6HsZx8yLtb1ZEuqPMtBtOzYZL5lZh
 Provides: libspdlog = 1.10.0-alt1:sisyphus+303982.100.3.1
 File: /usr/lib64/libspdlog.so.1	120777	root:root		libspdlog.so.1.10.0
-File: /usr/lib64/libspdlog.so.1.10.0	100644	root:root	455585cb3cf1623bec39190f0b17302b	
-RPMIdentity: 7459f5dd729f95b2ab3d45a592a11180d40a754419b067781239cd568acdb5f4d5a0e0052dbd38fc2924f2514d51b09e3059487c0fba37143f10180ba0b5485c
+File: /usr/lib64/libspdlog.so.1.10.0	100644	root:root	4862d795af2f259777b25452c406fde3	
+RPMIdentity: eabfb5121c548740df72f1a948504e8d0841eb2a7b6d188a5250ae7e4cf65642322f7cede95937eeb963b8957c05da461a1b54ebceea2c9a60127f32bcc0a8c4
--- libspdlog-debuginfo-1.10.0-alt1.x86_64.rpm.repo	2022-07-25 10:55:00.000000000 +0000
+++ libspdlog-debuginfo-1.10.0-alt1.x86_64.rpm.hasher	2023-05-29 02:31:43.777299152 +0000
@@ -1,4 +1,4 @@
-/usr/lib/debug/.build-id/62	40755	root:root	
-/usr/lib/debug/.build-id/62/63e3b064922e965d615c9ff76b460cad9860d2	120777	root:root	../../../../lib64/libspdlog.so.1.10.0
-/usr/lib/debug/.build-id/62/63e3b064922e965d615c9ff76b460cad9860d2.debug	120777	root:root	../../usr/lib64/libspdlog.so.1.10.0.debug
+/usr/lib/debug/.build-id/e0	40755	root:root	
+/usr/lib/debug/.build-id/e0/b5f3224c3c7a515ec17d0b1c7e24ddd036430b	120777	root:root	../../../../lib64/libspdlog.so.1.10.0
+/usr/lib/debug/.build-id/e0/b5f3224c3c7a515ec17d0b1c7e24ddd036430b.debug	120777	root:root	../../usr/lib64/libspdlog.so.1.10.0.debug
 /usr/lib/debug/usr/lib64/libspdlog.so.1.10.0.debug	100644	root:root	
@@ -76,6 +76,6 @@
 Provides: libspdlog-debuginfo = 1.10.0-alt1:sisyphus+303982.100.3.1
-File: /usr/lib/debug/.build-id/62	40755	root:root		
-File: /usr/lib/debug/.build-id/62/63e3b064922e965d615c9ff76b460cad9860d2	120777	root:root		../../../../lib64/libspdlog.so.1.10.0
-File: /usr/lib/debug/.build-id/62/63e3b064922e965d615c9ff76b460cad9860d2.debug	120777	root:root		../../usr/lib64/libspdlog.so.1.10.0.debug
-File: /usr/lib/debug/usr/lib64/libspdlog.so.1.10.0.debug	100644	root:root	672741466cfc5c9c560f3e02aa1eb65b	
+File: /usr/lib/debug/.build-id/e0	40755	root:root		
+File: /usr/lib/debug/.build-id/e0/b5f3224c3c7a515ec17d0b1c7e24ddd036430b	120777	root:root		../../../../lib64/libspdlog.so.1.10.0
+File: /usr/lib/debug/.build-id/e0/b5f3224c3c7a515ec17d0b1c7e24ddd036430b.debug	120777	root:root		../../usr/lib64/libspdlog.so.1.10.0.debug
+File: /usr/lib/debug/usr/lib64/libspdlog.so.1.10.0.debug	100644	root:root	f7c3bf8114e2945ad1a2226a8dbf861a	
 File: /usr/lib/debug/usr/lib64/libspdlog.so.1.debug	120777	root:root		libspdlog.so.1.10.0.debug
@@ -143,2 +143,2 @@
 File: /usr/src/debug/spdlog-1.10.0/x86_64-alt-linux	40755	root:root		
-RPMIdentity: 06aee5ecd45e5cfa8dffe1abe709c72bafced7c57df1fdc0b8039a302496a4f24b54f77946b10af78f24812277ffd614e8b11bace96a7cbc46e4980dcbd57da3
+RPMIdentity: 1dc25574193ffb1e88523144e9254ae955e1986dee87e4797673600bf969f33facc2d515597e159dc73fd297c9ec0bf833fcfb0ad944ad2067091f63bcc99589