<86>May  2 03:04:22 userdel[1585083]: delete user 'rooter'
<86>May  2 03:04:22 userdel[1585083]: removed group 'rooter' owned by 'rooter'
<86>May  2 03:04:22 userdel[1585083]: removed shadow group 'rooter' owned by 'rooter'
<86>May  2 03:04:22 groupadd[1585105]: group added to /etc/group: name=rooter, GID=774
<86>May  2 03:04:22 groupadd[1585105]: group added to /etc/gshadow: name=rooter
<86>May  2 03:04:22 groupadd[1585105]: new group: name=rooter, GID=774
useradd warning: rooter's uid 774 outside of the UID_MIN 1000 and UID_MAX 60000 range.
<86>May  2 03:04:22 useradd[1585118]: new user: name=rooter, UID=774, GID=774, home=/root, shell=/bin/bash, from=none
<86>May  2 03:04:22 userdel[1585148]: delete user 'builder'
<86>May  2 03:04:22 userdel[1585148]: removed group 'builder' owned by 'builder'
<86>May  2 03:04:22 userdel[1585148]: removed shadow group 'builder' owned by 'builder'
<86>May  2 03:04:22 groupadd[1585168]: group added to /etc/group: name=builder, GID=775
<86>May  2 03:04:22 groupadd[1585168]: group added to /etc/gshadow: name=builder
<86>May  2 03:04:22 groupadd[1585168]: new group: name=builder, GID=775
useradd warning: builder's uid 775 outside of the UID_MIN 1000 and UID_MAX 60000 range.
<86>May  2 03:04:22 useradd[1585179]: new user: name=builder, UID=775, GID=775, home=/usr/src, shell=/bin/bash, from=none
/usr/src/in/srpm/ppp-2.4.8-alt3.src.rpm: license not found in '/usr/share/license' directory: distributable
<13>May  2 03:04:24 rpmi: perl-IPC-Signal-1.00-alt3.1.1 1290501013 installed
<13>May  2 03:04:24 rpmi: liblz4-1:1.9.4-alt1 sisyphus+309416.100.1.1 1667412981 installed
<13>May  2 03:04:24 rpmi: libsystemd-1:252.7-alt1 sisyphus+316321.100.1.1 1678130436 installed
<13>May  2 03:04:24 rpmi: libdbus-1.14.6-alt1 sisyphus+315497.100.1.1 1676874443 installed
<13>May  2 03:04:24 rpmi: libpcap0.8-2:1.9.1-alt2 sisyphus+278380.100.1.1 1626093290 installed
<13>May  2 03:04:24 rpmi: libatm-2.5.1-alt7 sisyphus+304697.100.1.1 1659517181 installed
<13>May  2 03:04:24 rpmi: libp11-kit-0.24.1-alt1 sisyphus+293720.100.1.1 1642535264 installed
<13>May  2 03:04:24 rpmi: libtasn1-4.19.0-alt1 sisyphus+305700.100.1.1 1661359624 installed
<13>May  2 03:04:24 rpmi: rpm-macros-alternatives-0.5.2-alt2 sisyphus+315270.200.2.1 1676457367 installed
<13>May  2 03:04:24 rpmi: alternatives-0.5.2-alt2 sisyphus+315270.200.2.1 1676457367 installed
<13>May  2 03:04:24 rpmi: ca-certificates-2022.12.14-alt1 sisyphus+311754.200.1.1 1671046143 installed
<13>May  2 03:04:24 rpmi: ca-trust-0.1.4-alt1 sisyphus+308690.100.1.1 1666182992 installed
<13>May  2 03:04:24 rpmi: p11-kit-trust-0.24.1-alt1 sisyphus+293720.100.1.1 1642535264 installed
<13>May  2 03:04:25 rpmi: libcrypto1.1-1.1.1t-alt1 sisyphus+314824.100.2.2 1675799015 installed
<13>May  2 03:04:25 rpmi: libssl1.1-1.1.1t-alt1 sisyphus+314824.100.2.2 1675799015 installed
<13>May  2 03:04:25 rpmi: rpm-macros-pam0-1.5.2-alt1 sisyphus+284519.100.1.1 1630672115 installed
<13>May  2 03:04:25 rpmi: libpam0-devel-1.5.2-alt1 sisyphus+284519.100.1.1 1630672115 installed
<13>May  2 03:04:25 rpmi: libssl-devel-1.1.1t-alt1 sisyphus+314824.100.2.2 1675799015 installed
<13>May  2 03:04:25 rpmi: libatm-devel-2.5.1-alt7 sisyphus+304697.100.1.1 1659517181 installed
<13>May  2 03:04:25 rpmi: libpcap-devel-2:1.9.1-alt2 sisyphus+278380.100.1.1 1626093290 installed
<13>May  2 03:04:25 rpmi: libsystemd-devel-1:252.7-alt1 sisyphus+316321.100.1.1 1678130436 installed
<13>May  2 03:04:25 rpmi: perl-Proc-WaitStat-1.00-alt4.1.1 1290595156 installed
<13>May  2 03:04:25 rpmi: perl-Proc-Daemon-0.23-alt1 1451923889 installed
<13>May  2 03:04:25 rpmi: libudev-devel-1:252.7-alt1 sisyphus+316321.100.1.1 1678130436 installed
Building target platforms: x86_64
Building for target x86_64
Wrote: /usr/src/in/nosrpm/ppp-2.4.8-alt3.nosrc.rpm (w1.gzdio)
Installing ppp-2.4.8-alt3.src.rpm
Building target platforms: x86_64
Building for target x86_64
Executing(%prep): /bin/sh -e /usr/src/tmp/rpm-tmp.74316
+ umask 022
+ /bin/mkdir -p /usr/src/RPM/BUILD
+ cd /usr/src/RPM/BUILD
+ cd /usr/src/RPM/BUILD
+ rm -rf ppp-2.4.8
+ echo 'Source #0 (ppp-2.4.8.tar):'
Source #0 (ppp-2.4.8.tar):
+ /bin/tar -xf /usr/src/RPM/SOURCES/ppp-2.4.8.tar
+ cd ppp-2.4.8
+ /bin/chmod -c -Rf u+rwX,go-w .
+ echo 'Patch #1 (ppp-2.4.8-alt3.patch):'
Patch #1 (ppp-2.4.8-alt3.patch):
+ /usr/bin/patch -p1
patching file README.eap-tls
patching file chat/Makefile.linux
patching file chat/chat.8
patching file configure
patching file etc.ppp/eaptls-client
patching file etc.ppp/eaptls-server
patching file etc.ppp/openssl.cnf
patching file etc.ppp/options
patching file linux/Makefile.top
patching file pppd/Makefile.linux
patching file pppd/auth.c
patching file pppd/cbcp.c
patching file pppd/cbcp.h
patching file pppd/ccp.c
patching file pppd/chap-md5.c
patching file pppd/chap-new.c
patching file pppd/chap_ms.c
patching file pppd/demand.c
patching file pppd/eap-tls.c
patching file pppd/eap-tls.h
patching file pppd/eap.c
patching file pppd/eap.h
patching file pppd/ipcp.c
patching file pppd/ipcp.h
patching file pppd/ipv6cp.c
patching file pppd/ipv6cp.h
patching file pppd/ipxcp.c
patching file pppd/lcp.c
patching file pppd/main.c
patching file pppd/md4.c
patching file pppd/md4.h
patching file pppd/md5.c
patching file pppd/md5.h
patching file pppd/multilink.c
patching file pppd/options.c
patching file pppd/pathnames.h
patching file pppd/plugins/Makefile.linux
patching file pppd/plugins/dhcp/AUTHORS
patching file pppd/plugins/dhcp/COPYING
patching file pppd/plugins/dhcp/Makefile.linux
patching file pppd/plugins/dhcp/README
patching file pppd/plugins/dhcp/clientpacket.c
patching file pppd/plugins/dhcp/clientpacket.h
patching file pppd/plugins/dhcp/debug.h
patching file pppd/plugins/dhcp/dhcpc.c
patching file pppd/plugins/dhcp/dhcpc.h
patching file pppd/plugins/dhcp/dhcpd.h
patching file pppd/plugins/dhcp/files.h
patching file pppd/plugins/dhcp/leases.h
patching file pppd/plugins/dhcp/options.c
patching file pppd/plugins/dhcp/options.h
patching file pppd/plugins/dhcp/packet.c
patching file pppd/plugins/dhcp/packet.h
patching file pppd/plugins/dhcp/socket.c
patching file pppd/plugins/dhcp/socket.h
patching file pppd/plugins/passprompt.c
patching file pppd/plugins/passwordfd.c
patching file pppd/plugins/pppoatm/Makefile.linux
patching file pppd/plugins/pppoatm/pppoatm.c
patching file pppd/plugins/pppol2tp/Makefile.linux
patching file pppd/plugins/pppol2tp/l2tp_event.h
patching file pppd/plugins/pppol2tp/openl2tp.c
patching file pppd/plugins/pppol2tp/pppol2tp.c
patching file pppd/plugins/radius/Makefile.linux
patching file pppd/plugins/radius/clientid.c
patching file pppd/plugins/radius/md5.c
patching file pppd/plugins/radius/radius.c
patching file pppd/plugins/radius/util.c
patching file pppd/plugins/rp-pppoe/Makefile.linux
patching file pppd/plugins/rp-pppoe/if.c
patching file pppd/plugins/rp-pppoe/plugin.c
patching file pppd/plugins/rp-pppoe/pppoe-discovery.8
patching file pppd/plugins/rp-pppoe/pppoe-discovery.c
patching file pppd/plugins/winbind.c
patching file pppd/pppd.8
patching file pppd/pppd.h
patching file pppd/sha1.c
patching file pppd/sha1.h
patching file pppd/sys-linux.c
patching file pppd/sys-solaris.c
patching file pppd/tdb.c
patching file pppd/tty.c
patching file pppd/utils.c
patching file pppdump/Makefile.linux
patching file pppstats/Makefile.linux
patching file sample/auth-down
patching file sample/auth-up
patching file sample/callback-client
patching file sample/callback-server
patching file sample/callback-users
patching file sample/ip-down
patching file sample/ip-up
patching file sample/options
patching file sample/options.ttyXX
patching file sample/pap-secrets
+ sed -i -e 's|/usr/local/etc|/etc|' -e 's|/usr/local/sbin|/usr/sbin|' pppd/plugins/radius/etc/radiusclient.conf
+ sed -i -e 's|/etc/radiusclient|/etc/ppp/radius|g' pppd/plugins/radius/pppd-radattr.8 pppd/plugins/radius/pppd-radius.8 pppd/plugins/radius/avpair.c pppd/plugins/radius/buildreq.c pppd/plugins/radius/clientid.c pppd/plugins/radius/config.c pppd/plugins/radius/dict.c pppd/plugins/radius/ip_util.c pppd/plugins/radius/lock.c pppd/plugins/radius/md5.c pppd/plugins/radius/radattr.c pppd/plugins/radius/radius.c pppd/plugins/radius/radrealms.c pppd/plugins/radius/sendserver.c pppd/plugins/radius/util.c pppd/plugins/radius/includes.h pppd/plugins/radius/options.h pppd/plugins/radius/pathnames.h pppd/plugins/radius/radiusclient.h pppd/plugins/radius/etc/dictionary pppd/plugins/radius/etc/dictionary.ascend pppd/plugins/radius/etc/dictionary.compat pppd/plugins/radius/etc/dictionary.merit pppd/plugins/radius/etc/dictionary.microsoft pppd/plugins/radius/etc/issue pppd/plugins/radius/etc/port-id-map pppd/plugins/radius/etc/radiusclient.conf pppd/plugins/radius/etc/radiusclient.conf.in pppd/plugins/radius/etc/realms pppd/plugins/radius/etc/servers
+ find -type f -name '*.orig' -print -delete
+ rm -f include/linux/if_pppol2tp.h
+ exit 0
Executing(%build): /bin/sh -e /usr/src/tmp/rpm-tmp.74316
+ umask 022
+ /bin/mkdir -p /usr/src/RPM/BUILD
+ cd /usr/src/RPM/BUILD
+ cd ppp-2.4.8
+ CFLAGS='-pipe -frecord-gcc-switches -Wall -g -O2 -flto=auto -fPIC -Wall -D_GNU_SOURCE -fno-strict-aliasing'
+ export CFLAGS
+ CXXFLAGS='-pipe -frecord-gcc-switches -Wall -g -O2 -flto=auto -fPIC -Wall -D_GNU_SOURCE -fno-strict-aliasing'
+ export CXXFLAGS
+ FFLAGS='-pipe -frecord-gcc-switches -Wall -g -O2 -flto=auto -fPIC -Wall -D_GNU_SOURCE -fno-strict-aliasing'
+ export FFLAGS
+ FCFLAGS='-pipe -frecord-gcc-switches -Wall -g -O2 -flto=auto -fPIC -Wall -D_GNU_SOURCE -fno-strict-aliasing'
+ export FCFLAGS
+ '[' -n '' ']'
++ printf %s '-pipe -frecord-gcc-switches -Wall -g -O2 -flto=auto -fPIC -Wall -D_GNU_SOURCE -fno-strict-aliasing'
++ sed -r 's/(^|[[:space:]]+)-[^m][^[:space:]]*//g'
+ ASFLAGS=
+ export ASFLAGS
+ export lt_cv_prog_cc_static_works=no
+ lt_cv_prog_cc_static_works=no
+ export lt_cv_deplibs_check_method=pass_all
+ lt_cv_deplibs_check_method=pass_all
+ readlink -e -- ./configure
+ xargs -ri dirname -- '{}'
+ xargs -ri find '{}' -type f '(' -name config.sub -or -name config.guess ')' -printf '%h/\n'
+ sort -u
+ xargs -rn1 install -pm755 -- /usr/share/gnu-config/config.sub /usr/share/gnu-config/config.guess
+ ./configure --build=x86_64-alt-linux --host=x86_64-alt-linux --prefix=/usr --exec-prefix=/usr --bindir=/usr/bin --sbindir=/usr/sbin --sysconfdir=/etc --datadir=/usr/share --includedir=/usr/include --libdir=/usr/lib64 --libexecdir=/usr/lib --localstatedir=/var/lib --sharedstatedir=/var/lib --mandir=/usr/share/man --infodir=/usr/share/info --disable-dependency-tracking --disable-silent-rules --without-included-gettext
Configuring for Linux
Creating Makefiles.
  Makefile <= linux/Makefile.top
  pppd/Makefile <= pppd/Makefile.linux
  pppstats/Makefile <= pppstats/Makefile.linux
  chat/Makefile <= chat/Makefile.linux
  pppdump/Makefile <= pppdump/Makefile.linux
  pppd/plugins/Makefile <= pppd/plugins/Makefile.linux
  pppd/plugins/rp-pppoe/Makefile <= pppd/plugins/rp-pppoe/Makefile.linux
  pppd/plugins/radius/Makefile <= pppd/plugins/radius/Makefile.linux
  pppd/plugins/pppoatm/Makefile <= pppd/plugins/pppoatm/Makefile.linux
  pppd/plugins/pppol2tp/Makefile <= pppd/plugins/pppol2tp/Makefile.linux
  pppd/plugins/dhcp/Makefile <= pppd/plugins/dhcp/Makefile.linux
+ make -j8 USE_PAM=y CBCP=y CHAPMS=y MPPE=y HAVE_LIBATM=y HAVE_INET6=y SYSTEMD=y 'COPTS=-pipe -frecord-gcc-switches -Wall -g -O2 -flto=auto -fPIC -Wall -D_GNU_SOURCE -fno-strict-aliasing' CC=gcc libdir=/usr/lib64
cd chat; make -w -j8 -Otarget --jobserver-auth=fifo:/usr/src/tmp/GMfifo1595338 --sync-mutex=fnm:/usr/src/tmp/GmnvFhT5 all
make[1]: Entering directory '/usr/src/RPM/BUILD/ppp-2.4.8/chat'
make[1]: warning: -j8 forced in submake: resetting jobserver mode.
make[1]: Leaving directory '/usr/src/RPM/BUILD/ppp-2.4.8/chat'
make[1]: Entering directory '/usr/src/RPM/BUILD/ppp-2.4.8/chat'
gcc -c -pipe -frecord-gcc-switches -Wall -g -O2 -flto=auto -fPIC -Wall -D_GNU_SOURCE -fno-strict-aliasing -DTERMIOS			 -DSIGTYPE=void			 -UNO_SLEEP			 -DFNDELAY=O_NDELAY		 -o chat.o chat.c
chat.c: In function 'main':
chat.c:151:63: warning: value computed is not used [-Wunused-value]
  151 | #define OPTION(c,v)     (_O&2&&**v?*(*v)++:!c||_O&4?0:(!(_O&1)&& \
      |                                                               ^~
chat.c:297:22: note: in expansion of macro 'OPTION'
  297 |     while ((option = OPTION(argc, argv)) != 0) {
      |                      ^~~~~~
chat.c: In function 'chat_send':
chat.c:1047:9: warning: ignoring return value of 'write' declared with attribute 'warn_unused_result' [-Wunused-result]
 1047 |         write(2, s, strlen(s));
      |         ^~~~~~~~~~~~~~~~~~~~~~
chat.c: In function 'echo_stderr':
chat.c:1370:9: warning: ignoring return value of 'write' declared with attribute 'warn_unused_result' [-Wunused-result]
 1370 |         write(2, "\n", 1);
      |         ^~~~~~~~~~~~~~~~~
chat.c:1375:9: warning: ignoring return value of 'write' declared with attribute 'warn_unused_result' [-Wunused-result]
 1375 |         write(2, s, strlen(s));
      |         ^~~~~~~~~~~~~~~~~~~~~~
chat.c: At top level:
chat.c:90:19: warning: 'rcsid' defined but not used [-Wunused-const-variable=]
   90 | static const char rcsid[] = "$Id: chat.c,v 1.30 2004/01/17 05:47:55 carlsonj Exp $";
      |                   ^~~~~
make[1]: Leaving directory '/usr/src/RPM/BUILD/ppp-2.4.8/chat'
make[1]: Entering directory '/usr/src/RPM/BUILD/ppp-2.4.8/chat'
gcc  -pie -o chat chat.o
make[1]: Leaving directory '/usr/src/RPM/BUILD/ppp-2.4.8/chat'
cd pppd/plugins; make -w -j8 -Otarget --jobserver-auth=fifo:/usr/src/tmp/GMfifo1595338 --sync-mutex=fnm:/usr/src/tmp/GmnvFhT5 all
make[1]: Entering directory '/usr/src/RPM/BUILD/ppp-2.4.8/pppd/plugins'
make[1]: warning: -j8 forced in submake: resetting jobserver mode.
make[1]: Leaving directory '/usr/src/RPM/BUILD/ppp-2.4.8/pppd/plugins'
make[1]: Entering directory '/usr/src/RPM/BUILD/ppp-2.4.8/pppd/plugins'
gcc -pipe -frecord-gcc-switches -Wall -g -O2 -flto=auto -fPIC -Wall -D_GNU_SOURCE -fno-strict-aliasing -I.. -I../../include -fPIC -DUSE_EAPTLS=1 -DMPPE=1  -shared -o minconn.so minconn.c
make[1]: Leaving directory '/usr/src/RPM/BUILD/ppp-2.4.8/pppd/plugins'
make[1]: Entering directory '/usr/src/RPM/BUILD/ppp-2.4.8/pppd/plugins'
gcc -pipe -frecord-gcc-switches -Wall -g -O2 -flto=auto -fPIC -Wall -D_GNU_SOURCE -fno-strict-aliasing -I.. -I../../include -fPIC -DUSE_EAPTLS=1 -DMPPE=1  -shared -o passwordfd.so passwordfd.c
make[1]: Leaving directory '/usr/src/RPM/BUILD/ppp-2.4.8/pppd/plugins'
make[1]: Entering directory '/usr/src/RPM/BUILD/ppp-2.4.8/pppd/plugins'
gcc -pipe -frecord-gcc-switches -Wall -g -O2 -flto=auto -fPIC -Wall -D_GNU_SOURCE -fno-strict-aliasing -I.. -I../../include -fPIC -DUSE_EAPTLS=1 -DMPPE=1  -shared -o passprompt.so passprompt.c
passprompt.c: In function 'promptpass':
passprompt.c:57:9: warning: ignoring return value of 'seteuid' declared with attribute 'warn_unused_result' [-Wunused-result]
   57 |         seteuid(getuid());
      |         ^~~~~~~~~~~~~~~~~
passprompt.c:58:9: warning: ignoring return value of 'setegid' declared with attribute 'warn_unused_result' [-Wunused-result]
   58 |         setegid(getgid());
      |         ^~~~~~~~~~~~~~~~~
make[1]: Leaving directory '/usr/src/RPM/BUILD/ppp-2.4.8/pppd/plugins'
make[1]: Entering directory '/usr/src/RPM/BUILD/ppp-2.4.8/pppd/plugins'
gcc -pipe -frecord-gcc-switches -Wall -g -O2 -flto=auto -fPIC -Wall -D_GNU_SOURCE -fno-strict-aliasing -I.. -I../../include -fPIC -DUSE_EAPTLS=1 -DMPPE=1  -shared -o winbind.so winbind.c
winbind.c: In function 'run_ntlm_auth':
winbind.c:421:51: warning: pointer targets in passing argument 1 of 'strhex_to_str' differ in signedness [-Wpointer-sign]
  421 |                                 if (strhex_to_str(nt_key, 32, parameter) == 16) {
      |                                                   ^~~~~~
      |                                                   |
      |                                                   u_char * {aka unsigned char *}
winbind.c:168:28: note: expected 'char *' but argument is of type 'u_char *' {aka 'unsigned char *'}
  168 | size_t strhex_to_str(char *p, size_t len, const char *strhex)
      |                      ~~~~~~^
winbind.c: In function 'winbind_chap_verify':
winbind.c:637:50: warning: pointer targets in passing argument 6 of 'GenerateAuthenticatorResponse' differ in signedness [-Wpointer-sign]
  637 |                                 challenge, user, saresponse);
      |                                                  ^~~~~~~~~~
      |                                                  |
      |                                                  char *
In file included from winbind.c:39:
../chap_ms.h:104:32: note: expected 'u_char *' {aka 'unsigned char *'} but argument is of type 'char *'
  104 |                         u_char authResponse[MS_AUTH_RESPONSE_LENGTH+1]);
      |                         ~~~~~~~^~~~~~~~~~~~~~~~~~~~~~~~~~~~~~~~~~~~~~~
winbind.c: In function 'run_ntlm_auth':
winbind.c:305:17: warning: ignoring return value of 'setgid' declared with attribute 'warn_unused_result' [-Wunused-result]
  305 |                 setgid(getgid());
      |                 ^~~~~~~~~~~~~~~~
make[1]: Leaving directory '/usr/src/RPM/BUILD/ppp-2.4.8/pppd/plugins'
for d in rp-pppoe pppoatm pppol2tp radius dhcp; do make -w -j8 -Otarget --jobserver-auth=fifo:/usr/src/tmp/GMfifo1596292 --sync-mutex=fnm:/usr/src/tmp/GmnvFhT5 -C $d all || exit $?; done
make[2]: Entering directory '/usr/src/RPM/BUILD/ppp-2.4.8/pppd/plugins/rp-pppoe'
make[2]: warning: -j8 forced in submake: resetting jobserver mode.
make[2]: Leaving directory '/usr/src/RPM/BUILD/ppp-2.4.8/pppd/plugins/rp-pppoe'
make[2]: Entering directory '/usr/src/RPM/BUILD/ppp-2.4.8/pppd/plugins/rp-pppoe'
gcc -pipe -frecord-gcc-switches -Wall -g -O2 -flto=auto -fPIC -Wall -D_GNU_SOURCE -fno-strict-aliasing -I../../../include -fPIC '-DRP_VERSION="3.8p"' -I../../.. -c -o if.o if.c
if.c:16:19: warning: 'RCSID' defined but not used [-Wunused-const-variable=]
   16 | static char const RCSID[] =
      |                   ^~~~~
make[2]: Leaving directory '/usr/src/RPM/BUILD/ppp-2.4.8/pppd/plugins/rp-pppoe'
make[2]: Entering directory '/usr/src/RPM/BUILD/ppp-2.4.8/pppd/plugins/rp-pppoe'
gcc -pipe -frecord-gcc-switches -Wall -g -O2 -flto=auto -fPIC -Wall -D_GNU_SOURCE -fno-strict-aliasing -I../../../include -fPIC '-DRP_VERSION="3.8p"' -I../../.. -c -o common.o common.c
common.c: In function 'sendPADT':
common.c:135:19: warning: pointer targets in passing argument 1 of 'strcpy' differ in signedness [-Wpointer-sign]
  135 |         strcpy(err.payload, msg);
      |                ~~~^~~~~~~~
      |                   |
      |                   unsigned char *
In file included from /usr/include/features.h:490,
                 from /usr/include/bits/libc-header-start.h:33,
                 from /usr/include/stdio.h:27,
                 from pppoe.h:18,
                 from common.c:20:
/usr/include/bits/string_fortified.h:77:1: note: expected 'char * restrict' but argument is of type 'unsigned char *'
   77 | __NTH (strcpy (char *__restrict __dest, const char *__restrict __src))
      | ^~~~~
common.c: At top level:
common.c:16:19: warning: 'RCSID' defined but not used [-Wunused-const-variable=]
   16 | static char const RCSID[] =
      |                   ^~~~~
make[2]: Leaving directory '/usr/src/RPM/BUILD/ppp-2.4.8/pppd/plugins/rp-pppoe'
make[2]: Entering directory '/usr/src/RPM/BUILD/ppp-2.4.8/pppd/plugins/rp-pppoe'
gcc -pipe -frecord-gcc-switches -Wall -g -O2 -flto=auto -fPIC -Wall -D_GNU_SOURCE -fno-strict-aliasing -I../../../include -fPIC '-DRP_VERSION="3.8p"' -I../../.. -c -o debug.o debug.c
debug.c:16:19: warning: 'RCSID' defined but not used [-Wunused-const-variable=]
   16 | static char const RCSID[] =
      |                   ^~~~~
make[2]: Leaving directory '/usr/src/RPM/BUILD/ppp-2.4.8/pppd/plugins/rp-pppoe'
make[2]: Entering directory '/usr/src/RPM/BUILD/ppp-2.4.8/pppd/plugins/rp-pppoe'
gcc -pipe -frecord-gcc-switches -Wall -g -O2 -flto=auto -fPIC -Wall -D_GNU_SOURCE -fno-strict-aliasing -I../../../include -fPIC '-DRP_VERSION="3.8p"' -I../../.. -c -o plugin.o plugin.c
plugin.c:55:2: warning: #warning ugly hack: aligned_u64 must be defined in linux/types.h [-Wcpp]
   55 | #warning ugly hack: aligned_u64 must be defined in linux/types.h
      |  ^~~~~~~
plugin.c:25:19: warning: 'RCSID' defined but not used [-Wunused-const-variable=]
   25 | static char const RCSID[] =
      |                   ^~~~~
make[2]: Leaving directory '/usr/src/RPM/BUILD/ppp-2.4.8/pppd/plugins/rp-pppoe'
make[2]: Entering directory '/usr/src/RPM/BUILD/ppp-2.4.8/pppd/plugins/rp-pppoe'
gcc -pipe -frecord-gcc-switches -Wall -g -O2 -flto=auto -fPIC -Wall -D_GNU_SOURCE -fno-strict-aliasing -I../../../include -fPIC '-DRP_VERSION="3.8p"' -I../../.. -c -o discovery.o discovery.c
discovery.c: In function 'parsePADOTags':
discovery.c:136:9: warning: unused variable 'i' [-Wunused-variable]
  136 |     int i;
      |         ^
discovery.c: At top level:
discovery.c:11:19: warning: 'RCSID' defined but not used [-Wunused-const-variable=]
   11 | static char const RCSID[] =
      |                   ^~~~~
make[2]: Leaving directory '/usr/src/RPM/BUILD/ppp-2.4.8/pppd/plugins/rp-pppoe'
make[2]: Entering directory '/usr/src/RPM/BUILD/ppp-2.4.8/pppd/plugins/rp-pppoe'
gcc -pipe -frecord-gcc-switches -Wall -g -O2 -flto=auto -fPIC -Wall -D_GNU_SOURCE -fno-strict-aliasing -I../../../include -fPIC '-DRP_VERSION="3.8p"' -I../../.. -c -o pppoe-discovery.o pppoe-discovery.c
make[2]: Leaving directory '/usr/src/RPM/BUILD/ppp-2.4.8/pppd/plugins/rp-pppoe'
make[2]: Entering directory '/usr/src/RPM/BUILD/ppp-2.4.8/pppd/plugins/rp-pppoe'
gcc -pipe -frecord-gcc-switches -Wall -g -O2 -flto=auto -fPIC -Wall -D_GNU_SOURCE -fno-strict-aliasing -I../../../include -fPIC '-DRP_VERSION="3.8p"' -shared -o pppoe-discovery pppoe-discovery.o debug.o -ludev
make[2]: Leaving directory '/usr/src/RPM/BUILD/ppp-2.4.8/pppd/plugins/rp-pppoe'
make[2]: Entering directory '/usr/src/RPM/BUILD/ppp-2.4.8/pppd/plugins/rp-pppoe'
gcc -pipe -frecord-gcc-switches -Wall -g -O2 -flto=auto -fPIC -Wall -D_GNU_SOURCE -fno-strict-aliasing -I../../../include -fPIC '-DRP_VERSION="3.8p"' -shared -o rp-pppoe.so plugin.o discovery.o if.o common.o
make[2]: Leaving directory '/usr/src/RPM/BUILD/ppp-2.4.8/pppd/plugins/rp-pppoe'
make[2]: Entering directory '/usr/src/RPM/BUILD/ppp-2.4.8/pppd/plugins/pppoatm'
make[2]: warning: -j8 forced in submake: resetting jobserver mode.
make[2]: Leaving directory '/usr/src/RPM/BUILD/ppp-2.4.8/pppd/plugins/pppoatm'
make[2]: Entering directory '/usr/src/RPM/BUILD/ppp-2.4.8/pppd/plugins/pppoatm'
gcc -pipe -frecord-gcc-switches -Wall -g -O2 -flto=auto -fPIC -Wall -D_GNU_SOURCE -fno-strict-aliasing -I../.. -I../../../include -fPIC -c -o pppoatm.o pppoatm.c
make[2]: Leaving directory '/usr/src/RPM/BUILD/ppp-2.4.8/pppd/plugins/pppoatm'
make[2]: Entering directory '/usr/src/RPM/BUILD/ppp-2.4.8/pppd/plugins/pppoatm'
gcc -pipe -frecord-gcc-switches -Wall -g -O2 -flto=auto -fPIC -Wall -D_GNU_SOURCE -fno-strict-aliasing -I../.. -I../../../include -fPIC  -shared -o pppoatm.so pppoatm.o -latm
make[2]: Leaving directory '/usr/src/RPM/BUILD/ppp-2.4.8/pppd/plugins/pppoatm'
make[2]: Entering directory '/usr/src/RPM/BUILD/ppp-2.4.8/pppd/plugins/pppol2tp'
make[2]: warning: -j8 forced in submake: resetting jobserver mode.
make[2]: Leaving directory '/usr/src/RPM/BUILD/ppp-2.4.8/pppd/plugins/pppol2tp'
make[2]: Entering directory '/usr/src/RPM/BUILD/ppp-2.4.8/pppd/plugins/pppol2tp'
gcc -pipe -frecord-gcc-switches -Wall -g -O2 -flto=auto -fPIC -Wall -D_GNU_SOURCE -fno-strict-aliasing -I. -I../.. -I../../../include -fPIC -c -o openl2tp.o openl2tp.c
make[2]: Leaving directory '/usr/src/RPM/BUILD/ppp-2.4.8/pppd/plugins/pppol2tp'
make[2]: Entering directory '/usr/src/RPM/BUILD/ppp-2.4.8/pppd/plugins/pppol2tp'
gcc -pipe -frecord-gcc-switches -Wall -g -O2 -flto=auto -fPIC -Wall -D_GNU_SOURCE -fno-strict-aliasing -I. -I../.. -I../../../include -fPIC -c -o pppol2tp.o pppol2tp.c
pppol2tp.c: In function 'setdevname_pppol2tp':
pppol2tp.c:135:60: warning: pointer targets in passing argument 3 of 'getsockname' differ in signedness [-Wpointer-sign]
  135 |         if(getsockname(pppol2tp_fd, (struct sockaddr *)&s, &len) < 0) {
      |                                                            ^~~~
      |                                                            |
      |                                                            int *
In file included from /usr/include/net/if.h:26,
                 from pppol2tp.c:34:
/usr/include/sys/socket.h:117:47: note: expected 'socklen_t * restrict' {aka 'unsigned int * restrict'} but argument is of type 'int *'
  117 |                         socklen_t *__restrict __len) __THROW;
      |                         ~~~~~~~~~~~~~~~~~~~~~~^~~~~
pppol2tp.c:147:30: warning: pointer targets in passing argument 5 of 'getsockopt' differ in signedness [-Wpointer-sign]
  147 |                        &tmp, &tmp_len) < 0) {
      |                              ^~~~~~~~
      |                              |
      |                              int *
/usr/include/sys/socket.h:257:46: note: expected 'socklen_t * restrict' {aka 'unsigned int * restrict'} but argument is of type 'int *'
  257 |                        socklen_t *__restrict __optlen) __THROW;
      |                        ~~~~~~~~~~~~~~~~~~~~~~^~~~~~~~
pppol2tp.c:125:16: warning: unused variable 'a' [-Wunused-variable]
  125 |         char **a;
      |                ^
pppol2tp.c: In function 'send_config_pppol2tp':
pppol2tp.c:204:13: warning: unused variable 'fd' [-Wunused-variable]
  204 |         int fd;
      |             ^~
pppol2tp.c:202:22: warning: unused variable 'ifr' [-Wunused-variable]
  202 |         struct ifreq ifr;
      |                      ^~~
pppol2tp.c: In function 'pppol2tp_lcp_snoop':
pppol2tp.c:304:21: warning: variable 'snooping' set but not used [-Wunused-but-set-variable]
  304 |         static bool snooping = 1;
      |                     ^~~~~~~~
pppol2tp.c: At top level:
pppol2tp.c:483:13: warning: 'pppol2tp_cleanup' defined but not used [-Wunused-function]
  483 | static void pppol2tp_cleanup(void)
      |             ^~~~~~~~~~~~~~~~
make[2]: Leaving directory '/usr/src/RPM/BUILD/ppp-2.4.8/pppd/plugins/pppol2tp'
make[2]: Entering directory '/usr/src/RPM/BUILD/ppp-2.4.8/pppd/plugins/pppol2tp'
gcc -pipe -frecord-gcc-switches -Wall -g -O2 -flto=auto -fPIC -Wall -D_GNU_SOURCE -fno-strict-aliasing -I. -I../.. -I../../../include -fPIC  -shared -o openl2tp.so openl2tp.o 
make[2]: Leaving directory '/usr/src/RPM/BUILD/ppp-2.4.8/pppd/plugins/pppol2tp'
make[2]: Entering directory '/usr/src/RPM/BUILD/ppp-2.4.8/pppd/plugins/pppol2tp'
gcc -pipe -frecord-gcc-switches -Wall -g -O2 -flto=auto -fPIC -Wall -D_GNU_SOURCE -fno-strict-aliasing -I. -I../.. -I../../../include -fPIC  -shared -o pppol2tp.so pppol2tp.o 
make[2]: Leaving directory '/usr/src/RPM/BUILD/ppp-2.4.8/pppd/plugins/pppol2tp'
rm pppol2tp.o openl2tp.o
make[2]: Entering directory '/usr/src/RPM/BUILD/ppp-2.4.8/pppd/plugins/radius'
make[2]: warning: -j8 forced in submake: resetting jobserver mode.
make[2]: Leaving directory '/usr/src/RPM/BUILD/ppp-2.4.8/pppd/plugins/radius'
make[2]: Entering directory '/usr/src/RPM/BUILD/ppp-2.4.8/pppd/plugins/radius'
gcc -pipe -frecord-gcc-switches -Wall -g -O2 -flto=auto -fPIC -Wall -D_GNU_SOURCE -fno-strict-aliasing -I. -I../.. -I../../../include -fPIC -DRC_LOG_FACILITY=LOG_DAEMON -DCHAPMS=1 -DMPPE=1 -DMAXOCTETS=1 -DUSE_OPENSSL=1 -c -o buildreq.o buildreq.c
buildreq.c: In function 'rc_get_seqnbr':
buildreq.c:138:9: warning: ignoring return value of 'ftruncate' declared with attribute 'warn_unused_result' [-Wunused-result]
  138 |         ftruncate(fileno(sf),0);
      |         ^~~~~~~~~~~~~~~~~~~~~~~
make[2]: Leaving directory '/usr/src/RPM/BUILD/ppp-2.4.8/pppd/plugins/radius'
make[2]: Entering directory '/usr/src/RPM/BUILD/ppp-2.4.8/pppd/plugins/radius'
gcc -pipe -frecord-gcc-switches -Wall -g -O2 -flto=auto -fPIC -Wall -D_GNU_SOURCE -fno-strict-aliasing -I. -I../.. -I../../../include -fPIC -DRC_LOG_FACILITY=LOG_DAEMON -DCHAPMS=1 -DMPPE=1 -DMAXOCTETS=1 -DUSE_OPENSSL=1 -c -o dict.o dict.c
make[2]: Leaving directory '/usr/src/RPM/BUILD/ppp-2.4.8/pppd/plugins/radius'
make[2]: Entering directory '/usr/src/RPM/BUILD/ppp-2.4.8/pppd/plugins/radius'
gcc -pipe -frecord-gcc-switches -Wall -g -O2 -flto=auto -fPIC -Wall -D_GNU_SOURCE -fno-strict-aliasing -I. -I../.. -I../../../include -fPIC -DRC_LOG_FACILITY=LOG_DAEMON -DCHAPMS=1 -DMPPE=1 -DMAXOCTETS=1 -DUSE_OPENSSL=1 -c -o config.o config.c
config.c: In function 'rc_find_server':
config.c:528:46: warning: argument to 'sizeof' in 'memset' call is the same expression as the destination; did you mean to provide an explicit length? [-Wsizeof-pointer-memaccess]
  528 |                 memset (secret, '\0', sizeof (secret));
      |                                              ^
config.c:455:25: warning: unused variable 'len' [-Wunused-variable]
  455 |         int             len;
      |                         ^~~
make[2]: Leaving directory '/usr/src/RPM/BUILD/ppp-2.4.8/pppd/plugins/radius'
make[2]: Entering directory '/usr/src/RPM/BUILD/ppp-2.4.8/pppd/plugins/radius'
gcc -pipe -frecord-gcc-switches -Wall -g -O2 -flto=auto -fPIC -Wall -D_GNU_SOURCE -fno-strict-aliasing -I. -I../.. -I../../../include -fPIC -DRC_LOG_FACILITY=LOG_DAEMON -DCHAPMS=1 -DMPPE=1 -DMAXOCTETS=1 -DUSE_OPENSSL=1 -c -o avpair.o avpair.c
avpair.c: In function 'rc_avpair_assign':
avpair.c:79:36: warning: pointer targets in passing argument 1 of 'strncpy' differ in signedness [-Wpointer-sign]
   79 |                         strncpy (vp->strvalue, (char *) pval, AUTH_STRING_LEN);
      |                                  ~~^~~~~~~~~~
      |                                    |
      |                                    u_char * {aka unsigned char *}
In file included from /usr/include/features.h:490,
                 from /usr/include/sys/types.h:25,
                 from ./includes.h:17,
                 from avpair.c:17:
/usr/include/bits/string_fortified.h:92:1: note: expected 'char * restrict' but argument is of type 'u_char *' {aka 'unsigned char *'}
   92 | __NTH (strncpy (char *__restrict __dest, const char *__restrict __src,
      | ^~~~~
avpair.c: In function 'rc_avpair_gen':
avpair.c:199:42: warning: pointer targets in passing argument 1 of 'sprintf' differ in signedness [-Wpointer-sign]
  199 |                                 sprintf (hex, "%2.2X", *x_ptr);
      |                                          ^~~
      |                                          |
      |                                          unsigned char *
/usr/include/bits/stdio2.h:28:1: note: expected 'char * restrict' but argument is of type 'unsigned char *'
   28 | __NTH (sprintf (char *__restrict __s, const char *__restrict __fmt, ...))
      | ^~~~~
avpair.c:200:49: warning: pointer targets in passing argument 2 of 'strcat' differ in signedness [-Wpointer-sign]
  200 |                                 strcat (buffer, hex);
      |                                                 ^~~
      |                                                 |
      |                                                 unsigned char *
/usr/include/bits/string_fortified.h:128:1: note: expected 'const char * restrict' but argument is of type 'unsigned char *'
  128 | __NTH (strcat (char *__restrict __dest, const char *__restrict __src))
      | ^~~~~
avpair.c: In function 'rc_avpair_parse':
avpair.c:600:45: warning: pointer targets in passing argument 1 of 'strcpy' differ in signedness [-Wpointer-sign]
  600 |                                 strcpy (pair->strvalue, valstr);
      |                                         ~~~~^~~~~~~~~~
      |                                             |
      |                                             u_char * {aka unsigned char *}
/usr/include/bits/string_fortified.h:77:1: note: expected 'char * restrict' but argument is of type 'u_char *' {aka 'unsigned char *'}
   77 | __NTH (strcpy (char *__restrict __dest, const char *__restrict __src))
      | ^~~~~
avpair.c: In function 'rc_avpair_tostr':
avpair.c:724:48: warning: pointer targets in passing argument 2 of 'strncat' differ in signedness [-Wpointer-sign]
  724 |                                 strncat(value, ptr, 1);
      |                                                ^~~
      |                                                |
      |                                                unsigned char *
/usr/include/bits/string_fortified.h:135:1: note: expected 'const char * restrict' but argument is of type 'unsigned char *'
  135 | __NTH (strncat (char *__restrict __dest, const char *__restrict __src,
      | ^~~~~
make[2]: Leaving directory '/usr/src/RPM/BUILD/ppp-2.4.8/pppd/plugins/radius'
make[2]: Entering directory '/usr/src/RPM/BUILD/ppp-2.4.8/pppd/plugins/radius'
gcc -pipe -frecord-gcc-switches -Wall -g -O2 -flto=auto -fPIC -Wall -D_GNU_SOURCE -fno-strict-aliasing -I. -I../.. -I../../../include -fPIC -DRC_LOG_FACILITY=LOG_DAEMON -DCHAPMS=1 -DMPPE=1 -DMAXOCTETS=1 -DUSE_OPENSSL=1 -c -o ip_util.o ip_util.c
make[2]: Leaving directory '/usr/src/RPM/BUILD/ppp-2.4.8/pppd/plugins/radius'
make[2]: Entering directory '/usr/src/RPM/BUILD/ppp-2.4.8/pppd/plugins/radius'
gcc -pipe -frecord-gcc-switches -Wall -g -O2 -flto=auto -fPIC -Wall -D_GNU_SOURCE -fno-strict-aliasing -I. -I../.. -I../../../include -fPIC -DRC_LOG_FACILITY=LOG_DAEMON -DCHAPMS=1 -DMPPE=1 -DMAXOCTETS=1 -DUSE_OPENSSL=1 -c -o md5.o md5.c
make[2]: Leaving directory '/usr/src/RPM/BUILD/ppp-2.4.8/pppd/plugins/radius'
make[2]: Entering directory '/usr/src/RPM/BUILD/ppp-2.4.8/pppd/plugins/radius'
gcc -pipe -frecord-gcc-switches -Wall -g -O2 -flto=auto -fPIC -Wall -D_GNU_SOURCE -fno-strict-aliasing -I. -I../.. -I../../../include -fPIC -DRC_LOG_FACILITY=LOG_DAEMON -DCHAPMS=1 -DMPPE=1 -DMAXOCTETS=1 -DUSE_OPENSSL=1 -c -o lock.o lock.c
make[2]: Leaving directory '/usr/src/RPM/BUILD/ppp-2.4.8/pppd/plugins/radius'
make[2]: Entering directory '/usr/src/RPM/BUILD/ppp-2.4.8/pppd/plugins/radius'
gcc -pipe -frecord-gcc-switches -Wall -g -O2 -flto=auto -fPIC -Wall -D_GNU_SOURCE -fno-strict-aliasing -I. -I../.. -I../../../include -fPIC -DRC_LOG_FACILITY=LOG_DAEMON -DCHAPMS=1 -DMPPE=1 -DMAXOCTETS=1 -DUSE_OPENSSL=1 -c -o clientid.o clientid.c
make[2]: Leaving directory '/usr/src/RPM/BUILD/ppp-2.4.8/pppd/plugins/radius'
make[2]: Entering directory '/usr/src/RPM/BUILD/ppp-2.4.8/pppd/plugins/radius'
gcc -pipe -frecord-gcc-switches -Wall -g -O2 -flto=auto -fPIC -Wall -D_GNU_SOURCE -fno-strict-aliasing -I. -I../.. -I../../../include -fPIC -DRC_LOG_FACILITY=LOG_DAEMON -DCHAPMS=1 -DMPPE=1 -DMAXOCTETS=1 -DUSE_OPENSSL=1 -c -o sendserver.o sendserver.c
sendserver.c: In function 'rc_pack_list':
sendserver.c:107:28: warning: pointer targets in assignment from 'char *' to 'unsigned char *' differ in signedness [-Wpointer-sign]
  107 |                     vector = (char *)auth->vector;
      |                            ^
sendserver.c: In function 'rc_send_server':
sendserver.c:250:66: warning: pointer targets in passing argument 3 of 'getsockname' differ in signedness [-Wpointer-sign]
  250 |                    getsockname (sockfd, (struct sockaddr *) sin, &length) < 0)
      |                                                                  ^~~~~~~
      |                                                                  |
      |                                                                  int *
In file included from /usr/include/netinet/in.h:23,
                 from /usr/include/netdb.h:27,
                 from ./includes.h:22,
                 from sendserver.c:17:
/usr/include/sys/socket.h:117:47: note: expected 'socklen_t * restrict' {aka 'unsigned int * restrict'} but argument is of type 'int *'
  117 |                         socklen_t *__restrict __len) __THROW;
      |                         ~~~~~~~~~~~~~~~~~~~~~~^~~~~
sendserver.c:275:38: warning: pointer targets in passing argument 2 of 'rc_md5_calc' differ in signedness [-Wpointer-sign]
  275 |                 rc_md5_calc (vector, (char *) auth, total_length + secretlen);
      |                                      ^~~~~~~~~~~~~
      |                                      |
      |                                      char *
In file included from ./radiusclient.h:23,
                 from sendserver.c:18:
./radiusclient.h:458:40: note: expected 'unsigned char *' but argument is of type 'char *'
  458 | void rc_md5_calc __P((unsigned char *, unsigned char *, unsigned int));
      |                                        ^~~~~~~~~~~~~~~
../../pppd.h:66:19: note: in definition of macro '__P'
   66 | #define __P(args) args
      |                   ^~~~
sendserver.c:331:48: warning: pointer targets in passing argument 6 of 'recvfrom' differ in signedness [-Wpointer-sign]
  331 |                            (int) 0, &saremote, &salen);
      |                                                ^~~~~~
      |                                                |
      |                                                int *
In file included from /usr/include/sys/socket.h:343:
/usr/include/bits/socket2.h:62:56: note: expected 'socklen_t * restrict' {aka 'unsigned int * restrict'} but argument is of type 'int *'
   62 |           __SOCKADDR_ARG __addr, socklen_t *__restrict __addr_len)
      |                                  ~~~~~~~~~~~~~~~~~~~~~~^~~~~~~~~~
sendserver.c:365:39: warning: pointer targets in passing argument 2 of 'strcat' differ in signedness [-Wpointer-sign]
  365 |                         strcat(msg, vp->strvalue);
      |                                     ~~^~~~~~~~~~
      |                                       |
      |                                       u_char * {aka unsigned char *}
In file included from /usr/include/features.h:490,
                 from /usr/include/sys/types.h:25,
                 from ./includes.h:17:
/usr/include/bits/string_fortified.h:128:1: note: expected 'const char * restrict' but argument is of type 'u_char *' {aka 'unsigned char *'}
  128 | __NTH (strcat (char *__restrict __dest, const char *__restrict __src))
      | ^~~~~
sendserver.c: In function 'rc_check_reply':
sendserver.c:431:35: warning: pointer targets in passing argument 2 of 'rc_md5_calc' differ in signedness [-Wpointer-sign]
  431 |         rc_md5_calc (calc_digest, (char *) auth, totallen + secretlen);
      |                                   ^~~~~~~~~~~~~
      |                                   |
      |                                   char *
./radiusclient.h:458:40: note: expected 'unsigned char *' but argument is of type 'char *'
  458 | void rc_md5_calc __P((unsigned char *, unsigned char *, unsigned int));
      |                                        ^~~~~~~~~~~~~~~
../../pppd.h:66:19: note: in definition of macro '__P'
   66 | #define __P(args) args
      |                   ^~~~
make[2]: Leaving directory '/usr/src/RPM/BUILD/ppp-2.4.8/pppd/plugins/radius'
make[2]: Entering directory '/usr/src/RPM/BUILD/ppp-2.4.8/pppd/plugins/radius'
gcc -pipe -frecord-gcc-switches -Wall -g -O2 -flto=auto -fPIC -Wall -D_GNU_SOURCE -fno-strict-aliasing -I. -I../.. -I../../../include -fPIC -DRC_LOG_FACILITY=LOG_DAEMON -DCHAPMS=1 -DMPPE=1 -DMAXOCTETS=1 -DUSE_OPENSSL=1 -c -o util.o util.c
make[2]: Leaving directory '/usr/src/RPM/BUILD/ppp-2.4.8/pppd/plugins/radius'
make[2]: Entering directory '/usr/src/RPM/BUILD/ppp-2.4.8/pppd/plugins/radius'
ar rv libradiusclient.a avpair.o buildreq.o config.o dict.o ip_util.o clientid.o sendserver.o lock.o util.o md5.o
ar: creating libradiusclient.a
a - avpair.o
a - buildreq.o
a - config.o
a - dict.o
a - ip_util.o
a - clientid.o
a - sendserver.o
a - lock.o
a - util.o
a - md5.o
make[2]: Leaving directory '/usr/src/RPM/BUILD/ppp-2.4.8/pppd/plugins/radius'
make[2]: Entering directory '/usr/src/RPM/BUILD/ppp-2.4.8/pppd/plugins/radius'
gcc -pipe -frecord-gcc-switches -Wall -g -O2 -flto=auto -fPIC -Wall -D_GNU_SOURCE -fno-strict-aliasing -I. -I../.. -I../../../include -fPIC -DRC_LOG_FACILITY=LOG_DAEMON -DCHAPMS=1 -DMPPE=1 -DMAXOCTETS=1 -DUSE_OPENSSL=1 -c -o radius.o radius.c
radius.c:209:34: warning: "/*" within comment [-Wcomment]
  209 | * worry about looking in /etc/ppp/*-secrets
      |                                   
radius.c: In function 'radius_setparams':
radius.c:600:52: warning: pointer targets in passing argument 2 of 'script_setenv' differ in signedness [-Wpointer-sign]
  600 |                script_setenv("RADIUS_FILTER_ID", vp->strvalue, 1);
      |                                                  ~~^~~~~~~~~~
      |                                                    |
      |                                                    u_char * {aka unsigned char *}
In file included from radius.c:29:
../../pppd.h:546:33: note: expected 'char *' but argument is of type 'u_char *' {aka 'unsigned char *'}
  546 | void script_setenv __P((char *, char *, int));  /* set script env var */
      |                                 ^~~~~~
../../pppd.h:66:19: note: in definition of macro '__P'
   66 | #define __P(args) args
      |                   ^~~~
radius.c:604:55: warning: pointer targets in passing argument 2 of 'script_setenv' differ in signedness [-Wpointer-sign]
  604 |                script_setenv("RADIUS_FRAMED_ROUTE", vp->strvalue, 1);
      |                                                     ~~^~~~~~~~~~
      |                                                       |
      |                                                       u_char * {aka unsigned char *}
../../pppd.h:546:33: note: expected 'char *' but argument is of type 'u_char *' {aka 'unsigned char *'}
  546 | void script_setenv __P((char *, char *, int));  /* set script env var */
      |                                 ^~~~~~
../../pppd.h:66:19: note: in definition of macro '__P'
   66 | #define __P(args) args
      |                   ^~~~
radius.c:665:64: warning: pointer targets in passing argument 1 of 'strncmp' differ in signedness [-Wpointer-sign]
  665 |                 if ((vp->lvalue != 43) || strncmp(vp->strvalue + 1, "S=", 2)) {
      |                                                   ~~~~~~~~~~~~~^~~
      |                                                                |
      |                                                                u_char * {aka unsigned char *}
In file included from radius.c:47:
/usr/include/string.h:159:33: note: expected 'const char *' but argument is of type 'u_char *' {aka 'unsigned char *'}
  159 | extern int strncmp (const char *__s1, const char *__s2, size_t __n)
      |                     ~~~~~~~~~~~~^~~~
radius.c:670:51: warning: pointer targets in passing argument 2 of 'strlcpy' differ in signedness [-Wpointer-sign]
  670 |                     strlcpy(message, vp->strvalue + 1, message_space);
      |                                      ~~~~~~~~~~~~~^~~
      |                                                   |
      |                                                   u_char * {aka unsigned char *}
In file included from /usr/include/features.h:490,
                 from /usr/include/bits/libc-header-start.h:33,
                 from /usr/include/stdio.h:27,
                 from ../../pppd.h:52:
/usr/include/bits/string_fortified.h:154:1: note: expected 'const char * restrict' but argument is of type 'u_char *' {aka 'unsigned char *'}
  154 | __NTH (strlcpy (char *__restrict __dest, const char *__restrict __src,
      | ^~~~~
radius.c: At top level:
radius.c:26:19: warning: 'RCSID' defined but not used [-Wunused-const-variable=]
   26 | static char const RCSID[] =
      |                   ^~~~~
make[2]: Leaving directory '/usr/src/RPM/BUILD/ppp-2.4.8/pppd/plugins/radius'
make[2]: Entering directory '/usr/src/RPM/BUILD/ppp-2.4.8/pppd/plugins/radius'
gcc -pipe -frecord-gcc-switches -Wall -g -O2 -flto=auto -fPIC -Wall -D_GNU_SOURCE -fno-strict-aliasing -I. -I../.. -I../../../include -fPIC -DRC_LOG_FACILITY=LOG_DAEMON -DCHAPMS=1 -DMPPE=1 -DMAXOCTETS=1 -DUSE_OPENSSL=1 -c -o radattr.o radattr.c
radattr.c:17:19: warning: 'RCSID' defined but not used [-Wunused-const-variable=]
   17 | static char const RCSID[] =
      |                   ^~~~~
make[2]: Leaving directory '/usr/src/RPM/BUILD/ppp-2.4.8/pppd/plugins/radius'
make[2]: Entering directory '/usr/src/RPM/BUILD/ppp-2.4.8/pppd/plugins/radius'
gcc -pipe -frecord-gcc-switches -Wall -g -O2 -flto=auto -fPIC -Wall -D_GNU_SOURCE -fno-strict-aliasing -I. -I../.. -I../../../include -fPIC -DRC_LOG_FACILITY=LOG_DAEMON -DCHAPMS=1 -DMPPE=1 -DMAXOCTETS=1 -DUSE_OPENSSL=1 -c -o radrealms.o radrealms.c
radrealms.c:17:19: warning: 'RCSID' defined but not used [-Wunused-const-variable=]
   17 | static char const RCSID[] =
      |                   ^~~~~
make[2]: Leaving directory '/usr/src/RPM/BUILD/ppp-2.4.8/pppd/plugins/radius'
make[2]: Entering directory '/usr/src/RPM/BUILD/ppp-2.4.8/pppd/plugins/radius'
gcc -pipe -frecord-gcc-switches -Wall -g -O2 -flto=auto -fPIC -Wall -D_GNU_SOURCE -fno-strict-aliasing -I. -I../.. -I../../../include -fPIC -DRC_LOG_FACILITY=LOG_DAEMON -DCHAPMS=1 -DMPPE=1 -DMAXOCTETS=1 -DUSE_OPENSSL=1 -shared -o radattr.so radattr.o
make[2]: Leaving directory '/usr/src/RPM/BUILD/ppp-2.4.8/pppd/plugins/radius'
make[2]: Entering directory '/usr/src/RPM/BUILD/ppp-2.4.8/pppd/plugins/radius'
gcc -pipe -frecord-gcc-switches -Wall -g -O2 -flto=auto -fPIC -Wall -D_GNU_SOURCE -fno-strict-aliasing -I. -I../.. -I../../../include -fPIC -DRC_LOG_FACILITY=LOG_DAEMON -DCHAPMS=1 -DMPPE=1 -DMAXOCTETS=1 -DUSE_OPENSSL=1 -shared -o radrealms.so radrealms.o
make[2]: Leaving directory '/usr/src/RPM/BUILD/ppp-2.4.8/pppd/plugins/radius'
make[2]: Entering directory '/usr/src/RPM/BUILD/ppp-2.4.8/pppd/plugins/radius'
gcc -pipe -frecord-gcc-switches -Wall -g -O2 -flto=auto -fPIC -Wall -D_GNU_SOURCE -fno-strict-aliasing -I. -I../.. -I../../../include -fPIC -DRC_LOG_FACILITY=LOG_DAEMON -DCHAPMS=1 -DMPPE=1 -DMAXOCTETS=1 -DUSE_OPENSSL=1 -shared -o radius.so radius.o libradiusclient.a -lcrypto
make[2]: Leaving directory '/usr/src/RPM/BUILD/ppp-2.4.8/pppd/plugins/radius'
make[2]: Entering directory '/usr/src/RPM/BUILD/ppp-2.4.8/pppd/plugins/dhcp'
make[2]: warning: -j8 forced in submake: resetting jobserver mode.
make[2]: Leaving directory '/usr/src/RPM/BUILD/ppp-2.4.8/pppd/plugins/dhcp'
make[2]: Entering directory '/usr/src/RPM/BUILD/ppp-2.4.8/pppd/plugins/dhcp'
libtool --mode=compile --tag=CC gcc -I../.. -I../../../include -pipe -frecord-gcc-switches -Wall -g -O2 -flto=auto -fPIC -Wall -D_GNU_SOURCE -fno-strict-aliasing  -c options.c
libtool-default: compile:  gcc -I../.. -I../../../include -pipe -frecord-gcc-switches -Wall -g -O2 -flto=auto -fPIC -Wall -D_GNU_SOURCE -fno-strict-aliasing -c options.c  -fPIC -DPIC -o .libs/options.o
In file included from options.c:10:
options.c: In function 'get_option':
debug.h:16:34: warning: implicit declaration of function 'info' [-Wimplicit-function-declaration]
   16 | #define LOG(level, str, args...) info("DHCPC: " str, ## args)
      |                                  ^~~~
options.c:76:25: note: in expansion of macro 'LOG'
   76 |                         LOG(LOG_WARNING, "bogus packet, option fields too long.");
      |                         ^~~
options.c: In function 'add_option_string':
debug.h:9:37: warning: implicit declaration of function 'dbglog' [-Wimplicit-function-declaration]
    9 | # define DEBUG(level, str, args...) dbglog("DHCPC: " str, ## args)
      |                                     ^~~~~~
options.c:143:9: note: in expansion of macro 'DEBUG'
  143 |         DEBUG(LOG_INFO, "adding option 0x%02x", string[OPT_CODE]);
      |         ^~~~~
libtool-default: compile:  gcc -I../.. -I../../../include -pipe -frecord-gcc-switches -Wall -g -O2 -flto=auto -fPIC -Wall -D_GNU_SOURCE -fno-strict-aliasing -c options.c -o options.o >/dev/null 2>&1
make[2]: Leaving directory '/usr/src/RPM/BUILD/ppp-2.4.8/pppd/plugins/dhcp'
make[2]: Entering directory '/usr/src/RPM/BUILD/ppp-2.4.8/pppd/plugins/dhcp'
libtool --mode=compile --tag=CC gcc -I../.. -I../../../include -pipe -frecord-gcc-switches -Wall -g -O2 -flto=auto -fPIC -Wall -D_GNU_SOURCE -fno-strict-aliasing  -c clientpacket.c
libtool-default: compile:  gcc -I../.. -I../../../include -pipe -frecord-gcc-switches -Wall -g -O2 -flto=auto -fPIC -Wall -D_GNU_SOURCE -fno-strict-aliasing -c clientpacket.c  -fPIC -DPIC -o .libs/clientpacket.o
In file included from clientpacket.c:44:
clientpacket.c: In function 'send_discover':
debug.h:16:34: warning: implicit declaration of function 'info' [-Wimplicit-function-declaration]
   16 | #define LOG(level, str, args...) info("DHCPC: " str, ## args)
      |                                  ^~~~
clientpacket.c:109:9: note: in expansion of macro 'LOG'
  109 |         LOG(LOG_DEBUG, "Sending discover...");
      |         ^~~
clientpacket.c: In function 'get_raw_packet':
debug.h:9:37: warning: implicit declaration of function 'dbglog' [-Wimplicit-function-declaration]
    9 | # define DEBUG(level, str, args...) dbglog("DHCPC: " str, ## args)
      |                                     ^~~~~~
clientpacket.c:188:17: note: in expansion of macro 'DEBUG'
  188 |                 DEBUG(LOG_INFO, "couldn't read on raw listening socket -- ignoring");
      |                 ^~~~~
libtool-default: compile:  gcc -I../.. -I../../../include -pipe -frecord-gcc-switches -Wall -g -O2 -flto=auto -fPIC -Wall -D_GNU_SOURCE -fno-strict-aliasing -c clientpacket.c -o clientpacket.o >/dev/null 2>&1
make[2]: Leaving directory '/usr/src/RPM/BUILD/ppp-2.4.8/pppd/plugins/dhcp'
make[2]: Entering directory '/usr/src/RPM/BUILD/ppp-2.4.8/pppd/plugins/dhcp'
libtool --mode=compile --tag=CC gcc -I../.. -I../../../include -pipe -frecord-gcc-switches -Wall -g -O2 -flto=auto -fPIC -Wall -D_GNU_SOURCE -fno-strict-aliasing  -c socket.c
libtool-default: compile:  gcc -I../.. -I../../../include -pipe -frecord-gcc-switches -Wall -g -O2 -flto=auto -fPIC -Wall -D_GNU_SOURCE -fno-strict-aliasing -c socket.c  -fPIC -DPIC -o .libs/socket.o
In file included from socket.c:44:
socket.c: In function 'read_interface':
debug.h:9:37: warning: implicit declaration of function 'dbglog' [-Wimplicit-function-declaration]
    9 | # define DEBUG(level, str, args...) dbglog("DHCPC: " str, ## args)
      |                                     ^~~~~~
socket.c:61:33: note: in expansion of macro 'DEBUG'
   61 |                                 DEBUG(LOG_INFO, "%s (our ip) = %s", ifr.ifr_name, inet_ntoa(sin->sin_addr));
      |                                 ^~~~~
debug.h:16:34: warning: implicit declaration of function 'info' [-Wimplicit-function-declaration]
   16 | #define LOG(level, str, args...) info("DHCPC: " str, ## args)
      |                                  ^~~~
socket.c:63:33: note: in expansion of macro 'LOG'
   63 |                                 LOG(LOG_ERR, "SIOCGIFADDR failed!: %s", strerror(errno));
      |                                 ^~~
libtool-default: compile:  gcc -I../.. -I../../../include -pipe -frecord-gcc-switches -Wall -g -O2 -flto=auto -fPIC -Wall -D_GNU_SOURCE -fno-strict-aliasing -c socket.c -o socket.o >/dev/null 2>&1
make[2]: Leaving directory '/usr/src/RPM/BUILD/ppp-2.4.8/pppd/plugins/dhcp'
make[2]: Entering directory '/usr/src/RPM/BUILD/ppp-2.4.8/pppd/plugins/dhcp'
libtool --mode=compile --tag=CC gcc -I../.. -I../../../include -pipe -frecord-gcc-switches -Wall -g -O2 -flto=auto -fPIC -Wall -D_GNU_SOURCE -fno-strict-aliasing  -c packet.c
libtool-default: compile:  gcc -I../.. -I../../../include -pipe -frecord-gcc-switches -Wall -g -O2 -flto=auto -fPIC -Wall -D_GNU_SOURCE -fno-strict-aliasing -c packet.c  -fPIC -DPIC -o .libs/packet.o
In file included from packet.c:18:
packet.c: In function 'get_packet':
debug.h:9:37: warning: implicit declaration of function 'dbglog' [-Wimplicit-function-declaration]
    9 | # define DEBUG(level, str, args...) dbglog("DHCPC: " str, ## args)
      |                                     ^~~~~~
packet.c:60:17: note: in expansion of macro 'DEBUG'
   60 |                 DEBUG(LOG_INFO, "couldn't read on listening socket, ignoring");
      |                 ^~~~~
debug.h:16:34: warning: implicit declaration of function 'info' [-Wimplicit-function-declaration]
   16 | #define LOG(level, str, args...) info("DHCPC: " str, ## args)
      |                                  ^~~~
packet.c:65:17: note: in expansion of macro 'LOG'
   65 |                 LOG(LOG_ERR, "received bogus message, ignoring");
      |                 ^~~
packet.c:73:38: warning: pointer targets in passing argument 1 of 'strncmp' differ in signedness [-Wpointer-sign]
   73 |                             !strncmp(vendor, broken_vendors[i], vendor[OPT_LEN - 2])) {
      |                                      ^~~~~~
      |                                      |
      |                                      unsigned char *
In file included from packet.c:2:
/usr/include/string.h:159:33: note: expected 'const char *' but argument is of type 'unsigned char *'
  159 | extern int strncmp (const char *__s1, const char *__s2, size_t __n)
      |                     ~~~~~~~~~~~~^~~~
packet.c: In function 'raw_packet':
packet.c:121:12: warning: suggest explicit braces to avoid ambiguous 'else' [-Wdangling-else]
  121 |         if (payload->giaddr && source_port==CLIENT_PORT)
      |            ^
libtool-default: compile:  gcc -I../.. -I../../../include -pipe -frecord-gcc-switches -Wall -g -O2 -flto=auto -fPIC -Wall -D_GNU_SOURCE -fno-strict-aliasing -c packet.c -o packet.o >/dev/null 2>&1
make[2]: Leaving directory '/usr/src/RPM/BUILD/ppp-2.4.8/pppd/plugins/dhcp'
make[2]: Entering directory '/usr/src/RPM/BUILD/ppp-2.4.8/pppd/plugins/dhcp'
libtool --mode=compile --tag=CC gcc -I../.. -I../../../include -pipe -frecord-gcc-switches -Wall -g -O2 -flto=auto -fPIC -Wall -D_GNU_SOURCE -fno-strict-aliasing  -c dhcpc.c
libtool-default: compile:  gcc -I../.. -I../../../include -pipe -frecord-gcc-switches -Wall -g -O2 -flto=auto -fPIC -Wall -D_GNU_SOURCE -fno-strict-aliasing -c dhcpc.c  -fPIC -DPIC -o .libs/dhcpc.o
dhcpc.c: In function 'change_mode':
dhcpc.c:127:6: warning: suggest explicit braces to avoid ambiguous 'else' [-Wdangling-else]
  127 |   if (new_mode == LISTEN_RAW && client_config.giaddr)
      |      ^
dhcpc.c: In function 'dhcp_rx':
dhcpc.c:191:10: warning: unused variable 'now' [-Wunused-variable]
  191 |   time_t now;
      |          ^~~
dhcpc.c:190:7: warning: unused variable 'pid_fd' [-Wunused-variable]
  190 |   int pid_fd;
      |       ^~~~~~
dhcpc.c:189:18: warning: unused variable 'temp_addr' [-Wunused-variable]
  189 |   struct in_addr temp_addr;
      |                  ^~~~~~~~~
dhcpc.c:187:7: warning: unused variable 'c' [-Wunused-variable]
  187 |   int c, len;
      |       ^
dhcpc.c:185:7: warning: unused variable 'retval' [-Wunused-variable]
  185 |   int retval;
      |       ^~~~~~
dhcpc.c:183:17: warning: unused variable 't2' [-Wunused-variable]
  183 |   unsigned long t2 = 0;
      |                 ^~
dhcpc.c:182:18: warning: unused variable 'temp' [-Wunused-variable]
  182 |   unsigned char *temp, *message;
      |                  ^~~~
dhcpc.c: In function 'dhcp_request_new':
dhcpc.c:312:7: warning: unused variable 'c' [-Wunused-variable]
  312 |   int c, len;
      |       ^
dhcpc.c:308:25: warning: unused variable 't2' [-Wunused-variable]
  308 |   unsigned long t1 = 0, t2 = 0;
      |                         ^~
dhcpc.c:308:17: warning: unused variable 't1' [-Wunused-variable]
  308 |   unsigned long t1 = 0, t2 = 0;
      |                 ^~
dhcpc.c: In function 'dhcp_read_options':
dhcpc.c:514:6: warning: suggest explicit braces to avoid ambiguous 'else' [-Wdangling-else]
  514 |   if (dhcp_subnet_selection)
      |      ^
libtool-default: compile:  gcc -I../.. -I../../../include -pipe -frecord-gcc-switches -Wall -g -O2 -flto=auto -fPIC -Wall -D_GNU_SOURCE -fno-strict-aliasing -c dhcpc.c -o dhcpc.o >/dev/null 2>&1
make[2]: Leaving directory '/usr/src/RPM/BUILD/ppp-2.4.8/pppd/plugins/dhcp'
make[2]: Entering directory '/usr/src/RPM/BUILD/ppp-2.4.8/pppd/plugins/dhcp'
libtool --mode=link --tag=CC gcc -I../.. -I../../../include -pipe -frecord-gcc-switches -Wall -g -O2 -flto=auto -fPIC -Wall -D_GNU_SOURCE -fno-strict-aliasing  -o libdhcpc.la dhcpc.lo clientpacket.lo packet.lo socket.lo options.lo -shared -Wl,-soname,dhcpc.so
libtool-default: link: ar cr .libs/libdhcpc.a .libs/dhcpc.o .libs/clientpacket.o .libs/packet.o .libs/socket.o .libs/options.o 
libtool-default: link: ranlib .libs/libdhcpc.a
libtool-default: link: ( cd ".libs" && rm -f "libdhcpc.la" && ln -s "../libdhcpc.la" "libdhcpc.la" )
make[2]: Leaving directory '/usr/src/RPM/BUILD/ppp-2.4.8/pppd/plugins/dhcp'
make[2]: Entering directory '/usr/src/RPM/BUILD/ppp-2.4.8/pppd/plugins/dhcp'
gcc -o dhcpc.so .libs/dhcpc.o .libs/clientpacket.o .libs/packet.o .libs/socket.o .libs/options.o -shared -Wl,-soname,dhcpc.so
make[2]: Leaving directory '/usr/src/RPM/BUILD/ppp-2.4.8/pppd/plugins/dhcp'
cd pppd; make -w -j8 -Otarget --jobserver-auth=fifo:/usr/src/tmp/GMfifo1595338 --sync-mutex=fnm:/usr/src/tmp/GmnvFhT5 all
make[1]: Entering directory '/usr/src/RPM/BUILD/ppp-2.4.8/pppd'
make[1]: warning: -j8 forced in submake: resetting jobserver mode.
make[1]: Leaving directory '/usr/src/RPM/BUILD/ppp-2.4.8/pppd'
make[1]: Entering directory '/usr/src/RPM/BUILD/ppp-2.4.8/pppd'
gcc -pipe -frecord-gcc-switches -Wall -g -O2 -flto=auto -fPIC -Wall -D_GNU_SOURCE -fno-strict-aliasing -DHAVE_PATHS_H -DIPX_CHANGE -DHAVE_MMAP -I../include '-DDESTDIR="/usr"' '-DLIBDIR="/usr/lib64"' -DCHAPMS=1 -DMPPE=1 -DUSE_OPENSSL -DUSE_EAPTLS=1 -DHAS_SHADOW -DHAVE_CRYPT_H=1 -DHAVE_LOGWTMP=1 -I/usr/include/openssl -DUSE_PAM -DHAVE_MULTILINK -DUSE_TDB=1 -DSYSTEMD=1 -DPLUGIN -DPPP_FILTER -DINET6=1 -DCBCP_SUPPORT -DMAXOCTETS   -c -o fsm.o fsm.c
make[1]: Leaving directory '/usr/src/RPM/BUILD/ppp-2.4.8/pppd'
make[1]: Entering directory '/usr/src/RPM/BUILD/ppp-2.4.8/pppd'
gcc -pipe -frecord-gcc-switches -Wall -g -O2 -flto=auto -fPIC -Wall -D_GNU_SOURCE -fno-strict-aliasing -DHAVE_PATHS_H -DIPX_CHANGE -DHAVE_MMAP -I../include '-DDESTDIR="/usr"' '-DLIBDIR="/usr/lib64"' -DCHAPMS=1 -DMPPE=1 -DUSE_OPENSSL -DUSE_EAPTLS=1 -DHAS_SHADOW -DHAVE_CRYPT_H=1 -DHAVE_LOGWTMP=1 -I/usr/include/openssl -DUSE_PAM -DHAVE_MULTILINK -DUSE_TDB=1 -DSYSTEMD=1 -DPLUGIN -DPPP_FILTER -DINET6=1 -DCBCP_SUPPORT -DMAXOCTETS   -c -o magic.o magic.c
make[1]: Leaving directory '/usr/src/RPM/BUILD/ppp-2.4.8/pppd'
make[1]: Entering directory '/usr/src/RPM/BUILD/ppp-2.4.8/pppd'
gcc -pipe -frecord-gcc-switches -Wall -g -O2 -flto=auto -fPIC -Wall -D_GNU_SOURCE -fno-strict-aliasing -DHAVE_PATHS_H -DIPX_CHANGE -DHAVE_MMAP -I../include '-DDESTDIR="/usr"' '-DLIBDIR="/usr/lib64"' -DCHAPMS=1 -DMPPE=1 -DUSE_OPENSSL -DUSE_EAPTLS=1 -DHAS_SHADOW -DHAVE_CRYPT_H=1 -DHAVE_LOGWTMP=1 -I/usr/include/openssl -DUSE_PAM -DHAVE_MULTILINK -DUSE_TDB=1 -DSYSTEMD=1 -DPLUGIN -DPPP_FILTER -DINET6=1 -DCBCP_SUPPORT -DMAXOCTETS   -c -o chap-new.o chap-new.c
make[1]: Leaving directory '/usr/src/RPM/BUILD/ppp-2.4.8/pppd'
make[1]: Entering directory '/usr/src/RPM/BUILD/ppp-2.4.8/pppd'
gcc -pipe -frecord-gcc-switches -Wall -g -O2 -flto=auto -fPIC -Wall -D_GNU_SOURCE -fno-strict-aliasing -DHAVE_PATHS_H -DIPX_CHANGE -DHAVE_MMAP -I../include '-DDESTDIR="/usr"' '-DLIBDIR="/usr/lib64"' -DCHAPMS=1 -DMPPE=1 -DUSE_OPENSSL -DUSE_EAPTLS=1 -DHAS_SHADOW -DHAVE_CRYPT_H=1 -DHAVE_LOGWTMP=1 -I/usr/include/openssl -DUSE_PAM -DHAVE_MULTILINK -DUSE_TDB=1 -DSYSTEMD=1 -DPLUGIN -DPPP_FILTER -DINET6=1 -DCBCP_SUPPORT -DMAXOCTETS   -c -o ecp.o ecp.c
make[1]: Leaving directory '/usr/src/RPM/BUILD/ppp-2.4.8/pppd'
make[1]: Entering directory '/usr/src/RPM/BUILD/ppp-2.4.8/pppd'
gcc -pipe -frecord-gcc-switches -Wall -g -O2 -flto=auto -fPIC -Wall -D_GNU_SOURCE -fno-strict-aliasing -DHAVE_PATHS_H -DIPX_CHANGE -DHAVE_MMAP -I../include '-DDESTDIR="/usr"' '-DLIBDIR="/usr/lib64"' -DCHAPMS=1 -DMPPE=1 -DUSE_OPENSSL -DUSE_EAPTLS=1 -DHAS_SHADOW -DHAVE_CRYPT_H=1 -DHAVE_LOGWTMP=1 -I/usr/include/openssl -DUSE_PAM -DHAVE_MULTILINK -DUSE_TDB=1 -DSYSTEMD=1 -DPLUGIN -DPPP_FILTER -DINET6=1 -DCBCP_SUPPORT -DMAXOCTETS   -c -o upap.o upap.c
make[1]: Leaving directory '/usr/src/RPM/BUILD/ppp-2.4.8/pppd'
make[1]: Entering directory '/usr/src/RPM/BUILD/ppp-2.4.8/pppd'
gcc -pipe -frecord-gcc-switches -Wall -g -O2 -flto=auto -fPIC -Wall -D_GNU_SOURCE -fno-strict-aliasing -DHAVE_PATHS_H -DIPX_CHANGE -DHAVE_MMAP -I../include '-DDESTDIR="/usr"' '-DLIBDIR="/usr/lib64"' -DCHAPMS=1 -DMPPE=1 -DUSE_OPENSSL -DUSE_EAPTLS=1 -DHAS_SHADOW -DHAVE_CRYPT_H=1 -DHAVE_LOGWTMP=1 -I/usr/include/openssl -DUSE_PAM -DHAVE_MULTILINK -DUSE_TDB=1 -DSYSTEMD=1 -DPLUGIN -DPPP_FILTER -DINET6=1 -DCBCP_SUPPORT -DMAXOCTETS   -c -o lcp.o lcp.c
make[1]: Leaving directory '/usr/src/RPM/BUILD/ppp-2.4.8/pppd'
make[1]: Entering directory '/usr/src/RPM/BUILD/ppp-2.4.8/pppd'
gcc -pipe -frecord-gcc-switches -Wall -g -O2 -flto=auto -fPIC -Wall -D_GNU_SOURCE -fno-strict-aliasing -DHAVE_PATHS_H -DIPX_CHANGE -DHAVE_MMAP -I../include '-DDESTDIR="/usr"' '-DLIBDIR="/usr/lib64"' -DCHAPMS=1 -DMPPE=1 -DUSE_OPENSSL -DUSE_EAPTLS=1 -DHAS_SHADOW -DHAVE_CRYPT_H=1 -DHAVE_LOGWTMP=1 -I/usr/include/openssl -DUSE_PAM -DHAVE_MULTILINK -DUSE_TDB=1 -DSYSTEMD=1 -DPLUGIN -DPPP_FILTER -DINET6=1 -DCBCP_SUPPORT -DMAXOCTETS   -c -o ipcp.o ipcp.c
make[1]: Leaving directory '/usr/src/RPM/BUILD/ppp-2.4.8/pppd'
make[1]: Entering directory '/usr/src/RPM/BUILD/ppp-2.4.8/pppd'
gcc -pipe -frecord-gcc-switches -Wall -g -O2 -flto=auto -fPIC -Wall -D_GNU_SOURCE -fno-strict-aliasing -DHAVE_PATHS_H -DIPX_CHANGE -DHAVE_MMAP -I../include '-DDESTDIR="/usr"' '-DLIBDIR="/usr/lib64"' -DCHAPMS=1 -DMPPE=1 -DUSE_OPENSSL -DUSE_EAPTLS=1 -DHAS_SHADOW -DHAVE_CRYPT_H=1 -DHAVE_LOGWTMP=1 -I/usr/include/openssl -DUSE_PAM -DHAVE_MULTILINK -DUSE_TDB=1 -DSYSTEMD=1 -DPLUGIN -DPPP_FILTER -DINET6=1 -DCBCP_SUPPORT -DMAXOCTETS   -c -o ccp.o ccp.c
make[1]: Leaving directory '/usr/src/RPM/BUILD/ppp-2.4.8/pppd'
make[1]: Entering directory '/usr/src/RPM/BUILD/ppp-2.4.8/pppd'
gcc -pipe -frecord-gcc-switches -Wall -g -O2 -flto=auto -fPIC -Wall -D_GNU_SOURCE -fno-strict-aliasing -DHAVE_PATHS_H -DIPX_CHANGE -DHAVE_MMAP -I../include '-DDESTDIR="/usr"' '-DLIBDIR="/usr/lib64"' -DCHAPMS=1 -DMPPE=1 -DUSE_OPENSSL -DUSE_EAPTLS=1 -DHAS_SHADOW -DHAVE_CRYPT_H=1 -DHAVE_LOGWTMP=1 -I/usr/include/openssl -DUSE_PAM -DHAVE_MULTILINK -DUSE_TDB=1 -DSYSTEMD=1 -DPLUGIN -DPPP_FILTER -DINET6=1 -DCBCP_SUPPORT -DMAXOCTETS   -c -o demand.o demand.c
make[1]: Leaving directory '/usr/src/RPM/BUILD/ppp-2.4.8/pppd'
make[1]: Entering directory '/usr/src/RPM/BUILD/ppp-2.4.8/pppd'
gcc -pipe -frecord-gcc-switches -Wall -g -O2 -flto=auto -fPIC -Wall -D_GNU_SOURCE -fno-strict-aliasing -DHAVE_PATHS_H -DIPX_CHANGE -DHAVE_MMAP -I../include '-DDESTDIR="/usr"' '-DLIBDIR="/usr/lib64"' -DCHAPMS=1 -DMPPE=1 -DUSE_OPENSSL -DUSE_EAPTLS=1 -DHAS_SHADOW -DHAVE_CRYPT_H=1 -DHAVE_LOGWTMP=1 -I/usr/include/openssl -DUSE_PAM -DHAVE_MULTILINK -DUSE_TDB=1 -DSYSTEMD=1 -DPLUGIN -DPPP_FILTER -DINET6=1 -DCBCP_SUPPORT -DMAXOCTETS   -c -o utils.o utils.c
utils.c: In function 'lock':
utils.c:978:5: warning: ignoring return value of 'write' declared with attribute 'warn_unused_result' [-Wunused-result]
  978 |     write (fd, lock_buffer, 11);
      |     ^~~~~~~~~~~~~~~~~~~~~~~~~~~
utils.c: In function 'relock':
utils.c:1020:5: warning: ignoring return value of 'write' declared with attribute 'warn_unused_result' [-Wunused-result]
 1020 |     write (fd, lock_buffer, 11);
      |     ^~~~~~~~~~~~~~~~~~~~~~~~~~~
make[1]: Leaving directory '/usr/src/RPM/BUILD/ppp-2.4.8/pppd'
make[1]: Entering directory '/usr/src/RPM/BUILD/ppp-2.4.8/pppd'
gcc -pipe -frecord-gcc-switches -Wall -g -O2 -flto=auto -fPIC -Wall -D_GNU_SOURCE -fno-strict-aliasing -DHAVE_PATHS_H -DIPX_CHANGE -DHAVE_MMAP -I../include '-DDESTDIR="/usr"' '-DLIBDIR="/usr/lib64"' -DCHAPMS=1 -DMPPE=1 -DUSE_OPENSSL -DUSE_EAPTLS=1 -DHAS_SHADOW -DHAVE_CRYPT_H=1 -DHAVE_LOGWTMP=1 -I/usr/include/openssl -DUSE_PAM -DHAVE_MULTILINK -DUSE_TDB=1 -DSYSTEMD=1 -DPLUGIN -DPPP_FILTER -DINET6=1 -DCBCP_SUPPORT -DMAXOCTETS   -c -o main.o main.c
main.c: In function 'main':
main.c:584:17: warning: implicit declaration of function 'tty_close_fds' [-Wimplicit-function-declaration]
  584 |                 tty_close_fds();
      |                 ^~~~~~~~~~~~~
main.c:436:5: warning: ignoring return value of 'chdir' declared with attribute 'warn_unused_result' [-Wunused-result]
  436 |     chdir("/");
      |     ^~~~~~~~~~
main.c: In function 'open_ccp':
main.c:1615:9: warning: ignoring return value of 'write' declared with attribute 'warn_unused_result' [-Wunused-result]
 1615 |         write(sigpipe[1], &sig, sizeof(sig));
      |         ^~~~~~~~~~~~~~~~~~~~~~~~~~~~~~~~~~~~
main.c: In function 'chld':
main.c:1580:9: warning: ignoring return value of 'write' declared with attribute 'warn_unused_result' [-Wunused-result]
 1580 |         write(sigpipe[1], &sig, sizeof(sig));
      |         ^~~~~~~~~~~~~~~~~~~~~~~~~~~~~~~~~~~~
main.c: In function 'term':
main.c:1566:9: warning: ignoring return value of 'write' declared with attribute 'warn_unused_result' [-Wunused-result]
 1566 |         write(sigpipe[1], &sig, sizeof(sig));
      |         ^~~~~~~~~~~~~~~~~~~~~~~~~~~~~~~~~~~~
main.c: In function 'hup':
main.c:1544:9: warning: ignoring return value of 'write' declared with attribute 'warn_unused_result' [-Wunused-result]
 1544 |         write(sigpipe[1], &sig, sizeof(sig));
      |         ^~~~~~~~~~~~~~~~~~~~~~~~~~~~~~~~~~~~
main.c: In function 'device_script':
main.c:1824:5: warning: ignoring return value of 'setgid' declared with attribute 'warn_unused_result' [-Wunused-result]
 1824 |     setgid(getgid());
      |     ^~~~~~~~~~~~~~~~
main.c:1825:5: warning: ignoring return value of 'setuid' declared with attribute 'warn_unused_result' [-Wunused-result]
 1825 |     setuid(uid);
      |     ^~~~~~~~~~~
main.c: In function 'run_program':
main.c:1935:12: warning: ignoring return value of 'chdir' declared with attribute 'warn_unused_result' [-Wunused-result]
 1935 |     (void) chdir ("/"); /* no current directory. */
      |            ^~~~~~~~~~~
main.c:1936:5: warning: ignoring return value of 'setuid' declared with attribute 'warn_unused_result' [-Wunused-result]
 1936 |     setuid(0);          /* set real UID = root */
      |     ^~~~~~~~~
main.c:1937:5: warning: ignoring return value of 'setgid' declared with attribute 'warn_unused_result' [-Wunused-result]
 1937 |     setgid(getegid());
      |     ^~~~~~~~~~~~~~~~~
make[1]: Leaving directory '/usr/src/RPM/BUILD/ppp-2.4.8/pppd'
make[1]: Entering directory '/usr/src/RPM/BUILD/ppp-2.4.8/pppd'
gcc -pipe -frecord-gcc-switches -Wall -g -O2 -flto=auto -fPIC -Wall -D_GNU_SOURCE -fno-strict-aliasing -DHAVE_PATHS_H -DIPX_CHANGE -DHAVE_MMAP -I../include '-DDESTDIR="/usr"' '-DLIBDIR="/usr/lib64"' -DCHAPMS=1 -DMPPE=1 -DUSE_OPENSSL -DUSE_EAPTLS=1 -DHAS_SHADOW -DHAVE_CRYPT_H=1 -DHAVE_LOGWTMP=1 -I/usr/include/openssl -DUSE_PAM -DHAVE_MULTILINK -DUSE_TDB=1 -DSYSTEMD=1 -DPLUGIN -DPPP_FILTER -DINET6=1 -DCBCP_SUPPORT -DMAXOCTETS   -c -o session.o session.c
make[1]: Leaving directory '/usr/src/RPM/BUILD/ppp-2.4.8/pppd'
make[1]: Entering directory '/usr/src/RPM/BUILD/ppp-2.4.8/pppd'
gcc -pipe -frecord-gcc-switches -Wall -g -O2 -flto=auto -fPIC -Wall -D_GNU_SOURCE -fno-strict-aliasing -DHAVE_PATHS_H -DIPX_CHANGE -DHAVE_MMAP -I../include '-DDESTDIR="/usr"' '-DLIBDIR="/usr/lib64"' -DCHAPMS=1 -DMPPE=1 -DUSE_OPENSSL -DUSE_EAPTLS=1 -DHAS_SHADOW -DHAVE_CRYPT_H=1 -DHAVE_LOGWTMP=1 -I/usr/include/openssl -DUSE_PAM -DHAVE_MULTILINK -DUSE_TDB=1 -DSYSTEMD=1 -DPLUGIN -DPPP_FILTER -DINET6=1 -DCBCP_SUPPORT -DMAXOCTETS   -c -o ipxcp.o ipxcp.c
make[1]: Leaving directory '/usr/src/RPM/BUILD/ppp-2.4.8/pppd'
make[1]: Entering directory '/usr/src/RPM/BUILD/ppp-2.4.8/pppd'
gcc -pipe -frecord-gcc-switches -Wall -g -O2 -flto=auto -fPIC -Wall -D_GNU_SOURCE -fno-strict-aliasing -DHAVE_PATHS_H -DIPX_CHANGE -DHAVE_MMAP -I../include '-DDESTDIR="/usr"' '-DLIBDIR="/usr/lib64"' -DCHAPMS=1 -DMPPE=1 -DUSE_OPENSSL -DUSE_EAPTLS=1 -DHAS_SHADOW -DHAVE_CRYPT_H=1 -DHAVE_LOGWTMP=1 -I/usr/include/openssl -DUSE_PAM -DHAVE_MULTILINK -DUSE_TDB=1 -DSYSTEMD=1 -DPLUGIN -DPPP_FILTER -DINET6=1 -DCBCP_SUPPORT -DMAXOCTETS   -c -o auth.o auth.c
make[1]: Leaving directory '/usr/src/RPM/BUILD/ppp-2.4.8/pppd'
make[1]: Entering directory '/usr/src/RPM/BUILD/ppp-2.4.8/pppd'
gcc -pipe -frecord-gcc-switches -Wall -g -O2 -flto=auto -fPIC -Wall -D_GNU_SOURCE -fno-strict-aliasing -DHAVE_PATHS_H -DIPX_CHANGE -DHAVE_MMAP -I../include '-DDESTDIR="/usr"' '-DLIBDIR="/usr/lib64"' -DCHAPMS=1 -DMPPE=1 -DUSE_OPENSSL -DUSE_EAPTLS=1 -DHAS_SHADOW -DHAVE_CRYPT_H=1 -DHAVE_LOGWTMP=1 -I/usr/include/openssl -DUSE_PAM -DHAVE_MULTILINK -DUSE_TDB=1 -DSYSTEMD=1 -DPLUGIN -DPPP_FILTER -DINET6=1 -DCBCP_SUPPORT -DMAXOCTETS   -c -o options.o options.c
make[1]: Leaving directory '/usr/src/RPM/BUILD/ppp-2.4.8/pppd'
make[1]: Entering directory '/usr/src/RPM/BUILD/ppp-2.4.8/pppd'
gcc -pipe -frecord-gcc-switches -Wall -g -O2 -flto=auto -fPIC -Wall -D_GNU_SOURCE -fno-strict-aliasing -DHAVE_PATHS_H -DIPX_CHANGE -DHAVE_MMAP -I../include '-DDESTDIR="/usr"' '-DLIBDIR="/usr/lib64"' -DCHAPMS=1 -DMPPE=1 -DUSE_OPENSSL -DUSE_EAPTLS=1 -DHAS_SHADOW -DHAVE_CRYPT_H=1 -DHAVE_LOGWTMP=1 -I/usr/include/openssl -DUSE_PAM -DHAVE_MULTILINK -DUSE_TDB=1 -DSYSTEMD=1 -DPLUGIN -DPPP_FILTER -DINET6=1 -DCBCP_SUPPORT -DMAXOCTETS   -c -o sys-linux.o sys-linux.c
sys-linux.c: In function 'get_pty':
sys-linux.c:2965:21: warning: ignoring return value of 'fchown' declared with attribute 'warn_unused_result' [-Wunused-result]
 2965 |                     fchown(sfd, uid, -1);
      |                     ^~~~~~~~~~~~~~~~~~~~
make[1]: Leaving directory '/usr/src/RPM/BUILD/ppp-2.4.8/pppd'
make[1]: Entering directory '/usr/src/RPM/BUILD/ppp-2.4.8/pppd'
gcc -pipe -frecord-gcc-switches -Wall -g -O2 -flto=auto -fPIC -Wall -D_GNU_SOURCE -fno-strict-aliasing -DHAVE_PATHS_H -DIPX_CHANGE -DHAVE_MMAP -I../include '-DDESTDIR="/usr"' '-DLIBDIR="/usr/lib64"' -DCHAPMS=1 -DMPPE=1 -DUSE_OPENSSL -DUSE_EAPTLS=1 -DHAS_SHADOW -DHAVE_CRYPT_H=1 -DHAVE_LOGWTMP=1 -I/usr/include/openssl -DUSE_PAM -DHAVE_MULTILINK -DUSE_TDB=1 -DSYSTEMD=1 -DPLUGIN -DPPP_FILTER -DINET6=1 -DCBCP_SUPPORT -DMAXOCTETS   -c -o chap-md5.o chap-md5.c
make[1]: Leaving directory '/usr/src/RPM/BUILD/ppp-2.4.8/pppd'
make[1]: Entering directory '/usr/src/RPM/BUILD/ppp-2.4.8/pppd'
gcc -pipe -frecord-gcc-switches -Wall -g -O2 -flto=auto -fPIC -Wall -D_GNU_SOURCE -fno-strict-aliasing -DHAVE_PATHS_H -DIPX_CHANGE -DHAVE_MMAP -I../include '-DDESTDIR="/usr"' '-DLIBDIR="/usr/lib64"' -DCHAPMS=1 -DMPPE=1 -DUSE_OPENSSL -DUSE_EAPTLS=1 -DHAS_SHADOW -DHAVE_CRYPT_H=1 -DHAVE_LOGWTMP=1 -I/usr/include/openssl -DUSE_PAM -DHAVE_MULTILINK -DUSE_TDB=1 -DSYSTEMD=1 -DPLUGIN -DPPP_FILTER -DINET6=1 -DCBCP_SUPPORT -DMAXOCTETS   -c -o tty.o tty.c
tty.c: In function 'setup_serial':
tty.c:1241:40: warning: 'return' with a value, in function returning void [-Wreturn-type]
 1241 |                                 return -1;
      |                                        ^
tty.c:1205:6: note: declared here
 1205 | void setup_serial(char *connector)
      |      ^~~~~~~~~~~~
tty.c: In function 'start_charshunt':
tty.c:880:9: warning: ignoring return value of 'setgid' declared with attribute 'warn_unused_result' [-Wunused-result]
  880 |         setgid(getgid());
      |         ^~~~~~~~~~~~~~~~
tty.c:881:9: warning: ignoring return value of 'setuid' declared with attribute 'warn_unused_result' [-Wunused-result]
  881 |         setuid(uid);
      |         ^~~~~~~~~~~
tty.c: In function 'setup_serial':
tty.c:1228:33: warning: ignoring return value of 'seteuid' declared with attribute 'warn_unused_result' [-Wunused-result]
 1228 |                                 seteuid(uid);
      |                                 ^~~~~~~~~~~~
tty.c:1232:33: warning: ignoring return value of 'seteuid' declared with attribute 'warn_unused_result' [-Wunused-result]
 1232 |                                 seteuid(0);
      |                                 ^~~~~~~~~~
make[1]: Leaving directory '/usr/src/RPM/BUILD/ppp-2.4.8/pppd'
make[1]: Entering directory '/usr/src/RPM/BUILD/ppp-2.4.8/pppd'
gcc -pipe -frecord-gcc-switches -Wall -g -O2 -flto=auto -fPIC -Wall -D_GNU_SOURCE -fno-strict-aliasing -DHAVE_PATHS_H -DIPX_CHANGE -DHAVE_MMAP -I../include '-DDESTDIR="/usr"' '-DLIBDIR="/usr/lib64"' -DCHAPMS=1 -DMPPE=1 -DUSE_OPENSSL -DUSE_EAPTLS=1 -DHAS_SHADOW -DHAVE_CRYPT_H=1 -DHAVE_LOGWTMP=1 -I/usr/include/openssl -DUSE_PAM -DHAVE_MULTILINK -DUSE_TDB=1 -DSYSTEMD=1 -DPLUGIN -DPPP_FILTER -DINET6=1 -DCBCP_SUPPORT -DMAXOCTETS   -c -o eap.o eap.c
eap.c:156:21: warning: 'wkmodulus' defined but not used [-Wunused-const-variable=]
  156 | static const u_char wkmodulus[] = {
      |                     ^~~~~~~~~
make[1]: Leaving directory '/usr/src/RPM/BUILD/ppp-2.4.8/pppd'
make[1]: Entering directory '/usr/src/RPM/BUILD/ppp-2.4.8/pppd'
gcc -pipe -frecord-gcc-switches -Wall -g -O2 -flto=auto -fPIC -Wall -D_GNU_SOURCE -fno-strict-aliasing -DHAVE_PATHS_H -DIPX_CHANGE -DHAVE_MMAP -I../include '-DDESTDIR="/usr"' '-DLIBDIR="/usr/lib64"' -DCHAPMS=1 -DMPPE=1 -DUSE_OPENSSL -DUSE_EAPTLS=1 -DHAS_SHADOW -DHAVE_CRYPT_H=1 -DHAVE_LOGWTMP=1 -I/usr/include/openssl -DUSE_PAM -DHAVE_MULTILINK -DUSE_TDB=1 -DSYSTEMD=1 -DPLUGIN -DPPP_FILTER -DINET6=1 -DCBCP_SUPPORT -DMAXOCTETS   -c -o spinlock.o spinlock.c
make[1]: Leaving directory '/usr/src/RPM/BUILD/ppp-2.4.8/pppd'
make[1]: Entering directory '/usr/src/RPM/BUILD/ppp-2.4.8/pppd'
gcc -pipe -frecord-gcc-switches -Wall -g -O2 -flto=auto -fPIC -Wall -D_GNU_SOURCE -fno-strict-aliasing -DHAVE_PATHS_H -DIPX_CHANGE -DHAVE_MMAP -I../include '-DDESTDIR="/usr"' '-DLIBDIR="/usr/lib64"' -DCHAPMS=1 -DMPPE=1 -DUSE_OPENSSL -DUSE_EAPTLS=1 -DHAS_SHADOW -DHAVE_CRYPT_H=1 -DHAVE_LOGWTMP=1 -I/usr/include/openssl -DUSE_PAM -DHAVE_MULTILINK -DUSE_TDB=1 -DSYSTEMD=1 -DPLUGIN -DPPP_FILTER -DINET6=1 -DCBCP_SUPPORT -DMAXOCTETS   -c -o pppcrypt.o pppcrypt.c
make[1]: Leaving directory '/usr/src/RPM/BUILD/ppp-2.4.8/pppd'
make[1]: Entering directory '/usr/src/RPM/BUILD/ppp-2.4.8/pppd'
gcc -pipe -frecord-gcc-switches -Wall -g -O2 -flto=auto -fPIC -Wall -D_GNU_SOURCE -fno-strict-aliasing -DHAVE_PATHS_H -DIPX_CHANGE -DHAVE_MMAP -I../include '-DDESTDIR="/usr"' '-DLIBDIR="/usr/lib64"' -DCHAPMS=1 -DMPPE=1 -DUSE_OPENSSL -DUSE_EAPTLS=1 -DHAS_SHADOW -DHAVE_CRYPT_H=1 -DHAVE_LOGWTMP=1 -I/usr/include/openssl -DUSE_PAM -DHAVE_MULTILINK -DUSE_TDB=1 -DSYSTEMD=1 -DPLUGIN -DPPP_FILTER -DINET6=1 -DCBCP_SUPPORT -DMAXOCTETS   -c -o eui64.o eui64.c
make[1]: Leaving directory '/usr/src/RPM/BUILD/ppp-2.4.8/pppd'
make[1]: Entering directory '/usr/src/RPM/BUILD/ppp-2.4.8/pppd'
gcc -pipe -frecord-gcc-switches -Wall -g -O2 -flto=auto -fPIC -Wall -D_GNU_SOURCE -fno-strict-aliasing -DHAVE_PATHS_H -DIPX_CHANGE -DHAVE_MMAP -I../include '-DDESTDIR="/usr"' '-DLIBDIR="/usr/lib64"' -DCHAPMS=1 -DMPPE=1 -DUSE_OPENSSL -DUSE_EAPTLS=1 -DHAS_SHADOW -DHAVE_CRYPT_H=1 -DHAVE_LOGWTMP=1 -I/usr/include/openssl -DUSE_PAM -DHAVE_MULTILINK -DUSE_TDB=1 -DSYSTEMD=1 -DPLUGIN -DPPP_FILTER -DINET6=1 -DCBCP_SUPPORT -DMAXOCTETS   -c -o chap_ms.o chap_ms.c
chap_ms.c:517:26: warning: argument 2 of type 'u_char[16]' {aka 'unsigned char[16]'} with mismatched bound [-Warray-parameter=]
  517 |                   u_char PasswordHash[MD4_SIGNATURE_SIZE],
      |                   ~~~~~~~^~~~~~~~~~~~~~~~~~~~~~~~~~~~~~~~
In file included from chap_ms.c:89:
chap_ms.c:111:50: note: previously declared as 'u_char *' {aka 'unsigned char *'}
  111 | static void     ChallengeResponse __P((u_char *, u_char *, u_char[24]));
      |                                                  ^~~~~~~~
pppd.h:66:19: note: in definition of macro '__P'
   66 | #define __P(args) args
      |                   ^~~~
chap_ms.c:924:16: warning: argument 7 of type 'u_char[]' {aka 'unsigned char[]'} with mismatched bound [-Warray-parameter=]
  924 |         u_char authResponse[], int authenticator)
      |         ~~~~~~~^~~~~~~~~~~~~~
chap_ms.h:92:29: note: previously declared as 'u_char[41]' {aka 'unsigned char[41]'}
   92 |                   u_char *, u_char[MS_AUTH_RESPONSE_LENGTH+1], int));
      |                             ^~~~~~~~~~~~~~~~~~~~~~~~~~~~~~~~~
pppd.h:66:19: note: in definition of macro '__P'
   66 | #define __P(args) args
      |                   ^~~~
make[1]: Leaving directory '/usr/src/RPM/BUILD/ppp-2.4.8/pppd'
make[1]: Entering directory '/usr/src/RPM/BUILD/ppp-2.4.8/pppd'
gcc -pipe -frecord-gcc-switches -Wall -g -O2 -flto=auto -fPIC -Wall -D_GNU_SOURCE -fno-strict-aliasing -DHAVE_PATHS_H -DIPX_CHANGE -DHAVE_MMAP -I../include '-DDESTDIR="/usr"' '-DLIBDIR="/usr/lib64"' -DCHAPMS=1 -DMPPE=1 -DUSE_OPENSSL -DUSE_EAPTLS=1 -DHAS_SHADOW -DHAVE_CRYPT_H=1 -DHAVE_LOGWTMP=1 -I/usr/include/openssl -DUSE_PAM -DHAVE_MULTILINK -DUSE_TDB=1 -DSYSTEMD=1 -DPLUGIN -DPPP_FILTER -DINET6=1 -DCBCP_SUPPORT -DMAXOCTETS   -c -o ipv6cp.o ipv6cp.c
make[1]: Leaving directory '/usr/src/RPM/BUILD/ppp-2.4.8/pppd'
make[1]: Entering directory '/usr/src/RPM/BUILD/ppp-2.4.8/pppd'
gcc -pipe -frecord-gcc-switches -Wall -g -O2 -flto=auto -fPIC -Wall -D_GNU_SOURCE -fno-strict-aliasing -DHAVE_PATHS_H -DIPX_CHANGE -DHAVE_MMAP -I../include '-DDESTDIR="/usr"' '-DLIBDIR="/usr/lib64"' -DCHAPMS=1 -DMPPE=1 -DUSE_OPENSSL -DUSE_EAPTLS=1 -DHAS_SHADOW -DHAVE_CRYPT_H=1 -DHAVE_LOGWTMP=1 -I/usr/include/openssl -DUSE_PAM -DHAVE_MULTILINK -DUSE_TDB=1 -DSYSTEMD=1 -DPLUGIN -DPPP_FILTER -DINET6=1 -DCBCP_SUPPORT -DMAXOCTETS   -c -o multilink.o multilink.c
make[1]: Leaving directory '/usr/src/RPM/BUILD/ppp-2.4.8/pppd'
make[1]: Entering directory '/usr/src/RPM/BUILD/ppp-2.4.8/pppd'
gcc -pipe -frecord-gcc-switches -Wall -g -O2 -flto=auto -fPIC -Wall -D_GNU_SOURCE -fno-strict-aliasing -DHAVE_PATHS_H -DIPX_CHANGE -DHAVE_MMAP -I../include '-DDESTDIR="/usr"' '-DLIBDIR="/usr/lib64"' -DCHAPMS=1 -DMPPE=1 -DUSE_OPENSSL -DUSE_EAPTLS=1 -DHAS_SHADOW -DHAVE_CRYPT_H=1 -DHAVE_LOGWTMP=1 -I/usr/include/openssl -DUSE_PAM -DHAVE_MULTILINK -DUSE_TDB=1 -DSYSTEMD=1 -DPLUGIN -DPPP_FILTER -DINET6=1 -DCBCP_SUPPORT -DMAXOCTETS   -c -o cbcp.o cbcp.c
cbcp.c: In function 'cbcp_input':
cbcp.c:206:27: warning: pointer targets in passing argument 2 of 'cbcp_recvresp' differ in signedness [-Wpointer-sign]
  206 |         cbcp_recvresp(us, inp, len);
      |                           ^~~
      |                           |
      |                           u_char * {aka unsigned char *}
In file included from cbcp.c:43:
cbcp.c:104:54: note: expected 'char *' but argument is of type 'u_char *' {aka 'unsigned char *'}
  104 | static void cbcp_recvresp __P((cbcp_state *us, char *pckt, int len));
      |                                                ~~~~~~^~~~
pppd.h:66:19: note: in definition of macro '__P'
   66 | #define __P(args) args
      |                   ^~~~
cbcp.c: In function 'cbcp_printpkt':
cbcp.c:297:21: warning: variable 'addrt' set but not used [-Wunused-but-set-variable]
  297 |                 int addrt;
      |                     ^~~~~
cbcp.c: In function 'cbcp_recvreq':
cbcp.c:328:27: warning: variable 'addr_type' set but not used [-Wunused-but-set-variable]
  328 |     u_char type, opt_len, addr_type;
      |                           ^~~~~~~~~
cbcp.c: In function 'cbcp_recvack':
cbcp.c:473:18: warning: variable 'addr_type' set but not used [-Wunused-but-set-variable]
  473 |     u_char type, addr_type;
      |                  ^~~~~~~~~
cbcp.c: In function 'cbcp_recvresp':
cbcp.c:662:18: warning: variable 'addr_type' set but not used [-Wunused-but-set-variable]
  662 |     u_char type, addr_type;
      |                  ^~~~~~~~~
make[1]: Leaving directory '/usr/src/RPM/BUILD/ppp-2.4.8/pppd'
make[1]: Entering directory '/usr/src/RPM/BUILD/ppp-2.4.8/pppd'
gcc -pipe -frecord-gcc-switches -Wall -g -O2 -flto=auto -fPIC -Wall -D_GNU_SOURCE -fno-strict-aliasing -DHAVE_PATHS_H -DIPX_CHANGE -DHAVE_MMAP -I../include '-DDESTDIR="/usr"' '-DLIBDIR="/usr/lib64"' -DCHAPMS=1 -DMPPE=1 -DUSE_OPENSSL -DUSE_EAPTLS=1 -DHAS_SHADOW -DHAVE_CRYPT_H=1 -DHAVE_LOGWTMP=1 -I/usr/include/openssl -DUSE_PAM -DHAVE_MULTILINK -DUSE_TDB=1 -DSYSTEMD=1 -DPLUGIN -DPPP_FILTER -DINET6=1 -DCBCP_SUPPORT -DMAXOCTETS   -c -o tdb.o tdb.c
make[1]: Leaving directory '/usr/src/RPM/BUILD/ppp-2.4.8/pppd'
make[1]: Entering directory '/usr/src/RPM/BUILD/ppp-2.4.8/pppd'
gcc -pipe -frecord-gcc-switches -Wall -g -O2 -flto=auto -fPIC -Wall -D_GNU_SOURCE -fno-strict-aliasing -DHAVE_PATHS_H -DIPX_CHANGE -DHAVE_MMAP -I../include '-DDESTDIR="/usr"' '-DLIBDIR="/usr/lib64"' -DCHAPMS=1 -DMPPE=1 -DUSE_OPENSSL -DUSE_EAPTLS=1 -DHAS_SHADOW -DHAVE_CRYPT_H=1 -DHAVE_LOGWTMP=1 -I/usr/include/openssl -DUSE_PAM -DHAVE_MULTILINK -DUSE_TDB=1 -DSYSTEMD=1 -DPLUGIN -DPPP_FILTER -DINET6=1 -DCBCP_SUPPORT -DMAXOCTETS   -c -o eap-tls.o eap-tls.c
make[1]: Leaving directory '/usr/src/RPM/BUILD/ppp-2.4.8/pppd'
make[1]: Entering directory '/usr/src/RPM/BUILD/ppp-2.4.8/pppd'
gcc -pipe -frecord-gcc-switches -Wall -g -O2 -flto=auto -fPIC -Wall -D_GNU_SOURCE -fno-strict-aliasing -DHAVE_PATHS_H -DIPX_CHANGE -DHAVE_MMAP -I../include '-DDESTDIR="/usr"' '-DLIBDIR="/usr/lib64"' -DCHAPMS=1 -DMPPE=1 -DUSE_OPENSSL -DUSE_EAPTLS=1 -DHAS_SHADOW -DHAVE_CRYPT_H=1 -DHAVE_LOGWTMP=1 -I/usr/include/openssl -DUSE_PAM -DHAVE_MULTILINK -DUSE_TDB=1 -DSYSTEMD=1 -DPLUGIN -DPPP_FILTER -DINET6=1 -DCBCP_SUPPORT -DMAXOCTETS -pie  -Wl,-E -o pppd main.o magic.o fsm.o lcp.o ipcp.o upap.o chap-new.o ccp.o ecp.o auth.o options.o demand.o utils.o sys-linux.o ipxcp.o tty.o eap.o chap-md5.o session.o chap_ms.o eap-tls.o pppcrypt.o multilink.o tdb.o spinlock.o ipv6cp.o eui64.o cbcp.o -ludev -lcrypto -lssl -lcrypto -lcrypt -lutil -lcrypto -lpam -ldl -lsystemd -ldl -lpcap
make[1]: Leaving directory '/usr/src/RPM/BUILD/ppp-2.4.8/pppd'
cd pppstats; make -w -j8 -Otarget --jobserver-auth=fifo:/usr/src/tmp/GMfifo1595338 --sync-mutex=fnm:/usr/src/tmp/GmnvFhT5 all
make[1]: Entering directory '/usr/src/RPM/BUILD/ppp-2.4.8/pppstats'
make[1]: warning: -j8 forced in submake: resetting jobserver mode.
make[1]: Leaving directory '/usr/src/RPM/BUILD/ppp-2.4.8/pppstats'
make[1]: Entering directory '/usr/src/RPM/BUILD/ppp-2.4.8/pppstats'
gcc -pipe -frecord-gcc-switches -Wall -g -O2 -flto=auto -fPIC -Wall -D_GNU_SOURCE -fno-strict-aliasing -I../include  -o pppstats pppstats.c 
pppstats.c:39:19: warning: 'rcsid' defined but not used [-Wunused-const-variable=]
   39 | static const char rcsid[] = "$Id: pppstats.c,v 1.29 2002/10/27 12:56:26 fcusack Exp $";
      |                   ^~~~~
make[1]: Leaving directory '/usr/src/RPM/BUILD/ppp-2.4.8/pppstats'
cd pppdump; make -w -j8 -Otarget --jobserver-auth=fifo:/usr/src/tmp/GMfifo1595338 --sync-mutex=fnm:/usr/src/tmp/GmnvFhT5 all
make[1]: Entering directory '/usr/src/RPM/BUILD/ppp-2.4.8/pppdump'
make[1]: warning: -j8 forced in submake: resetting jobserver mode.
make[1]: Leaving directory '/usr/src/RPM/BUILD/ppp-2.4.8/pppdump'
make[1]: Entering directory '/usr/src/RPM/BUILD/ppp-2.4.8/pppdump'
gcc -I../include/net -fPIC   -c -o deflate.o deflate.c
make[1]: Leaving directory '/usr/src/RPM/BUILD/ppp-2.4.8/pppdump'
make[1]: Entering directory '/usr/src/RPM/BUILD/ppp-2.4.8/pppdump'
gcc -I../include/net -fPIC   -c -o bsd-comp.o bsd-comp.c
make[1]: Leaving directory '/usr/src/RPM/BUILD/ppp-2.4.8/pppdump'
make[1]: Entering directory '/usr/src/RPM/BUILD/ppp-2.4.8/pppdump'
gcc -I../include/net -fPIC   -c -o pppdump.o pppdump.c
make[1]: Leaving directory '/usr/src/RPM/BUILD/ppp-2.4.8/pppdump'
make[1]: Entering directory '/usr/src/RPM/BUILD/ppp-2.4.8/pppdump'
gcc -I../include/net -fPIC   -c -o zlib.o zlib.c
make[1]: Leaving directory '/usr/src/RPM/BUILD/ppp-2.4.8/pppdump'
make[1]: Entering directory '/usr/src/RPM/BUILD/ppp-2.4.8/pppdump'
gcc -I../include/net -fPIC  -o pppdump pppdump.o bsd-comp.o deflate.o zlib.o
make[1]: Leaving directory '/usr/src/RPM/BUILD/ppp-2.4.8/pppdump'
+ exit 0
Executing(%install): /bin/sh -e /usr/src/tmp/rpm-tmp.26011
+ umask 022
+ /bin/mkdir -p /usr/src/RPM/BUILD
+ cd /usr/src/RPM/BUILD
+ /bin/chmod -Rf u+rwX -- /usr/src/tmp/ppp-buildroot
+ :
+ /bin/rm -rf -- /usr/src/tmp/ppp-buildroot
+ PATH=/usr/libexec/rpm-build:/usr/src/bin:/bin:/usr/bin:/usr/X11R6/bin:/usr/games
+ cd ppp-2.4.8
+ make 'INSTALL=/usr/libexec/rpm-build/install -p' install DESTDIR=/usr/src/tmp/ppp-buildroot BINDIR=/usr/src/tmp/ppp-buildroot/usr/sbin INCDIR=/usr/src/tmp/ppp-buildroot/usr/include libdir=/usr/lib64 MANDIR=/usr/src/tmp/ppp-buildroot/usr/share/man/man8 RUNDIR=/usr/src/tmp/ppp-buildroot/var/run/ppp LOGDIR=/usr/src/tmp/ppp-buildroot/var/log/ppp
make: Entering directory '/usr/src/RPM/BUILD/ppp-2.4.8'
/usr/libexec/rpm-build/install -p -d -m 755 /usr/src/tmp/ppp-buildroot/usr/sbin
/usr/libexec/rpm-build/install -p -d -m 755 /usr/src/tmp/ppp-buildroot/var/run/ppp
/usr/libexec/rpm-build/install -p -d -m 755 /usr/src/tmp/ppp-buildroot/var/log/ppp
/usr/libexec/rpm-build/install -p -d -m 755 /usr/src/tmp/ppp-buildroot/usr/share/man/man8/man8
cd chat; make -w -Otarget install
make[1]: Entering directory '/usr/src/RPM/BUILD/ppp-2.4.8/chat'
mkdir -p /usr/src/tmp/ppp-buildroot/usr/sbin /usr/src/tmp/ppp-buildroot/usr/share/man/man8
/usr/libexec/rpm-build/install -p -m 755 chat /usr/src/tmp/ppp-buildroot/usr/sbin
/usr/libexec/rpm-build/install -p -m 644 chat.8 /usr/src/tmp/ppp-buildroot/usr/share/man/man8
make[1]: Leaving directory '/usr/src/RPM/BUILD/ppp-2.4.8/chat'
cd pppd/plugins; make -w -Otarget install
make[1]: Entering directory '/usr/src/RPM/BUILD/ppp-2.4.8/pppd/plugins'
mkdir -p /usr/src/tmp/ppp-buildroot//usr/lib64/pppd/2.4.8
/usr/libexec/rpm-build/install -p minconn.so passprompt.so passwordfd.so winbind.so /usr/src/tmp/ppp-buildroot//usr/lib64/pppd/2.4.8
for d in rp-pppoe pppoatm pppol2tp radius dhcp; do make -w -Otarget -C $d install || exit $?; done
make[2]: Entering directory '/usr/src/RPM/BUILD/ppp-2.4.8/pppd/plugins/rp-pppoe'
/usr/libexec/rpm-build/install -p -d -m 755 /usr/src/tmp/ppp-buildroot//usr/lib64/pppd/2.4.8
/usr/libexec/rpm-build/install -p -m 644 rp-pppoe.so /usr/src/tmp/ppp-buildroot//usr/lib64/pppd/2.4.8
/usr/libexec/rpm-build/install -p -d -m 755 /usr/src/tmp/ppp-buildroot/usr/sbin
/usr/libexec/rpm-build/install -p -m 755 pppoe-discovery /usr/src/tmp/ppp-buildroot/usr/sbin
/usr/libexec/rpm-build/install -p -c -m 644 pppoe-discovery.8 /usr/src/tmp/ppp-buildroot/usr/share/man/man8
make[2]: Leaving directory '/usr/src/RPM/BUILD/ppp-2.4.8/pppd/plugins/rp-pppoe'
make[2]: Entering directory '/usr/src/RPM/BUILD/ppp-2.4.8/pppd/plugins/pppoatm'
cc  -I../.. -I../../../include -fPIC -I. -c -o text2qos.o text2qos.c
cc  -I../.. -I../../../include -fPIC -I. -c -o text2atm.o text2atm.c
cc  -I../.. -I../../../include -fPIC -I. -c -o misc.o misc.c
cc  -I../.. -I../../../include -fPIC -I. -c -o ans.o ans.c
cc  -I../.. -I../../../include -fPIC -I.  -shared -o pppoatm.so pppoatm.o text2qos.o text2atm.o misc.o ans.o -lresolv
/usr/libexec/rpm-build/install -p -d -m 755 /usr/src/tmp/ppp-buildroot//usr/lib64/pppd/2.4.8
/usr/libexec/rpm-build/install -p -m 0644 pppoatm.so /usr/src/tmp/ppp-buildroot//usr/lib64/pppd/2.4.8
make[2]: Leaving directory '/usr/src/RPM/BUILD/ppp-2.4.8/pppd/plugins/pppoatm'
make[2]: Entering directory '/usr/src/RPM/BUILD/ppp-2.4.8/pppd/plugins/pppol2tp'
/usr/libexec/rpm-build/install -p -d -m 755 /usr/src/tmp/ppp-buildroot//usr/lib64/pppd/2.4.8
/usr/libexec/rpm-build/install -p -c -m 755 pppol2tp.so openl2tp.so /usr/src/tmp/ppp-buildroot//usr/lib64/pppd/2.4.8
make[2]: Leaving directory '/usr/src/RPM/BUILD/ppp-2.4.8/pppd/plugins/pppol2tp'
make[2]: Entering directory '/usr/src/RPM/BUILD/ppp-2.4.8/pppd/plugins/radius'
mkdir -p /usr/src/tmp/ppp-buildroot//usr/lib64/pppd/2.4.8
/usr/libexec/rpm-build/install -p -m 755 radius.so /usr/src/tmp/ppp-buildroot//usr/lib64/pppd/2.4.8
/usr/libexec/rpm-build/install -p -m 755 radattr.so /usr/src/tmp/ppp-buildroot//usr/lib64/pppd/2.4.8
/usr/libexec/rpm-build/install -p -m 755 radrealms.so /usr/src/tmp/ppp-buildroot//usr/lib64/pppd/2.4.8
/usr/libexec/rpm-build/install -p -m 644 pppd-radius.8 /usr/src/tmp/ppp-buildroot/usr/share/man/man8
/usr/libexec/rpm-build/install -p -m 644 pppd-radattr.8 /usr/src/tmp/ppp-buildroot/usr/share/man/man8
make[2]: Leaving directory '/usr/src/RPM/BUILD/ppp-2.4.8/pppd/plugins/radius'
make[2]: Entering directory '/usr/src/RPM/BUILD/ppp-2.4.8/pppd/plugins/dhcp'
mkdir -p /usr/src/tmp/ppp-buildroot//usr/lib64/pppd/2.4.8
/usr/libexec/rpm-build/install -p -m 755 dhcpc.so /usr/src/tmp/ppp-buildroot//usr/lib64/pppd/2.4.8
make[2]: Leaving directory '/usr/src/RPM/BUILD/ppp-2.4.8/pppd/plugins/dhcp'
make[1]: Leaving directory '/usr/src/RPM/BUILD/ppp-2.4.8/pppd/plugins'
cd pppd; make -w -Otarget install
make[1]: Entering directory '/usr/src/RPM/BUILD/ppp-2.4.8/pppd'
mkdir -p /usr/src/tmp/ppp-buildroot/usr/sbin /usr/src/tmp/ppp-buildroot/usr/share/man/man8
/usr/libexec/rpm-build/install -p -m 755 pppd /usr/src/tmp/ppp-buildroot/usr/sbin/pppd
/usr/libexec/rpm-build/install -p -m 644 pppd.8 /usr/src/tmp/ppp-buildroot/usr/share/man/man8
make[1]: Leaving directory '/usr/src/RPM/BUILD/ppp-2.4.8/pppd'
cd pppstats; make -w -Otarget install
make[1]: Entering directory '/usr/src/RPM/BUILD/ppp-2.4.8/pppstats'
mkdir -p /usr/src/tmp/ppp-buildroot/usr/share/man/man8
/usr/libexec/rpm-build/install -p -m 755 pppstats /usr/src/tmp/ppp-buildroot/usr/sbin
/usr/libexec/rpm-build/install -p -m 644 pppstats.8 /usr/src/tmp/ppp-buildroot/usr/share/man/man8
make[1]: Leaving directory '/usr/src/RPM/BUILD/ppp-2.4.8/pppstats'
cd pppdump; make -w -Otarget install
make[1]: Entering directory '/usr/src/RPM/BUILD/ppp-2.4.8/pppdump'
mkdir -p /usr/src/tmp/ppp-buildroot/usr/sbin /usr/src/tmp/ppp-buildroot/usr/share/man/man8
/usr/libexec/rpm-build/install -p -m 755 pppdump /usr/src/tmp/ppp-buildroot/usr/sbin
/usr/libexec/rpm-build/install -p -m 644 pppdump.8 /usr/src/tmp/ppp-buildroot/usr/share/man/man8
make[1]: Leaving directory '/usr/src/RPM/BUILD/ppp-2.4.8/pppdump'
cd pppd; make -w -Otarget install-devel
make[1]: Entering directory '/usr/src/RPM/BUILD/ppp-2.4.8/pppd'
mkdir -p /usr/src/tmp/ppp-buildroot/usr/include/pppd
/usr/libexec/rpm-build/install -p -m 644 ccp.h session.h chap-new.h ecp.h fsm.h ipcp.h ipxcp.h lcp.h magic.h md5.h patchlevel.h pathnames.h pppd.h upap.h eap.h cbcp.h chap_ms.h eap-tls.h pppcrypt.h tdb.h spinlock.h ipv6cp.h eui64.h /usr/src/tmp/ppp-buildroot/usr/include/pppd
make[1]: Leaving directory '/usr/src/RPM/BUILD/ppp-2.4.8/pppd'
make: Leaving directory '/usr/src/RPM/BUILD/ppp-2.4.8'
+ make 'INSTALL=/usr/libexec/rpm-build/install -p' install-etcppp INSTROOT=/usr/src/tmp/ppp-buildroot ETCDIR=/usr/src/tmp/ppp-buildroot/etc/ppp
make: Entering directory '/usr/src/RPM/BUILD/ppp-2.4.8'
/usr/libexec/rpm-build/install -p -d -m 755 /usr/src/tmp/ppp-buildroot/etc/ppp
/usr/libexec/rpm-build/install -p -c -m 644 etc.ppp/options /usr/src/tmp/ppp-buildroot/etc/ppp/options
/usr/libexec/rpm-build/install -p -c -m 600 etc.ppp/pap-secrets /usr/src/tmp/ppp-buildroot/etc/ppp/pap-secrets
/usr/libexec/rpm-build/install -p -c -m 600 etc.ppp/chap-secrets /usr/src/tmp/ppp-buildroot/etc/ppp/chap-secrets
/usr/libexec/rpm-build/install -p -c -m 600 etc.ppp/eaptls-server /usr/src/tmp/ppp-buildroot/etc/ppp/eaptls-server
/usr/libexec/rpm-build/install -p -c -m 600 etc.ppp/eaptls-client /usr/src/tmp/ppp-buildroot/etc/ppp/eaptls-client
make: Leaving directory '/usr/src/RPM/BUILD/ppp-2.4.8'
++ find scripts/ sample/ -type f
+ for f in `find scripts/ sample/ -type f`
+ chmod 644 scripts/secure-card
+ fgrep -qs /usr/local/bin/ scripts/secure-card
fgrep: warning: fgrep is obsolescent; using grep -F
+ subst -p 's|/usr/local/bin|/usr/bin|g' scripts/secure-card
+ file -b scripts/secure-card
+ fgrep -qs 'shell script'
fgrep: warning: fgrep is obsolescent; using grep -F
+ for f in `find scripts/ sample/ -type f`
+ chmod 644 scripts/redialer
+ fgrep -qs /usr/local/bin/ scripts/redialer
fgrep: warning: fgrep is obsolescent; using grep -F
+ file -b scripts/redialer
+ fgrep -qs 'shell script'
fgrep: warning: fgrep is obsolescent; using grep -F
+ chmod a+x scripts/redialer
+ for f in `find scripts/ sample/ -type f`
+ chmod 644 scripts/ppp-on-ssh
+ fgrep -qs /usr/local/bin/ scripts/ppp-on-ssh
fgrep: warning: fgrep is obsolescent; using grep -F
+ subst -p 's|/usr/local/bin|/usr/bin|g' scripts/ppp-on-ssh
+ file -b scripts/ppp-on-ssh
+ fgrep -qs 'shell script'
fgrep: warning: fgrep is obsolescent; using grep -F
+ chmod a+x scripts/ppp-on-ssh
+ for f in `find scripts/ sample/ -type f`
+ chmod 644 scripts/ppp-on-rsh
+ fgrep -qs /usr/local/bin/ scripts/ppp-on-rsh
fgrep: warning: fgrep is obsolescent; using grep -F
+ subst -p 's|/usr/local/bin|/usr/bin|g' scripts/ppp-on-rsh
+ file -b scripts/ppp-on-rsh
+ fgrep -qs 'shell script'
fgrep: warning: fgrep is obsolescent; using grep -F
+ chmod a+x scripts/ppp-on-rsh
+ for f in `find scripts/ sample/ -type f`
+ chmod 644 scripts/ppp-on-dialer
+ fgrep -qs /usr/local/bin/ scripts/ppp-on-dialer
fgrep: warning: fgrep is obsolescent; using grep -F
+ file -b scripts/ppp-on-dialer
+ fgrep -qs 'shell script'
fgrep: warning: fgrep is obsolescent; using grep -F
+ chmod a+x scripts/ppp-on-dialer
+ for f in `find scripts/ sample/ -type f`
+ chmod 644 scripts/ppp-on
+ fgrep -qs /usr/local/bin/ scripts/ppp-on
fgrep: warning: fgrep is obsolescent; using grep -F
+ file -b scripts/ppp-on
+ fgrep -qs 'shell script'
fgrep: warning: fgrep is obsolescent; using grep -F
+ chmod a+x scripts/ppp-on
+ for f in `find scripts/ sample/ -type f`
+ chmod 644 scripts/ppp-off
+ fgrep -qs /usr/local/bin/ scripts/ppp-off
fgrep: warning: fgrep is obsolescent; using grep -F
+ file -b scripts/ppp-off
+ fgrep -qs 'shell script'
fgrep: warning: fgrep is obsolescent; using grep -F
+ chmod a+x scripts/ppp-off
+ for f in `find scripts/ sample/ -type f`
+ chmod 644 scripts/pon.1
+ fgrep -qs /usr/local/bin/ scripts/pon.1
fgrep: warning: fgrep is obsolescent; using grep -F
+ file -b scripts/pon.1
+ fgrep -qs 'shell script'
fgrep: warning: fgrep is obsolescent; using grep -F
+ for f in `find scripts/ sample/ -type f`
+ chmod 644 scripts/pon
+ fgrep -qs /usr/local/bin/ scripts/pon
fgrep: warning: fgrep is obsolescent; using grep -F
+ file -b scripts/pon
+ fgrep -qs 'shell script'
fgrep: warning: fgrep is obsolescent; using grep -F
+ chmod a+x scripts/pon
+ for f in `find scripts/ sample/ -type f`
+ chmod 644 scripts/poff
+ fgrep -qs /usr/local/bin/ scripts/poff
fgrep: warning: fgrep is obsolescent; using grep -F
+ file -b scripts/poff
+ fgrep -qs 'shell script'
fgrep: warning: fgrep is obsolescent; using grep -F
+ chmod a+x scripts/poff
+ for f in `find scripts/ sample/ -type f`
+ chmod 644 scripts/plog
+ fgrep -qs /usr/local/bin/ scripts/plog
fgrep: warning: fgrep is obsolescent; using grep -F
+ file -b scripts/plog
+ fgrep -qs 'shell script'
fgrep: warning: fgrep is obsolescent; using grep -F
+ chmod a+x scripts/plog
+ for f in `find scripts/ sample/ -type f`
+ chmod 644 scripts/options-ssh-rem
+ fgrep -qs /usr/local/bin/ scripts/options-ssh-rem
fgrep: warning: fgrep is obsolescent; using grep -F
+ file -b scripts/options-ssh-rem
+ fgrep -qs 'shell script'
fgrep: warning: fgrep is obsolescent; using grep -F
+ for f in `find scripts/ sample/ -type f`
+ chmod 644 scripts/options-ssh-loc
+ fgrep -qs /usr/local/bin/ scripts/options-ssh-loc
fgrep: warning: fgrep is obsolescent; using grep -F
+ file -b scripts/options-ssh-loc
+ fgrep -qs 'shell script'
fgrep: warning: fgrep is obsolescent; using grep -F
+ for f in `find scripts/ sample/ -type f`
+ chmod 644 scripts/options-rsh-rem
+ fgrep -qs /usr/local/bin/ scripts/options-rsh-rem
fgrep: warning: fgrep is obsolescent; using grep -F
+ file -b scripts/options-rsh-rem
+ fgrep -qs 'shell script'
fgrep: warning: fgrep is obsolescent; using grep -F
+ for f in `find scripts/ sample/ -type f`
+ chmod 644 scripts/options-rsh-loc
+ fgrep -qs /usr/local/bin/ scripts/options-rsh-loc
fgrep: warning: fgrep is obsolescent; using grep -F
+ file -b scripts/options-rsh-loc
+ fgrep -qs 'shell script'
fgrep: warning: fgrep is obsolescent; using grep -F
+ for f in `find scripts/ sample/ -type f`
+ chmod 644 scripts/ipv6-up.sample
+ fgrep -qs /usr/local/bin/ scripts/ipv6-up.sample
fgrep: warning: fgrep is obsolescent; using grep -F
+ file -b scripts/ipv6-up.sample
+ fgrep -qs 'shell script'
fgrep: warning: fgrep is obsolescent; using grep -F
+ chmod a+x scripts/ipv6-up.sample
+ for f in `find scripts/ sample/ -type f`
+ chmod 644 scripts/ipv6-down.sample
+ fgrep -qs /usr/local/bin/ scripts/ipv6-down.sample
fgrep: warning: fgrep is obsolescent; using grep -F
+ file -b scripts/ipv6-down.sample
+ fgrep -qs 'shell script'
fgrep: warning: fgrep is obsolescent; using grep -F
+ chmod a+x scripts/ipv6-down.sample
+ for f in `find scripts/ sample/ -type f`
+ chmod 644 scripts/ip-up.local.add
+ fgrep -qs /usr/local/bin/ scripts/ip-up.local.add
fgrep: warning: fgrep is obsolescent; using grep -F
+ file -b scripts/ip-up.local.add
+ fgrep -qs 'shell script'
fgrep: warning: fgrep is obsolescent; using grep -F
+ for f in `find scripts/ sample/ -type f`
+ chmod 644 scripts/ip-down.local.add
+ fgrep -qs /usr/local/bin/ scripts/ip-down.local.add
fgrep: warning: fgrep is obsolescent; using grep -F
+ file -b scripts/ip-down.local.add
+ fgrep -qs 'shell script'
fgrep: warning: fgrep is obsolescent; using grep -F
+ for f in `find scripts/ sample/ -type f`
+ chmod 644 scripts/chatchat/chatchat.c
+ fgrep -qs /usr/local/bin/ scripts/chatchat/chatchat.c
fgrep: warning: fgrep is obsolescent; using grep -F
+ file -b scripts/chatchat/chatchat.c
+ fgrep -qs 'shell script'
fgrep: warning: fgrep is obsolescent; using grep -F
+ for f in `find scripts/ sample/ -type f`
+ chmod 644 scripts/chatchat/README
+ fgrep -qs /usr/local/bin/ scripts/chatchat/README
fgrep: warning: fgrep is obsolescent; using grep -F
+ file -b scripts/chatchat/README
+ fgrep -qs 'shell script'
fgrep: warning: fgrep is obsolescent; using grep -F
+ for f in `find scripts/ sample/ -type f`
+ chmod 644 scripts/chat-callback
+ fgrep -qs /usr/local/bin/ scripts/chat-callback
fgrep: warning: fgrep is obsolescent; using grep -F
+ file -b scripts/chat-callback
+ fgrep -qs 'shell script'
fgrep: warning: fgrep is obsolescent; using grep -F
+ for f in `find scripts/ sample/ -type f`
+ chmod 644 scripts/callback
+ fgrep -qs /usr/local/bin/ scripts/callback
fgrep: warning: fgrep is obsolescent; using grep -F
+ file -b scripts/callback
+ fgrep -qs 'shell script'
fgrep: warning: fgrep is obsolescent; using grep -F
+ chmod a+x scripts/callback
+ for f in `find scripts/ sample/ -type f`
+ chmod 644 scripts/autopppd
+ fgrep -qs /usr/local/bin/ scripts/autopppd
fgrep: warning: fgrep is obsolescent; using grep -F
+ file -b scripts/autopppd
+ fgrep -qs 'shell script'
fgrep: warning: fgrep is obsolescent; using grep -F
+ for f in `find scripts/ sample/ -type f`
+ chmod 644 scripts/README
+ fgrep -qs /usr/local/bin/ scripts/README
fgrep: warning: fgrep is obsolescent; using grep -F
+ file -b scripts/README
+ fgrep -qs 'shell script'
fgrep: warning: fgrep is obsolescent; using grep -F
+ for f in `find scripts/ sample/ -type f`
+ chmod 644 sample/pap-secrets
+ fgrep -qs /usr/local/bin/ sample/pap-secrets
fgrep: warning: fgrep is obsolescent; using grep -F
+ file -b sample/pap-secrets
+ fgrep -qs 'shell script'
fgrep: warning: fgrep is obsolescent; using grep -F
+ for f in `find scripts/ sample/ -type f`
+ chmod 644 sample/options.ttyXX
+ fgrep -qs /usr/local/bin/ sample/options.ttyXX
fgrep: warning: fgrep is obsolescent; using grep -F
+ file -b sample/options.ttyXX
+ fgrep -qs 'shell script'
fgrep: warning: fgrep is obsolescent; using grep -F
+ for f in `find scripts/ sample/ -type f`
+ chmod 644 sample/options
+ fgrep -qs /usr/local/bin/ sample/options
fgrep: warning: fgrep is obsolescent; using grep -F
+ file -b sample/options
+ fgrep -qs 'shell script'
fgrep: warning: fgrep is obsolescent; using grep -F
+ for f in `find scripts/ sample/ -type f`
+ chmod 644 sample/ip-up
+ fgrep -qs /usr/local/bin/ sample/ip-up
fgrep: warning: fgrep is obsolescent; using grep -F
+ file -b sample/ip-up
+ fgrep -qs 'shell script'
fgrep: warning: fgrep is obsolescent; using grep -F
+ chmod a+x sample/ip-up
+ for f in `find scripts/ sample/ -type f`
+ chmod 644 sample/ip-down
+ fgrep -qs /usr/local/bin/ sample/ip-down
fgrep: warning: fgrep is obsolescent; using grep -F
+ file -b sample/ip-down
+ fgrep -qs 'shell script'
fgrep: warning: fgrep is obsolescent; using grep -F
+ chmod a+x sample/ip-down
+ for f in `find scripts/ sample/ -type f`
+ chmod 644 sample/callback-users
+ fgrep -qs /usr/local/bin/ sample/callback-users
fgrep: warning: fgrep is obsolescent; using grep -F
+ file -b sample/callback-users
+ fgrep -qs 'shell script'
fgrep: warning: fgrep is obsolescent; using grep -F
+ for f in `find scripts/ sample/ -type f`
+ chmod 644 sample/callback-server
+ fgrep -qs /usr/local/bin/ sample/callback-server
fgrep: warning: fgrep is obsolescent; using grep -F
+ file -b sample/callback-server
+ fgrep -qs 'shell script'
fgrep: warning: fgrep is obsolescent; using grep -F
+ chmod a+x sample/callback-server
+ for f in `find scripts/ sample/ -type f`
+ chmod 644 sample/callback-client
+ fgrep -qs /usr/local/bin/ sample/callback-client
fgrep: warning: fgrep is obsolescent; using grep -F
+ file -b sample/callback-client
+ fgrep -qs 'shell script'
fgrep: warning: fgrep is obsolescent; using grep -F
+ chmod a+x sample/callback-client
+ for f in `find scripts/ sample/ -type f`
+ chmod 644 sample/auth-up
+ fgrep -qs /usr/local/bin/ sample/auth-up
fgrep: warning: fgrep is obsolescent; using grep -F
+ file -b sample/auth-up
+ fgrep -qs 'shell script'
fgrep: warning: fgrep is obsolescent; using grep -F
+ chmod a+x sample/auth-up
+ for f in `find scripts/ sample/ -type f`
+ chmod 644 sample/auth-down
+ fgrep -qs /usr/local/bin/ sample/auth-down
fgrep: warning: fgrep is obsolescent; using grep -F
+ file -b sample/auth-down
+ fgrep -qs 'shell script'
fgrep: warning: fgrep is obsolescent; using grep -F
+ chmod a+x sample/auth-down
+ install -pDm640 /usr/src/RPM/SOURCES/ppp.pamd /usr/src/tmp/ppp-buildroot/etc/pam.d/ppp
+ mkdir -p /usr/src/tmp/ppp-buildroot/etc/ppp/peers
+ install -pm600 sample/callback-client sample/callback-server sample/callback-users /usr/src/tmp/ppp-buildroot/etc/ppp/
+ mkdir -p /usr/src/tmp/ppp-buildroot/etc/ppp/radius
+ cp -a pppd/plugins/radius/etc/dictionary pppd/plugins/radius/etc/dictionary.ascend pppd/plugins/radius/etc/dictionary.compat pppd/plugins/radius/etc/dictionary.merit pppd/plugins/radius/etc/dictionary.microsoft pppd/plugins/radius/etc/issue pppd/plugins/radius/etc/port-id-map pppd/plugins/radius/etc/radiusclient.conf pppd/plugins/radius/etc/radiusclient.conf.in pppd/plugins/radius/etc/realms pppd/plugins/radius/etc/servers /usr/src/tmp/ppp-buildroot/etc/ppp/radius/
+ install -pDm755 /usr/src/RPM/SOURCES/ppp.control /usr/src/tmp/ppp-buildroot/etc/control.d/facilities/ppp
+ mkdir -p /usr/src/tmp/ppp-buildroot/var/log/ppp /usr/src/tmp/ppp-buildroot/var/run/ppp
+ touch /usr/src/tmp/ppp-buildroot/var/log/ppp/connect-errors
+ touch /usr/src/tmp/ppp-buildroot/var/run/ppp/resolv.conf
+ ln -s ../../var/log/ppp/connect-errors /usr/src/tmp/ppp-buildroot/etc/ppp/connect-errors
+ ln -s ../../var/run/ppp/resolv.conf /usr/src/tmp/ppp-buildroot/etc/ppp/resolv.conf
+ install -pDm644 /usr/src/RPM/SOURCES/ppp.tmpfiles /usr/src/tmp/ppp-buildroot//lib/tmpfiles.d/ppp.conf
+ install -pDm644 /usr/src/RPM/SOURCES/95-ppp.rules /usr/src/tmp/ppp-buildroot//lib/udev/rules.d/95-ppp.rules
+ install -pDm644 /usr/src/RPM/SOURCES/ppp.logrotate /usr/src/tmp/ppp-buildroot/etc/logrotate.d/ppp
+ install -pm600 etc.ppp/openssl.cnf /usr/src/tmp/ppp-buildroot/etc/ppp/openssl.cnf
+ /usr/lib/rpm/brp-alt
Cleaning files in /usr/src/tmp/ppp-buildroot (auto)
mode of './usr/lib64/pppd/2.4.8/dhcpc.so' changed from 0755 (rwxr-xr-x) to 0644 (rw-r--r--)
mode of './usr/lib64/pppd/2.4.8/radrealms.so' changed from 0755 (rwxr-xr-x) to 0644 (rw-r--r--)
mode of './usr/lib64/pppd/2.4.8/radattr.so' changed from 0755 (rwxr-xr-x) to 0644 (rw-r--r--)
mode of './usr/lib64/pppd/2.4.8/radius.so' changed from 0755 (rwxr-xr-x) to 0644 (rw-r--r--)
mode of './usr/lib64/pppd/2.4.8/openl2tp.so' changed from 0755 (rwxr-xr-x) to 0644 (rw-r--r--)
mode of './usr/lib64/pppd/2.4.8/pppol2tp.so' changed from 0755 (rwxr-xr-x) to 0644 (rw-r--r--)
mode of './usr/lib64/pppd/2.4.8/winbind.so' changed from 0755 (rwxr-xr-x) to 0644 (rw-r--r--)
mode of './usr/lib64/pppd/2.4.8/passwordfd.so' changed from 0755 (rwxr-xr-x) to 0644 (rw-r--r--)
mode of './usr/lib64/pppd/2.4.8/passprompt.so' changed from 0755 (rwxr-xr-x) to 0644 (rw-r--r--)
mode of './usr/lib64/pppd/2.4.8/minconn.so' changed from 0755 (rwxr-xr-x) to 0644 (rw-r--r--)
mode of './usr/sbin/pppoe-discovery' changed from 0755 (rwxr-xr-x) to 0644 (rw-r--r--)
Verifying and fixing files in /usr/src/tmp/ppp-buildroot (binconfig,pkgconfig,libtool,desktop,gnuconfig)
Checking contents of files in /usr/src/tmp/ppp-buildroot/ (default)
Compressing files in /usr/src/tmp/ppp-buildroot (auto)
Adjusting library links in /usr/src/tmp/ppp-buildroot
./lib: (from <cmdline>:0)
./usr/lib64: (from <cmdline>:0)
Verifying ELF objects in /usr/src/tmp/ppp-buildroot (arch=normal,fhs=normal,lfs=relaxed,lint=relaxed,rpath=normal,stack=normal,textrel=normal,unresolved=normal)
verify-elf: WARNING: ./usr/lib64/pppd/2.4.8/dhcpc.so: undefined symbol: peer_authname
verify-elf: WARNING: ./usr/lib64/pppd/2.4.8/dhcpc.so: undefined symbol: ip_choose_hook
verify-elf: WARNING: ./usr/lib64/pppd/2.4.8/dhcpc.so: undefined symbol: exitnotify
verify-elf: WARNING: ./usr/lib64/pppd/2.4.8/dhcpc.so: undefined symbol: untimeout
verify-elf: WARNING: ./usr/lib64/pppd/2.4.8/dhcpc.so: undefined symbol: add_options
verify-elf: WARNING: ./usr/lib64/pppd/2.4.8/dhcpc.so: undefined symbol: timeout
verify-elf: WARNING: ./usr/lib64/pppd/2.4.8/dhcpc.so: undefined symbol: dbglog
verify-elf: WARNING: ./usr/lib64/pppd/2.4.8/dhcpc.so: undefined symbol: add_notifier
verify-elf: WARNING: ./usr/lib64/pppd/2.4.8/dhcpc.so: undefined symbol: fatal
verify-elf: WARNING: ./usr/lib64/pppd/2.4.8/dhcpc.so: undefined symbol: info
verify-elf: WARNING: ./usr/lib64/pppd/2.4.8/radrealms.so: undefined symbol: radius_pre_auth_hook
verify-elf: WARNING: ./usr/lib64/pppd/2.4.8/radrealms.so: undefined symbol: option_error
verify-elf: WARNING: ./usr/lib64/pppd/2.4.8/radrealms.so: undefined symbol: add_options
verify-elf: WARNING: ./usr/lib64/pppd/2.4.8/radrealms.so: undefined symbol: info
verify-elf: WARNING: ./usr/lib64/pppd/2.4.8/radattr.so: undefined symbol: ifname
verify-elf: WARNING: ./usr/lib64/pppd/2.4.8/radattr.so: undefined symbol: exitnotify
verify-elf: WARNING: ./usr/lib64/pppd/2.4.8/radattr.so: undefined symbol: radius_attributes_hook
verify-elf: WARNING: ./usr/lib64/pppd/2.4.8/radattr.so: undefined symbol: slprintf
verify-elf: WARNING: ./usr/lib64/pppd/2.4.8/radattr.so: undefined symbol: dbglog
verify-elf: WARNING: ./usr/lib64/pppd/2.4.8/radattr.so: undefined symbol: add_notifier
verify-elf: WARNING: ./usr/lib64/pppd/2.4.8/radattr.so: undefined symbol: rc_avpair_tostr
verify-elf: WARNING: ./usr/lib64/pppd/2.4.8/radattr.so: undefined symbol: info
verify-elf: WARNING: ./usr/lib64/pppd/2.4.8/radius.so: undefined symbol: sync_serial
verify-elf: WARNING: ./usr/lib64/pppd/2.4.8/radius.so: undefined symbol: maxconnect
verify-elf: WARNING: ./usr/lib64/pppd/2.4.8/radius.so: undefined symbol: ip_choose_hook
verify-elf: WARNING: ./usr/lib64/pppd/2.4.8/radius.so: undefined symbol: hostname
verify-elf: WARNING: ./usr/lib64/pppd/2.4.8/radius.so: undefined symbol: chap_verify_hook
verify-elf: WARNING: ./usr/lib64/pppd/2.4.8/radius.so: undefined symbol: mppe_send_key
verify-elf: WARNING: ./usr/lib64/pppd/2.4.8/radius.so: undefined symbol: mppe_keys_set
verify-elf: WARNING: ./usr/lib64/pppd/2.4.8/radius.so: undefined symbol: maxoctets
verify-elf: WARNING: ./usr/lib64/pppd/2.4.8/radius.so: undefined symbol: chap_check_hook
verify-elf: WARNING: ./usr/lib64/pppd/2.4.8/radius.so: undefined symbol: ipcp_hisoptions
verify-elf: WARNING: ./usr/lib64/pppd/2.4.8/radius.so: undefined symbol: ip_down_notifier
verify-elf: WARNING: ./usr/lib64/pppd/2.4.8/radius.so: undefined symbol: ipparam
verify-elf: WARNING: ./usr/lib64/pppd/2.4.8/radius.so: undefined symbol: ipcp_allowoptions
verify-elf: WARNING: ./usr/lib64/pppd/2.4.8/radius.so: undefined symbol: ipcp_wantoptions
verify-elf: WARNING: ./usr/lib64/pppd/2.4.8/radius.so: undefined symbol: link_stats_valid
verify-elf: WARNING: ./usr/lib64/pppd/2.4.8/radius.so: undefined symbol: ifname
verify-elf: WARNING: ./usr/lib64/pppd/2.4.8/radius.so: undefined symbol: using_pty
verify-elf: WARNING: ./usr/lib64/pppd/2.4.8/radius.so: undefined symbol: status
verify-elf: WARNING: ./usr/lib64/pppd/2.4.8/radius.so: undefined symbol: allowed_address_hook
verify-elf: WARNING: ./usr/lib64/pppd/2.4.8/radius.so: undefined symbol: maxoctets_dir
verify-elf: WARNING: ./usr/lib64/pppd/2.4.8/radius.so: undefined symbol: ip_up_notifier
verify-elf: WARNING: ./usr/lib64/pppd/2.4.8/radius.so: undefined symbol: devnam
verify-elf: WARNING: ./usr/lib64/pppd/2.4.8/radius.so: undefined symbol: mppe_recv_key
verify-elf: WARNING: ./usr/lib64/pppd/2.4.8/radius.so: undefined symbol: idle_time_limit
verify-elf: WARNING: ./usr/lib64/pppd/2.4.8/radius.so: undefined symbol: link_connect_time
verify-elf: WARNING: ./usr/lib64/pppd/2.4.8/radius.so: undefined symbol: remote_number
verify-elf: WARNING: ./usr/lib64/pppd/2.4.8/radius.so: undefined symbol: pap_auth_hook
verify-elf: WARNING: ./usr/lib64/pppd/2.4.8/radius.so: undefined symbol: link_stats
verify-elf: WARNING: ./usr/lib64/pppd/2.4.8/radius.so: undefined symbol: pap_check_hook
verify-elf: WARNING: ./usr/lib64/pppd/2.4.8/radius.so: undefined symbol: novm
verify-elf: WARNING: ./usr/lib64/pppd/2.4.8/radius.so: undefined symbol: update_link_stats
verify-elf: WARNING: ./usr/lib64/pppd/2.4.8/radius.so: undefined symbol: bad_ip_adrs
verify-elf: WARNING: ./usr/lib64/pppd/2.4.8/radius.so: undefined symbol: mppe_set_keys
verify-elf: WARNING: ./usr/lib64/pppd/2.4.8/radius.so: undefined symbol: script_setenv
verify-elf: WARNING: ./usr/lib64/pppd/2.4.8/radius.so: undefined symbol: magic
verify-elf: WARNING: ./usr/lib64/pppd/2.4.8/radius.so: undefined symbol: set_mppe_enc_types
verify-elf: WARNING: ./usr/lib64/pppd/2.4.8/radius.so: undefined symbol: info
verify-elf: WARNING: ./usr/lib64/pppd/2.4.8/radius.so: undefined symbol: slprintf
verify-elf: WARNING: ./usr/lib64/pppd/2.4.8/radius.so: undefined symbol: untimeout
verify-elf: WARNING: ./usr/lib64/pppd/2.4.8/radius.so: undefined symbol: add_notifier
verify-elf: WARNING: ./usr/lib64/pppd/2.4.8/radius.so: undefined symbol: add_options
verify-elf: WARNING: ./usr/lib64/pppd/2.4.8/radius.so: undefined symbol: fatal
verify-elf: WARNING: ./usr/lib64/pppd/2.4.8/radius.so: undefined symbol: timeout
verify-elf: WARNING: ./usr/lib64/pppd/2.4.8/openl2tp.so: undefined symbol: multilink_join_hook
verify-elf: WARNING: ./usr/lib64/pppd/2.4.8/openl2tp.so: undefined symbol: ifname
verify-elf: WARNING: ./usr/lib64/pppd/2.4.8/openl2tp.so: undefined symbol: ifunit
verify-elf: WARNING: ./usr/lib64/pppd/2.4.8/openl2tp.so: undefined symbol: peer_authname
verify-elf: WARNING: ./usr/lib64/pppd/2.4.8/openl2tp.so: undefined symbol: pppol2tp_ip_updown_hook
verify-elf: WARNING: ./usr/lib64/pppd/2.4.8/openl2tp.so: undefined symbol: pppol2tp_send_accm_hook
verify-elf: WARNING: ./usr/lib64/pppd/2.4.8/openl2tp.so: undefined symbol: dbglog
verify-elf: WARNING: ./usr/lib64/pppd/2.4.8/pppol2tp.so: undefined symbol: ip_up_notifier
verify-elf: WARNING: ./usr/lib64/pppd/2.4.8/pppol2tp.so: undefined symbol: ifname
verify-elf: WARNING: ./usr/lib64/pppd/2.4.8/pppol2tp.so: undefined symbol: ip_down_notifier
verify-elf: WARNING: ./usr/lib64/pppd/2.4.8/pppol2tp.so: undefined symbol: ifunit
verify-elf: WARNING: ./usr/lib64/pppd/2.4.8/pppol2tp.so: undefined symbol: the_channel
verify-elf: WARNING: ./usr/lib64/pppd/2.4.8/pppol2tp.so: undefined symbol: snoop_send_hook
verify-elf: WARNING: ./usr/lib64/pppd/2.4.8/pppol2tp.so: undefined symbol: ipcp_allowoptions
verify-elf: WARNING: ./usr/lib64/pppd/2.4.8/pppol2tp.so: undefined symbol: lcp_allowoptions
verify-elf: WARNING: ./usr/lib64/pppd/2.4.8/pppol2tp.so: undefined symbol: snoop_recv_hook
verify-elf: WARNING: ./usr/lib64/pppd/2.4.8/pppol2tp.so: undefined symbol: ccp_allowoptions
verify-elf: WARNING: ./usr/lib64/pppd/2.4.8/pppol2tp.so: undefined symbol: ccp_wantoptions
verify-elf: WARNING: ./usr/lib64/pppd/2.4.8/pppol2tp.so: undefined symbol: ipcp_wantoptions
verify-elf: WARNING: ./usr/lib64/pppd/2.4.8/pppol2tp.so: undefined symbol: ipv6_up_notifier
verify-elf: WARNING: ./usr/lib64/pppd/2.4.8/pppol2tp.so: undefined symbol: modem
verify-elf: WARNING: ./usr/lib64/pppd/2.4.8/pppol2tp.so: undefined symbol: lcp_wantoptions
verify-elf: WARNING: ./usr/lib64/pppd/2.4.8/pppol2tp.so: undefined symbol: new_style_driver
verify-elf: WARNING: ./usr/lib64/pppd/2.4.8/pppol2tp.so: undefined symbol: ipv6_down_notifier
verify-elf: WARNING: ./usr/lib64/pppd/2.4.8/pppol2tp.so: undefined symbol: generic_establish_ppp
verify-elf: WARNING: ./usr/lib64/pppd/2.4.8/pppol2tp.so: undefined symbol: generic_disestablish_ppp
verify-elf: WARNING: ./usr/lib64/pppd/2.4.8/pppol2tp.so: undefined symbol: int_option
verify-elf: WARNING: ./usr/lib64/pppd/2.4.8/pppol2tp.so: undefined symbol: add_options
verify-elf: WARNING: ./usr/lib64/pppd/2.4.8/pppol2tp.so: undefined symbol: ppp_available
verify-elf: WARNING: ./usr/lib64/pppd/2.4.8/pppol2tp.so: undefined symbol: dbglog
verify-elf: WARNING: ./usr/lib64/pppd/2.4.8/pppol2tp.so: undefined symbol: add_notifier
verify-elf: WARNING: ./usr/lib64/pppd/2.4.8/pppol2tp.so: undefined symbol: novm
verify-elf: WARNING: ./usr/lib64/pppd/2.4.8/pppol2tp.so: undefined symbol: fatal
verify-elf: WARNING: ./usr/lib64/pppd/2.4.8/pppol2tp.so: undefined symbol: netif_set_mtu
verify-elf: WARNING: ./usr/lib64/pppd/2.4.8/pppoatm.so: undefined symbol: the_channel
verify-elf: WARNING: ./usr/lib64/pppd/2.4.8/pppoatm.so: undefined symbol: lcp_allowoptions
verify-elf: WARNING: ./usr/lib64/pppd/2.4.8/pppoatm.so: undefined symbol: devstat
verify-elf: WARNING: ./usr/lib64/pppd/2.4.8/pppoatm.so: undefined symbol: devnam
verify-elf: WARNING: ./usr/lib64/pppd/2.4.8/pppoatm.so: undefined symbol: devnam
verify-elf: WARNING: ./usr/lib64/pppd/2.4.8/pppoatm.so: undefined symbol: ppp_devnam
verify-elf: WARNING: ./usr/lib64/pppd/2.4.8/pppoatm.so: undefined symbol: lcp_wantoptions
verify-elf: WARNING: ./usr/lib64/pppd/2.4.8/pppoatm.so: undefined symbol: new_style_driver
verify-elf: WARNING: ./usr/lib64/pppd/2.4.8/pppoatm.so: undefined symbol: generic_establish_ppp
verify-elf: WARNING: ./usr/lib64/pppd/2.4.8/pppoatm.so: undefined symbol: generic_disestablish_ppp
verify-elf: WARNING: ./usr/lib64/pppd/2.4.8/pppoatm.so: undefined symbol: add_options
verify-elf: WARNING: ./usr/lib64/pppd/2.4.8/pppoatm.so: undefined symbol: ppp_available
verify-elf: WARNING: ./usr/lib64/pppd/2.4.8/pppoatm.so: undefined symbol: fatal
verify-elf: WARNING: ./usr/lib64/pppd/2.4.8/pppoatm.so: undefined symbol: info
verify-elf: WARNING: ./usr/lib64/pppd/2.4.8/rp-pppoe.so: undefined symbol: the_channel
verify-elf: WARNING: ./usr/lib64/pppd/2.4.8/rp-pppoe.so: undefined symbol: debug
verify-elf: WARNING: ./usr/lib64/pppd/2.4.8/rp-pppoe.so: undefined symbol: pr_log
verify-elf: WARNING: ./usr/lib64/pppd/2.4.8/rp-pppoe.so: undefined symbol: ipcp_allowoptions
verify-elf: WARNING: ./usr/lib64/pppd/2.4.8/rp-pppoe.so: undefined symbol: ppp_session_number
verify-elf: WARNING: ./usr/lib64/pppd/2.4.8/rp-pppoe.so: undefined symbol: lcp_allowoptions
verify-elf: WARNING: ./usr/lib64/pppd/2.4.8/rp-pppoe.so: undefined symbol: ccp_allowoptions
verify-elf: WARNING: ./usr/lib64/pppd/2.4.8/rp-pppoe.so: undefined symbol: ccp_wantoptions
verify-elf: WARNING: ./usr/lib64/pppd/2.4.8/rp-pppoe.so: undefined symbol: ipcp_wantoptions
verify-elf: WARNING: ./usr/lib64/pppd/2.4.8/rp-pppoe.so: undefined symbol: devnam
verify-elf: WARNING: ./usr/lib64/pppd/2.4.8/rp-pppoe.so: undefined symbol: devnam
verify-elf: WARNING: ./usr/lib64/pppd/2.4.8/rp-pppoe.so: undefined symbol: remote_number
verify-elf: WARNING: ./usr/lib64/pppd/2.4.8/rp-pppoe.so: undefined symbol: ppp_devnam
verify-elf: WARNING: ./usr/lib64/pppd/2.4.8/rp-pppoe.so: undefined symbol: modem
verify-elf: WARNING: ./usr/lib64/pppd/2.4.8/rp-pppoe.so: undefined symbol: lcp_wantoptions
verify-elf: WARNING: ./usr/lib64/pppd/2.4.8/rp-pppoe.so: undefined symbol: new_style_driver
verify-elf: WARNING: ./usr/lib64/pppd/2.4.8/rp-pppoe.so: undefined symbol: generic_establish_ppp
verify-elf: WARNING: ./usr/lib64/pppd/2.4.8/rp-pppoe.so: undefined symbol: generic_disestablish_ppp
verify-elf: WARNING: ./usr/lib64/pppd/2.4.8/rp-pppoe.so: undefined symbol: option_error
verify-elf: WARNING: ./usr/lib64/pppd/2.4.8/rp-pppoe.so: undefined symbol: script_setenv
verify-elf: WARNING: ./usr/lib64/pppd/2.4.8/rp-pppoe.so: undefined symbol: end_pr_log
verify-elf: WARNING: ./usr/lib64/pppd/2.4.8/rp-pppoe.so: undefined symbol: add_options
verify-elf: WARNING: ./usr/lib64/pppd/2.4.8/rp-pppoe.so: undefined symbol: ppp_available
verify-elf: WARNING: ./usr/lib64/pppd/2.4.8/rp-pppoe.so: undefined symbol: dbglog
verify-elf: WARNING: ./usr/lib64/pppd/2.4.8/rp-pppoe.so: undefined symbol: options_from_file
verify-elf: WARNING: ./usr/lib64/pppd/2.4.8/rp-pppoe.so: undefined symbol: init_pr_log
verify-elf: WARNING: ./usr/lib64/pppd/2.4.8/rp-pppoe.so: undefined symbol: novm
verify-elf: WARNING: ./usr/lib64/pppd/2.4.8/rp-pppoe.so: undefined symbol: fatal
verify-elf: WARNING: ./usr/lib64/pppd/2.4.8/rp-pppoe.so: undefined symbol: info
verify-elf: WARNING: ./usr/lib64/pppd/2.4.8/winbind.so: undefined symbol: pap_check_hook
verify-elf: WARNING: ./usr/lib64/pppd/2.4.8/winbind.so: undefined symbol: chap_check_hook
verify-elf: WARNING: ./usr/lib64/pppd/2.4.8/winbind.so: undefined symbol: chap_verify_hook
verify-elf: WARNING: ./usr/lib64/pppd/2.4.8/winbind.so: undefined symbol: allowed_address_hook
verify-elf: WARNING: ./usr/lib64/pppd/2.4.8/winbind.so: undefined symbol: ipcp_wantoptions
verify-elf: WARNING: ./usr/lib64/pppd/2.4.8/winbind.so: undefined symbol: pap_auth_hook
verify-elf: WARNING: ./usr/lib64/pppd/2.4.8/winbind.so: undefined symbol: chap_mdtype_all
verify-elf: WARNING: ./usr/lib64/pppd/2.4.8/winbind.so: undefined symbol: option_error
verify-elf: WARNING: ./usr/lib64/pppd/2.4.8/winbind.so: undefined symbol: slprintf
verify-elf: WARNING: ./usr/lib64/pppd/2.4.8/winbind.so: undefined symbol: add_options
verify-elf: WARNING: ./usr/lib64/pppd/2.4.8/winbind.so: undefined symbol: GenerateAuthenticatorResponse
verify-elf: WARNING: ./usr/lib64/pppd/2.4.8/winbind.so: undefined symbol: mppe_set_keys2
verify-elf: WARNING: ./usr/lib64/pppd/2.4.8/winbind.so: undefined symbol: safe_fork
verify-elf: WARNING: ./usr/lib64/pppd/2.4.8/winbind.so: undefined symbol: mppe_set_keys
verify-elf: WARNING: ./usr/lib64/pppd/2.4.8/winbind.so: undefined symbol: ChallengeHash
verify-elf: WARNING: ./usr/lib64/pppd/2.4.8/winbind.so: undefined symbol: novm
verify-elf: WARNING: ./usr/lib64/pppd/2.4.8/winbind.so: undefined symbol: fatal
verify-elf: WARNING: ./usr/lib64/pppd/2.4.8/winbind.so: undefined symbol: info
verify-elf: WARNING: ./usr/lib64/pppd/2.4.8/winbind.so: undefined symbol: notice
verify-elf: WARNING: ./usr/lib64/pppd/2.4.8/passwordfd.so: undefined symbol: eaptls_passwd_hook
verify-elf: WARNING: ./usr/lib64/pppd/2.4.8/passwordfd.so: undefined symbol: pap_check_hook
verify-elf: WARNING: ./usr/lib64/pppd/2.4.8/passwordfd.so: undefined symbol: chap_check_hook
verify-elf: WARNING: ./usr/lib64/pppd/2.4.8/passwordfd.so: undefined symbol: pap_passwd_hook
verify-elf: WARNING: ./usr/lib64/pppd/2.4.8/passwordfd.so: undefined symbol: chap_passwd_hook
verify-elf: WARNING: ./usr/lib64/pppd/2.4.8/passwordfd.so: undefined symbol: add_options
verify-elf: WARNING: ./usr/lib64/pppd/2.4.8/passprompt.so: undefined symbol: eaptls_passwd_hook
verify-elf: WARNING: ./usr/lib64/pppd/2.4.8/passprompt.so: undefined symbol: pap_passwd_hook
verify-elf: WARNING: ./usr/lib64/pppd/2.4.8/passprompt.so: undefined symbol: status
verify-elf: WARNING: ./usr/lib64/pppd/2.4.8/passprompt.so: undefined symbol: remote_name
verify-elf: WARNING: ./usr/lib64/pppd/2.4.8/passprompt.so: undefined symbol: add_options
verify-elf: WARNING: ./usr/lib64/pppd/2.4.8/passprompt.so: undefined symbol: sys_close
verify-elf: WARNING: ./usr/lib64/pppd/2.4.8/minconn.so: undefined symbol: idle_time_limit
verify-elf: WARNING: ./usr/lib64/pppd/2.4.8/minconn.so: undefined symbol: idle_time_hook
verify-elf: WARNING: ./usr/lib64/pppd/2.4.8/minconn.so: undefined symbol: info
verify-elf: WARNING: ./usr/lib64/pppd/2.4.8/minconn.so: undefined symbol: add_options
Processing files: ppp-2.4.8-alt3
Executing(%doc): /bin/sh -e /usr/src/tmp/rpm-tmp.64975
+ umask 022
+ /bin/mkdir -p /usr/src/RPM/BUILD
+ cd /usr/src/RPM/BUILD
+ cd ppp-2.4.8
+ DOCDIR=/usr/src/tmp/ppp-buildroot/usr/share/doc/ppp-2.4.8
+ export DOCDIR
+ rm -rf /usr/src/tmp/ppp-buildroot/usr/share/doc/ppp-2.4.8
+ /bin/mkdir -p /usr/src/tmp/ppp-buildroot/usr/share/doc/ppp-2.4.8
+ cp -prL PLUGINS SETUP FAQ README README.MPPE README.MSCHAP80 README.MSCHAP81 README.cbcp README.eap-srp README.eap-tls README.linux README.pppoe README.pppol2tp README.pwfd README.sol2 scripts sample /usr/src/tmp/ppp-buildroot/usr/share/doc/ppp-2.4.8
+ chmod -R go-w /usr/src/tmp/ppp-buildroot/usr/share/doc/ppp-2.4.8
+ chmod -R a+rX /usr/src/tmp/ppp-buildroot/usr/share/doc/ppp-2.4.8
+ exit 0
Finding Provides (using /usr/lib/rpm/find-provides)
Executing: /bin/sh -e /usr/src/tmp/rpm-tmp.7tmETk
find-provides: running scripts (alternatives,debuginfo,lib,pam,perl,pkgconfig,python,python3,shell)
lib.prov: /usr/src/tmp/ppp-buildroot/usr/lib64/pppd/2.4.8/minconn.so: 2 symbols, 11 bpp
lib.prov: /usr/src/tmp/ppp-buildroot/usr/lib64/pppd/2.4.8/openl2tp.so: 2 symbols, 11 bpp
lib.prov: /usr/src/tmp/ppp-buildroot/usr/lib64/pppd/2.4.8/passprompt.so: 2 symbols, 11 bpp
lib.prov: /usr/src/tmp/ppp-buildroot/usr/lib64/pppd/2.4.8/passwordfd.so: 2 symbols, 11 bpp
lib.prov: /usr/src/tmp/ppp-buildroot/usr/lib64/pppd/2.4.8/pppol2tp.so: 7 symbols, 13 bpp
lib.prov: /usr/src/tmp/ppp-buildroot/usr/lib64/pppd/2.4.8/winbind.so: 5 symbols, 13 bpp
Finding Requires (using /usr/lib/rpm/find-requires)
Executing: /bin/sh -e /usr/src/tmp/rpm-tmp.4VtUC8
find-requires: running scripts (cpp,debuginfo,files,lib,pam,perl,pkgconfig,pkgconfiglib,python,python3,rpmlib,shebang,shell,static,symlinks,systemd-services)
shebang.req.files: executable script /usr/src/tmp/ppp-buildroot/etc/ppp/callback-client is not executable
shebang.req.files: executable script /usr/src/tmp/ppp-buildroot/etc/ppp/callback-server is not executable
find-requires: FINDPACKAGE-COMMANDS: sleep
Finding Requires(pre) (using /usr/lib/rpm/find-scriptlet-requires)
Executing: /bin/sh -e /usr/src/tmp/rpm-tmp.WgA67e
Finding Requires(post) (using /usr/lib/rpm/find-scriptlet-requires)
Executing: /bin/sh -e /usr/src/tmp/rpm-tmp.XrYzKh
Provides: /usr/lib64/pppd/2.4.8/minconn.so()(64bit) = set:ecvwB6, /usr/lib64/pppd/2.4.8/openl2tp.so()(64bit) = set:ecvwB6, /usr/lib64/pppd/2.4.8/passprompt.so()(64bit) = set:ecvwB6, /usr/lib64/pppd/2.4.8/passwordfd.so()(64bit) = set:ecvwB6, /usr/lib64/pppd/2.4.8/pppol2tp.so()(64bit) = set:gdLFRUUjAiRqaCL0, /usr/lib64/pppd/2.4.8/winbind.so()(64bit) = set:gdLi4TeC5GN6, pam0(ppp)
Requires: ppp-common, libssl, kmod >= 14, udev >= 204-alt2, /bin/sh, /etc/control.d/facilities(control_fmode), /etc/control.d/facilities(new_fmode), /etc/control.d/facilities(new_help), /etc/control.d/functions, /etc/logrotate.d, /etc/pam.d, /lib/udev/rules.d, /lib64/ld-linux-x86-64.so.2, coreutils, libc.so.6()(64bit) >= set:poiedc, libc.so.6(ALT_2.24)(64bit), libc.so.6(GLIBC_2.14)(64bit), libc.so.6(GLIBC_2.15)(64bit), libc.so.6(GLIBC_2.2.5)(64bit), libc.so.6(GLIBC_2.3)(64bit), libc.so.6(GLIBC_2.3.4)(64bit), libc.so.6(GLIBC_2.33)(64bit), libc.so.6(GLIBC_2.34)(64bit), libc.so.6(GLIBC_2.4)(64bit), libc.so.6(GLIBC_2.7)(64bit), libcrypt.so.1()(64bit) >= set:ihuTa, libcrypt.so.1(XCRYPT_2.0)(64bit), libcrypto.so.1.1()(64bit) >= set:qkvV29JtreDN5HlasJkEbPMX922H9lrMsJanBZl5tXFL9j5mFUQy8ZFiUmvvfvsjbSdJxtv8nPTE3LDknPZ6U22um4zkMEzkMCWzFNV9fNCju6wsWa3u9wQwCkmKAWMXhmYUQXP6Nx8TUNNE13AUnq5NVKRbJAxmoxhS5k2ZewdWzgGumy3lo, libcrypto.so.1.1(OPENSSL_1_1_0)(64bit), libpam(include), libpam.so.0()(64bit) >= set:jfaU0elpOZaI4OMxyIgYI1, libpam.so.0(LIBPAM_1.0)(64bit), libpcap.so.0.8()(64bit) >= set:khO4qzPRREupwgY1, libssl.so.1.1()(64bit) >= set:mg0FWuLbyh1NQA0hGcVffzxQ9a2gXJZlaLYJOXW1Xr8ha2bMWr0Ftq9u7LWZlqL1Hm3Oz9HgwiEOqgjNZD3UZ2DPHr6, libssl.so.1.1(OPENSSL_1_1_0)(64bit), libsystemd.so.0()(64bit) >= set:nmZGf6, libsystemd.so.0(LIBSYSTEMD_209)(64bit), libudev.so.1()(64bit) >= set:khX6Jf02g5ZgIbNol7, libudev.so.1(LIBUDEV_183)(64bit), pam0(common-login), rtld(GNU_HASH)
Requires(interp): /bin/sh
Requires(rpmlib): rpmlib(SetVersions)
Requires(pre): /bin/sh, /usr/sbin/control-dump
Requires(post): /bin/sh, /usr/sbin/control, /usr/sbin/control-restore
Obsoletes: ppp-cbcp, ppp-mppe, ppp-extra
Finding debuginfo files (using /usr/lib/rpm/find-debuginfo-files)
Executing: /bin/sh -e /usr/src/tmp/rpm-tmp.JPkhRc
Creating ppp-debuginfo package
Processing files: ppp-devel-2.4.8-alt3
Finding Provides (using /usr/lib/rpm/find-provides)
Executing: /bin/sh -e /usr/src/tmp/rpm-tmp.3PO8iX
find-provides: running scripts (alternatives,debuginfo,lib,pam,perl,pkgconfig,python,python3,shell)
Finding Requires (using /usr/lib/rpm/find-requires)
Executing: /bin/sh -e /usr/src/tmp/rpm-tmp.ERfqAL
find-requires: running scripts (cpp,debuginfo,files,lib,pam,perl,pkgconfig,pkgconfiglib,python,python3,rpmlib,shebang,shell,static,symlinks,systemd-services)
/usr/src/tmp/ppp-buildroot/usr/include/pppd/eui64.h:42:2: error: #error "this file should only be included when INET6 is defined"
   42 | #error  "this file should only be included when INET6 is defined"
      |  ^~~~~
cpp.req: /usr/src/tmp/ppp-buildroot/usr/include/pppd/eui64.h: cpp failed, trying c++ mode
x86_64-alt-linux-cpp: fatal error: cannot execute 'cc1plus': execvp: No such file or directory
compilation terminated.
cpp.req: WARNING: /usr/src/tmp/ppp-buildroot/usr/include/pppd/eui64.h: cpp failed
/usr/src/tmp/ppp-buildroot/usr/include/pppd/pppcrypt.h:41:10: fatal error: des.h: No such file or directory
   41 | #include <des.h>
      |          ^~~~~~~
compilation terminated.
cpp.req: WARNING: /usr/src/tmp/ppp-buildroot/usr/include/pppd/pppcrypt.h: cpp failed
Requires: ppp = 2.4.8-alt3, libssl-devel
Processing files: ppp-radius-2.4.8-alt3
Finding Provides (using /usr/lib/rpm/find-provides)
Executing: /bin/sh -e /usr/src/tmp/rpm-tmp.yV94oc
find-provides: running scripts (alternatives,debuginfo,lib,pam,perl,pkgconfig,python,python3,shell)
lib.prov: /usr/src/tmp/ppp-buildroot/usr/lib64/pppd/2.4.8/radattr.so: 2 symbols, 11 bpp
lib.prov: /usr/src/tmp/ppp-buildroot/usr/lib64/pppd/2.4.8/radius.so: 54 symbols, 16 bpp
lib.prov: /usr/src/tmp/ppp-buildroot/usr/lib64/pppd/2.4.8/radrealms.so: 3 symbols, 12 bpp
Finding Requires (using /usr/lib/rpm/find-requires)
Executing: /bin/sh -e /usr/src/tmp/rpm-tmp.3QOezc
find-requires: running scripts (cpp,debuginfo,files,lib,pam,perl,pkgconfig,pkgconfiglib,python,python3,rpmlib,shebang,shell,static,symlinks,systemd-services)
Provides: /usr/lib64/pppd/2.4.8/radattr.so()(64bit) = set:ecvwB6, /usr/lib64/pppd/2.4.8/radius.so()(64bit) = set:jdEZ0hTcGQPRu11RZmOT2lCSTBktszQZcXPkvevCzv9B6ZfrVP9WZ42zhVgGOSuOg6uIVCk6bIGQMgmkZj81mGS4ZyhfksoVcFAF6KNEIpuYp2, /usr/lib64/pppd/2.4.8/radrealms.so()(64bit) = set:fdvwBeFq
Requires: ppp = 2.4.8-alt3, libc.so.6()(64bit) >= set:poiedc, libc.so.6(ALT_2.24)(64bit), libc.so.6(GLIBC_2.14)(64bit), libc.so.6(GLIBC_2.15)(64bit), libc.so.6(GLIBC_2.2.5)(64bit), libc.so.6(GLIBC_2.3)(64bit), libc.so.6(GLIBC_2.3.4)(64bit), libc.so.6(GLIBC_2.4)(64bit), libc.so.6(GLIBC_2.7)(64bit), libcrypto.so.1.1()(64bit) >= set:qoRmGPiyXFOpk0, libcrypto.so.1.1(OPENSSL_1_1_0)(64bit), rtld(GNU_HASH)
Requires(rpmlib): rpmlib(SetVersions)
Finding debuginfo files (using /usr/lib/rpm/find-debuginfo-files)
Executing: /bin/sh -e /usr/src/tmp/rpm-tmp.DD2GyU
Creating ppp-radius-debuginfo package
Processing files: ppp-pppoatm-2.4.8-alt3
Finding Provides (using /usr/lib/rpm/find-provides)
Executing: /bin/sh -e /usr/src/tmp/rpm-tmp.SmdzEr
find-provides: running scripts (alternatives,debuginfo,lib,pam,perl,pkgconfig,python,python3,shell)
lib.prov: /usr/src/tmp/ppp-buildroot/usr/lib64/pppd/2.4.8/pppoatm.so: 11 symbols, 14 bpp
Finding Requires (using /usr/lib/rpm/find-requires)
Executing: /bin/sh -e /usr/src/tmp/rpm-tmp.TbWUFH
find-requires: running scripts (cpp,debuginfo,files,lib,pam,perl,pkgconfig,pkgconfiglib,python,python3,rpmlib,shebang,shell,static,symlinks,systemd-services)
Provides: /usr/lib64/pppd/2.4.8/pppoatm.so()(64bit) = set:hdnWBliaZJVhPzQ8szZ285di1
Requires: ppp = 2.4.8-alt3, libc.so.6(ALT_2.24)(64bit), libc.so.6(GLIBC_2.14)(64bit), libc.so.6(GLIBC_2.2.5)(64bit), libc.so.6(GLIBC_2.3)(64bit), libc.so.6(GLIBC_2.34)(64bit), libc.so.6(GLIBC_2.4)(64bit), libc.so.6(GLIBC_2.7)(64bit), rtld(GNU_HASH)
Finding debuginfo files (using /usr/lib/rpm/find-debuginfo-files)
Executing: /bin/sh -e /usr/src/tmp/rpm-tmp.j4qUxS
Creating ppp-pppoatm-debuginfo package
Processing files: ppp-pppoe-2.4.8-alt3
Finding Provides (using /usr/lib/rpm/find-provides)
Executing: /bin/sh -e /usr/src/tmp/rpm-tmp.DyUYx8
find-provides: running scripts (alternatives,debuginfo,lib,pam,perl,pkgconfig,python,python3,shell)
lib.prov: /usr/src/tmp/ppp-buildroot/usr/lib64/pppd/2.4.8/rp-pppoe.so: 19 symbols, 15 bpp
Finding Requires (using /usr/lib/rpm/find-requires)
Executing: /bin/sh -e /usr/src/tmp/rpm-tmp.jZXF06
find-requires: running scripts (cpp,debuginfo,files,lib,pam,perl,pkgconfig,pkgconfiglib,python,python3,rpmlib,shebang,shell,static,symlinks,systemd-services)
Provides: /usr/lib64/pppd/2.4.8/rp-pppoe.so()(64bit) = set:idsHZJQIK09eSoyBLUucKy92rv0HwqaVQZfaKOz9f
Requires: ppp = 2.4.8-alt3, libc.so.6(ALT_2.24)(64bit), libc.so.6(GLIBC_2.14)(64bit), libc.so.6(GLIBC_2.15)(64bit), libc.so.6(GLIBC_2.2.5)(64bit), libc.so.6(GLIBC_2.3)(64bit), libc.so.6(GLIBC_2.3.4)(64bit), libc.so.6(GLIBC_2.4)(64bit), libc.so.6(GLIBC_2.7)(64bit), libudev.so.1()(64bit) >= set:khX6Jf02g5ZgIbNol7, libudev.so.1(LIBUDEV_183)(64bit), rtld(GNU_HASH)
Requires(rpmlib): rpmlib(SetVersions)
Finding debuginfo files (using /usr/lib/rpm/find-debuginfo-files)
Executing: /bin/sh -e /usr/src/tmp/rpm-tmp.M6qrh4
Creating ppp-pppoe-debuginfo package
Processing files: ppp-dhcp-2.4.8-alt3
Executing(%doc): /bin/sh -e /usr/src/tmp/rpm-tmp.37760
+ umask 022
+ /bin/mkdir -p /usr/src/RPM/BUILD
+ cd /usr/src/RPM/BUILD
+ cd ppp-2.4.8
+ DOCDIR=/usr/src/tmp/ppp-buildroot/usr/share/doc/ppp-dhcp-2.4.8
+ export DOCDIR
+ rm -rf /usr/src/tmp/ppp-buildroot/usr/share/doc/ppp-dhcp-2.4.8
+ /bin/mkdir -p /usr/src/tmp/ppp-buildroot/usr/share/doc/ppp-dhcp-2.4.8
+ cp -prL pppd/plugins/dhcp/README /usr/src/tmp/ppp-buildroot/usr/share/doc/ppp-dhcp-2.4.8
+ chmod -R go-w /usr/src/tmp/ppp-buildroot/usr/share/doc/ppp-dhcp-2.4.8
+ chmod -R a+rX /usr/src/tmp/ppp-buildroot/usr/share/doc/ppp-dhcp-2.4.8
+ cp -prL pppd/plugins/dhcp/AUTHORS /usr/src/tmp/ppp-buildroot/usr/share/doc/ppp-dhcp-2.4.8
+ chmod -R go-w /usr/src/tmp/ppp-buildroot/usr/share/doc/ppp-dhcp-2.4.8
+ chmod -R a+rX /usr/src/tmp/ppp-buildroot/usr/share/doc/ppp-dhcp-2.4.8
+ cp -prL pppd/plugins/dhcp/COPYING /usr/src/tmp/ppp-buildroot/usr/share/doc/ppp-dhcp-2.4.8
+ chmod -R go-w /usr/src/tmp/ppp-buildroot/usr/share/doc/ppp-dhcp-2.4.8
+ chmod -R a+rX /usr/src/tmp/ppp-buildroot/usr/share/doc/ppp-dhcp-2.4.8
+ exit 0
Finding Provides (using /usr/lib/rpm/find-provides)
Executing: /bin/sh -e /usr/src/tmp/rpm-tmp.k2yXKf
find-provides: running scripts (alternatives,debuginfo,lib,pam,perl,pkgconfig,python,python3,shell)
lib.prov: /usr/src/tmp/ppp-buildroot/usr/lib64/pppd/2.4.8/dhcpc.so: 37 symbols, 16 bpp
Finding Requires (using /usr/lib/rpm/find-requires)
Executing: /bin/sh -e /usr/src/tmp/rpm-tmp.1YEDYw
find-requires: running scripts (cpp,debuginfo,files,lib,pam,perl,pkgconfig,pkgconfiglib,python,python3,rpmlib,shebang,shell,static,symlinks,systemd-services)
Provides: /usr/lib64/pppd/2.4.8/dhcpc.so()(64bit) = set:jdRhg2HGhYaI9TK34mgtn7m8N85C4k0miH5GGQfP3D2iOvKSdFKg91mnCYoXWucK0UE8TnWIkppTU0
Requires: ppp = 2.4.8-alt3, libc.so.6(GLIBC_2.14)(64bit), libc.so.6(GLIBC_2.15)(64bit), libc.so.6(GLIBC_2.2.5)(64bit), libc.so.6(GLIBC_2.3.4)(64bit), libc.so.6(GLIBC_2.4)(64bit), rtld(GNU_HASH)
Finding debuginfo files (using /usr/lib/rpm/find-debuginfo-files)
Executing: /bin/sh -e /usr/src/tmp/rpm-tmp.LH3Jav
Creating ppp-dhcp-debuginfo package
Processing files: ppp-debuginfo-2.4.8-alt3
Finding Provides (using /usr/lib/rpm/find-provides)
Executing: /bin/sh -e /usr/src/tmp/rpm-tmp.i1S074
find-provides: running scripts (debuginfo)
Finding Requires (using /usr/lib/rpm/find-requires)
Executing: /bin/sh -e /usr/src/tmp/rpm-tmp.rwhM1O
find-requires: running scripts (debuginfo)
Requires: ppp = 2.4.8-alt3, /usr/lib/debug/lib64/ld-linux-x86-64.so.2.debug, debug64(libc.so.6), debug64(libcrypt.so.1), debug64(libcrypto.so.1.1), debug64(libpam.so.0), debug64(libpcap.so.0.8), debug64(libssl.so.1.1), debug64(libsystemd.so.0), debug64(libudev.so.1)
Processing files: ppp-radius-debuginfo-2.4.8-alt3
Finding Provides (using /usr/lib/rpm/find-provides)
Executing: /bin/sh -e /usr/src/tmp/rpm-tmp.HERMIP
find-provides: running scripts (debuginfo)
Finding Requires (using /usr/lib/rpm/find-requires)
Executing: /bin/sh -e /usr/src/tmp/rpm-tmp.tj0aN3
find-requires: running scripts (debuginfo)
Requires: ppp-radius = 2.4.8-alt3, debug64(libc.so.6), debug64(libcrypto.so.1.1)
Processing files: ppp-pppoatm-debuginfo-2.4.8-alt3
Finding Provides (using /usr/lib/rpm/find-provides)
Executing: /bin/sh -e /usr/src/tmp/rpm-tmp.pKWiHR
find-provides: running scripts (debuginfo)
Finding Requires (using /usr/lib/rpm/find-requires)
Executing: /bin/sh -e /usr/src/tmp/rpm-tmp.gaF5n1
find-requires: running scripts (debuginfo)
Requires: ppp-pppoatm = 2.4.8-alt3, debug64(libc.so.6)
Processing files: ppp-pppoe-debuginfo-2.4.8-alt3
Finding Provides (using /usr/lib/rpm/find-provides)
Executing: /bin/sh -e /usr/src/tmp/rpm-tmp.tNy1XG
find-provides: running scripts (debuginfo)
Finding Requires (using /usr/lib/rpm/find-requires)
Executing: /bin/sh -e /usr/src/tmp/rpm-tmp.bfufQW
find-requires: running scripts (debuginfo)
Requires: ppp-pppoe = 2.4.8-alt3, debug64(libc.so.6), debug64(libudev.so.1)
Processing files: ppp-dhcp-debuginfo-2.4.8-alt3
Finding Provides (using /usr/lib/rpm/find-provides)
Executing: /bin/sh -e /usr/src/tmp/rpm-tmp.Qvh5Bz
find-provides: running scripts (debuginfo)
Finding Requires (using /usr/lib/rpm/find-requires)
Executing: /bin/sh -e /usr/src/tmp/rpm-tmp.XCmxoj
find-requires: running scripts (debuginfo)
Requires: ppp-dhcp = 2.4.8-alt3, debug64(libc.so.6)
Adding to ppp-devel a strict dependency on ppp
Adding to ppp-radius a strict dependency on ppp
Adding to ppp-pppoatm a strict dependency on ppp
Adding to ppp-pppoe a strict dependency on ppp
Adding to ppp-dhcp a strict dependency on ppp
Adding to ppp-debuginfo a strict dependency on ppp
Adding to ppp-radius-debuginfo a strict dependency on ppp-radius
Adding to ppp-pppoatm-debuginfo a strict dependency on ppp-pppoatm
Adding to ppp-pppoe-debuginfo a strict dependency on ppp-pppoe
Adding to ppp-dhcp-debuginfo a strict dependency on ppp-dhcp
Adding to ppp-radius-debuginfo a strict dependency on ppp-debuginfo
Removing from ppp-radius-debuginfo 5 sources provided by ppp-debuginfo
Adding to ppp-pppoatm-debuginfo a strict dependency on ppp-debuginfo
Removing from ppp-pppoatm-debuginfo 2 sources provided by ppp-debuginfo
Adding to ppp-pppoe-debuginfo a strict dependency on ppp-debuginfo
Removing from ppp-pppoe-debuginfo 4 sources provided by ppp-debuginfo
Adding to ppp-dhcp-debuginfo a strict dependency on ppp-debuginfo
Removing from ppp-dhcp-debuginfo 1 sources provided by ppp-debuginfo
Removing 13 extra deps from ppp-radius due to repentancy on ppp
Removing 8 extra deps from ppp-pppoatm due to repentancy on ppp
Removing 12 extra deps from ppp-pppoe due to repentancy on ppp
Removing 6 extra deps from ppp-dhcp due to repentancy on ppp
Removing 2 extra deps from ppp-radius-debuginfo due to repentancy on ppp-debuginfo
Removing 1 extra deps from ppp-pppoatm-debuginfo due to repentancy on ppp-debuginfo
Removing 2 extra deps from ppp-pppoe-debuginfo due to repentancy on ppp-debuginfo
Removing 1 extra deps from ppp-dhcp-debuginfo due to repentancy on ppp-debuginfo
Wrote: /usr/src/RPM/RPMS/x86_64/ppp-2.4.8-alt3.x86_64.rpm (w2.lzdio)
Wrote: /usr/src/RPM/RPMS/noarch/ppp-devel-2.4.8-alt3.noarch.rpm (w2.lzdio)
Wrote: /usr/src/RPM/RPMS/x86_64/ppp-radius-2.4.8-alt3.x86_64.rpm (w2.lzdio)
Wrote: /usr/src/RPM/RPMS/x86_64/ppp-pppoatm-2.4.8-alt3.x86_64.rpm (w2.lzdio)
Wrote: /usr/src/RPM/RPMS/x86_64/ppp-pppoe-2.4.8-alt3.x86_64.rpm (w2.lzdio)
Wrote: /usr/src/RPM/RPMS/x86_64/ppp-dhcp-2.4.8-alt3.x86_64.rpm (w2.lzdio)
Wrote: /usr/src/RPM/RPMS/x86_64/ppp-debuginfo-2.4.8-alt3.x86_64.rpm (w2.lzdio)
Wrote: /usr/src/RPM/RPMS/x86_64/ppp-radius-debuginfo-2.4.8-alt3.x86_64.rpm (w2.lzdio)
Wrote: /usr/src/RPM/RPMS/x86_64/ppp-pppoatm-debuginfo-2.4.8-alt3.x86_64.rpm (w2.lzdio)
Wrote: /usr/src/RPM/RPMS/x86_64/ppp-pppoe-debuginfo-2.4.8-alt3.x86_64.rpm (w2.lzdio)
Wrote: /usr/src/RPM/RPMS/x86_64/ppp-dhcp-debuginfo-2.4.8-alt3.x86_64.rpm (w2.lzdio)
20.73user 9.93system 0:42.26elapsed 72%CPU (0avgtext+0avgdata 69780maxresident)k
0inputs+0outputs (0major+2153415minor)pagefaults 0swaps
/.out/ppp-devel-2.4.8-alt3.noarch.rpm: license not found in '/usr/share/license' directory: distributable
/.out/ppp-2.4.8-alt3.x86_64.rpm: license not found in '/usr/share/license' directory: distributable
/.out/ppp-radius-2.4.8-alt3.x86_64.rpm: license not found in '/usr/share/license' directory: distributable
/.out/ppp-pppoatm-2.4.8-alt3.x86_64.rpm: license not found in '/usr/share/license' directory: distributable
/.out/ppp-pppoe-2.4.8-alt3.x86_64.rpm: license not found in '/usr/share/license' directory: distributable
/.out/ppp-dhcp-2.4.8-alt3.x86_64.rpm: license not found in '/usr/share/license' directory: distributable
/.out/ppp-debuginfo-2.4.8-alt3.x86_64.rpm: license not found in '/usr/share/license' directory: distributable
/.out/ppp-radius-debuginfo-2.4.8-alt3.x86_64.rpm: license not found in '/usr/share/license' directory: distributable
/.out/ppp-pppoatm-debuginfo-2.4.8-alt3.x86_64.rpm: license not found in '/usr/share/license' directory: distributable
/.out/ppp-pppoe-debuginfo-2.4.8-alt3.x86_64.rpm: license not found in '/usr/share/license' directory: distributable
/.out/ppp-dhcp-debuginfo-2.4.8-alt3.x86_64.rpm: license not found in '/usr/share/license' directory: distributable
2.97user 1.62system 0:50.78elapsed 9%CPU (0avgtext+0avgdata 110224maxresident)k
88inputs+0outputs (32774major+164729minor)pagefaults 0swaps
--- ppp-2.4.8-alt3.x86_64.rpm.repo	2021-07-17 11:38:41.000000000 +0000
+++ ppp-2.4.8-alt3.x86_64.rpm.hasher	2023-05-02 03:05:10.978827856 +0000
@@ -115,2 +115,4 @@
 Requires: libc.so.6(GLIBC_2.3.4)(64bit)  
+Requires: libc.so.6(GLIBC_2.33)(64bit)  
+Requires: libc.so.6(GLIBC_2.34)(64bit)  
 Requires: libc.so.6(GLIBC_2.4)(64bit)  
@@ -121,3 +123,2 @@
 Requires: libcrypto.so.1.1(OPENSSL_1_1_0)(64bit)  
-Requires: libdl.so.2(GLIBC_2.2.5)(64bit)  
 Requires: libpam(include)  
@@ -132,3 +133,2 @@
 Requires: libudev.so.1(LIBUDEV_183)(64bit)  
-Requires: libutil.so.1(GLIBC_2.2.5)(64bit)  
 Requires: pam0(common-login)  
@@ -170,12 +170,12 @@
 File: /usr/lib64/pppd/2.4.8	40755	root:root		
-File: /usr/lib64/pppd/2.4.8/minconn.so	100644	root:root	68412b431767e569e319791f96199f48	
-File: /usr/lib64/pppd/2.4.8/openl2tp.so	100644	root:root	5ad401022e1dcf1f72597b4911406272	
-File: /usr/lib64/pppd/2.4.8/passprompt.so	100644	root:root	2c2f08bab725d191e289e725b5a6cd8e	
-File: /usr/lib64/pppd/2.4.8/passwordfd.so	100644	root:root	2234c925c89e43ec0231d86112be652a	
-File: /usr/lib64/pppd/2.4.8/pppol2tp.so	100644	root:root	f40a5ad02f33f5c5c5a4f90cda7a7ad4	
-File: /usr/lib64/pppd/2.4.8/winbind.so	100644	root:root	f20d15861b2955aa64f50e1aafe3b65d	
-File: /usr/sbin/chat	100711	root:root	fa753f443625bfaccb9eecab6934a2e5	
-File: /usr/sbin/pppd	100711	root:root	2cc719be1c12c35ad5193d07b1ac7674	
-File: /usr/sbin/pppdump	100711	root:root	8d3ad94c605b5c9f38a0aa3f1c21698b	
-File: /usr/sbin/pppstats	100711	root:root	4ee292415b306d83bded3f2b54d4f50f	
+File: /usr/lib64/pppd/2.4.8/minconn.so	100644	root:root	a5638b6b927c4ba100f3065a18ee04bc	
+File: /usr/lib64/pppd/2.4.8/openl2tp.so	100644	root:root	596c6887b96298d72dd6811238099a70	
+File: /usr/lib64/pppd/2.4.8/passprompt.so	100644	root:root	2b59859d272ddf219a3e8c0775c24242	
+File: /usr/lib64/pppd/2.4.8/passwordfd.so	100644	root:root	dbfb20d418bc015084a690ac663295e7	
+File: /usr/lib64/pppd/2.4.8/pppol2tp.so	100644	root:root	ed922c6ba3530ac97079731d904fac8a	
+File: /usr/lib64/pppd/2.4.8/winbind.so	100644	root:root	94e798b664181c28d56368a3e12d8443	
+File: /usr/sbin/chat	100711	root:root	27e0ff1165b4bffd4f178fc8a48e7b6c	
+File: /usr/sbin/pppd	100711	root:root	62f474df373585f5e2ee965bfea9ae3d	
+File: /usr/sbin/pppdump	100711	root:root	2bfa0b9da6e831104de57d5841132ee5	
+File: /usr/sbin/pppstats	100711	root:root	580d31906f97b114368d7335d0ad3c83	
 File: /usr/share/doc/ppp-2.4.8	40755	root:root		
@@ -242,2 +242,2 @@
 File: /var/run/ppp/resolv.conf	100644	root:root		
-RPMIdentity: cd4b58998d954c620823fd13296b06d8684bc99398d95f1da016b5e5181786dbe7f00a04f1dc516482d095e644b752c97c45d1247a3c1feaaf3ce7d03a862167
+RPMIdentity: 3419b6d06c36c77bcd0734f8f6253ad939cb0a944dfe32cdbc4ec1b7a531fd07acf5dc471fafd921c1c016a5e191ab34ce0f78749132e63d2bef532796008941
--- ppp-debuginfo-2.4.8-alt3.x86_64.rpm.repo	2021-07-17 11:38:41.000000000 +0000
+++ ppp-debuginfo-2.4.8-alt3.x86_64.rpm.hasher	2023-05-02 03:05:11.057827383 +0000
@@ -1,31 +1,31 @@
-/usr/lib/debug/.build-id/1d	40755	root:root	
-/usr/lib/debug/.build-id/1d/6c342f01736f474cbc8f549f60699145587689	120777	root:root	../../../../lib64/pppd/2.4.8/minconn.so
-/usr/lib/debug/.build-id/1d/6c342f01736f474cbc8f549f60699145587689.debug	120777	root:root	../../usr/lib64/pppd/2.4.8/minconn.so.debug
-/usr/lib/debug/.build-id/39	40755	root:root	
-/usr/lib/debug/.build-id/39/b1b5d699837bb1562a65a5ac5f581c4a9b53ba	120777	root:root	../../../../lib64/pppd/2.4.8/winbind.so
-/usr/lib/debug/.build-id/39/b1b5d699837bb1562a65a5ac5f581c4a9b53ba.debug	120777	root:root	../../usr/lib64/pppd/2.4.8/winbind.so.debug
-/usr/lib/debug/.build-id/6a	40755	root:root	
-/usr/lib/debug/.build-id/6a/41c07eda1d7b86a84d03c6550eb28846952afe	120777	root:root	../../../../sbin/pppstats
-/usr/lib/debug/.build-id/6a/41c07eda1d7b86a84d03c6550eb28846952afe.debug	120777	root:root	../../usr/sbin/pppstats.debug
+/usr/lib/debug/.build-id/0c	40755	root:root	
+/usr/lib/debug/.build-id/0c/607a6a56090dacdfbdd664a3c70ebff708d0f0	120777	root:root	../../../../lib64/pppd/2.4.8/minconn.so
+/usr/lib/debug/.build-id/0c/607a6a56090dacdfbdd664a3c70ebff708d0f0.debug	120777	root:root	../../usr/lib64/pppd/2.4.8/minconn.so.debug
+/usr/lib/debug/.build-id/1a	40755	root:root	
+/usr/lib/debug/.build-id/1a/7fca43e4015d2918e07ba2b47f988a3380147f	120777	root:root	../../../../sbin/pppstats
+/usr/lib/debug/.build-id/1a/7fca43e4015d2918e07ba2b47f988a3380147f.debug	120777	root:root	../../usr/sbin/pppstats.debug
+/usr/lib/debug/.build-id/30	40755	root:root	
+/usr/lib/debug/.build-id/30/3d01e334f45fc7eb25fbe3378eabb5ce065eaf	120777	root:root	../../../../lib64/pppd/2.4.8/openl2tp.so
+/usr/lib/debug/.build-id/30/3d01e334f45fc7eb25fbe3378eabb5ce065eaf.debug	120777	root:root	../../usr/lib64/pppd/2.4.8/openl2tp.so.debug
+/usr/lib/debug/.build-id/46	40755	root:root	
+/usr/lib/debug/.build-id/46/3941f9b0b330c1f29ce5f417395d3187a61831	120777	root:root	../../../../lib64/pppd/2.4.8/winbind.so
+/usr/lib/debug/.build-id/46/3941f9b0b330c1f29ce5f417395d3187a61831.debug	120777	root:root	../../usr/lib64/pppd/2.4.8/winbind.so.debug
 /usr/lib/debug/.build-id/6d	40755	root:root	
-/usr/lib/debug/.build-id/6d/5b1ec12b923beb6021d40a9c822060d28ac920	120777	root:root	../../../../lib64/pppd/2.4.8/passprompt.so
-/usr/lib/debug/.build-id/6d/5b1ec12b923beb6021d40a9c822060d28ac920.debug	120777	root:root	../../usr/lib64/pppd/2.4.8/passprompt.so.debug
-/usr/lib/debug/.build-id/83	40755	root:root	
-/usr/lib/debug/.build-id/83/75301bbe1d6c7791aa813b73e4611b2c01ddd6	120777	root:root	../../../../sbin/chat
-/usr/lib/debug/.build-id/83/75301bbe1d6c7791aa813b73e4611b2c01ddd6.debug	120777	root:root	../../usr/sbin/chat.debug
-/usr/lib/debug/.build-id/b1	40755	root:root	
-/usr/lib/debug/.build-id/b1/823a96767e3f55afe9b8fdb9479336eab3b487	120777	root:root	../../../../lib64/pppd/2.4.8/passwordfd.so
-/usr/lib/debug/.build-id/b1/823a96767e3f55afe9b8fdb9479336eab3b487.debug	120777	root:root	../../usr/lib64/pppd/2.4.8/passwordfd.so.debug
-/usr/lib/debug/.build-id/cf	40755	root:root	
-/usr/lib/debug/.build-id/cf/1566cd957c31dc6492f859b9c98bd3317e0318	120777	root:root	../../../../sbin/pppd
-/usr/lib/debug/.build-id/cf/1566cd957c31dc6492f859b9c98bd3317e0318.debug	120777	root:root	../../usr/sbin/pppd.debug
+/usr/lib/debug/.build-id/6d/d6f243a0883fee017cece595cf5f1bc0e9aabf	120777	root:root	../../../../lib64/pppd/2.4.8/passwordfd.so
+/usr/lib/debug/.build-id/6d/d6f243a0883fee017cece595cf5f1bc0e9aabf.debug	120777	root:root	../../usr/lib64/pppd/2.4.8/passwordfd.so.debug
+/usr/lib/debug/.build-id/90	40755	root:root	
+/usr/lib/debug/.build-id/90/e2fa0987de56836c9a9ce0a8593054c6a7bf80	120777	root:root	../../../../sbin/chat
+/usr/lib/debug/.build-id/90/e2fa0987de56836c9a9ce0a8593054c6a7bf80.debug	120777	root:root	../../usr/sbin/chat.debug
+/usr/lib/debug/.build-id/a0	40755	root:root	
+/usr/lib/debug/.build-id/a0/1c362cd08c4ab45c3db8688908fd40e61381dd	120777	root:root	../../../../sbin/pppdump
+/usr/lib/debug/.build-id/a0/1c362cd08c4ab45c3db8688908fd40e61381dd.debug	120777	root:root	../../usr/sbin/pppdump.debug
+/usr/lib/debug/.build-id/ad	40755	root:root	
+/usr/lib/debug/.build-id/ad/2e2a32cdd66fbeec339d781d06f0d7c1c3b3cd	120777	root:root	../../../../lib64/pppd/2.4.8/passprompt.so
+/usr/lib/debug/.build-id/ad/2e2a32cdd66fbeec339d781d06f0d7c1c3b3cd.debug	120777	root:root	../../usr/lib64/pppd/2.4.8/passprompt.so.debug
 /usr/lib/debug/.build-id/d1	40755	root:root	
-/usr/lib/debug/.build-id/d1/84fc45df73ae777aefb4562023340ed72deab7	120777	root:root	../../../../lib64/pppd/2.4.8/pppol2tp.so
-/usr/lib/debug/.build-id/d1/84fc45df73ae777aefb4562023340ed72deab7.debug	120777	root:root	../../usr/lib64/pppd/2.4.8/pppol2tp.so.debug
-/usr/lib/debug/.build-id/eb	40755	root:root	
-/usr/lib/debug/.build-id/eb/ce0e3c87ebc0e6d0408161343cfc5b96170612	120777	root:root	../../../../sbin/pppdump
-/usr/lib/debug/.build-id/eb/ce0e3c87ebc0e6d0408161343cfc5b96170612.debug	120777	root:root	../../usr/sbin/pppdump.debug
-/usr/lib/debug/.build-id/f3	40755	root:root	
-/usr/lib/debug/.build-id/f3/bb656561e1655f5a5ef28315a5be0bcad1b6f7	120777	root:root	../../../../lib64/pppd/2.4.8/openl2tp.so
-/usr/lib/debug/.build-id/f3/bb656561e1655f5a5ef28315a5be0bcad1b6f7.debug	120777	root:root	../../usr/lib64/pppd/2.4.8/openl2tp.so.debug
+/usr/lib/debug/.build-id/d1/8f245cc2c07917bf22db0aad10af4c61ced8c4	120777	root:root	../../../../lib64/pppd/2.4.8/pppol2tp.so
+/usr/lib/debug/.build-id/d1/8f245cc2c07917bf22db0aad10af4c61ced8c4.debug	120777	root:root	../../usr/lib64/pppd/2.4.8/pppol2tp.so.debug
+/usr/lib/debug/.build-id/d3	40755	root:root	
+/usr/lib/debug/.build-id/d3/9c82602122fda8409a73a22c09aa72f16458e0	120777	root:root	../../../../sbin/pppd
+/usr/lib/debug/.build-id/d3/9c82602122fda8409a73a22c09aa72f16458e0.debug	120777	root:root	../../usr/sbin/pppd.debug
 /usr/lib/debug/usr/lib64/pppd	40755	root:root	
@@ -116,3 +116,2 @@
 Requires: debug64(libcrypto.so.1.1)  
-Requires: debug64(libdl.so.2)  
 Requires: debug64(libpam.so.0)  
@@ -122,3 +121,2 @@
 Requires: debug64(libudev.so.1)  
-Requires: debug64(libutil.so.1)  
 Requires: ppp = 2.4.8-alt3:sisyphus+279366.100.1.2
@@ -126,44 +124,44 @@
 Provides: ppp-debuginfo = 2.4.8-alt3:sisyphus+279366.100.1.2
-File: /usr/lib/debug/.build-id/1d	40755	root:root		
-File: /usr/lib/debug/.build-id/1d/6c342f01736f474cbc8f549f60699145587689	120777	root:root		../../../../lib64/pppd/2.4.8/minconn.so
-File: /usr/lib/debug/.build-id/1d/6c342f01736f474cbc8f549f60699145587689.debug	120777	root:root		../../usr/lib64/pppd/2.4.8/minconn.so.debug
-File: /usr/lib/debug/.build-id/39	40755	root:root		
-File: /usr/lib/debug/.build-id/39/b1b5d699837bb1562a65a5ac5f581c4a9b53ba	120777	root:root		../../../../lib64/pppd/2.4.8/winbind.so
-File: /usr/lib/debug/.build-id/39/b1b5d699837bb1562a65a5ac5f581c4a9b53ba.debug	120777	root:root		../../usr/lib64/pppd/2.4.8/winbind.so.debug
-File: /usr/lib/debug/.build-id/6a	40755	root:root		
-File: /usr/lib/debug/.build-id/6a/41c07eda1d7b86a84d03c6550eb28846952afe	120777	root:root		../../../../sbin/pppstats
-File: /usr/lib/debug/.build-id/6a/41c07eda1d7b86a84d03c6550eb28846952afe.debug	120777	root:root		../../usr/sbin/pppstats.debug
+File: /usr/lib/debug/.build-id/0c	40755	root:root		
+File: /usr/lib/debug/.build-id/0c/607a6a56090dacdfbdd664a3c70ebff708d0f0	120777	root:root		../../../../lib64/pppd/2.4.8/minconn.so
+File: /usr/lib/debug/.build-id/0c/607a6a56090dacdfbdd664a3c70ebff708d0f0.debug	120777	root:root		../../usr/lib64/pppd/2.4.8/minconn.so.debug
+File: /usr/lib/debug/.build-id/1a	40755	root:root		
+File: /usr/lib/debug/.build-id/1a/7fca43e4015d2918e07ba2b47f988a3380147f	120777	root:root		../../../../sbin/pppstats
+File: /usr/lib/debug/.build-id/1a/7fca43e4015d2918e07ba2b47f988a3380147f.debug	120777	root:root		../../usr/sbin/pppstats.debug
+File: /usr/lib/debug/.build-id/30	40755	root:root		
+File: /usr/lib/debug/.build-id/30/3d01e334f45fc7eb25fbe3378eabb5ce065eaf	120777	root:root		../../../../lib64/pppd/2.4.8/openl2tp.so
+File: /usr/lib/debug/.build-id/30/3d01e334f45fc7eb25fbe3378eabb5ce065eaf.debug	120777	root:root		../../usr/lib64/pppd/2.4.8/openl2tp.so.debug
+File: /usr/lib/debug/.build-id/46	40755	root:root		
+File: /usr/lib/debug/.build-id/46/3941f9b0b330c1f29ce5f417395d3187a61831	120777	root:root		../../../../lib64/pppd/2.4.8/winbind.so
+File: /usr/lib/debug/.build-id/46/3941f9b0b330c1f29ce5f417395d3187a61831.debug	120777	root:root		../../usr/lib64/pppd/2.4.8/winbind.so.debug
 File: /usr/lib/debug/.build-id/6d	40755	root:root		
-File: /usr/lib/debug/.build-id/6d/5b1ec12b923beb6021d40a9c822060d28ac920	120777	root:root		../../../../lib64/pppd/2.4.8/passprompt.so
-File: /usr/lib/debug/.build-id/6d/5b1ec12b923beb6021d40a9c822060d28ac920.debug	120777	root:root		../../usr/lib64/pppd/2.4.8/passprompt.so.debug
-File: /usr/lib/debug/.build-id/83	40755	root:root		
-File: /usr/lib/debug/.build-id/83/75301bbe1d6c7791aa813b73e4611b2c01ddd6	120777	root:root		../../../../sbin/chat
-File: /usr/lib/debug/.build-id/83/75301bbe1d6c7791aa813b73e4611b2c01ddd6.debug	120777	root:root		../../usr/sbin/chat.debug
-File: /usr/lib/debug/.build-id/b1	40755	root:root		
-File: /usr/lib/debug/.build-id/b1/823a96767e3f55afe9b8fdb9479336eab3b487	120777	root:root		../../../../lib64/pppd/2.4.8/passwordfd.so
-File: /usr/lib/debug/.build-id/b1/823a96767e3f55afe9b8fdb9479336eab3b487.debug	120777	root:root		../../usr/lib64/pppd/2.4.8/passwordfd.so.debug
-File: /usr/lib/debug/.build-id/cf	40755	root:root		
-File: /usr/lib/debug/.build-id/cf/1566cd957c31dc6492f859b9c98bd3317e0318	120777	root:root		../../../../sbin/pppd
-File: /usr/lib/debug/.build-id/cf/1566cd957c31dc6492f859b9c98bd3317e0318.debug	120777	root:root		../../usr/sbin/pppd.debug
+File: /usr/lib/debug/.build-id/6d/d6f243a0883fee017cece595cf5f1bc0e9aabf	120777	root:root		../../../../lib64/pppd/2.4.8/passwordfd.so
+File: /usr/lib/debug/.build-id/6d/d6f243a0883fee017cece595cf5f1bc0e9aabf.debug	120777	root:root		../../usr/lib64/pppd/2.4.8/passwordfd.so.debug
+File: /usr/lib/debug/.build-id/90	40755	root:root		
+File: /usr/lib/debug/.build-id/90/e2fa0987de56836c9a9ce0a8593054c6a7bf80	120777	root:root		../../../../sbin/chat
+File: /usr/lib/debug/.build-id/90/e2fa0987de56836c9a9ce0a8593054c6a7bf80.debug	120777	root:root		../../usr/sbin/chat.debug
+File: /usr/lib/debug/.build-id/a0	40755	root:root		
+File: /usr/lib/debug/.build-id/a0/1c362cd08c4ab45c3db8688908fd40e61381dd	120777	root:root		../../../../sbin/pppdump
+File: /usr/lib/debug/.build-id/a0/1c362cd08c4ab45c3db8688908fd40e61381dd.debug	120777	root:root		../../usr/sbin/pppdump.debug
+File: /usr/lib/debug/.build-id/ad	40755	root:root		
+File: /usr/lib/debug/.build-id/ad/2e2a32cdd66fbeec339d781d06f0d7c1c3b3cd	120777	root:root		../../../../lib64/pppd/2.4.8/passprompt.so
+File: /usr/lib/debug/.build-id/ad/2e2a32cdd66fbeec339d781d06f0d7c1c3b3cd.debug	120777	root:root		../../usr/lib64/pppd/2.4.8/passprompt.so.debug
 File: /usr/lib/debug/.build-id/d1	40755	root:root		
-File: /usr/lib/debug/.build-id/d1/84fc45df73ae777aefb4562023340ed72deab7	120777	root:root		../../../../lib64/pppd/2.4.8/pppol2tp.so
-File: /usr/lib/debug/.build-id/d1/84fc45df73ae777aefb4562023340ed72deab7.debug	120777	root:root		../../usr/lib64/pppd/2.4.8/pppol2tp.so.debug
-File: /usr/lib/debug/.build-id/eb	40755	root:root		
-File: /usr/lib/debug/.build-id/eb/ce0e3c87ebc0e6d0408161343cfc5b96170612	120777	root:root		../../../../sbin/pppdump
-File: /usr/lib/debug/.build-id/eb/ce0e3c87ebc0e6d0408161343cfc5b96170612.debug	120777	root:root		../../usr/sbin/pppdump.debug
-File: /usr/lib/debug/.build-id/f3	40755	root:root		
-File: /usr/lib/debug/.build-id/f3/bb656561e1655f5a5ef28315a5be0bcad1b6f7	120777	root:root		../../../../lib64/pppd/2.4.8/openl2tp.so
-File: /usr/lib/debug/.build-id/f3/bb656561e1655f5a5ef28315a5be0bcad1b6f7.debug	120777	root:root		../../usr/lib64/pppd/2.4.8/openl2tp.so.debug
+File: /usr/lib/debug/.build-id/d1/8f245cc2c07917bf22db0aad10af4c61ced8c4	120777	root:root		../../../../lib64/pppd/2.4.8/pppol2tp.so
+File: /usr/lib/debug/.build-id/d1/8f245cc2c07917bf22db0aad10af4c61ced8c4.debug	120777	root:root		../../usr/lib64/pppd/2.4.8/pppol2tp.so.debug
+File: /usr/lib/debug/.build-id/d3	40755	root:root		
+File: /usr/lib/debug/.build-id/d3/9c82602122fda8409a73a22c09aa72f16458e0	120777	root:root		../../../../sbin/pppd
+File: /usr/lib/debug/.build-id/d3/9c82602122fda8409a73a22c09aa72f16458e0.debug	120777	root:root		../../usr/sbin/pppd.debug
 File: /usr/lib/debug/usr/lib64/pppd	40755	root:root		
 File: /usr/lib/debug/usr/lib64/pppd/2.4.8	40755	root:root		
-File: /usr/lib/debug/usr/lib64/pppd/2.4.8/minconn.so.debug	100644	root:root	81f7c450a1c0e9995c539e2bd5562306	
-File: /usr/lib/debug/usr/lib64/pppd/2.4.8/openl2tp.so.debug	100644	root:root	32e3600b499e35aa4e8a38e462267d4f	
-File: /usr/lib/debug/usr/lib64/pppd/2.4.8/passprompt.so.debug	100644	root:root	1eaee70c7ddc12d0131cafda45c6c640	
-File: /usr/lib/debug/usr/lib64/pppd/2.4.8/passwordfd.so.debug	100644	root:root	568690582ccb2031c0db8323002472bc	
-File: /usr/lib/debug/usr/lib64/pppd/2.4.8/pppol2tp.so.debug	100644	root:root	f00bcfc0722cc610e4a272f4a25497e1	
-File: /usr/lib/debug/usr/lib64/pppd/2.4.8/winbind.so.debug	100644	root:root	e184637b1a54d55e8708bdac7b9bdde6	
-File: /usr/lib/debug/usr/sbin/chat.debug	100644	root:root	41562554102582402669d8f3e85f0aff	
-File: /usr/lib/debug/usr/sbin/pppd.debug	100644	root:root	c890b4870ed346045a96f7a27868fb8a	
-File: /usr/lib/debug/usr/sbin/pppdump.debug	100644	root:root	49d626a1f46fc79e3aea8a407f88fbca	
-File: /usr/lib/debug/usr/sbin/pppstats.debug	100644	root:root	15ed576df3f0714328c09237e9944b2a	
+File: /usr/lib/debug/usr/lib64/pppd/2.4.8/minconn.so.debug	100644	root:root	0211a02bae781ea2423c4f1599c9ea83	
+File: /usr/lib/debug/usr/lib64/pppd/2.4.8/openl2tp.so.debug	100644	root:root	c0626670140a4cbe70d6ecbf1b6dba3a	
+File: /usr/lib/debug/usr/lib64/pppd/2.4.8/passprompt.so.debug	100644	root:root	27213c1daacc803f58f1f73cd4d7ae9c	
+File: /usr/lib/debug/usr/lib64/pppd/2.4.8/passwordfd.so.debug	100644	root:root	62ee503183f7fa0734992fef19e4893e	
+File: /usr/lib/debug/usr/lib64/pppd/2.4.8/pppol2tp.so.debug	100644	root:root	8df8fd8fe158de2f905ef48c80e39565	
+File: /usr/lib/debug/usr/lib64/pppd/2.4.8/winbind.so.debug	100644	root:root	b6837974529b85dc224a22c4ab7293d2	
+File: /usr/lib/debug/usr/sbin/chat.debug	100644	root:root	6609283f79f978a2040c5c1c8ad13826	
+File: /usr/lib/debug/usr/sbin/pppd.debug	100644	root:root	e064760b7f73296890d8e0b9502afb29	
+File: /usr/lib/debug/usr/sbin/pppdump.debug	100644	root:root	4fe8b164dba1890ca423b6a7f4d628b1	
+File: /usr/lib/debug/usr/sbin/pppstats.debug	100644	root:root	a51d5caef35563dd09b5c2b77318806d	
 File: /usr/src/debug/ppp-2.4.8	40755	root:root		
@@ -238,2 +236,2 @@
 File: /usr/src/debug/ppp-2.4.8/pppstats/pppstats.c	100644	root:root	7437f3a0a5493f48465c83d264637655	
-RPMIdentity: 921d6602e34466f87f28ede60986376f9db00ea6dd7d2e962c31aaffb858fc0fe35198f9ecbf73452041ffd5775ffb3ee7fbe7a7ca153382c8a87fdfc0e75eb9
+RPMIdentity: 0bfca24b5590faff9705e59207385eacf9c62697798ca78d668a0235148a8a63a777521d09903d9e84e6b3eb8232b7bf187efe2a05cbe2389782288aaa76b5b3
--- ppp-dhcp-2.4.8-alt3.x86_64.rpm.repo	2021-07-17 11:38:41.000000000 +0000
+++ ppp-dhcp-2.4.8-alt3.x86_64.rpm.hasher	2023-05-02 03:05:11.205826497 +0000
@@ -9,3 +9,3 @@
 Provides: ppp-dhcp = 2.4.8-alt3:sisyphus+279366.100.1.2
-File: /usr/lib64/pppd/2.4.8/dhcpc.so	100644	root:root	e3e5a6e248306f8045cc301f1a650f6c	
+File: /usr/lib64/pppd/2.4.8/dhcpc.so	100644	root:root	86dab2ad927f4166125cd36bd6d6374e	
 File: /usr/share/doc/ppp-dhcp-2.4.8	40755	root:root		
@@ -14,2 +14,2 @@
 File: /usr/share/doc/ppp-dhcp-2.4.8/README	100644	root:root	f5cb1aad349c5935679ee65a8157706d	
-RPMIdentity: 01446f4a8dd82378736041e4258031e101c8ed41d2706b3d21619aba69ebd2ab3b237eeabc825a2c6c51e742bd4cdf51ccfaa10a48221af19096bd9d28c831e7
+RPMIdentity: a687ef943c269abbdc8ca04a31290a94f19164c0ef660af6a681278e7eaf3be95a5384d6dde847ab8e349c0fde42c82138b695c8ca1b3ff1787b9da16f49fc73
--- ppp-dhcp-debuginfo-2.4.8-alt3.x86_64.rpm.repo	2021-07-17 11:38:41.000000000 +0000
+++ ppp-dhcp-debuginfo-2.4.8-alt3.x86_64.rpm.hasher	2023-05-02 03:05:11.274826083 +0000
@@ -1,4 +1,4 @@
-/usr/lib/debug/.build-id/5e	40755	root:root	
-/usr/lib/debug/.build-id/5e/81be98c71b9993196d4cdcd340c2249a0dba4f	120777	root:root	../../../../lib64/pppd/2.4.8/dhcpc.so
-/usr/lib/debug/.build-id/5e/81be98c71b9993196d4cdcd340c2249a0dba4f.debug	120777	root:root	../../usr/lib64/pppd/2.4.8/dhcpc.so.debug
+/usr/lib/debug/.build-id/75	40755	root:root	
+/usr/lib/debug/.build-id/75/591e1838fd9db506a2247b3149fddbf6ce4ba0	120777	root:root	../../../../lib64/pppd/2.4.8/dhcpc.so
+/usr/lib/debug/.build-id/75/591e1838fd9db506a2247b3149fddbf6ce4ba0.debug	120777	root:root	../../usr/lib64/pppd/2.4.8/dhcpc.so.debug
 /usr/lib/debug/usr/lib64/pppd	40755	root:root	
@@ -25,8 +25,8 @@
 Provides: ppp-dhcp-debuginfo = 2.4.8-alt3:sisyphus+279366.100.1.2
-File: /usr/lib/debug/.build-id/5e	40755	root:root		
-File: /usr/lib/debug/.build-id/5e/81be98c71b9993196d4cdcd340c2249a0dba4f	120777	root:root		../../../../lib64/pppd/2.4.8/dhcpc.so
-File: /usr/lib/debug/.build-id/5e/81be98c71b9993196d4cdcd340c2249a0dba4f.debug	120777	root:root		../../usr/lib64/pppd/2.4.8/dhcpc.so.debug
+File: /usr/lib/debug/.build-id/75	40755	root:root		
+File: /usr/lib/debug/.build-id/75/591e1838fd9db506a2247b3149fddbf6ce4ba0	120777	root:root		../../../../lib64/pppd/2.4.8/dhcpc.so
+File: /usr/lib/debug/.build-id/75/591e1838fd9db506a2247b3149fddbf6ce4ba0.debug	120777	root:root		../../usr/lib64/pppd/2.4.8/dhcpc.so.debug
 File: /usr/lib/debug/usr/lib64/pppd	40755	root:root		
 File: /usr/lib/debug/usr/lib64/pppd/2.4.8	40755	root:root		
-File: /usr/lib/debug/usr/lib64/pppd/2.4.8/dhcpc.so.debug	100644	root:root	5b3a8d266d8ce2b14f283e3f8f5d5c31	
+File: /usr/lib/debug/usr/lib64/pppd/2.4.8/dhcpc.so.debug	100644	root:root	b89d85a689f507a0f3519577d9779e7f	
 File: /usr/src/debug/ppp-2.4.8	40755	root:root		
@@ -46,2 +46,2 @@
 File: /usr/src/debug/ppp-2.4.8/pppd/plugins/dhcp/socket.h	100644	root:root	f0fe895a76193aeba4a17f467f71cf84	
-RPMIdentity: cd1cd15aeeb0ab4c33b96c65eabf4caea69baf1ef25ede31c36da7328a747fa3ee489b411a0d5d279a5c2ae59c1f763e961e6c848bb3aeb8531c93be93f03d71
+RPMIdentity: 541960a467443edc7db8825170ddbb3fd6242309c5c6fcb834714a6b9992d5b40c42cbfa4756e687c52f20c45d5578413fb561190c2cc2cb71a3de8374b03270
--- ppp-pppoatm-2.4.8-alt3.x86_64.rpm.repo	2021-07-17 11:38:41.000000000 +0000
+++ ppp-pppoatm-2.4.8-alt3.x86_64.rpm.hasher	2023-05-02 03:05:11.351825622 +0000
@@ -1,3 +1,2 @@
 /usr/lib64/pppd/2.4.8/pppoatm.so	100644	root:root	
-Requires: libresolv.so.2(GLIBC_2.2.5)(64bit)  
 Requires: ppp = 2.4.8-alt3:sisyphus+279366.100.1.2
@@ -6,3 +5,3 @@
 Provides: ppp-pppoatm = 2.4.8-alt3:sisyphus+279366.100.1.2
-File: /usr/lib64/pppd/2.4.8/pppoatm.so	100644	root:root	a4565380fc5df79e8c76486fab08fe75	
-RPMIdentity: 8d6bb8502e78e61ac54ea908aef674e8db8fcbf20bff03bebe5529edbf66041aa862d8d840a8244c995ddd2a02cfc7b018343c9c3d14b17b479970777f028d37
+File: /usr/lib64/pppd/2.4.8/pppoatm.so	100644	root:root	a7289f07b70257196bb189eaed42a512	
+RPMIdentity: 931eaa5b4853147855588546824e3de7ea83bcb4f45914ed746b4f135856f8eeed49a6ec2359ecef87180ec458d6421a70b8402afdceb68cf30549db7b54a07c
--- ppp-pppoatm-debuginfo-2.4.8-alt3.x86_64.rpm.repo	2021-07-17 11:38:41.000000000 +0000
+++ ppp-pppoatm-debuginfo-2.4.8-alt3.x86_64.rpm.hasher	2023-05-02 03:05:11.422825197 +0000
@@ -1,4 +1,4 @@
-/usr/lib/debug/.build-id/eb	40755	root:root	
-/usr/lib/debug/.build-id/eb/56e303e541989e21cbc14d2f924a00aab1a121	120777	root:root	../../../../lib64/pppd/2.4.8/pppoatm.so
-/usr/lib/debug/.build-id/eb/56e303e541989e21cbc14d2f924a00aab1a121.debug	120777	root:root	../../usr/lib64/pppd/2.4.8/pppoatm.so.debug
+/usr/lib/debug/.build-id/d9	40755	root:root	
+/usr/lib/debug/.build-id/d9/8ca02224afa814bed376ab2625d1b0b13bda2d	120777	root:root	../../../../lib64/pppd/2.4.8/pppoatm.so
+/usr/lib/debug/.build-id/d9/8ca02224afa814bed376ab2625d1b0b13bda2d.debug	120777	root:root	../../usr/lib64/pppd/2.4.8/pppoatm.so.debug
 /usr/lib/debug/usr/lib64/pppd	40755	root:root	
@@ -11,3 +11,2 @@
 /usr/src/debug/ppp-2.4.8/pppd/plugins/pppoatm/pppoatm.c	100644	root:root	
-Requires: debug64(libresolv.so.2)  
 Requires: ppp-pppoatm = 2.4.8-alt3:sisyphus+279366.100.1.2
@@ -16,8 +15,8 @@
 Provides: ppp-pppoatm-debuginfo = 2.4.8-alt3:sisyphus+279366.100.1.2
-File: /usr/lib/debug/.build-id/eb	40755	root:root		
-File: /usr/lib/debug/.build-id/eb/56e303e541989e21cbc14d2f924a00aab1a121	120777	root:root		../../../../lib64/pppd/2.4.8/pppoatm.so
-File: /usr/lib/debug/.build-id/eb/56e303e541989e21cbc14d2f924a00aab1a121.debug	120777	root:root		../../usr/lib64/pppd/2.4.8/pppoatm.so.debug
+File: /usr/lib/debug/.build-id/d9	40755	root:root		
+File: /usr/lib/debug/.build-id/d9/8ca02224afa814bed376ab2625d1b0b13bda2d	120777	root:root		../../../../lib64/pppd/2.4.8/pppoatm.so
+File: /usr/lib/debug/.build-id/d9/8ca02224afa814bed376ab2625d1b0b13bda2d.debug	120777	root:root		../../usr/lib64/pppd/2.4.8/pppoatm.so.debug
 File: /usr/lib/debug/usr/lib64/pppd	40755	root:root		
 File: /usr/lib/debug/usr/lib64/pppd/2.4.8	40755	root:root		
-File: /usr/lib/debug/usr/lib64/pppd/2.4.8/pppoatm.so.debug	100644	root:root	f82a0dad30a183549c249111ed468ab4	
+File: /usr/lib/debug/usr/lib64/pppd/2.4.8/pppoatm.so.debug	100644	root:root	339e02519854d6d5610ebb21c6d7674d	
 File: /usr/src/debug/ppp-2.4.8	40755	root:root		
@@ -27,2 +26,2 @@
 File: /usr/src/debug/ppp-2.4.8/pppd/plugins/pppoatm/pppoatm.c	100644	root:root	f1678fb1a2e32edaf00bddaf81805d09	
-RPMIdentity: 4951de26819e5f218e8a9bcceda2a731f2ac1ec8c3552f242241f4a19911ee6da5e35381fae75693519761351abb678e613dafc768433a1043d331a71104d0fa
+RPMIdentity: 55ca2c359518d4d744e96518232725b0c0e935c6d32b5b24dfe56f3ac8b310be5234f4bad24a6071131344bc5ad789d1f2a194dad3b62841fee14618afe3f2b8
--- ppp-pppoe-2.4.8-alt3.x86_64.rpm.repo	2021-07-17 11:38:41.000000000 +0000
+++ ppp-pppoe-2.4.8-alt3.x86_64.rpm.hasher	2023-05-02 03:05:11.503824711 +0000
@@ -7,5 +7,5 @@
 Provides: ppp-pppoe = 2.4.8-alt3:sisyphus+279366.100.1.2
-File: /usr/lib64/pppd/2.4.8/rp-pppoe.so	100644	root:root	605af5cf722bdf570743174881dfe550	
-File: /usr/sbin/pppoe-discovery	100755	root:root	a455834821964812a51cb52d7741f7ab	
+File: /usr/lib64/pppd/2.4.8/rp-pppoe.so	100644	root:root	6d0fd0c46079089a786328150e9538c5	
+File: /usr/sbin/pppoe-discovery	100755	root:root	315949df11476de76a787f9358309315	
 File: /usr/share/man/man8/pppoe-discovery.8.xz	100644	root:root	4f8700b570b6ec364a19c0677742a5d4	
-RPMIdentity: 2561abcda793718708d1cd36991298bbb48cfb243bb28c9b18739fef19d1df8ad4680716d7de3f02609aa5ef3b80319aa8fc7b7ea7974d7d6230907c9b7ca8b2
+RPMIdentity: 762700b5ba1d6457f9c2d64d09a24c2f5ccc5a2dcb475c7991ee921e230ea62855776635bcb3ad866ff9a44c4d7d9c8e1802f2520284bacb271f4bc8e11462e2
--- ppp-pppoe-debuginfo-2.4.8-alt3.x86_64.rpm.repo	2021-07-17 11:38:41.000000000 +0000
+++ ppp-pppoe-debuginfo-2.4.8-alt3.x86_64.rpm.hasher	2023-05-02 03:05:11.580824250 +0000
@@ -1,7 +1,7 @@
-/usr/lib/debug/.build-id/15	40755	root:root	
-/usr/lib/debug/.build-id/15/72d7b308ef681bd8dff7d44543ff3328069e5b	120777	root:root	../../../../sbin/pppoe-discovery
-/usr/lib/debug/.build-id/15/72d7b308ef681bd8dff7d44543ff3328069e5b.debug	120777	root:root	../../usr/sbin/pppoe-discovery.debug
-/usr/lib/debug/.build-id/29	40755	root:root	
-/usr/lib/debug/.build-id/29/394c58a326e6c61afeb4e1de34feb76c2f75a8	120777	root:root	../../../../lib64/pppd/2.4.8/rp-pppoe.so
-/usr/lib/debug/.build-id/29/394c58a326e6c61afeb4e1de34feb76c2f75a8.debug	120777	root:root	../../usr/lib64/pppd/2.4.8/rp-pppoe.so.debug
+/usr/lib/debug/.build-id/82	40755	root:root	
+/usr/lib/debug/.build-id/82/6ca691e1904a5b17d3b1235e113755cd12b865	120777	root:root	../../../../sbin/pppoe-discovery
+/usr/lib/debug/.build-id/82/6ca691e1904a5b17d3b1235e113755cd12b865.debug	120777	root:root	../../usr/sbin/pppoe-discovery.debug
+/usr/lib/debug/.build-id/b8	40755	root:root	
+/usr/lib/debug/.build-id/b8/5465023abdd1141eee8cebe2c7117f55b86ef7	120777	root:root	../../../../lib64/pppd/2.4.8/rp-pppoe.so
+/usr/lib/debug/.build-id/b8/5465023abdd1141eee8cebe2c7117f55b86ef7.debug	120777	root:root	../../usr/lib64/pppd/2.4.8/rp-pppoe.so.debug
 /usr/lib/debug/usr/lib64/pppd	40755	root:root	
@@ -25,12 +25,12 @@
 Provides: ppp-pppoe-debuginfo = 2.4.8-alt3:sisyphus+279366.100.1.2
-File: /usr/lib/debug/.build-id/15	40755	root:root		
-File: /usr/lib/debug/.build-id/15/72d7b308ef681bd8dff7d44543ff3328069e5b	120777	root:root		../../../../sbin/pppoe-discovery
-File: /usr/lib/debug/.build-id/15/72d7b308ef681bd8dff7d44543ff3328069e5b.debug	120777	root:root		../../usr/sbin/pppoe-discovery.debug
-File: /usr/lib/debug/.build-id/29	40755	root:root		
-File: /usr/lib/debug/.build-id/29/394c58a326e6c61afeb4e1de34feb76c2f75a8	120777	root:root		../../../../lib64/pppd/2.4.8/rp-pppoe.so
-File: /usr/lib/debug/.build-id/29/394c58a326e6c61afeb4e1de34feb76c2f75a8.debug	120777	root:root		../../usr/lib64/pppd/2.4.8/rp-pppoe.so.debug
+File: /usr/lib/debug/.build-id/82	40755	root:root		
+File: /usr/lib/debug/.build-id/82/6ca691e1904a5b17d3b1235e113755cd12b865	120777	root:root		../../../../sbin/pppoe-discovery
+File: /usr/lib/debug/.build-id/82/6ca691e1904a5b17d3b1235e113755cd12b865.debug	120777	root:root		../../usr/sbin/pppoe-discovery.debug
+File: /usr/lib/debug/.build-id/b8	40755	root:root		
+File: /usr/lib/debug/.build-id/b8/5465023abdd1141eee8cebe2c7117f55b86ef7	120777	root:root		../../../../lib64/pppd/2.4.8/rp-pppoe.so
+File: /usr/lib/debug/.build-id/b8/5465023abdd1141eee8cebe2c7117f55b86ef7.debug	120777	root:root		../../usr/lib64/pppd/2.4.8/rp-pppoe.so.debug
 File: /usr/lib/debug/usr/lib64/pppd	40755	root:root		
 File: /usr/lib/debug/usr/lib64/pppd/2.4.8	40755	root:root		
-File: /usr/lib/debug/usr/lib64/pppd/2.4.8/rp-pppoe.so.debug	100644	root:root	b91bed4be65545f254cc97db0843246a	
-File: /usr/lib/debug/usr/sbin/pppoe-discovery.debug	100644	root:root	2847ffb2264a5561abadf701e11da748	
+File: /usr/lib/debug/usr/lib64/pppd/2.4.8/rp-pppoe.so.debug	100644	root:root	31aaf7157dcc8b242f27bd60cbd6ee68	
+File: /usr/lib/debug/usr/sbin/pppoe-discovery.debug	100644	root:root	1d9e9f88d0e305c6c3e00f012a2697dd	
 File: /usr/src/debug/ppp-2.4.8	40755	root:root		
@@ -46,2 +46,2 @@
 File: /usr/src/debug/ppp-2.4.8/pppd/plugins/rp-pppoe/pppoe.h	100644	root:root	7acb6dfd8937a778601193d0c38341ef	
-RPMIdentity: 09cf47e36f7c5134764016a547e26a44d3f1d0778c40ae4759349a76a093a1421bc6840b6331097cb9dcc0a6d13e17d90e6050c5bfa4fa2de349b864a20c8d62
+RPMIdentity: 5b1e07f14fabd4b6aa8729dc0fe08cd74030200b16e3e60fa8e02f2d7660efb4d67f9904722973cdf38771e4bff1f4e6135d4e68a4e0636a6d69f30b9b5ef6f0
--- ppp-radius-2.4.8-alt3.x86_64.rpm.repo	2021-07-17 11:38:41.000000000 +0000
+++ ppp-radius-2.4.8-alt3.x86_64.rpm.hasher	2023-05-02 03:05:11.655823801 +0000
@@ -35,7 +35,7 @@
 File: /etc/ppp/radius/servers	100644	root:root	d04ebe819296aad1a8f67b4823be6e64	
-File: /usr/lib64/pppd/2.4.8/radattr.so	100644	root:root	8f673c9b79b1d8b8ca4a5ab7a7111d0b	
-File: /usr/lib64/pppd/2.4.8/radius.so	100644	root:root	50c4e95e90994a942b660dc02d20e65d	
-File: /usr/lib64/pppd/2.4.8/radrealms.so	100644	root:root	e91de40706c3808340d28cb68ed7db19	
+File: /usr/lib64/pppd/2.4.8/radattr.so	100644	root:root	7d0f20b42a7f4d169a1e41ea9728c031	
+File: /usr/lib64/pppd/2.4.8/radius.so	100644	root:root	f9fb5bbcd0a3389f09f0adeb098ee8f7	
+File: /usr/lib64/pppd/2.4.8/radrealms.so	100644	root:root	52415655fc46671f621baf00f622b951	
 File: /usr/share/man/man8/pppd-radattr.8.xz	100644	root:root	16004a98df311ca44a09d89cf72a0fbd	
 File: /usr/share/man/man8/pppd-radius.8.xz	100644	root:root	7d16442725f52cfb86f9421844dab956	
-RPMIdentity: 987f4252ba4e4771a00816f34a992247faed78b314fb16580228a48db1b222069d84cacf423a8b110498ea0b852d703665d0ed9f81dda432407049738740a791
+RPMIdentity: 49ed9bec1991db7458cd0a30004adca67105f12088fdb892105a56bfa0eaff4da94373348ee7c73dcc7a939c415f5f7f4d76c32c24656142e77ee8b8cfdb0863
--- ppp-radius-debuginfo-2.4.8-alt3.x86_64.rpm.repo	2021-07-17 11:38:41.000000000 +0000
+++ ppp-radius-debuginfo-2.4.8-alt3.x86_64.rpm.hasher	2023-05-02 03:05:11.738823303 +0000
@@ -1,10 +1,10 @@
-/usr/lib/debug/.build-id/a9	40755	root:root	
-/usr/lib/debug/.build-id/a9/f50e08d1bb7439783e349b4cff2dc3ab774d6b	120777	root:root	../../../../lib64/pppd/2.4.8/radattr.so
-/usr/lib/debug/.build-id/a9/f50e08d1bb7439783e349b4cff2dc3ab774d6b.debug	120777	root:root	../../usr/lib64/pppd/2.4.8/radattr.so.debug
-/usr/lib/debug/.build-id/bc	40755	root:root	
-/usr/lib/debug/.build-id/bc/0ed4438b4344ff912cc09a0375802b33f6cac2	120777	root:root	../../../../lib64/pppd/2.4.8/radius.so
-/usr/lib/debug/.build-id/bc/0ed4438b4344ff912cc09a0375802b33f6cac2.debug	120777	root:root	../../usr/lib64/pppd/2.4.8/radius.so.debug
-/usr/lib/debug/.build-id/c2	40755	root:root	
-/usr/lib/debug/.build-id/c2/68ac1ac2a15f4e85dbed8cd174d887a0aeaa5b	120777	root:root	../../../../lib64/pppd/2.4.8/radrealms.so
-/usr/lib/debug/.build-id/c2/68ac1ac2a15f4e85dbed8cd174d887a0aeaa5b.debug	120777	root:root	../../usr/lib64/pppd/2.4.8/radrealms.so.debug
+/usr/lib/debug/.build-id/13	40755	root:root	
+/usr/lib/debug/.build-id/13/7ac6203108522cb4dbf4f5d268a3044948720e	120777	root:root	../../../../lib64/pppd/2.4.8/radius.so
+/usr/lib/debug/.build-id/13/7ac6203108522cb4dbf4f5d268a3044948720e.debug	120777	root:root	../../usr/lib64/pppd/2.4.8/radius.so.debug
+/usr/lib/debug/.build-id/66	40755	root:root	
+/usr/lib/debug/.build-id/66/042d217880130fba0f6a8c87a0b481b3490a3f	120777	root:root	../../../../lib64/pppd/2.4.8/radrealms.so
+/usr/lib/debug/.build-id/66/042d217880130fba0f6a8c87a0b481b3490a3f.debug	120777	root:root	../../usr/lib64/pppd/2.4.8/radrealms.so.debug
+/usr/lib/debug/.build-id/9d	40755	root:root	
+/usr/lib/debug/.build-id/9d/7e209f4fadee6c9ca66c9bff73d54769d0f3ee	120777	root:root	../../../../lib64/pppd/2.4.8/radattr.so
+/usr/lib/debug/.build-id/9d/7e209f4fadee6c9ca66c9bff73d54769d0f3ee.debug	120777	root:root	../../usr/lib64/pppd/2.4.8/radattr.so.debug
 /usr/lib/debug/usr/lib64/pppd	40755	root:root	
@@ -38,16 +38,16 @@
 Provides: ppp-radius-debuginfo = 2.4.8-alt3:sisyphus+279366.100.1.2
-File: /usr/lib/debug/.build-id/a9	40755	root:root		
-File: /usr/lib/debug/.build-id/a9/f50e08d1bb7439783e349b4cff2dc3ab774d6b	120777	root:root		../../../../lib64/pppd/2.4.8/radattr.so
-File: /usr/lib/debug/.build-id/a9/f50e08d1bb7439783e349b4cff2dc3ab774d6b.debug	120777	root:root		../../usr/lib64/pppd/2.4.8/radattr.so.debug
-File: /usr/lib/debug/.build-id/bc	40755	root:root		
-File: /usr/lib/debug/.build-id/bc/0ed4438b4344ff912cc09a0375802b33f6cac2	120777	root:root		../../../../lib64/pppd/2.4.8/radius.so
-File: /usr/lib/debug/.build-id/bc/0ed4438b4344ff912cc09a0375802b33f6cac2.debug	120777	root:root		../../usr/lib64/pppd/2.4.8/radius.so.debug
-File: /usr/lib/debug/.build-id/c2	40755	root:root		
-File: /usr/lib/debug/.build-id/c2/68ac1ac2a15f4e85dbed8cd174d887a0aeaa5b	120777	root:root		../../../../lib64/pppd/2.4.8/radrealms.so
-File: /usr/lib/debug/.build-id/c2/68ac1ac2a15f4e85dbed8cd174d887a0aeaa5b.debug	120777	root:root		../../usr/lib64/pppd/2.4.8/radrealms.so.debug
+File: /usr/lib/debug/.build-id/13	40755	root:root		
+File: /usr/lib/debug/.build-id/13/7ac6203108522cb4dbf4f5d268a3044948720e	120777	root:root		../../../../lib64/pppd/2.4.8/radius.so
+File: /usr/lib/debug/.build-id/13/7ac6203108522cb4dbf4f5d268a3044948720e.debug	120777	root:root		../../usr/lib64/pppd/2.4.8/radius.so.debug
+File: /usr/lib/debug/.build-id/66	40755	root:root		
+File: /usr/lib/debug/.build-id/66/042d217880130fba0f6a8c87a0b481b3490a3f	120777	root:root		../../../../lib64/pppd/2.4.8/radrealms.so
+File: /usr/lib/debug/.build-id/66/042d217880130fba0f6a8c87a0b481b3490a3f.debug	120777	root:root		../../usr/lib64/pppd/2.4.8/radrealms.so.debug
+File: /usr/lib/debug/.build-id/9d	40755	root:root		
+File: /usr/lib/debug/.build-id/9d/7e209f4fadee6c9ca66c9bff73d54769d0f3ee	120777	root:root		../../../../lib64/pppd/2.4.8/radattr.so
+File: /usr/lib/debug/.build-id/9d/7e209f4fadee6c9ca66c9bff73d54769d0f3ee.debug	120777	root:root		../../usr/lib64/pppd/2.4.8/radattr.so.debug
 File: /usr/lib/debug/usr/lib64/pppd	40755	root:root		
 File: /usr/lib/debug/usr/lib64/pppd/2.4.8	40755	root:root		
-File: /usr/lib/debug/usr/lib64/pppd/2.4.8/radattr.so.debug	100644	root:root	85a6fb541067c25416d12a729d2cc0ab	
-File: /usr/lib/debug/usr/lib64/pppd/2.4.8/radius.so.debug	100644	root:root	61aaf60cecc8d86c758a33b0c9a6da67	
-File: /usr/lib/debug/usr/lib64/pppd/2.4.8/radrealms.so.debug	100644	root:root	42d225006abd85293634cbbbafc2d89b	
+File: /usr/lib/debug/usr/lib64/pppd/2.4.8/radattr.so.debug	100644	root:root	1c5cbe10840ad6a3c9dc67266f8fd6dd	
+File: /usr/lib/debug/usr/lib64/pppd/2.4.8/radius.so.debug	100644	root:root	5f3d11c9abb23b47a9e589d26a2ce76a	
+File: /usr/lib/debug/usr/lib64/pppd/2.4.8/radrealms.so.debug	100644	root:root	cb63c4a23a11e0a7a510468d23befffd	
 File: /usr/src/debug/ppp-2.4.8	40755	root:root		
@@ -72,2 +72,2 @@
 File: /usr/src/debug/ppp-2.4.8/pppd/plugins/radius/util.c	100644	root:root	ca0b824866a7b18cc44abc334ae5978b	
-RPMIdentity: 8ae013c8206da8731d9285e4b2dd701f75795f687b535c4ff1701bc36964dc5dbb9eb00839e0991ea11fdc0c54e7a76716ce0a6bdd917cc0d574dc33dde53a47
+RPMIdentity: a734f775eca8aec04afcc2de20da4b92e1f21841711abb7a4afbb7526200b5909494c79a734d1b02e1c818a60f6b2bc5831a7dfaaf84e2d500065e08a7e49a32