<86>Mar 30 02:22:25 userdel[266655]: delete user 'rooter'
<86>Mar 30 02:22:25 userdel[266655]: removed group 'rooter' owned by 'rooter'
<86>Mar 30 02:22:25 userdel[266655]: removed shadow group 'rooter' owned by 'rooter'
<86>Mar 30 02:22:25 groupadd[266693]: group added to /etc/group: name=rooter, GID=1311
<86>Mar 30 02:22:25 groupadd[266693]: group added to /etc/gshadow: name=rooter
<86>Mar 30 02:22:25 groupadd[266693]: new group: name=rooter, GID=1311
<86>Mar 30 02:22:25 useradd[266725]: new user: name=rooter, UID=1311, GID=1311, home=/root, shell=/bin/bash
<86>Mar 30 02:22:25 userdel[266770]: delete user 'builder'
<86>Mar 30 02:22:25 userdel[266770]: removed group 'builder' owned by 'builder'
<86>Mar 30 02:22:25 userdel[266770]: removed shadow group 'builder' owned by 'builder'
<86>Mar 30 02:22:25 groupadd[266813]: group added to /etc/group: name=builder, GID=1312
<86>Mar 30 02:22:25 groupadd[266813]: group added to /etc/gshadow: name=builder
<86>Mar 30 02:22:25 groupadd[266813]: new group: name=builder, GID=1312
<86>Mar 30 02:22:25 useradd[266840]: new user: name=builder, UID=1312, GID=1312, home=/usr/src, shell=/bin/bash
/usr/src/in/srpm/libcds-2.0.0-alt2.src.rpm: license not found in '/usr/share/license' directory: like
<13>Mar 30 02:22:28 rpmi: libboost_system1.80.0-1:1.80.0-alt1 sisyphus+308894.400.1.1 1666588748 installed
<13>Mar 30 02:22:28 rpmi: libboost_atomic1.80.0-1:1.80.0-alt1 sisyphus+308894.400.1.1 1666588748 installed
<13>Mar 30 02:22:28 rpmi: libboost_contract1.80.0-1:1.80.0-alt1 sisyphus+308894.400.1.1 1666588748 installed
<13>Mar 30 02:22:28 rpmi: libboost_chrono1.80.0-1:1.80.0-alt1 sisyphus+308894.400.1.1 1666588748 installed
<13>Mar 30 02:22:28 rpmi: libboost_timer1.80.0-1:1.80.0-alt1 sisyphus+308894.400.1.1 1666588748 installed
<13>Mar 30 02:22:28 rpmi: libboost_thread1.80.0-1:1.80.0-alt1 sisyphus+308894.400.1.1 1666588748 installed
<13>Mar 30 02:22:28 rpmi: libboost_type_erasure1.80.0-1:1.80.0-alt1 sisyphus+308894.400.1.1 1666588748 installed
<13>Mar 30 02:22:28 rpmi: gcc-c++-common-1.4.27-alt1 sisyphus+278099.1300.1.1 1626028636 installed
<13>Mar 30 02:22:28 rpmi: libstdc++12-devel-12.2.1-alt1 sisyphus+317240.100.2.1 1679582373 installed
<13>Mar 30 02:22:28 rpmi: gcc12-c++-12.2.1-alt1 sisyphus+317240.100.2.1 1679582373 installed
<13>Mar 30 02:22:28 rpmi: libboost_context1.80.0-1:1.80.0-alt1 sisyphus+308894.400.1.1 1666588748 installed
<13>Mar 30 02:22:28 rpmi: libboost_fiber1.80.0-1:1.80.0-alt1 sisyphus+308894.400.1.1 1666588748 installed
<13>Mar 30 02:22:28 rpmi: libboost_stacktrace1.80.0-1:1.80.0-alt1 sisyphus+308894.400.1.1 1666588748 installed
<13>Mar 30 02:22:28 rpmi: libboost_nowide1.80.0-1:1.80.0-alt1 sisyphus+308894.400.1.1 1666588748 installed
<13>Mar 30 02:22:28 rpmi: libboost_test1.80.0-1:1.80.0-alt1 sisyphus+308894.400.1.1 1666588748 installed
<13>Mar 30 02:22:28 rpmi: libboost_serialization1.80.0-1:1.80.0-alt1 sisyphus+308894.400.1.1 1666588748 installed
<13>Mar 30 02:22:28 rpmi: libboost_random1.80.0-1:1.80.0-alt1 sisyphus+308894.400.1.1 1666588748 installed
<13>Mar 30 02:22:28 rpmi: libboost_iostreams1.80.0-1:1.80.0-alt1 sisyphus+308894.400.1.1 1666588748 installed
<13>Mar 30 02:22:28 rpmi: libboost_json1.80.0-1:1.80.0-alt1 sisyphus+308894.400.1.1 1666588748 installed
<13>Mar 30 02:22:28 rpmi: libboost_regex1.80.0-1:1.80.0-alt1 sisyphus+308894.400.1.1 1666588748 installed
<13>Mar 30 02:22:28 rpmi: libboost_graph1.80.0-1:1.80.0-alt1 sisyphus+308894.400.1.1 1666588748 installed
<13>Mar 30 02:22:28 rpmi: libboost_date_time1.80.0-1:1.80.0-alt1 sisyphus+308894.400.1.1 1666588748 installed
<13>Mar 30 02:22:28 rpmi: libboost_container1.80.0-1:1.80.0-alt1 sisyphus+308894.400.1.1 1666588748 installed
<13>Mar 30 02:22:29 rpmi: boost-devel-headers-1:1.80.0-alt1 sisyphus+308894.400.1.1 1666588748 installed
<13>Mar 30 02:22:29 rpmi: boost-devel-1:1.80.0-alt1 sisyphus+308894.400.1.1 1666588748 installed
<13>Mar 30 02:22:29 rpmi: gcc-c++-12-alt1 sisyphus+300988.300.1.1 1654033053 installed
<13>Mar 30 02:22:29 rpmi: libdb4.7-devel-4.7.25-alt12 sisyphus+283793.100.2.1 1629966936 installed
Building target platforms: x86_64
Building for target x86_64
Wrote: /usr/src/in/nosrpm/libcds-2.0.0-alt2.nosrc.rpm (w1.gzdio)
Installing libcds-2.0.0-alt2.src.rpm
Building target platforms: x86_64
Building for target x86_64
Executing(%prep): /bin/sh -e /usr/src/tmp/rpm-tmp.29840
+ umask 022
+ /bin/mkdir -p /usr/src/RPM/BUILD
+ cd /usr/src/RPM/BUILD
+ cd /usr/src/RPM/BUILD
+ rm -rf libcds-2.0.0
+ echo 'Source #0 (libcds-2.0.0.tar):'
Source #0 (libcds-2.0.0.tar):
+ /bin/tar -xf /usr/src/RPM/SOURCES/libcds-2.0.0.tar
+ cd libcds-2.0.0
+ /bin/chmod -c -Rf u+rwX,go-w .
+ exit 0
Executing(%build): /bin/sh -e /usr/src/tmp/rpm-tmp.29840
+ umask 022
+ /bin/mkdir -p /usr/src/RPM/BUILD
+ cd /usr/src/RPM/BUILD
+ cd libcds-2.0.0
+ cd build
+ export CDS_PLATFORM_DEBUG_LDFLAGS=-lpthread
+ CDS_PLATFORM_DEBUG_LDFLAGS=-lpthread
+ ./build.sh -t release -o linux -z '-pipe -frecord-gcc-switches -Wall -g -O2 -flto=auto' -b 64
compiler version=g++ 12
./build.sh: line 456: test: !=: unary operator expected
Building with the following options ...
Processor: amd64
Platform: linux
C Compiler: gcc
C++ Compiler: g++
C++ Compiler version: 12
Bits to build: 64
Compile options:  -pipe -frecord-gcc-switches -Wall -g -O2 -flto=auto -m64 -fPIC -march=native  
Link options:  -m64 -fPIC 
Link options (for test cds-unit app):  -m64 -fPIC 
PATH=/usr/src/bin:/bin:/usr/bin:/usr/X11R6/bin:/usr/games
LD_LIBRARY_PATH=
BIN_PATH=../bin/gcc-amd64-linux-64
OBJ_PATH=../obj/gcc-amd64-linux-64
x86_64-alt-linux-g++ (GCC) 12.2.1 20230322 (ALT Sisyphus 12.2.1-alt1)
Build started
---------------------------------
Make debug library
make: Entering directory '/usr/src/RPM/BUILD/libcds-2.0.0/build'
g++ -std=c++11 -c  -pipe -frecord-gcc-switches -Wall -g -O2 -flto=auto -D_DEBUG -O0 -g  -m64 -fPIC -march=native   -D_REENTRANT -D_POSIX_PTHREAD_SEMANTICS -D_FILE_OFFSET_BITS=64 -I..  -o ../obj/gcc-amd64-linux-64/debug/hp_gc.o ../src/hp_gc.cpp
g++ -std=c++11 -c  -pipe -frecord-gcc-switches -Wall -g -O2 -flto=auto -D_DEBUG -O0 -g  -m64 -fPIC -march=native   -D_REENTRANT -D_POSIX_PTHREAD_SEMANTICS -D_FILE_OFFSET_BITS=64 -I..  -o ../obj/gcc-amd64-linux-64/debug/init.o ../src/init.cpp
g++ -std=c++11 -c  -pipe -frecord-gcc-switches -Wall -g -O2 -flto=auto -D_DEBUG -O0 -g  -m64 -fPIC -march=native   -D_REENTRANT -D_POSIX_PTHREAD_SEMANTICS -D_FILE_OFFSET_BITS=64 -I..  -o ../obj/gcc-amd64-linux-64/debug/dhp_gc.o ../src/dhp_gc.cpp
g++ -std=c++11 -c  -pipe -frecord-gcc-switches -Wall -g -O2 -flto=auto -D_DEBUG -O0 -g  -m64 -fPIC -march=native   -D_REENTRANT -D_POSIX_PTHREAD_SEMANTICS -D_FILE_OFFSET_BITS=64 -I..  -o ../obj/gcc-amd64-linux-64/debug/urcu_gp.o ../src/urcu_gp.cpp
g++ -std=c++11 -c  -pipe -frecord-gcc-switches -Wall -g -O2 -flto=auto -D_DEBUG -O0 -g  -m64 -fPIC -march=native   -D_REENTRANT -D_POSIX_PTHREAD_SEMANTICS -D_FILE_OFFSET_BITS=64 -I..  -o ../obj/gcc-amd64-linux-64/debug/urcu_sh.o ../src/urcu_sh.cpp
g++ -std=c++11 -c  -pipe -frecord-gcc-switches -Wall -g -O2 -flto=auto -D_DEBUG -O0 -g  -m64 -fPIC -march=native   -D_REENTRANT -D_POSIX_PTHREAD_SEMANTICS -D_FILE_OFFSET_BITS=64 -I..  -o ../obj/gcc-amd64-linux-64/debug/michael_heap.o ../src/michael_heap.cpp
g++ -std=c++11 -c  -pipe -frecord-gcc-switches -Wall -g -O2 -flto=auto -D_DEBUG -O0 -g  -m64 -fPIC -march=native   -D_REENTRANT -D_POSIX_PTHREAD_SEMANTICS -D_FILE_OFFSET_BITS=64 -I..  -o ../obj/gcc-amd64-linux-64/debug/topology_hpux.o ../src/topology_hpux.cpp
g++ -std=c++11 -c  -pipe -frecord-gcc-switches -Wall -g -O2 -flto=auto -D_DEBUG -O0 -g  -m64 -fPIC -march=native   -D_REENTRANT -D_POSIX_PTHREAD_SEMANTICS -D_FILE_OFFSET_BITS=64 -I..  -o ../obj/gcc-amd64-linux-64/debug/topology_linux.o ../src/topology_linux.cpp
g++ -std=c++11 -c  -pipe -frecord-gcc-switches -Wall -g -O2 -flto=auto -D_DEBUG -O0 -g  -m64 -fPIC -march=native   -D_REENTRANT -D_POSIX_PTHREAD_SEMANTICS -D_FILE_OFFSET_BITS=64 -I..  -o ../obj/gcc-amd64-linux-64/debug/topology_osx.o ../src/topology_osx.cpp
g++ -std=c++11 -c  -pipe -frecord-gcc-switches -Wall -g -O2 -flto=auto -D_DEBUG -O0 -g  -m64 -fPIC -march=native   -D_REENTRANT -D_POSIX_PTHREAD_SEMANTICS -D_FILE_OFFSET_BITS=64 -I..  -o ../obj/gcc-amd64-linux-64/debug/dllmain.o ../src/dllmain.cpp
g++  -shared  -m64 -fPIC   -lpthread ../obj/gcc-amd64-linux-64/debug/hp_gc.o ../obj/gcc-amd64-linux-64/debug/init.o ../obj/gcc-amd64-linux-64/debug/dhp_gc.o ../obj/gcc-amd64-linux-64/debug/urcu_gp.o ../obj/gcc-amd64-linux-64/debug/urcu_sh.o ../obj/gcc-amd64-linux-64/debug/michael_heap.o ../obj/gcc-amd64-linux-64/debug/topology_hpux.o ../obj/gcc-amd64-linux-64/debug/topology_linux.o ../obj/gcc-amd64-linux-64/debug/topology_osx.o ../obj/gcc-amd64-linux-64/debug/dllmain.o -o libcds-debug.so.2.0.0 -lpthread -ldl -lstdc++
mv ./libcds-debug.so.2.0.0 ../bin/gcc-amd64-linux-64/libcds-debug.so.2.0.0
ln -sf libcds-debug.so.2.0.0 ../bin/gcc-amd64-linux-64/libcds-debug.so
make: Leaving directory '/usr/src/RPM/BUILD/libcds-2.0.0/build'
---------------------------------
Make release library
make: Entering directory '/usr/src/RPM/BUILD/libcds-2.0.0/build'
g++ -std=c++11 -c  -pipe -frecord-gcc-switches -Wall -g -O2 -flto=auto -DNDEBUG -O3 -fno-strict-aliasing  -m64 -fPIC -march=native    -D_REENTRANT -D_POSIX_PTHREAD_SEMANTICS -D_FILE_OFFSET_BITS=64 -I..  -o ../obj/gcc-amd64-linux-64/release/hp_gc.o ../src/hp_gc.cpp
g++ -std=c++11 -c  -pipe -frecord-gcc-switches -Wall -g -O2 -flto=auto -DNDEBUG -O3 -fno-strict-aliasing  -m64 -fPIC -march=native    -D_REENTRANT -D_POSIX_PTHREAD_SEMANTICS -D_FILE_OFFSET_BITS=64 -I..  -o ../obj/gcc-amd64-linux-64/release/init.o ../src/init.cpp
g++ -std=c++11 -c  -pipe -frecord-gcc-switches -Wall -g -O2 -flto=auto -DNDEBUG -O3 -fno-strict-aliasing  -m64 -fPIC -march=native    -D_REENTRANT -D_POSIX_PTHREAD_SEMANTICS -D_FILE_OFFSET_BITS=64 -I..  -o ../obj/gcc-amd64-linux-64/release/dhp_gc.o ../src/dhp_gc.cpp
g++ -std=c++11 -c  -pipe -frecord-gcc-switches -Wall -g -O2 -flto=auto -DNDEBUG -O3 -fno-strict-aliasing  -m64 -fPIC -march=native    -D_REENTRANT -D_POSIX_PTHREAD_SEMANTICS -D_FILE_OFFSET_BITS=64 -I..  -o ../obj/gcc-amd64-linux-64/release/urcu_gp.o ../src/urcu_gp.cpp
g++ -std=c++11 -c  -pipe -frecord-gcc-switches -Wall -g -O2 -flto=auto -DNDEBUG -O3 -fno-strict-aliasing  -m64 -fPIC -march=native    -D_REENTRANT -D_POSIX_PTHREAD_SEMANTICS -D_FILE_OFFSET_BITS=64 -I..  -o ../obj/gcc-amd64-linux-64/release/urcu_sh.o ../src/urcu_sh.cpp
g++ -std=c++11 -c  -pipe -frecord-gcc-switches -Wall -g -O2 -flto=auto -DNDEBUG -O3 -fno-strict-aliasing  -m64 -fPIC -march=native    -D_REENTRANT -D_POSIX_PTHREAD_SEMANTICS -D_FILE_OFFSET_BITS=64 -I..  -o ../obj/gcc-amd64-linux-64/release/michael_heap.o ../src/michael_heap.cpp
g++ -std=c++11 -c  -pipe -frecord-gcc-switches -Wall -g -O2 -flto=auto -DNDEBUG -O3 -fno-strict-aliasing  -m64 -fPIC -march=native    -D_REENTRANT -D_POSIX_PTHREAD_SEMANTICS -D_FILE_OFFSET_BITS=64 -I..  -o ../obj/gcc-amd64-linux-64/release/topology_hpux.o ../src/topology_hpux.cpp
g++ -std=c++11 -c  -pipe -frecord-gcc-switches -Wall -g -O2 -flto=auto -DNDEBUG -O3 -fno-strict-aliasing  -m64 -fPIC -march=native    -D_REENTRANT -D_POSIX_PTHREAD_SEMANTICS -D_FILE_OFFSET_BITS=64 -I..  -o ../obj/gcc-amd64-linux-64/release/topology_linux.o ../src/topology_linux.cpp
g++ -std=c++11 -c  -pipe -frecord-gcc-switches -Wall -g -O2 -flto=auto -DNDEBUG -O3 -fno-strict-aliasing  -m64 -fPIC -march=native    -D_REENTRANT -D_POSIX_PTHREAD_SEMANTICS -D_FILE_OFFSET_BITS=64 -I..  -o ../obj/gcc-amd64-linux-64/release/topology_osx.o ../src/topology_osx.cpp
g++ -std=c++11 -c  -pipe -frecord-gcc-switches -Wall -g -O2 -flto=auto -DNDEBUG -O3 -fno-strict-aliasing  -m64 -fPIC -march=native    -D_REENTRANT -D_POSIX_PTHREAD_SEMANTICS -D_FILE_OFFSET_BITS=64 -I..  -o ../obj/gcc-amd64-linux-64/release/dllmain.o ../src/dllmain.cpp
g++  -shared  -m64 -fPIC   ../obj/gcc-amd64-linux-64/release/hp_gc.o ../obj/gcc-amd64-linux-64/release/init.o ../obj/gcc-amd64-linux-64/release/dhp_gc.o ../obj/gcc-amd64-linux-64/release/urcu_gp.o ../obj/gcc-amd64-linux-64/release/urcu_sh.o ../obj/gcc-amd64-linux-64/release/michael_heap.o ../obj/gcc-amd64-linux-64/release/topology_hpux.o ../obj/gcc-amd64-linux-64/release/topology_linux.o ../obj/gcc-amd64-linux-64/release/topology_osx.o ../obj/gcc-amd64-linux-64/release/dllmain.o  -o libcds.so.2.0.0 -lpthread -ldl -lstdc++
mv ./libcds.so.2.0.0 ../bin/gcc-amd64-linux-64/libcds.so.2.0.0
ln -sf libcds.so.2.0.0 ../bin/gcc-amd64-linux-64/libcds.so
make: Leaving directory '/usr/src/RPM/BUILD/libcds-2.0.0/build'
---------------------------------
Make tests
make: Entering directory '/usr/src/RPM/BUILD/libcds-2.0.0/build'
g++ -std=c++11 -c  -pipe -frecord-gcc-switches -Wall -g -O2 -flto=auto -DNDEBUG -O3 -fno-strict-aliasing   -m64 -fPIC -march=native    -D_REENTRANT -D_POSIX_PTHREAD_SEMANTICS -D_FILE_OFFSET_BITS=64 -I..  -o ../obj/gcc-amd64-linux-64/test/hp_gc.o ../src/hp_gc.cpp
Assembler messages:
Fatal error: can't create ../obj/gcc-amd64-linux-64/test/hp_gc.o: No such file or directory
make: *** [Makefile:63: ../obj/gcc-amd64-linux-64/test/hp_gc.o] Error 2
make: Leaving directory '/usr/src/RPM/BUILD/libcds-2.0.0/build'
make: *** Waiting for unfinished jobs....
make: Entering directory '/usr/src/RPM/BUILD/libcds-2.0.0/build'
g++ -std=c++11 -c  -pipe -frecord-gcc-switches -Wall -g -O2 -flto=auto -DNDEBUG -O3 -fno-strict-aliasing   -m64 -fPIC -march=native    -D_REENTRANT -D_POSIX_PTHREAD_SEMANTICS -D_FILE_OFFSET_BITS=64 -I..  -o ../obj/gcc-amd64-linux-64/test/init.o ../src/init.cpp
Assembler messages:
Fatal error: can't create ../obj/gcc-amd64-linux-64/test/init.o: No such file or directory
make: *** [Makefile:63: ../obj/gcc-amd64-linux-64/test/init.o] Error 2
make: Leaving directory '/usr/src/RPM/BUILD/libcds-2.0.0/build'
+ exit 0
Executing(%install): /bin/sh -e /usr/src/tmp/rpm-tmp.79284
+ umask 022
+ /bin/mkdir -p /usr/src/RPM/BUILD
+ cd /usr/src/RPM/BUILD
+ /bin/chmod -Rf u+rwX -- /usr/src/tmp/libcds-buildroot
+ :
+ /bin/rm -rf -- /usr/src/tmp/libcds-buildroot
+ PATH=/usr/libexec/rpm-build:/usr/src/bin:/bin:/usr/bin:/usr/X11R6/bin:/usr/games
+ cd libcds-2.0.0
+ mkdir -p /usr/src/tmp/libcds-buildroot/usr/lib64/
+ cp bin/gcc-amd64-linux-64/libcds.so /usr/src/tmp/libcds-buildroot/usr/lib64/
+ cp bin/gcc-amd64-linux-64/libcds.so.2.0.0 /usr/src/tmp/libcds-buildroot/usr/lib64/
+ mkdir -p /usr/src/tmp/libcds-buildroot/usr/include/
+ cp -a cds/ /usr/src/tmp/libcds-buildroot/usr/include/
+ /usr/lib/rpm/brp-alt
Cleaning files in /usr/src/tmp/libcds-buildroot (auto)
mode of './usr/lib64/libcds.so.2.0.0' changed from 0755 (rwxr-xr-x) to 0644 (rw-r--r--)
mode of './usr/lib64/libcds.so' changed from 0755 (rwxr-xr-x) to 0644 (rw-r--r--)
Verifying and fixing files in /usr/src/tmp/libcds-buildroot (binconfig,pkgconfig,libtool,desktop,gnuconfig)
Checking contents of files in /usr/src/tmp/libcds-buildroot/ (default)
Compressing files in /usr/src/tmp/libcds-buildroot (auto)
Adjusting library links in /usr/src/tmp/libcds-buildroot
./usr/lib64: (from <cmdline>:0)
	libcds.so -> libcds.so
	libcds.so.2.0.0 -> libcds.so.2.0.0
Verifying ELF objects in /usr/src/tmp/libcds-buildroot (arch=normal,fhs=normal,lfs=relaxed,lint=relaxed,rpath=normal,stack=normal,textrel=normal,unresolved=normal)
Processing files: libcds-2.0.0-alt2
Finding Provides (using /usr/lib/rpm/find-provides)
Executing: /bin/sh -e /usr/src/tmp/rpm-tmp.4rJ3GJ
find-provides: running scripts (debuginfo,lib,pam,perl,pkgconfig,python,python3,shell)
lib.prov: /usr/src/tmp/libcds-buildroot/usr/lib64/libcds.so.2.0.0: 43 symbols, 16 bpp
Finding Requires (using /usr/lib/rpm/find-requires)
Executing: /bin/sh -e /usr/src/tmp/rpm-tmp.0DP0dR
find-requires: running scripts (cpp,debuginfo,files,lib,pam,perl,pkgconfig,pkgconfiglib,python,python3,rpmlib,shebang,shell,static,symlinks,systemd-services)
Provides: libcds.so.2.0.0()(64bit) = set:jd8pPbueUMZ5tFIlLz2006aa2LLMGzAefuOvCVoxws0y8FJQUjYjEl3gsrboEspaUzdO5yUQfogLcHnZyNKcz7qzb
Requires: libc.so.6(GLIBC_2.2.5)(64bit), libc.so.6(GLIBC_2.34)(64bit), libc.so.6(GLIBC_2.4)(64bit), libgcc_s.so.1(GCC_3.0)(64bit), libgcc_s.so.1(GCC_3.3.1)(64bit), libstdc++.so.6(CXXABI_1.3)(64bit), libstdc++.so.6(GLIBCXX_3.4)(64bit), libstdc++.so.6(GLIBCXX_3.4.11)(64bit), libstdc++.so.6(GLIBCXX_3.4.21)(64bit), libstdc++.so.6(GLIBCXX_3.4.29)(64bit), rtld(GNU_HASH)
Finding debuginfo files (using /usr/lib/rpm/find-debuginfo-files)
Executing: /bin/sh -e /usr/src/tmp/rpm-tmp.hdXD6K
Creating libcds-debuginfo package
Processing files: libcds-devel-2.0.0-alt2
Finding Provides (using /usr/lib/rpm/find-provides)
Executing: /bin/sh -e /usr/src/tmp/rpm-tmp.qVBHRD
find-provides: running scripts (debuginfo,lib,pam,perl,pkgconfig,python,python3,shell)
lib.prov: /usr/src/tmp/libcds-buildroot/usr/lib64/libcds.so: 43 symbols, 16 bpp
Finding Requires (using /usr/lib/rpm/find-requires)
Executing: /bin/sh -e /usr/src/tmp/rpm-tmp.BCYCiM
find-requires: running scripts (cpp,debuginfo,files,lib,pam,perl,pkgconfig,pkgconfiglib,python,python3,rpmlib,shebang,shell,static,symlinks,systemd-services)
In file included from /usr/src/tmp/libcds-buildroot/usr/include/cds/init.h:15:
/usr/src/tmp/libcds-buildroot/usr/include/cds/details/defs.h:17:10: fatal error: cstdint: No such file or directory
   17 | #include <cstdint>
      |          ^~~~~~~~~
compilation terminated.
cpp.req: /usr/src/tmp/libcds-buildroot/usr/include/cds/init.h: cpp failed, trying c++ mode
/usr/src/tmp/libcds-buildroot/usr/include/cds/os/aix/timer.h:18:5: error: #error "<cds/os/timer.h> must be included"
   18 | #   error "<cds/os/timer.h> must be included"
      |     ^~~~~
/usr/src/tmp/libcds-buildroot/usr/include/cds/os/aix/timer.h:22:10: fatal error: sys/systemcfg.h: No such file or directory
   22 | #include <sys/systemcfg.h>
      |          ^~~~~~~~~~~~~~~~~
compilation terminated.
cpp.req: WARNING: /usr/src/tmp/libcds-buildroot/usr/include/cds/os/aix/timer.h: cpp failed
/usr/src/tmp/libcds-buildroot/usr/include/cds/os/osx/timer.h:16:5: error: #error "<cds/os/timer.h> must be included"
   16 | #   error "<cds/os/timer.h> must be included"
      |     ^~~~~
/usr/src/tmp/libcds-buildroot/usr/include/cds/os/osx/timer.h:21:10: fatal error: mach/clock.h: No such file or directory
   21 | #include <mach/clock.h>
      |          ^~~~~~~~~~~~~~
compilation terminated.
cpp.req: WARNING: /usr/src/tmp/libcds-buildroot/usr/include/cds/os/osx/timer.h: cpp failed
/usr/src/tmp/libcds-buildroot/usr/include/cds/os/win/timer.h:16:5: error: #error "<cds/os/timer.h> must be included"
   16 | #   error "<cds/os/timer.h> must be included"
      |     ^~~~~
/usr/src/tmp/libcds-buildroot/usr/include/cds/os/win/timer.h:19:10: fatal error: windows.h: No such file or directory
   19 | #include <windows.h>
      |          ^~~~~~~~~~~
compilation terminated.
cpp.req: WARNING: /usr/src/tmp/libcds-buildroot/usr/include/cds/os/win/timer.h: cpp failed
/usr/src/tmp/libcds-buildroot/usr/include/cds/os/win/thread.h:15:10: fatal error: windows.h: No such file or directory
   15 | #include <windows.h>
      |          ^~~~~~~~~~~
compilation terminated.
cpp.req: WARNING: /usr/src/tmp/libcds-buildroot/usr/include/cds/os/win/thread.h: cpp failed
/usr/src/tmp/libcds-buildroot/usr/include/cds/os/aix/topology.h:16:5: error: #error "<cds/os/topology.h> must be included instead"
   16 | #   error "<cds/os/topology.h> must be included instead"
      |     ^~~~~
cpp.req: WARNING: /usr/src/tmp/libcds-buildroot/usr/include/cds/os/aix/topology.h: cpp failed
/usr/src/tmp/libcds-buildroot/usr/include/cds/os/osx/topology.h:16:5: error: #error "<cds/os/topology.h> must be included instead"
   16 | #   error "<cds/os/topology.h> must be included instead"
      |     ^~~~~
cpp.req: WARNING: /usr/src/tmp/libcds-buildroot/usr/include/cds/os/osx/topology.h: cpp failed
/usr/src/tmp/libcds-buildroot/usr/include/cds/os/win/topology.h:16:5: error: #error "<cds/os/topology.h> must be included instead"
   16 | #   error "<cds/os/topology.h> must be included instead"
      |     ^~~~~
/usr/src/tmp/libcds-buildroot/usr/include/cds/os/win/topology.h:20:10: fatal error: windows.h: No such file or directory
   20 | #include <windows.h>
      |          ^~~~~~~~~~~
compilation terminated.
cpp.req: WARNING: /usr/src/tmp/libcds-buildroot/usr/include/cds/os/win/topology.h: cpp failed
In file included from /usr/src/tmp/libcds-buildroot/usr/include/cds/os/hpux/timer.h:15:
/usr/src/tmp/libcds-buildroot/usr/include/cds/os/sunos/timer.h:16:5: error: #error "<cds/os/timer.h> must be included"
   16 | #   error "<cds/os/timer.h> must be included"
      |     ^~~~~
cpp.req: WARNING: /usr/src/tmp/libcds-buildroot/usr/include/cds/os/hpux/timer.h: cpp failed
/usr/src/tmp/libcds-buildroot/usr/include/cds/os/hpux/topology.h:16:5: error: #error "<cds/os/topology.h> must be included instead"
   16 | #   error "<cds/os/topology.h> must be included instead"
      |     ^~~~~
/usr/src/tmp/libcds-buildroot/usr/include/cds/os/hpux/topology.h:19:10: fatal error: sys/mpctl.h: No such file or directory
   19 | #include <sys/mpctl.h>
      |          ^~~~~~~~~~~~~
compilation terminated.
cpp.req: WARNING: /usr/src/tmp/libcds-buildroot/usr/include/cds/os/hpux/topology.h: cpp failed
/usr/src/tmp/libcds-buildroot/usr/include/cds/os/posix/timer.h:16:5: error: #error "<cds/os/timer.h> must be included"
   16 | #   error "<cds/os/timer.h> must be included"
      |     ^~~~~
cpp.req: WARNING: /usr/src/tmp/libcds-buildroot/usr/include/cds/os/posix/timer.h: cpp failed
/usr/src/tmp/libcds-buildroot/usr/include/cds/os/sunos/timer.h:16:5: error: #error "<cds/os/timer.h> must be included"
   16 | #   error "<cds/os/timer.h> must be included"
      |     ^~~~~
cpp.req: WARNING: /usr/src/tmp/libcds-buildroot/usr/include/cds/os/sunos/timer.h: cpp failed
/usr/src/tmp/libcds-buildroot/usr/include/cds/os/sunos/topology.h:16:5: error: #error "<cds/os/topology.h> must be included instead"
   16 | #   error "<cds/os/topology.h> must be included instead"
      |     ^~~~~
/usr/src/tmp/libcds-buildroot/usr/include/cds/os/sunos/topology.h:19:10: fatal error: sys/processor.h: No such file or directory
   19 | #include <sys/processor.h>
      |          ^~~~~~~~~~~~~~~~~
compilation terminated.
cpp.req: WARNING: /usr/src/tmp/libcds-buildroot/usr/include/cds/os/sunos/topology.h: cpp failed
/usr/src/tmp/libcds-buildroot/usr/include/cds/os/posix/fake_topology.h:16:5: error: #error "<cds/os/topology.h> must be included instead"
   16 | #   error "<cds/os/topology.h> must be included instead"
      |     ^~~~~
cpp.req: WARNING: /usr/src/tmp/libcds-buildroot/usr/include/cds/os/posix/fake_topology.h: cpp failed
/usr/src/tmp/libcds-buildroot/usr/include/cds/compiler/vc/defs.h:26:5: error: #error "Only MS Visual C++ 12 (2013) and above is supported"
   26 | #   error "Only MS Visual C++ 12 (2013) and above is supported"
      |     ^~~~~
/usr/src/tmp/libcds-buildroot/usr/include/cds/compiler/vc/defs.h:69:5: error: #error Microsoft Visual C++ compiler is supported for x86 only
   69 | #   error Microsoft Visual C++ compiler is supported for x86 only
      |     ^~~~~
In file included from /usr/src/tmp/libcds-buildroot/usr/include/cds/compiler/vc/defs.h:128:
/usr/src/tmp/libcds-buildroot/usr/include/cds/compiler/vc/compiler_barriers.h:18:13: fatal error: intrin.h: No such file or directory
   18 | #   include <intrin.h>
      |             ^~~~~~~~~~
compilation terminated.
cpp.req: WARNING: /usr/src/tmp/libcds-buildroot/usr/include/cds/compiler/vc/defs.h: cpp failed
/usr/src/tmp/libcds-buildroot/usr/include/cds/os/free_bsd/timer.h:16:5: error: #error "<cds/os/timer.h> must be included"
   16 | #   error "<cds/os/timer.h> must be included"
      |     ^~~~~
/usr/src/tmp/libcds-buildroot/usr/include/cds/os/free_bsd/timer.h:20:10: fatal error: sys/timespec.h: No such file or directory
   20 | #include <sys/timespec.h>
      |          ^~~~~~~~~~~~~~~~
compilation terminated.
cpp.req: WARNING: /usr/src/tmp/libcds-buildroot/usr/include/cds/os/free_bsd/timer.h: cpp failed
/usr/src/tmp/libcds-buildroot/usr/include/cds/os/free_bsd/topology.h:16:5: error: #error "<cds/os/topology.h> must be included instead"
   16 | #   error "<cds/os/topology.h> must be included instead"
      |     ^~~~~
/usr/src/tmp/libcds-buildroot/usr/include/cds/os/free_bsd/topology.h:22:10: fatal error: sys/sysctl.h: No such file or directory
   22 | #include <sys/sysctl.h>
      |          ^~~~~~~~~~~~~~
compilation terminated.
cpp.req: WARNING: /usr/src/tmp/libcds-buildroot/usr/include/cds/os/free_bsd/topology.h: cpp failed
/usr/src/tmp/libcds-buildroot/usr/include/cds/compiler/vc/compiler_barriers.h:18:13: fatal error: intrin.h: No such file or directory
   18 | #   include <intrin.h>
      |             ^~~~~~~~~~
compilation terminated.
cpp.req: WARNING: /usr/src/tmp/libcds-buildroot/usr/include/cds/compiler/vc/compiler_barriers.h: cpp failed
/usr/src/tmp/libcds-buildroot/usr/include/cds/compiler/clang/defs.h:29:5: error: #error "Compiler version error. Clang version 3.3.0 and above is supported"
   29 | #   error "Compiler version error. Clang version 3.3.0 and above is supported"
      |     ^~~~~
cpp.req: WARNING: /usr/src/tmp/libcds-buildroot/usr/include/cds/compiler/clang/defs.h: cpp failed
/usr/src/tmp/libcds-buildroot/usr/include/cds/compiler/vc/x86/bitop.h:15:10: fatal error: intrin.h: No such file or directory
   15 | #include <intrin.h>
      |          ^~~~~~~~~~
compilation terminated.
cpp.req: WARNING: /usr/src/tmp/libcds-buildroot/usr/include/cds/compiler/vc/x86/bitop.h: cpp failed
/usr/src/tmp/libcds-buildroot/usr/include/cds/compiler/vc/x86/cxx11_atomic.h:15:10: fatal error: intrin.h: No such file or directory
   15 | #include <intrin.h>
      |          ^~~~~~~~~~
compilation terminated.
cpp.req: WARNING: /usr/src/tmp/libcds-buildroot/usr/include/cds/compiler/vc/x86/cxx11_atomic.h: cpp failed
/usr/src/tmp/libcds-buildroot/usr/include/cds/compiler/vc/amd64/bitop.h:28:13: fatal error: intrin.h: No such file or directory
   28 | #   include <intrin.h>
      |             ^~~~~~~~~~
compilation terminated.
cpp.req: WARNING: /usr/src/tmp/libcds-buildroot/usr/include/cds/compiler/vc/amd64/bitop.h: cpp failed
/usr/src/tmp/libcds-buildroot/usr/include/cds/compiler/vc/amd64/cxx11_atomic.h:15:10: fatal error: intrin.h: No such file or directory
   15 | #include <intrin.h>
      |          ^~~~~~~~~~
compilation terminated.
cpp.req: WARNING: /usr/src/tmp/libcds-buildroot/usr/include/cds/compiler/vc/amd64/cxx11_atomic.h: cpp failed
/usr/src/tmp/libcds-buildroot/usr/include/cds/container/striped_map/std_hash_map_vc.h:16:5: error: #error <cds/container/striped_map/std_hash_map.h> must be included instead of <cds/container/striped_map/std_hash_map_vc.h> header
   16 | #   error <cds/container/striped_map/std_hash_map.h> must be included instead of <cds/container/striped_map/std_hash_map_vc.h> header
      |     ^~~~~
cpp.req: WARNING: /usr/src/tmp/libcds-buildroot/usr/include/cds/container/striped_map/std_hash_map_vc.h: cpp failed
/usr/src/tmp/libcds-buildroot/usr/include/cds/container/striped_set/std_hash_set_vc.h:16:5: error: #error <cds/container/striped_set/std_hash_set.h> must be included instead of <cds/container/striped_set/std_hash_set_vc.h> header
   16 | #   error <cds/container/striped_set/std_hash_set.h> must be included instead of <cds/container/striped_set/std_hash_set_vc.h> header
      |     ^~~~~
cpp.req: WARNING: /usr/src/tmp/libcds-buildroot/usr/include/cds/container/striped_set/std_hash_set_vc.h: cpp failed
Provides: libcds.so()(64bit) = set:jd8pPbueUMZ5tFIlLz2006aa2LLMGzAefuOvCVoxws0y8FJQUjYjEl3gsrboEspaUzdO5yUQfogLcHnZyNKcz7qzb
Requires: libcds = 2.0.0-alt2, boost-devel-headers, libc.so.6(GLIBC_2.2.5)(64bit), libc.so.6(GLIBC_2.34)(64bit), libc.so.6(GLIBC_2.4)(64bit), libgcc_s.so.1(GCC_3.0)(64bit), libgcc_s.so.1(GCC_3.3.1)(64bit), libstdc++.so.6(CXXABI_1.3)(64bit), libstdc++.so.6(GLIBCXX_3.4)(64bit), libstdc++.so.6(GLIBCXX_3.4.11)(64bit), libstdc++.so.6(GLIBCXX_3.4.21)(64bit), libstdc++.so.6(GLIBCXX_3.4.29)(64bit), rtld(GNU_HASH)
Finding debuginfo files (using /usr/lib/rpm/find-debuginfo-files)
Executing: /bin/sh -e /usr/src/tmp/rpm-tmp.cEc28F
Creating libcds-devel-debuginfo package
Processing files: libcds-debuginfo-2.0.0-alt2
Finding Provides (using /usr/lib/rpm/find-provides)
Executing: /bin/sh -e /usr/src/tmp/rpm-tmp.Of0CeW
find-provides: running scripts (debuginfo)
Finding Requires (using /usr/lib/rpm/find-requires)
Executing: /bin/sh -e /usr/src/tmp/rpm-tmp.UZJzRr
find-requires: running scripts (debuginfo)
Provides: debug64(libcds.so.2.0.0)
Requires: libcds = 2.0.0-alt2, debug64(libc.so.6), debug64(libgcc_s.so.1), debug64(libstdc++.so.6)
Processing files: libcds-devel-debuginfo-2.0.0-alt2
Finding Provides (using /usr/lib/rpm/find-provides)
Executing: /bin/sh -e /usr/src/tmp/rpm-tmp.3Jn6NO
find-provides: running scripts (debuginfo)
Finding Requires (using /usr/lib/rpm/find-requires)
Executing: /bin/sh -e /usr/src/tmp/rpm-tmp.pQKSrw
find-requires: running scripts (debuginfo)
Provides: debug64(libcds.so)
Requires: libcds-devel = 2.0.0-alt2, debug64(libc.so.6), debug64(libgcc_s.so.1), debug64(libstdc++.so.6)
Adding to libcds-devel-debuginfo a strict dependency on libcds-debuginfo
Removing from libcds-devel-debuginfo 49 sources provided by libcds-debuginfo
also prunning dir /usr/src/debug/libcds-2.0.0/cds/algo
also prunning dir /usr/src/debug/libcds-2.0.0/cds/compiler/gcc/amd64
also prunning dir /usr/src/debug/libcds-2.0.0/cds/container/details
also prunning dir /usr/src/debug/libcds-2.0.0/cds/details
also prunning dir /usr/src/debug/libcds-2.0.0/cds/gc/details
also prunning dir /usr/src/debug/libcds-2.0.0/cds/gc/impl
also prunning dir /usr/src/debug/libcds-2.0.0/cds/intrusive
also prunning dir /usr/src/debug/libcds-2.0.0/cds/lock
also prunning dir /usr/src/debug/libcds-2.0.0/cds/memory/michael
also prunning dir /usr/src/debug/libcds-2.0.0/cds/opt
also prunning dir /usr/src/debug/libcds-2.0.0/cds/os/linux
also prunning dir /usr/src/debug/libcds-2.0.0/cds/os/posix
also prunning dir /usr/src/debug/libcds-2.0.0/cds/threading/details
also prunning dir /usr/src/debug/libcds-2.0.0/cds/urcu/details
also prunning dir /usr/src/debug/libcds-2.0.0/cds/user_setup
also prunning dir /usr/src/debug/libcds-2.0.0/src
also prunning dir /usr/src/debug/libcds-2.0.0/cds/compiler/gcc
also prunning dir /usr/src/debug/libcds-2.0.0/cds/container
also prunning dir /usr/src/debug/libcds-2.0.0/cds/gc
also prunning dir /usr/src/debug/libcds-2.0.0/cds/memory
also prunning dir /usr/src/debug/libcds-2.0.0/cds/os
also prunning dir /usr/src/debug/libcds-2.0.0/cds/threading
also prunning dir /usr/src/debug/libcds-2.0.0/cds/urcu
also prunning dir /usr/src/debug/libcds-2.0.0/cds/compiler
also prunning dir /usr/src/debug/libcds-2.0.0/cds
Removing 11 extra deps from libcds-devel due to repentancy on libcds
Removing 3 extra deps from libcds-devel-debuginfo due to repentancy on libcds-debuginfo
Wrote: /usr/src/RPM/RPMS/x86_64/libcds-2.0.0-alt2.x86_64.rpm (w2.lzdio)
Wrote: /usr/src/RPM/RPMS/x86_64/libcds-devel-2.0.0-alt2.x86_64.rpm (w2.lzdio)
Wrote: /usr/src/RPM/RPMS/x86_64/libcds-debuginfo-2.0.0-alt2.x86_64.rpm (w2.lzdio)
Wrote: /usr/src/RPM/RPMS/x86_64/libcds-devel-debuginfo-2.0.0-alt2.x86_64.rpm (w2.lzdio)
17.24user 5.07system 0:31.13elapsed 71%CPU (0avgtext+0avgdata 102472maxresident)k
0inputs+0outputs (0major+1921181minor)pagefaults 0swaps
/.out/libcds-2.0.0-alt2.x86_64.rpm: license not found in '/usr/share/license' directory: like
/.out/libcds-devel-2.0.0-alt2.x86_64.rpm: license not found in '/usr/share/license' directory: like
/.out/libcds-debuginfo-2.0.0-alt2.x86_64.rpm: license not found in '/usr/share/license' directory: like
/.out/libcds-devel-debuginfo-2.0.0-alt2.x86_64.rpm: license not found in '/usr/share/license' directory: like
2.29user 1.14system 0:39.67elapsed 8%CPU (0avgtext+0avgdata 110320maxresident)k
0inputs+0outputs (32862major+164559minor)pagefaults 0swaps
--- libcds-2.0.0-alt2.x86_64.rpm.repo	2015-10-28 21:28:37.000000000 +0000
+++ libcds-2.0.0-alt2.x86_64.rpm.hasher	2023-03-30 02:23:03.352640660 +0000
@@ -2,5 +2,6 @@
 Requires: libc.so.6(GLIBC_2.2.5)(64bit)  
+Requires: libc.so.6(GLIBC_2.34)(64bit)  
 Requires: libc.so.6(GLIBC_2.4)(64bit)  
 Requires: libgcc_s.so.1(GCC_3.0)(64bit)  
-Requires: libpthread.so.0(GLIBC_2.2.5)(64bit)  
+Requires: libgcc_s.so.1(GCC_3.3.1)(64bit)  
 Requires: libstdc++.so.6(CXXABI_1.3)(64bit)  
@@ -9,7 +10,8 @@
 Requires: libstdc++.so.6(GLIBCXX_3.4.21)(64bit)  
+Requires: libstdc++.so.6(GLIBCXX_3.4.29)(64bit)  
 Requires: rtld(GNU_HASH)  
 Requires: rpmlib(PayloadIsLzma)  
-Provides: libcds.so.2.0.0()(64bit) = set:jdo8t8V5f7sUZqKkSGTh10CHuKcwl4uvxl79tuYAZIc7b4A3g49JB6vyv2JWtcwrWmMgVOkM7rRm5chsrMN93WBpZav9SBpYgrs1
+Provides: libcds.so.2.0.0()(64bit) = set:jd8pPbueUMZ5tFIlLz2006aa2LLMGzAefuOvCVoxws0y8FJQUjYjEl3gsrboEspaUzdO5yUQfogLcHnZyNKcz7qzb
 Provides: libcds = 2.0.0-alt2
-File: /usr/lib64/libcds.so.2.0.0	100644	root:root	c90f5e333e42aee25aa7d1ffa11809ca	
-RPMIdentity: 93ed4652eb2d8381d56f62714ef5a50ce64280e37ce64765b7f43668b426a34e82c8c42437e84dde56851bd1a28a48036bd14bc5d59a10400ffa31890b8505ab
+File: /usr/lib64/libcds.so.2.0.0	100644	root:root	1d10beb482c40d629b25398925f106ce	
+RPMIdentity: 1e196ebb0c3cdb90fa6d4f72272ae1400405726d0960c0df55cb36f136adf175f83678a49d10c68c9cfce41fcd245145a24be04d1b7ae832b2aff7292ef43887
--- libcds-debuginfo-2.0.0-alt2.x86_64.rpm.repo	2015-10-28 21:28:37.000000000 +0000
+++ libcds-debuginfo-2.0.0-alt2.x86_64.rpm.hasher	2023-03-30 02:23:03.621645127 +0000
@@ -1,6 +1,7 @@
-/usr/lib/debug/.build-id/4e	40755	root:root	
-/usr/lib/debug/.build-id/4e/c91a786d761420dc5f97f24620e469d2c2177e	120777	root:root	../../../../lib64/libcds.so.2.0.0
-/usr/lib/debug/.build-id/4e/c91a786d761420dc5f97f24620e469d2c2177e.debug	120777	root:root	../../usr/lib64/libcds.so.2.0.0.debug
+/usr/lib/debug/.build-id/7e	40755	root:root	
+/usr/lib/debug/.build-id/7e/a66f2a871c82eed843d5a330d2cb6b9c9b8922	120777	root:root	../../../../lib64/libcds.so.2.0.0
+/usr/lib/debug/.build-id/7e/a66f2a871c82eed843d5a330d2cb6b9c9b8922.debug	120777	root:root	../../usr/lib64/libcds.so.2.0.0.debug
 /usr/lib/debug/usr/lib64/libcds.so.2.0.0.debug	100644	root:root	
 /usr/src/debug/libcds-2.0.0	40755	root:root	
+/usr/src/debug/libcds-2.0.0/build	40755	root:root	
 /usr/src/debug/libcds-2.0.0/cds	40755	root:root	
@@ -69,2 +70,3 @@
 /usr/src/debug/libcds-2.0.0/src/dhp_gc.cpp	100644	root:root	
+/usr/src/debug/libcds-2.0.0/src/dllmain.cpp	100644	root:root	
 /usr/src/debug/libcds-2.0.0/src/hp_const.h	100644	root:root	
@@ -73,3 +75,5 @@
 /usr/src/debug/libcds-2.0.0/src/michael_heap.cpp	100644	root:root	
+/usr/src/debug/libcds-2.0.0/src/topology_hpux.cpp	100644	root:root	
 /usr/src/debug/libcds-2.0.0/src/topology_linux.cpp	100644	root:root	
+/usr/src/debug/libcds-2.0.0/src/topology_osx.cpp	100644	root:root	
 /usr/src/debug/libcds-2.0.0/src/urcu_gp.cpp	100644	root:root	
@@ -79,3 +83,2 @@
 Requires: debug64(libgcc_s.so.1)  
-Requires: debug64(libpthread.so.0)  
 Requires: debug64(libstdc++.so.6)  
@@ -84,7 +87,8 @@
 Provides: libcds-debuginfo = 2.0.0-alt2
-File: /usr/lib/debug/.build-id/4e	40755	root:root		
-File: /usr/lib/debug/.build-id/4e/c91a786d761420dc5f97f24620e469d2c2177e	120777	root:root		../../../../lib64/libcds.so.2.0.0
-File: /usr/lib/debug/.build-id/4e/c91a786d761420dc5f97f24620e469d2c2177e.debug	120777	root:root		../../usr/lib64/libcds.so.2.0.0.debug
-File: /usr/lib/debug/usr/lib64/libcds.so.2.0.0.debug	100644	root:root	ca245b2e5cf3c2e119d16b68db94757b	
+File: /usr/lib/debug/.build-id/7e	40755	root:root		
+File: /usr/lib/debug/.build-id/7e/a66f2a871c82eed843d5a330d2cb6b9c9b8922	120777	root:root		../../../../lib64/libcds.so.2.0.0
+File: /usr/lib/debug/.build-id/7e/a66f2a871c82eed843d5a330d2cb6b9c9b8922.debug	120777	root:root		../../usr/lib64/libcds.so.2.0.0.debug
+File: /usr/lib/debug/usr/lib64/libcds.so.2.0.0.debug	100644	root:root	45138545e0d4f0d55ca16d806f97a661	
 File: /usr/src/debug/libcds-2.0.0	40755	root:root		
+File: /usr/src/debug/libcds-2.0.0/build	40755	root:root		
 File: /usr/src/debug/libcds-2.0.0/cds	40755	root:root		
@@ -153,2 +157,3 @@
 File: /usr/src/debug/libcds-2.0.0/src/dhp_gc.cpp	100644	root:root	422c31c8b0a806dc26954239c874e70b	
+File: /usr/src/debug/libcds-2.0.0/src/dllmain.cpp	100644	root:root	21f740a0152b7c5542647da28f432d11	
 File: /usr/src/debug/libcds-2.0.0/src/hp_const.h	100644	root:root	80855749942467cad03df4126f2a1eff	
@@ -157,5 +162,7 @@
 File: /usr/src/debug/libcds-2.0.0/src/michael_heap.cpp	100644	root:root	5579f4f36467f68bc8f744034646c000	
+File: /usr/src/debug/libcds-2.0.0/src/topology_hpux.cpp	100644	root:root	184f0f5c7a14f0ead8fc420da8f3a0d8	
 File: /usr/src/debug/libcds-2.0.0/src/topology_linux.cpp	100644	root:root	5324e9b121a9a77b58db5c1765465af0	
+File: /usr/src/debug/libcds-2.0.0/src/topology_osx.cpp	100644	root:root	f557f7edd623b758ed68be5e125e3d78	
 File: /usr/src/debug/libcds-2.0.0/src/urcu_gp.cpp	100644	root:root	4520c287e47a61b68736640298628868	
 File: /usr/src/debug/libcds-2.0.0/src/urcu_sh.cpp	100644	root:root	339d522979a178c78bf98576216e0620	
-RPMIdentity: 52cf7d712892465f606e0e67383bce7cac88feb3edabeb1c0dfe2bded4dcce2110fe3d3412f7e2f669efa224e716be67bcb2753974b5f8f5447187d635134f75
+RPMIdentity: c0b468c8bf2347c65a1dfe8d8280ed3b2738ee7fd56a3338ff6d899272c7d011a7354b421c00d06b298d631077fcee93c6665565812d36c5e9e2fb0aef5125fd
--- libcds-devel-2.0.0-alt2.x86_64.rpm.repo	2015-10-28 21:28:37.000000000 +0000
+++ libcds-devel-2.0.0-alt2.x86_64.rpm.hasher	2023-03-30 02:23:03.749647253 +0000
@@ -373,4 +373,5 @@
 Requires: libcds = 2.0.0-alt2
+Requires: boost-devel-headers  
 Requires: rpmlib(PayloadIsLzma)  
-Provides: libcds.so()(64bit) = set:jdo8t8V5f7sUZqKkSGTh10CHuKcwl4uvxl79tuYAZIc7b4A3g49JB6vyv2JWtcwrWmMgVOkM7rRm5chsrMN93WBpZav9SBpYgrs1
+Provides: libcds.so()(64bit) = set:jd8pPbueUMZ5tFIlLz2006aa2LLMGzAefuOvCVoxws0y8FJQUjYjEl3gsrboEspaUzdO5yUQfogLcHnZyNKcz7qzb
 Provides: libcds-devel = 2.0.0-alt2
@@ -747,3 +748,3 @@
 File: /usr/include/cds/version.h	100644	root:root	34d7366e36c96c83d7d2b197097d70a3	
-File: /usr/lib64/libcds.so	100644	root:root	59bdd1e9131cf4ed10d2a68b3ad02872	
-RPMIdentity: 2008db547f4d02af7f709ceba461f5fce04aca9ad9115e426d7cbb9a0ac36d88c6ce881c76e9a940f1da1bfb4eddca440e08cd49867f56bbb0d3c550242a2a18
+File: /usr/lib64/libcds.so	100644	root:root	af2bf99b100f6c16a004371bc83631ff	
+RPMIdentity: 00735d7a8cfd487138d6fb450d68d96d3bbd50a1ca71323b506b5670c056680c2b4cfaedc8f696a1b97cb345bfc0dfe036d9129f975bb2c7c84514190f20fe28
--- libcds-devel-debuginfo-2.0.0-alt2.x86_64.rpm.repo	2015-10-28 21:28:37.000000000 +0000
+++ libcds-devel-debuginfo-2.0.0-alt2.x86_64.rpm.hasher	2023-03-30 02:23:03.802648133 +0000
@@ -1,2 +1,4 @@
 /usr/lib/debug/usr/lib64/libcds.so.debug	100644	root:root	
+/usr/src/debug/libcds-2.0.0	40755	root:root	
+/usr/src/debug/libcds-2.0.0/build	40755	root:root	
 Requires: libcds-devel = 2.0.0-alt2
@@ -6,3 +8,5 @@
 Provides: libcds-devel-debuginfo = 2.0.0-alt2
-File: /usr/lib/debug/usr/lib64/libcds.so.debug	100644	root:root	ca245b2e5cf3c2e119d16b68db94757b	
-RPMIdentity: 5160a0d48842c6131b72b4fc2f7680fa55c0cbd2383f3c701ea325c198a0d167a7736a4344f938f46dc980f97ec39f2b97d2fd371c4f5731a5f37b057aca006b
+File: /usr/lib/debug/usr/lib64/libcds.so.debug	100644	root:root	45138545e0d4f0d55ca16d806f97a661	
+File: /usr/src/debug/libcds-2.0.0	40755	root:root		
+File: /usr/src/debug/libcds-2.0.0/build	40755	root:root		
+RPMIdentity: 14215b7b5de2aa1907ca8c76d241f2ed877401567b19dfc8a8bf3a4025aeba9460ed95eaf7823eb99affc4e5aefc58e515026919eeff4b08dcb7377c8eda3565