<86>Oct 25 06:45:05 userdel[21432]: delete user 'rooter'
<86>Oct 25 06:45:05 userdel[21432]: removed shadow group 'rooter' owned by 'rooter'
<86>Oct 25 06:45:05 groupadd[21437]: group added to /etc/group: name=rooter, GID=543
<86>Oct 25 06:45:05 groupadd[21437]: group added to /etc/gshadow: name=rooter
<86>Oct 25 06:45:05 groupadd[21437]: new group: name=rooter, GID=543
<86>Oct 25 06:45:05 useradd[21441]: new user: name=rooter, UID=543, GID=543, home=/root, shell=/bin/bash
<86>Oct 25 06:45:05 userdel[21449]: delete user 'builder'
<86>Oct 25 06:45:05 userdel[21449]: removed group 'builder' owned by 'builder'
<86>Oct 25 06:45:05 userdel[21449]: removed shadow group 'builder' owned by 'builder'
<86>Oct 25 06:45:05 groupadd[21455]: group added to /etc/group: name=builder, GID=544
<86>Oct 25 06:45:05 groupadd[21455]: group added to /etc/gshadow: name=builder
<86>Oct 25 06:45:05 groupadd[21455]: new group: name=builder, GID=544
<86>Oct 25 06:45:05 useradd[21460]: new user: name=builder, UID=544, GID=544, home=/usr/src, shell=/bin/bash
<13>Oct 25 06:45:10 rpmi: rpm-macros-cmake-3.15.4-alt1 sisyphus+239520.100.1.1 1571611942 installed
<13>Oct 25 06:45:16 rpmi: libjpeg-2:2.0.2-alt1 sisyphus+226996.100.1.1 1554902884 installed
<13>Oct 25 06:45:16 rpmi: libpng16-1.6.37-alt1 sisyphus+236677.100.2.1 1566917982 installed
<13>Oct 25 06:45:16 rpmi: libexpat-2.2.4-alt1 1503305341 installed
<13>Oct 25 06:45:16 rpmi: libalsa-1:1.1.9-alt2 sisyphus+229323.100.1.1 1557826762 installed
<13>Oct 25 06:45:16 rpmi: libgomp1-9.2.1-alt1 sisyphus+239632.100.3.1 1571782948 installed
<13>Oct 25 06:45:16 rpmi: libogg-1.3.3-alt1 sisyphus+221902.4000.4.1 1550598413 installed
<13>Oct 25 06:45:16 rpmi: udev-rules-1:243-alt3 sisyphus+239239.100.1.1 1571079023 installed
<13>Oct 25 06:45:16 rpmi: libwayland-client-1.17.0-alt1 sisyphus+225894.100.1.1 1553872803 installed
<13>Oct 25 06:45:16 rpmi: libusb-1.0.23-alt1 sisyphus+237317.100.1.1 1568059904 installed
<13>Oct 25 06:45:16 rpmi: libboost_system1.67.0-1:1.67.0-alt8 sisyphus+238768.500.16.1 1571430204 installed
<13>Oct 25 06:45:16 rpmi: libopenjpeg2.0-2.3.1-alt1 sisyphus+226454.100.1.1 1554284336 installed
<13>Oct 25 06:45:16 rpmi: libwebp7-1.0.3-alt1 sisyphus+234493.100.1.1 1563090161 installed
<13>Oct 25 06:45:16 rpmi: libvorbis-1.3.6-alt2 sisyphus+220072.200.2.2 1548744467 installed
<13>Oct 25 06:45:16 rpmi: qt5-base-common-5.12.5-alt1 sisyphus+238768.340.19.1 1571500911 installed
<13>Oct 25 06:45:16 rpmi: libxkbcommon-0.9.1-alt1 sisyphus+239553.100.1.1 1571659623 installed
<13>Oct 25 06:45:16 rpmi: libraw1394-11-2.1.2-alt1 sisyphus+225496.100.2.1 1553244591 installed
<13>Oct 25 06:45:16 rpmi: libgudev-1:233-alt1 sisyphus+235422.100.1.1 1564855269 installed
<13>Oct 25 06:45:16 rpmi: perl-Try-Tiny-0.30-alt1 1514318058 installed
<13>Oct 25 06:45:16 rpmi: perl-libnet-1:3.11-alt1 1511423541 installed
<13>Oct 25 06:45:16 rpmi: libsqlite3-3.30.1-alt2 sisyphus+239645.100.1.1 1571835190 installed
<13>Oct 25 06:45:16 rpmi: libidn2-2.2.0-alt1 sisyphus+229970.100.1.1 1558625623 installed
<13>Oct 25 06:45:16 rpmi: liblcms2-2.9-alt1 1516411888 installed
<13>Oct 25 06:45:16 rpmi: libICE-1.0.9-alt1 1409902719 installed
<13>Oct 25 06:45:16 rpmi: libSM-1.2.3-alt1 sisyphus+226734.100.2.1 1554586157 installed
<13>Oct 25 06:45:16 rpmi: libtheora-2:1.1.1-alt6 sisyphus+223372.100.2.1 1551525759 installed
<13>Oct 25 06:45:16 rpmi: libv4l-1.18.0-alt1 sisyphus+238247.100.1.1 1569587629 installed
<13>Oct 25 06:45:16 rpmi: liborc-0.4.30.1-alt0.2 sisyphus+238216.100.1.1 1569505613 installed
<13>Oct 25 06:45:16 rpmi: libfftw3-common-3.3.8-alt1 sisyphus+226899.100.1.1 1554782385 installed
<13>Oct 25 06:45:16 rpmi: libopenblas-0.2.20-alt2 sisyphus+229410.100.1.1 1557920443 installed
<13>Oct 25 06:45:16 rpmi: libquadmath0-9.2.1-alt1 sisyphus+239632.100.3.1 1571782948 installed
<13>Oct 25 06:45:16 rpmi: perl-Module-Runtime-0.016-alt1 1509549848 installed
<13>Oct 25 06:45:16 rpmi: perl-HTTP-Date-6.02-alt1 1348645274 installed
<13>Oct 25 06:45:16 rpmi: perl-Term-ANSIColor-4.06-alt1 1479407083 installed
<13>Oct 25 06:45:16 rpmi: tex-common-0.2-alt4 1244804096 installed
<13>Oct 25 06:45:16 rpmi: libgdbm-1.8.3-alt10 1454943313 installed
<13>Oct 25 06:45:16 rpmi: libfribidi-1.0.7-alt1 sisyphus+238256.100.1.1 1569654630 installed
<13>Oct 25 06:45:16 rpmi: libglvnd-7:1.1.1-alt1 sisyphus+224993.100.4.1 1552634540 installed
<13>Oct 25 06:45:16 rpmi: libfftw3-3.3.8-alt1 sisyphus+226899.100.1.1 1554782385 installed
<13>Oct 25 06:45:16 rpmi: qt5-declarative-common-5.12.5-alt2 sisyphus+239426.100.1.1 1571479035 installed
<13>Oct 25 06:45:16 rpmi: libjasper-2.0.16-alt1 sisyphus+231386.100.1.1 1559568071 installed
<13>Oct 25 06:45:16 rpmi: libnl3-3.5.0-alt1 sisyphus+237716.100.1.1 1568781467 installed
<13>Oct 25 06:45:16 rpmi: libibverbs-24.0-alt3 sisyphus+233653.100.1.1 1562118434 installed
<13>Oct 25 06:45:16 rpmi: perl-XML-NamespaceSupport-1.12-alt1 1491296348 installed
<13>Oct 25 06:45:16 rpmi: libjack-1:1.9.12-alt2 sisyphus+222776.100.1.1 1551043815 installed
<13>Oct 25 06:45:16 rpmi: libdvdread-5.0.0-alt1 1414228692 installed
<13>Oct 25 06:45:16 rpmi: libserd-0.30.0-alt1_1 sisyphus+221097.100.1.1 1549718399 installed
<13>Oct 25 06:45:16 rpmi: libspeex-1.2-alt1 1528115225 installed
<13>Oct 25 06:45:16 rpmi: libopus-1.2.1-alt1.1 1504605235 installed
<13>Oct 25 06:45:16 rpmi: libgsm-1.0.17-alt1 1523356157 installed
<13>Oct 25 06:45:16 rpmi: libnettle7-3.5.1-alt1 sisyphus+235265.40.6.1 1566223043 installed
<13>Oct 25 06:45:16 rpmi: perl-Unicode-Normalize-1:5.28.2-alt1 sisyphus+230063.100.1.1 1558785281 installed
<13>Oct 25 06:45:17 rpmi: libicu65-1:6.5.1-alt1 sisyphus+238768.100.16.1 1571427351 installed
<13>Oct 25 06:45:17 rpmi: libpaper-1.1.26-alt1 sisyphus+221360.100.1.1 1549974198 installed
<13>Oct 25 06:45:17 rpmi: libjbig-2.1-alt1 1401380921 installed
<13>Oct 25 06:45:17 rpmi: libtiff5-4.0.10.0.93.91480d3d-alt1 sisyphus+231496.100.1.1 1559668975 installed
<13>Oct 25 06:45:17 rpmi: psutils-2:1.23-alt2 sisyphus+226711.100.1.1 1554520810 installed
<13>Oct 25 06:45:17 rpmi: libsord-0.16.2-alt1_3 sisyphus+221690.100.1.1 1550344141 installed
<13>Oct 25 06:45:17 rpmi: librdmacm-24.0-alt3 sisyphus+233653.100.1.1 1562118434 installed
<13>Oct 25 06:45:17 rpmi: perl-Dist-CheckConflicts-0.11-alt1 1397076608 installed
<13>Oct 25 06:45:17 rpmi: perl-Module-Implementation-0.09-alt1 1418836057 installed
<13>Oct 25 06:45:17 rpmi: libgfortran5-9.2.1-alt1 sisyphus+239632.100.3.1 1571782948 installed
<13>Oct 25 06:45:17 rpmi: libunicap-0.9.12-alt1 sisyphus+225152.100.1.1 1552760621 installed
<13>Oct 25 06:45:17 rpmi: libdc1394-22-2.2.5-alt1 1529659237 installed
<13>Oct 25 06:45:17 rpmi: libwayland-egl-4:18.1.0-alt1 sisyphus+225894.100.1.1 1553872803 installed
<13>Oct 25 06:45:17 rpmi: libflac8-1.3.2-alt2 sisyphus+220898.4400.11.1 1551972983 installed
<13>Oct 25 06:45:17 rpmi: libsndfile-1.0.28-alt2 sisyphus.212728.100 1536333060 installed
<13>Oct 25 06:45:17 rpmi: libnuma-2.0.11-alt1 1450022595 installed
<13>Oct 25 06:45:17 rpmi: libmtdev-1.1.5-alt1 sisyphus+220715.100.1.1 1549364508 installed
<13>Oct 25 06:45:17 rpmi: libmnl-1.0.4-alt2 sisyphus+220683.100.1.1 1549335455 installed
<13>Oct 25 06:45:17 rpmi: perl-XML-SAX-Base-1.09-alt1 1494364363 installed
<13>Oct 25 06:45:17 rpmi: libdv-1.0.0-alt5.7 sisyphus+220898.5400.11.1 1551973252 installed
<13>Oct 25 06:45:17 rpmi: ilmbase24-common-2.3.0-alt1 sisyphus+237892.300.1.1 1568978151 installed
<13>Oct 25 06:45:17 rpmi: libiex24-2.3.0-alt1 sisyphus+237892.300.1.1 1568978151 installed
<13>Oct 25 06:45:17 rpmi: libhalf24-2.3.0-alt1 sisyphus+237892.300.1.1 1568978151 installed
<13>Oct 25 06:45:17 rpmi: libbs2b-3.1.0-alt1.3 1327614911 installed
<13>Oct 25 06:45:17 rpmi: libx265-160-2.8-alt1 1529659165 installed
<13>Oct 25 06:45:17 rpmi: libx264-148-alt2 1496163823 installed
<13>Oct 25 06:45:17 rpmi: libwavpack-5.1.0-alt1 1486754494 installed
<13>Oct 25 06:45:17 rpmi: libvpx6-1.8.1-alt1 sisyphus+235215.200.3.2 1564545755 installed
<13>Oct 25 06:45:17 rpmi: libtwolame-0.4.0-alt1 sisyphus+239176.100.2.1 1571294326 installed
<13>Oct 25 06:45:17 rpmi: libopencore-amrwb0-0.1.5-alt1 1529659318 installed
<13>Oct 25 06:45:17 rpmi: libopencore-amrnb0-0.1.5-alt1 1529659318 installed
<13>Oct 25 06:45:17 rpmi: liblame-3.100-alt1 1527082573 installed
<13>Oct 25 06:45:17 rpmi: libproxy-0.4.15-alt3 sisyphus+227885.100.1.2 1555818596 installed
<13>Oct 25 06:45:18 rpmi: libpcre2-10.33-alt1.1 sisyphus+227856.100.1.2 1555786372 installed
<13>Oct 25 06:45:18 rpmi: libqt5-core-5.12.5-alt1 sisyphus+238768.340.19.1 1571500911 installed
<13>Oct 25 06:45:18 rpmi: libqt5-sql-5.12.5-alt1 sisyphus+238768.340.19.1 1571500911 installed
<13>Oct 25 06:45:18 rpmi: libiptables-1.8.3-alt2 sisyphus+230708.100.1.1 1559139619 installed
<13>Oct 25 06:45:18 rpmi: libjson-c4-0.13.1-alt1 sisyphus+226468.100.8.1 1554723265 installed
<13>Oct 25 06:45:18 rpmi: libdevmapper-1.02.163-alt1 sisyphus+235860.260.6.1 1565551887 installed
<13>Oct 25 06:45:18 rpmi: msulogin-1.0-alt1 1366288481 installed
<13>Oct 25 06:45:18 rpmi: mount-2.33.2-alt1 sisyphus+227076.100.1.1 1555076778 installed
<13>Oct 25 06:45:18 rpmi: libglog-0.3.4-alt4 sisyphus+235324.300.2.1 1564663103 installed
<13>Oct 25 06:45:18 rpmi: libtcl-8.6.9-alt1 sisyphus+227145.100.1.2 1555606523 installed
<13>Oct 25 06:45:18 rpmi: python-module-sphinxcontrib-2.1.1-alt2.1.2 sisyphus+227529.1100.1.2 1555924423 installed
<13>Oct 25 06:45:18 rpmi: perl-Text-Unidecode-1.30-alt1 1480505027 installed
<13>Oct 25 06:45:18 rpmi: perl-IO-stringy-2.111-alt1 1432302202 installed
<13>Oct 25 06:45:18 rpmi: perl-MRO-Compat-0.13-alt1 1491292748 installed
<13>Oct 25 06:45:18 rpmi: perl-Devel-StackTrace-1:2.04-alt1 sisyphus+230065.100.1.1 1558783788 installed
<13>Oct 25 06:45:18 rpmi: perl-Sub-Exporter-Progressive-0.001013-alt1 1479395404 installed
<13>Oct 25 06:45:18 rpmi: perl-File-Which-1.23-alt1 sisyphus.218871.100 1546337313 installed
<13>Oct 25 06:45:18 rpmi: perl-Tie-RefHash-1.39-alt1 1316492563 installed
<13>Oct 25 06:45:18 rpmi: perl-TimeDate-2.30-alt1 1374766201 installed
<13>Oct 25 06:45:18 rpmi: perl-IO-Socket-IP-0.39-alt1 1494508514 installed
<13>Oct 25 06:45:18 rpmi: perl-LWP-MediaTypes-6.04-alt1 sisyphus+225468.100.1.1 1553186684 installed
<13>Oct 25 06:45:18 rpmi: perl-Compress-Raw-Zlib-2.087-alt1 sisyphus+236138.100.1.1 1565888150 installed
<13>Oct 25 06:45:18 rpmi: perl-HTML-Tagset-3.20-alt2 1317725093 installed
<13>Oct 25 06:45:18 rpmi: libnspr-1:4.22-alt1 sisyphus+237323.140.2.1 1568109117 installed
<13>Oct 25 06:45:18 rpmi: xml-utils-1:2.9.9.0.52.f824-alt1 sisyphus+229881.200.3.1 1558978732 installed
<13>Oct 25 06:45:18 rpmi: libp11-kit-0.23.15-alt1 sisyphus+226408.100.2.1 1554288187 installed
<13>Oct 25 06:45:18 rpmi: libtasn1-4.14-alt1 sisyphus+235791.100.1.1 1565282369 installed
<13>Oct 25 06:45:18 rpmi: libltdl7-2.4.6-alt1 sisyphus+226971.100.2.1 1554906326 installed
<13>Oct 25 06:45:18 rpmi: liblz4-1:1.9.2-alt1 sisyphus+238585.100.2.2 1570066861 installed
<13>Oct 25 06:45:18 rpmi: libpixman-3:0.38.4-alt1 sisyphus+228006.100.1.1 1556013486 installed
<13>Oct 25 06:45:18 rpmi: libwayland-server-1.17.0-alt1 sisyphus+225894.100.1.1 1553872803 installed
<13>Oct 25 06:45:18 rpmi: ilmbase12-common-2.2.0-alt2 sisyphus+237892.200.2.1 1568981821 installed
<13>Oct 25 06:45:18 rpmi: libiex12-2.2.0-alt2 sisyphus+237892.200.2.1 1568981821 installed
<13>Oct 25 06:45:18 rpmi: libilmthread12-2.2.0-alt2 sisyphus+237892.200.2.1 1568981821 installed
<13>Oct 25 06:45:18 rpmi: libhalf12-2.2.0-alt2 sisyphus+237892.200.2.1 1568981821 installed
<13>Oct 25 06:45:18 rpmi: perl-autodie-2.29-alt1 1445013559 installed
<13>Oct 25 06:45:18 rpmi: perl-File-HomeDir-1.004-alt1 1525450444 installed
<13>Oct 25 06:45:18 rpmi: perl-Devel-GlobalDestruction-1:0.14-alt1 1479389769 installed
<13>Oct 25 06:45:18 rpmi: perl-Role-Tiny-2.001003-alt1 sisyphus+239155.100.1.1 1570980419 installed
<13>Oct 25 06:45:18 rpmi: perl-OLE-Storage_Lite-0.19-alt2 1291028388 installed
<13>Oct 25 06:45:18 rpmi: tcl-8.6.9-alt1 sisyphus+227145.100.1.2 1555606523 installed
<13>Oct 25 06:45:18 rpmi: sysvinit-2.88-alt5 1424350685 installed
<13>Oct 25 06:45:18 rpmi: libqt5-concurrent-5.12.5-alt1 sisyphus+238768.340.19.1 1571500911 installed
<13>Oct 25 06:45:18 rpmi: libqt5-test-5.12.5-alt1 sisyphus+238768.340.19.1 1571500911 installed
<13>Oct 25 06:45:18 rpmi: libqt5-xml-5.12.5-alt1 sisyphus+238768.340.19.1 1571500911 installed
<13>Oct 25 06:45:18 rpmi: libilmthread24-2.3.0-alt1 sisyphus+237892.300.1.1 1568978151 installed
<13>Oct 25 06:45:18 rpmi: libnetlink-5.3.0-alt1 sisyphus+238584.100.2.1 1570062599 installed
<13>Oct 25 06:45:18 rpmi: libnuma-devel-2.0.11-alt1 1450022595 installed
<13>Oct 25 06:45:18 rpmi: libsamplerate-0.1.9-alt2 1487790080 installed
<13>Oct 25 06:45:18 rpmi: librubberband-1.8.1-alt1.hg20140905.1 1434271009 installed
<13>Oct 25 06:45:18 rpmi: libsratom-0.6.2-alt1_3 sisyphus+221691.100.1.1 1550345184 installed
<13>Oct 25 06:45:18 rpmi: liblilv-0.24.4-alt1_5 sisyphus+221689.100.1.1 1550343708 installed
<13>Oct 25 06:45:18 rpmi: libboost_regex1.67.0-1:1.67.0-alt8 sisyphus+238768.500.16.1 1571430204 installed
<13>Oct 25 06:45:18 rpmi: libboost_graph1.67.0-1:1.67.0-alt8 sisyphus+238768.500.16.1 1571430204 installed
<13>Oct 25 06:45:18 rpmi: perl-unicore-1:5.28.2-alt1 sisyphus+230063.100.1.1 1558785281 installed
<13>Oct 25 06:45:18 rpmi: perl-Net-IDN-Encode-2.500-alt1 sisyphus+221481.100.1.1 1550127189 installed
<13>Oct 25 06:45:18 rpmi: libarchive13-3.4.0-alt1 sisyphus+235265.640.9.1 1566482445 installed
<13>Oct 25 06:45:18 rpmi: libhogweed5-3.5.1-alt1 sisyphus+235265.40.6.1 1566223043 installed
<13>Oct 25 06:45:18 rpmi: libgnutls30-3.6.10-alt1 sisyphus+238398.100.1.1 1569857989 installed
<13>Oct 25 06:45:18 rpmi: libshout2-2.2.2-alt3 1303374846 installed
<13>Oct 25 06:45:18 rpmi: libportaudio2-19-alt7 1528701664 installed
<13>Oct 25 06:45:18 rpmi: libofa-0.9.3-alt4.1.qa3 1506957670 installed
<13>Oct 25 06:45:18 rpmi: libOpenGL-7:1.1.1-alt1 sisyphus+224993.100.4.1 1552634540 installed
<13>Oct 25 06:45:18 rpmi: libGLES-7:1.1.1-alt1 sisyphus+224993.100.4.1 1552634540 installed
<13>Oct 25 06:45:18 rpmi: libgdbm-devel-1.8.3-alt10 1454943313 installed
<13>Oct 25 06:45:18 rpmi: perl-Data-Dump-1.23-alt1 1444601978 installed
<13>Oct 25 06:45:18 rpmi: perl-File-Listing-6.04-alt1 1329758996 installed
<13>Oct 25 06:45:18 rpmi: libquadmath9-devel-9.2.1-alt1 sisyphus+239632.100.3.1 1571782948 installed
<13>Oct 25 06:45:18 rpmi: libquadmath8-devel-8.3.1-alt7 sisyphus+239632.200.3.1 1571787695 installed
<13>Oct 25 06:45:18 rpmi: libfftw3q-3.3.8-alt1 sisyphus+226899.100.1.1 1554782385 installed
<13>Oct 25 06:45:18 rpmi: libfftw3f-3.3.8-alt1 sisyphus+226899.100.1.1 1554782385 installed
<13>Oct 25 06:45:19 rpmi: libfftw3l-3.3.8-alt1 sisyphus+226899.100.1.1 1554782385 installed
<13>Oct 25 06:45:19 rpmi: libavc1394-0.5.4-alt1.qa1 1460816780 installed
<13>Oct 25 06:45:19 rpmi: libiec61883-1.2.0-alt1.qa1 1460815903 installed
<13>Oct 25 06:45:19 rpmi: qt5-multimedia-common-5.12.5-alt1 sisyphus+239023.600.5.2 1571277997 installed
<13>Oct 25 06:45:19 rpmi: qt5-serialport-common-5.12.5-alt1 sisyphus+239023.700.5.2 1571278140 installed
<13>Oct 25 06:45:19 rpmi: libqt5-serialport-5.12.5-alt1 sisyphus+239023.700.5.2 1571278140 installed
<13>Oct 25 06:45:19 rpmi: rpm-macros-qt5-5.12.5-alt1 sisyphus+238768.340.19.1 1571500911 installed
<13>Oct 25 06:45:19 rpmi: libboost_atomic1.67.0-1:1.67.0-alt8 sisyphus+238768.500.16.1 1571430204 installed
<13>Oct 25 06:45:19 rpmi: libboost_contract1.67.0-1:1.67.0-alt8 sisyphus+238768.500.16.1 1571430204 installed
<13>Oct 25 06:45:19 rpmi: libboost_random1.67.0-1:1.67.0-alt8 sisyphus+238768.500.16.1 1571430204 installed
<13>Oct 25 06:45:19 rpmi: libboost_chrono1.67.0-1:1.67.0-alt8 sisyphus+238768.500.16.1 1571430204 installed
<13>Oct 25 06:45:19 rpmi: libboost_timer1.67.0-1:1.67.0-alt8 sisyphus+238768.500.16.1 1571430204 installed
<13>Oct 25 06:45:19 rpmi: libboost_filesystem1.67.0-1:1.67.0-alt8 sisyphus+238768.500.16.1 1571430204 installed
<13>Oct 25 06:45:19 rpmi: libboost_thread1.67.0-1:1.67.0-alt8 sisyphus+238768.500.16.1 1571430204 installed
<13>Oct 25 06:45:19 rpmi: libboost_type_erasure1.67.0-1:1.67.0-alt8 sisyphus+238768.500.16.1 1571430204 installed
<13>Oct 25 06:45:19 rpmi: hamlib-3.3-alt1.1 sisyphus+219907.22400.1.1 1548371027 installed
<13>Oct 25 06:45:19 rpmi: libwayland-cursor-1.17.0-alt1 sisyphus+225894.100.1.1 1553872803 installed
<13>Oct 25 06:45:19 rpmi: libvidstab-1.1.0-alt2 sisyphus+222665.100.1.1 1550985428 installed
<13>Oct 25 06:45:19 rpmi: libgomp9-devel-9.2.1-alt1 sisyphus+239632.100.3.1 1571782948 installed
<13>Oct 25 06:45:20 rpmi: flite-2.1-alt1 sisyphus+222718.100.1.1 1551026078 installed
<13>Oct 25 06:45:20 rpmi: libalsa-devel-1:1.1.9-alt2 sisyphus+229323.100.1.1 1557826762 installed
<13>Oct 25 06:45:20 rpmi: xxd-4:8.1.2120-alt1 sisyphus+238838.100.1.1 1570455552 installed
<13>Oct 25 06:45:20 rpmi: pciids-20191014-alt1 sisyphus+239246.100.1.1 1571106162 installed
<13>Oct 25 06:45:20 rpmi: tcsh-6.20.00-alt2 1503603377 installed
<13>Oct 25 06:45:20 rpmi: rpm-macros-mpi-selector-1.0.3-alt3 1504498675 installed
<13>Oct 25 06:45:20 rpmi: mpi-selector-1.0.3-alt3 1504498675 installed
<13>Oct 25 06:45:20 rpmi: openmpi-2.0.1-alt8 sisyphus+229856.100.1.1 1558540100 installed
<13>Oct 25 06:45:20 rpmi: rpm-macros-info-install-6.5-alt2 sisyphus+220294.200.2.1 1548933637 installed
<13>Oct 25 06:45:20 rpmi: perl-Unicode-EastAsianWidth-12.0-alt1 sisyphus+237401.100.1.1 1568197363 installed
<13>Oct 25 06:45:20 rpmi: libxml2-devel-1:2.9.9.0.52.f824-alt1 sisyphus+229881.200.3.1 1558978732 installed
<13>Oct 25 06:45:20 rpmi: libts-1.0-alt1.qa1 1366249318 installed
<13>Oct 25 06:45:20 rpmi: libpci-3.6.2-alt2 sisyphus+225907.100.1.1 1553930304 installed
<13>Oct 25 06:45:20 rpmi: pciutils-3.6.2-alt2 sisyphus+225907.100.1.1 1553930304 installed
<13>Oct 25 06:45:20 rpmi: libopenal1-1.19.1-alt1 sisyphus+222956.100.1.1 1551298513 installed
<13>Oct 25 06:45:20 rpmi: libwacom-data-1.1-alt1 sisyphus+238155.300.2.1 1569408114 installed
<13>Oct 25 06:45:20 rpmi: libwacom-1.1-alt1 sisyphus+238155.300.2.1 1569408114 installed
<13>Oct 25 06:45:20 rpmi: libibumad-24.0-alt3 sisyphus+233653.100.1.1 1562118434 installed
<13>Oct 25 06:45:20 rpmi: libevdev-1.8.0-alt1 sisyphus+236608.100.1.1 1566815733 installed
<13>Oct 25 06:45:20 rpmi: libinput-1.14.2-alt1 sisyphus+239176.20.4.1 1571611778 installed
<13>Oct 25 06:45:20 rpmi: libboost_program_options1.67.0-1:1.67.0-alt8 sisyphus+238768.500.16.1 1571430204 installed
<13>Oct 25 06:45:20 rpmi: xorg-proto-devel-2019.1-alt1 sisyphus+232786.100.1.1 1561106722 installed
<13>Oct 25 06:45:20 rpmi: libatm-2.5.1-alt6 sisyphus+234093.100.1.1 1562575879 installed
<13>Oct 25 06:45:20 rpmi: chrooted-0.3.9-alt1 1524554183 installed
<13>Oct 25 06:45:20 rpmi: chrooted-resolv-0.3.1-alt2 1176155257 installed
<13>Oct 25 06:45:20 rpmi: libmpeg2-0.5.1-alt3.svn20120718 1410845586 installed
<13>Oct 25 06:45:20 rpmi: libcdio-2.0.0-alt1.1 1516233232 installed
<13>Oct 25 06:45:20 rpmi: liba52-0.7.4-alt9 1528303350 installed
<13>Oct 25 06:45:20 rpmi: libtag-1.11.1-alt1 1479892949 installed
<13>Oct 25 06:45:20 rpmi: libmpg123-1.25.12-alt1 sisyphus+236590.100.1.1 1566763895 installed
<13>Oct 25 06:45:20 rpmi: libvisual0.4-0.4.0-alt3 1301290263 installed
<13>Oct 25 06:45:20 rpmi: libgraphene-1.10.0-alt1 sisyphus+237282.100.1.1 1567964934 installed
<13>Oct 25 06:45:20 rpmi: libcdparanoia-1:10.2-alt6 1501248110 installed
<13>Oct 25 06:45:20 rpmi: libwebrtc-0.3-alt2 sisyphus+229377.100.1.1 1557873868 installed
<13>Oct 25 06:45:20 rpmi: vulkan-filesystem-1.1.121-alt1.1 sisyphus+236811.500.2.1 1567091259 installed
<13>Oct 25 06:45:20 rpmi: libvulkan1-1.1.121-alt1.1 sisyphus+236811.500.2.1 1567091259 installed
<13>Oct 25 06:45:20 rpmi: libvo-amrwbenc-0.1.3-alt1 1465493713 installed
<13>Oct 25 06:45:20 rpmi: libvo-aacenc-0.1.3-alt1 1393497439 installed
<13>Oct 25 06:45:20 rpmi: libsbc-1.2-alt1.1 1501780340 installed
<13>Oct 25 06:45:20 rpmi: libopenh264-2.0.0-alt1 sisyphus+238676.200.2.1 1570206437 installed
<13>Oct 25 06:45:20 rpmi: libtbb-2019-alt1.u8 sisyphus+235076.100.2.1 1563979139 installed
<13>Oct 25 06:45:20 rpmi: libprotobuf17-3.6.1.3-alt2 sisyphus+227259.100.1.1 1555610513 installed
<13>Oct 25 06:45:20 rpmi: libgflags-2.2.2-alt1 sisyphus+235324.400.2.1 1564663143 installed
<13>Oct 25 06:45:20 rpmi: libepoxy-1.5.3-alt1 sisyphus+226740.100.2.3 1554619014 installed
<13>Oct 25 06:45:20 rpmi: gtk+3-themes-incompatible-3.20-alt3 1461944560 installed
<13>Oct 25 06:45:20 rpmi: tinyxml-2.6.2-alt1.2 1465754828 installed
<13>Oct 25 06:45:20 rpmi: openni-1.5.7.10-alt2_13 1525876438 installed
<13>Oct 25 06:45:20 rpmi: libmodplug-0.8.9.0-alt1 sisyphus+224334.100.1.1 1552243564 installed
<13>Oct 25 06:45:20 rpmi: libmms-0.6.4-alt1 1409679936 installed
<13>Oct 25 06:45:20 rpmi: libyajl-2.1.0-alt1 1399891593 installed
<13>Oct 25 06:45:20 rpmi: libkate-0.4.1-alt1.4 sisyphus+223368.100.1.1 1551503981 installed
<13>Oct 25 06:45:20 rpmi: libasyncns-0.8-alt2.qa1 1365949819 installed
<13>Oct 25 06:45:20 rpmi: liblash-1:0.5.4-alt1_40 sisyphus+237783.100.1.1 1568832172 installed
<13>Oct 25 06:45:20 rpmi: libfaad2-2.7-alt6 sisyphus+220898.4600.11.1 1551973073 installed
<13>Oct 25 06:45:20 rpmi: libdvdcss-1.3.0-alt1 1414269645 installed
<13>Oct 25 06:45:20 rpmi: libdvdnav-5.0.1-alt1 1414229734 installed
<13>Oct 25 06:45:20 rpmi: libdca0-0.0.5-alt4.qa1 sisyphus+222535.100.1.1 1550881650 installed
<13>Oct 25 06:45:20 rpmi: libsoundtouch-2.1.2-alt1 sisyphus+222705.100.1.1 1551002622 installed
<13>Oct 25 06:45:20 rpmi: openexr24-common-2.3.0-alt2 sisyphus+237980.100.1.1 1569181624 installed
<13>Oct 25 06:45:21 rpmi: libilmimf24-2.3.0-alt2 sisyphus+237980.100.1.1 1569181624 installed
<13>Oct 25 06:45:21 rpmi: libgme-0.6.1-alt1 1521318053 installed
<13>Oct 25 06:45:21 rpmi: libudfread-1.0.0-alt3 1528906336 installed
<13>Oct 25 06:45:21 rpmi: libzeromq-4.2.3-alt1 1513846882 installed
<13>Oct 25 06:45:21 rpmi: libsoxr-0.1.2-alt4 sisyphus+222649.100.1.1 1550964841 installed
<13>Oct 25 06:45:21 rpmi: libxvid-1.3.4-alt1 1507033988 installed
<13>Oct 25 06:45:21 rpmi: libsnappy-1.1.7-alt1 sisyphus+227320.100.1.3 1555618688 installed
<13>Oct 25 06:45:21 rpmi: libcodec2-0.8.1-alt1 1533802521 installed
<13>Oct 25 06:45:21 rpmi: libaom-1.0.0-alt2 sisyphus+235903.100.1.1 1565598673 installed
<13>Oct 25 06:45:21 rpmi: libCharLS-1.0-alt2 1389518018 installed
<13>Oct 25 06:45:21 rpmi: gcc-fortran-common-1.4.24-alt1 sisyphus+239632.400.3.1 1571789271 installed
<13>Oct 25 06:45:21 rpmi: libgfortran9-devel-9.2.1-alt1 sisyphus+239632.100.3.1 1571782948 installed
<13>Oct 25 06:45:21 rpmi: gcc9-fortran-9.2.1-alt1 sisyphus+239632.100.3.1 1571782948 installed
<13>Oct 25 06:45:21 rpmi: gcc-fortran-9-alt1 sisyphus+239632.300.3.1 1571789214 installed
<13>Oct 25 06:45:21 rpmi: gcc-c++-common-1.4.24-alt1 sisyphus+239632.400.3.1 1571789271 installed
<13>Oct 25 06:45:22 rpmi: libstdc++9-devel-9.2.1-alt1 sisyphus+239632.100.3.1 1571782948 installed
<13>Oct 25 06:45:23 rpmi: gcc9-c++-9.2.1-alt1 sisyphus+239632.100.3.1 1571782948 installed
<13>Oct 25 06:45:23 rpmi: gcc-c++-9-alt1 sisyphus+239632.300.3.1 1571789214 installed
<13>Oct 25 06:45:23 rpmi: udev-hwdb-1:243-alt3 sisyphus+239239.100.1.1 1571079023 installed
<13>Oct 25 06:45:23 rpmi: libseccomp-2.4.1-alt1 sisyphus+228056.100.1.1 1556057319 installed
<13>Oct 25 06:45:23 rpmi: libargon2-20190702-alt1 sisyphus+235300.100.1.1 1564606506 installed
<13>Oct 25 06:45:23 rpmi: hwclock-1:2.33.2-alt1 sisyphus+227076.100.1.1 1555076778 installed
<13>Oct 25 06:45:23 rpmi: hashalot-0.3-alt1.qa1 1366323553 installed
<13>Oct 25 06:45:23 rpmi: losetup-2.33.2-alt1 sisyphus+227076.100.1.1 1555076778 installed
<13>Oct 25 06:45:23 rpmi: lsblk-2.33.2-alt1 sisyphus+227076.100.1.1 1555076778 installed
<13>Oct 25 06:45:23 rpmi: cmake-modules-3.15.4-alt1 sisyphus+239520.100.1.1 1571611942 installed
<13>Oct 25 06:45:23 rpmi: libuv-1.32.0-alt1 sisyphus+237725.100.7.3 1569407628 installed
<13>Oct 25 06:45:23 rpmi: librhash-1.3.5-alt2 1505156277 installed
<13>Oct 25 06:45:23 rpmi: libjsoncpp19-1.8.4-alt4 sisyphus+232904.100.1.1 1561247384 installed
<13>Oct 25 06:45:23 rpmi: libmetis-5.1.0-alt1.1 1465290044 installed
<13>Oct 25 06:45:23 rpmi: libboost_context1.67.0-1:1.67.0-alt8 sisyphus+238768.500.16.1 1571430204 installed
<13>Oct 25 06:45:23 rpmi: libboost_fiber1.67.0-1:1.67.0-alt8 sisyphus+238768.500.16.1 1571430204 installed
<13>Oct 25 06:45:23 rpmi: libboost_stacktrace1.67.0-1:1.67.0-alt8 sisyphus+238768.500.16.1 1571430204 installed
<13>Oct 25 06:45:23 rpmi: libnumpy-py3-1:1.15.4-alt3 sisyphus+237451.600.2.1 1568395117 installed
<13>Oct 25 06:45:23 rpmi: libboost_python1.67.0-1:1.67.0-alt8 sisyphus+238768.500.16.1 1571430204 installed
<13>Oct 25 06:45:23 rpmi: libboost_test1.67.0-1:1.67.0-alt8 sisyphus+238768.500.16.1 1571430204 installed
<13>Oct 25 06:45:23 rpmi: libboost_serialization1.67.0-1:1.67.0-alt8 sisyphus+238768.500.16.1 1571430204 installed
<13>Oct 25 06:45:23 rpmi: libboost_iostreams1.67.0-1:1.67.0-alt8 sisyphus+238768.500.16.1 1571430204 installed
<13>Oct 25 06:45:23 rpmi: libboost_date_time1.67.0-1:1.67.0-alt8 sisyphus+238768.500.16.1 1571430204 installed
<13>Oct 25 06:45:23 rpmi: libboost_container1.67.0-1:1.67.0-alt8 sisyphus+238768.500.16.1 1571430204 installed
<13>Oct 25 06:45:23 rpmi: perl-Algorithm-Diff-1.1903-alt1 1418755800 installed
<13>Oct 25 06:45:23 rpmi: t1utils-1.41-alt1 1502978415 installed
<13>Oct 25 06:45:23 rpmi: libqqwing-1.3.4-alt2 1436192940 installed
<13>Oct 25 06:45:23 rpmi: qqwing-1.3.4-alt2 1436192940 installed
<13>Oct 25 06:45:23 rpmi: python-module-iniconfig-1.0.0-alt2 sisyphus+235493.2400.6.1 1565442448 installed
<13>Oct 25 06:45:23 rpmi: python-module-apipkg-1.5-alt1 1531926894 installed
<13>Oct 25 06:45:23 rpmi: python-module-imagesize-1.1.0-alt1 sisyphus+229015.100.2.1 1557233756 installed
<13>Oct 25 06:45:23 rpmi: python-sphinx-objects.inv-1:2.3.9.20191009-alt1 sisyphus+239017.100.1.1 1570703288 installed
<13>Oct 25 06:45:23 rpmi: libxapian-1.4.5-alt3 sisyphus+222778.100.1.1 1551144769 installed
<13>Oct 25 06:45:23 rpmi: python-module-google-0.4.2-alt2.1 sisyphus+228356.1500.3.1 1556633038 installed
<13>Oct 25 06:45:23 rpmi: python-module-enum34-1.1.6-alt3 1527251693 installed
<13>Oct 25 06:45:23 rpmi: libnumpy-1:1.15.4-alt3 sisyphus+237451.600.2.1 1568395117 installed
<13>Oct 25 06:45:23 rpmi: libxblas-1.0.248-alt1.3 sisyphus+229150.100.1.1 1557388758 installed
<13>Oct 25 06:45:23 rpmi: liblapack-1:3.8.0-alt3 sisyphus+221521.100.1.1 1550134909 installed
<13>Oct 25 06:45:23 rpmi: libsuitesparse-5.4.0-alt1 sisyphus+231121.400.4.1 1559650159 installed
<13>Oct 25 06:45:24 rpmi: ceres-solver-1.13.0-alt1_8 sisyphus+226018.100.1.1 1554036847 installed
<13>Oct 25 06:45:24 rpmi: perl-Unicode-Map-0.112-alt7.1 sisyphus+219907.5000.1.1 1548349925 installed
<13>Oct 25 06:45:24 rpmi: perl-Digest-Perl-MD5-1.9-alt1 1394057208 installed
<13>Oct 25 06:45:24 rpmi: perl-Crypt-RC4-2.02-alt1 1319549646 installed
<13>Oct 25 06:45:24 rpmi: perl-Math-Complex-1.59-alt1 1334229876 installed
<13>Oct 25 06:45:24 rpmi: perl-XML-RegExp-0.04-alt1 1348526543 installed
<13>Oct 25 06:45:24 rpmi: perl-DBI-1.642-alt1.1 sisyphus+219907.3200.1.1 1548345175 installed
<13>Oct 25 06:45:24 rpmi: perl-Package-Stash-XS-0.29-alt1.1 sisyphus+219907.3400.1.1 1548345296 installed
<13>Oct 25 06:45:24 rpmi: perl-Package-Stash-0.38-alt1 sisyphus.218845.100 1546250118 installed
<13>Oct 25 06:45:24 rpmi: perl-Sub-Identify-0.14-alt1.2 sisyphus+219907.3700.1.1 1548345423 installed
<13>Oct 25 06:45:24 rpmi: perl-Variable-Magic-0.62-alt1.2 sisyphus+219907.3600.1.1 1548345381 installed
<13>Oct 25 06:45:24 rpmi: perl-B-Hooks-EndOfScope-0.24-alt1 1524680298 installed
<13>Oct 25 06:45:24 rpmi: perl-namespace-clean-0.27-alt1 1464272543 installed
<13>Oct 25 06:45:24 rpmi: perl-namespace-autoclean-0.29-alt1 sisyphus+236797.100.1.1 1567078861 installed
<13>Oct 25 06:45:24 rpmi: perl-Sub-Quote-2.006006-alt1 sisyphus+238802.100.1.1 1570439522 installed
<13>Oct 25 06:45:24 rpmi: perl-Class-Data-Inheritable-0.08-alt2 1316996762 installed
<13>Oct 25 06:45:24 rpmi: perl-Exception-Class-1.44-alt1 1513614520 installed
<13>Oct 25 06:45:24 rpmi: perl-PadWalker-2.3-alt1.2 sisyphus+219907.3500.1.1 1548345336 installed
<13>Oct 25 06:45:24 rpmi: perl-Devel-Caller-2.06-alt2.2 sisyphus+219907.4000.1.1 1548345464 installed
<13>Oct 25 06:45:24 rpmi: perl-Devel-LexAlias-0.05-alt3_17 sisyphus+219907.4100.1.1 1548345510 installed
<13>Oct 25 06:45:24 rpmi: perl-Eval-Closure-0.14-alt1 1465147597 installed
<13>Oct 25 06:45:24 rpmi: perl-Params-ValidationCompiler-0.30-alt1 1533170707 installed
<13>Oct 25 06:45:24 rpmi: perl-Mail-Sendmail-0.80-alt1 1504118031 installed
<13>Oct 25 06:45:24 rpmi: perl-Mail-Sender-1:0.903-alt1 1479576662 installed
<13>Oct 25 06:45:24 rpmi: perl-Email-Date-Format-1.005-alt1 1413796337 installed
<13>Oct 25 06:45:24 rpmi: ppp-common-0.5.1-alt1 1244040597 installed
<13>Oct 25 06:45:24 rpmi: sendmail-common-1.7-alt3 1353029717 installed
<13>Oct 25 06:45:24 rpmi: perl-Locale-Maketext-Simple-0.21-alt3 1321333616 installed
<13>Oct 25 06:45:24 rpmi: perl-IPC-System-Simple-1.25-alt2_1 1388863478 installed
<13>Oct 25 06:45:24 rpmi: perl-Term-Cap-1.17-alt1 1445018869 installed
<13>Oct 25 06:45:24 rpmi: perl-Pod-Escapes-1.07-alt1 1418767892 installed
<13>Oct 25 06:45:24 rpmi: perl-File-Copy-Recursive-0.45-alt1 sisyphus+235291.100.1.1 1564606222 installed
<13>Oct 25 06:45:24 rpmi: perl-Digest-SHA1-2.13-alt5.2 sisyphus+219907.4500.1.1 1548349730 installed
<13>Oct 25 06:45:24 rpmi: less-530-alt1 sisyphus+226367.200.2.2 1554151813 installed
<13>Oct 25 06:45:24 rpmi: perl-Compress-Raw-Bzip2-2.087-alt1 sisyphus+236137.100.1.1 1565888150 installed
<13>Oct 25 06:45:24 rpmi: libdb4.7-devel-4.7.25-alt9 1490438456 installed
<13>Oct 25 06:45:24 rpmi: perl-devel-1:5.28.2-alt1 sisyphus+230063.100.1.1 1558785281 installed
<13>Oct 25 06:45:24 rpmi: perl-Test-Fatal-0.014-alt1 1418768336 installed
<13>Oct 25 06:45:24 rpmi: perl-Specio-0.44-alt1 sisyphus+236156.100.1.2 1565893582 installed
<13>Oct 25 06:45:24 rpmi: rgb-1.0.6-alt3 sisyphus+229441.100.1.2 1557940332 installed
<13>Oct 25 06:45:24 rpmi: libnetpbm11-10.85.04-alt1 sisyphus+225727.140.8.1 1553672201 installed
<13>Oct 25 06:45:24 rpmi: mailx-8.1.2-alt7 1366314831 installed
<13>Oct 25 06:45:24 rpmi: sharutils-4.6.3-alt1.1.qa2.1 1449219807 installed
<13>Oct 25 06:45:24 rpmi: ncompress-4.2.4.4-alt1 1366160439 installed
<13>Oct 25 06:45:24 rpmi: ed-1:0.2-alt10 1449768441 installed
<13>Oct 25 06:45:24 rpmi: dos2unix-7.3.5-alt1 1499695585 installed
<13>Oct 25 06:45:24 rpmi: libruby-2.5.5-alt4.1 sisyphus+237310.40.2.1 1568211289 installed
<13>Oct 25 06:45:24 rpmi: libyaml2-0.2.2-alt1 sisyphus+229134.100.1.1 1557342720 installed
<13>Oct 25 06:45:24 rpmi: perl-Filter-1.59-alt1.1 sisyphus+219907.400.1.1 1548343225 installed
<13>Oct 25 06:45:24 rpmi: perl-Encode-3.01-alt1 sisyphus+224923.100.1.1 1552474113 installed
<13>Oct 25 06:45:24 rpmi: perl-URI-1.76-alt1 sisyphus+220243.100.1.1 1548863244 installed
<13>Oct 25 06:45:24 rpmi: perl-HTML-Parser-3.72-alt1.2 sisyphus+219907.600.1.1 1548343407 installed
<13>Oct 25 06:45:24 rpmi: perl-IO-Compress-2.087-alt1 sisyphus+236429.100.1.1 1566466735 installed
<13>Oct 25 06:45:24 rpmi: perl-Net-HTTP-6.19-alt1 sisyphus+229756.100.1.1 1558454558 installed
<13>Oct 25 06:45:24 rpmi: perl-Pod-Simple-3.39-alt1 sisyphus+234046.100.1.1 1562497785 installed
<13>Oct 25 06:45:24 rpmi: perl-Pod-Usage-1.69-alt1 1464274721 installed
<13>Oct 25 06:45:24 rpmi: perl-podlators-4.12-alt1 sisyphus+231574.100.1.1 1559749961 installed
<13>Oct 25 06:45:24 rpmi: perl-WWW-RobotRules-6.02-alt1 1329756211 installed
<13>Oct 25 06:45:24 rpmi: perl-Encode-Locale-1.05-alt1 1444608613 installed
<13>Oct 25 06:45:24 rpmi: perl-IO-HTML-1.001-alt1 1404821752 installed
<13>Oct 25 06:45:24 rpmi: perl-HTTP-Message-6.18-alt1 1528288416 installed
<13>Oct 25 06:45:24 rpmi: perl-HTTP-Cookies-6.04-alt1 1504116575 installed
<13>Oct 25 06:45:24 rpmi: perl-HTTP-Negotiate-6.01-alt1 1329760563 installed
<13>Oct 25 06:45:24 rpmi: perl-libwww-6.39-alt1 sisyphus+229237.100.1.1 1557650051 installed
<13>Oct 25 06:45:24 rpmi: perl-XML-Parser-2.44-alt2.2 sisyphus+219907.1300.1.1 1548343654 installed
<13>Oct 25 06:45:24 rpmi: perl-HTML-Tree-5.07-alt1 1506480309 installed
<13>Oct 25 06:45:24 rpmi: perl-HTML-Formatter-2.16-alt1 1482105372 installed
<13>Oct 25 06:45:24 rpmi: perl-XML-LibXML-2.0201-alt1 sisyphus+231120.200.1.1 1559144562 installed
<13>Oct 25 06:45:24 rpmi: perl-XML-SAX-1.02-alt1 sisyphus+232322.100.1.1 1560758406 installed
<13>Oct 25 06:45:24 rpmi: perl-XML-Simple-2.25-alt1 1521437714 installed
<13>Oct 25 06:45:24 rpmi: icon-naming-utils-0.8.90-alt1 1236573102 installed
<13>Oct 25 06:45:25 rpmi: icon-theme-adwaita-3.34.0-alt1 sisyphus+237956.3300.4.2 1569336552 installed
<13>Oct 25 06:45:25 rpmi: perl-XML-DOM-1.46-alt1 1474815568 installed
<13>Oct 25 06:45:25 rpmi: perl-XML-XPath-1.44-alt1 sisyphus.215541.100 1540451758 installed
<13>Oct 25 06:45:25 rpmi: perl-HTML-Form-6.05-alt1 sisyphus+238797.100.1.1 1570438635 installed
<13>Oct 25 06:45:25 rpmi: perl-WWW-Mechanize-1.94-alt1 sisyphus+239152.100.1.1 1570978875 installed
<13>Oct 25 06:45:25 rpmi: perl-XML-Writer-0.625-alt1 1402417374 installed
<13>Oct 25 06:45:25 rpmi: hwinfo-utils-21.23-alt1.1 sisyphus+223919.100.1.1 1551893088 installed
<13>Oct 25 06:45:25 rpmi: perl-MIME-Types-2.17-alt1 1517533413 installed
<13>Oct 25 06:45:25 rpmi: perl-Text-CSV_XS-1.40-alt1 sisyphus+237771.100.1.1 1568826534 installed
<13>Oct 25 06:45:25 rpmi: perl-Spreadsheet-ParseExcel-1:0.65-alt1 1395677487 installed
<13>Oct 25 06:45:25 rpmi: perl-MIME-Charset-1.012.2-alt1 1494353584 installed
<13>Oct 25 06:45:25 rpmi: perl-YAML-Tiny-1.73-alt1 1520430664 installed
<13>Oct 25 06:45:25 rpmi: perl-libintl-1.31-alt1.1 sisyphus+219907.6300.1.1 1548352427 installed
<13>Oct 25 06:45:25 rpmi: libkpathsea6-2019-alt1_2 sisyphus+238768.1400.17.1 1571467400 installed
<13>Oct 25 06:45:25 rpmi: libptexenc1-2019-alt1_2 sisyphus+238768.1400.17.1 1571467400 installed
<13>Oct 25 06:45:25 rpmi: libsynctex2-2019-alt1_2 sisyphus+238768.1400.17.1 1571467400 installed
<13>Oct 25 06:45:25 rpmi: libtexlua5-2019-alt1_2 sisyphus+238768.1400.17.1 1571467400 installed
<13>Oct 25 06:45:25 rpmi: zziplib-0.13.69-alt2 sisyphus+236408.100.1.1 1566394972 installed
<13>Oct 25 06:45:25 rpmi: publicsuffix-list-dafsa-20190823-alt1 sisyphus+236630.100.1.1 1566830156 installed
<13>Oct 25 06:45:25 rpmi: libpsl-0.21.0-alt2 sisyphus+237083.100.1.1 1567531663 installed
<13>Oct 25 06:45:25 rpmi: libnghttp2-1.39.2-alt1 sisyphus+236978.100.1.1 1567325215 installed
<13>Oct 25 06:45:25 rpmi: libbrotlicommon-1.0.7-alt1 sisyphus+226738.100.2.1 1554554565 installed
<13>Oct 25 06:45:25 rpmi: libbrotlidec-1.0.7-alt1 sisyphus+226738.100.2.1 1554554565 installed
<13>Oct 25 06:45:25 rpmi: poppler-data-0.4.9-alt1 sisyphus.216033.100 1541141723 installed
<13>Oct 25 06:45:25 rpmi: libteckit-2.5.1-alt2.1 1319227424 installed
<13>Oct 25 06:45:25 rpmi: libteckit-utils-2.5.1-alt2.1 1319227424 installed
<13>Oct 25 06:45:25 rpmi: libdialog-1.3.20171209-alt1 1529583087 installed
<13>Oct 25 06:45:25 rpmi: dialog-1.3.20171209-alt1 1529583087 installed
<13>Oct 25 06:45:25 rpmi: python-modules-curses-2.7.16-alt1 sisyphus+226365.200.2.1 1554143277 installed
<13>Oct 25 06:45:25 rpmi: sgml-common-0.6.3-alt15 1423664786 installed
<13>Oct 25 06:45:25 rpmi: docbook-dtds-4.5-alt1 1223476557 installed
<13>Oct 25 06:45:25 rpmi: docbook-style-xsl-1.79.1-alt4 sisyphus+232871.100.1.1 1561238010 installed
<13>Oct 25 06:45:25 rpmi: lynx-data-2.8.9-alt1.pre.1.1 1535763485 installed
<13>Oct 25 06:45:25 rpmi: libverto-0.3.0-alt1_7 sisyphus+225932.100.1.1 1553994917 installed
<13>Oct 25 06:45:25 rpmi: libkeyutils-1.6-alt2 sisyphus+226520.100.2.1 1554512088 installed
<13>Oct 25 06:45:25 rpmi: libcom_err-1.44.6-alt1 sisyphus+224154.100.1.1 1552091653 installed
<13>Oct 25 06:45:25 rpmi: rpm-macros-alternatives-0.5.1-alt1 sisyphus+226946.100.1.1 1554830426 installed
<13>Oct 25 06:45:25 rpmi: alternatives-0.5.1-alt1 sisyphus+226946.100.1.1 1554830426 installed
<13>Oct 25 06:45:25 rpmi: ca-certificates-2019.09.10-alt1 sisyphus+237323.300.1.1 1568103476 installed
<13>Oct 25 06:45:25 rpmi: ca-trust-0.1.2-alt1 sisyphus+233348.100.1.1 1561653823 installed
<13>Oct 25 06:45:25 rpmi: p11-kit-trust-0.23.15-alt1 sisyphus+226408.100.2.1 1554288187 installed
<13>Oct 25 06:45:26 rpmi: libcrypto1.1-1.1.1d-alt1.1 sisyphus+237931.100.2.1 1569235630 installed
<13>Oct 25 06:45:26 rpmi: libssl1.1-1.1.1d-alt1.1 sisyphus+237931.100.2.1 1569235630 installed
<86>Oct 25 06:45:26 groupadd[53285]: group added to /etc/group: name=_keytab, GID=499
<86>Oct 25 06:45:26 groupadd[53285]: group added to /etc/gshadow: name=_keytab
<86>Oct 25 06:45:26 groupadd[53285]: new group: name=_keytab, GID=499
<13>Oct 25 06:45:26 rpmi: libkrb5-1.16.3-alt1 sisyphus+223678.100.1.1 1551746443 installed
<13>Oct 25 06:45:26 rpmi: libpython3-3.7.4-alt2 sisyphus+239418.100.1.1 1571389791 installed
<13>Oct 25 06:45:26 rpmi: python3-3.7.4-alt2 sisyphus+239418.100.1.1 1571389791 installed
<13>Oct 25 06:45:26 rpmi: python3-base-3.7.4-alt2 sisyphus+239418.100.1.1 1571389791 installed
<13>Oct 25 06:45:26 rpmi: libkmod-26-alt1 sisyphus+226359.100.1.1 1554129988 installed
<13>Oct 25 06:45:26 rpmi: kmod-26-alt1 sisyphus+226359.100.1.1 1554129988 installed
<13>Oct 25 06:45:27 rpmi: python3-module-numpy-1:1.15.4-alt3 sisyphus+237451.600.2.1 1568395117 installed
<13>Oct 25 06:45:27 rpmi: libboost_python3-1.67.0-1:1.67.0-alt8 sisyphus+238768.500.16.1 1571430204 installed
<13>Oct 25 06:45:27 rpmi: libboost_numpy3-1.67.0-1:1.67.0-alt8 sisyphus+238768.500.16.1 1571430204 installed
<13>Oct 25 06:45:27 rpmi: libtirpc-1.0.3-alt1 1532008015 installed
<13>Oct 25 06:45:27 rpmi: libnsl2-1.1.0-alt1_1 1511548748 installed
<13>Oct 25 06:45:27 rpmi: python-modules-encodings-2.7.16-alt1 sisyphus+226365.200.2.1 1554143277 installed
<13>Oct 25 06:45:27 rpmi: python-modules-compiler-2.7.16-alt1 sisyphus+226365.200.2.1 1554143277 installed
<13>Oct 25 06:45:27 rpmi: python-modules-email-2.7.16-alt1 sisyphus+226365.200.2.1 1554143277 installed
<13>Oct 25 06:45:27 rpmi: python-modules-unittest-2.7.16-alt1 sisyphus+226365.200.2.1 1554143277 installed
<13>Oct 25 06:45:27 rpmi: python-modules-nis-2.7.16-alt1 sisyphus+226365.200.2.1 1554143277 installed
<13>Oct 25 06:45:27 rpmi: python-modules-2.7.16-alt1 sisyphus+226365.200.2.1 1554143277 installed
<13>Oct 25 06:45:27 rpmi: python-modules-xml-2.7.16-alt1 sisyphus+226365.200.2.1 1554143277 installed
<13>Oct 25 06:45:27 rpmi: python-module-six-1.12.0-alt1 sisyphus+219665.100.2.1 1548148570 installed
<13>Oct 25 06:45:27 rpmi: python-module-pkg_resources-1:41.4.0-alt1 sisyphus+238787.100.2.1 1570608044 installed
<13>Oct 25 06:45:27 rpmi: python-modules-ctypes-2.7.16-alt1 sisyphus+226365.200.2.1 1554143277 installed
<13>Oct 25 06:45:27 rpmi: python-modules-json-2.7.16-alt1 sisyphus+226365.200.2.1 1554143277 installed
<13>Oct 25 06:45:27 rpmi: python-modules-multiprocessing-2.7.16-alt1 sisyphus+226365.200.2.1 1554143277 installed
<13>Oct 25 06:45:27 rpmi: python-modules-logging-2.7.16-alt1 sisyphus+226365.200.2.1 1554143277 installed
<13>Oct 25 06:45:27 rpmi: python-modules-hotshot-2.7.16-alt1 sisyphus+226365.200.2.1 1554143277 installed
<13>Oct 25 06:45:27 rpmi: python-module-chardet-3.0.4-alt1 sisyphus+227476.1700.1.2 1555756717 installed
<13>Oct 25 06:45:27 rpmi: python-tools-2to3-2.7.16-alt1 sisyphus+226365.200.2.1 1554143277 installed
<13>Oct 25 06:45:27 rpmi: python-module-future-0.16.0-alt2 sisyphus+228356.200.3.3 1556645013 installed
<13>Oct 25 06:45:27 rpmi: python-module-pyglet-1.3.0-alt4.a1.hg20150730.1.1.1 1460413686 installed
<13>Oct 25 06:45:27 rpmi: python-module-whoosh-2.7.4-alt1 1527697941 installed
<13>Oct 25 06:45:27 rpmi: python-module-webencodings-0.5.1-alt1.1 1517943573 installed
<13>Oct 25 06:45:27 rpmi: asciidoc-8.6.9-alt1.1 1520284178 installed
<13>Oct 25 06:45:27 rpmi: python-modules-bsddb-2.7.16-alt1 sisyphus+226365.200.2.1 1554143277 installed
<13>Oct 25 06:45:27 rpmi: python-2.7.16-alt1 sisyphus+226365.200.2.1 1554143277 installed
<13>Oct 25 06:45:27 rpmi: python-strict-2.7.16-alt1 sisyphus+226365.200.2.1 1554143277 installed
<13>Oct 25 06:45:27 rpmi: python-modules-distutils-2.7.16-alt1 sisyphus+226365.200.2.1 1554143277 installed
<13>Oct 25 06:45:27 rpmi: python-module-numpy-1:1.15.4-alt3 sisyphus+237451.600.2.1 1568395117 installed
<13>Oct 25 06:45:27 rpmi: libboost_numpy1.67.0-1:1.67.0-alt8 sisyphus+238768.500.16.1 1571430204 installed
<13>Oct 25 06:45:29 rpmi: boost-devel-headers-1:1.67.0-alt8 sisyphus+238768.500.16.1 1571430204 installed
<13>Oct 25 06:45:29 rpmi: boost-devel-1:1.67.0-alt8 sisyphus+238768.500.16.1 1571430204 installed
<13>Oct 25 06:45:29 rpmi: python-module-4Suite-XML-1.0.2-alt4 sisyphus+224327.100.1.1 1552242107 installed
<13>Oct 25 06:45:29 rpmi: python-module-idna-2.8-alt1 sisyphus+227494.400.1.3 1555838720 installed
<13>Oct 25 06:45:29 rpmi: python-module-pycparser-2.19-alt1 sisyphus+228366.1000.2.3 1556706938 installed
<13>Oct 25 06:45:29 rpmi: python-module-cffi-1.12.3-alt1 sisyphus+229040.200.3.1 1557316502 installed
<13>Oct 25 06:45:29 rpmi: python-module-ntlm-1.1.0-alt1.2 sisyphus+228512.100.1.1 1556654575 installed
<13>Oct 25 06:45:29 rpmi: python-module-pytz-1:2016.10-alt1 1484291011 installed
<13>Oct 25 06:45:29 rpmi: python-module-babel-1:2.6.0-alt1 sisyphus+228351.2400.6.2 1556652168 installed
<13>Oct 25 06:45:29 rpmi: python-module-PyStemmer-1.0.1-alt1.2.1 1321387369 installed
<13>Oct 25 06:45:29 rpmi: python-module-snowballstemmer-1.2.0-alt2.1 1457859319 installed
<13>Oct 25 06:45:29 rpmi: python-module-simplejson-3.15.0-alt3.qa1 sisyphus+233013.100.1.1 1561323445 installed
<13>Oct 25 06:45:29 rpmi: python-module-ipaddress-1.0.18-alt1.1 sisyphus+227494.1700.1.3 1555839523 installed
<13>Oct 25 06:45:29 rpmi: python-module-cryptography-2.8-alt1 sisyphus+239390.100.1.2 1571349409 installed
<13>Oct 25 06:45:29 rpmi: python-module-OpenSSL-19.0.0-alt1 sisyphus+238757.100.1.1 1570339901 installed
<13>Oct 25 06:45:29 rpmi: python-module-ndg-0.4.2-alt1.qa1 sisyphus+227504.1300.1.2 1555853074 installed
<13>Oct 25 06:45:29 rpmi: python-module-ndg-httpsclient-0.4.2-alt1.qa1 sisyphus+227504.1300.1.2 1555853074 installed
<13>Oct 25 06:45:29 rpmi: python-module-backports-3.5.0.1-alt1.1.1 1517645428 installed
<13>Oct 25 06:45:29 rpmi: python-module-backports.ssl_match_hostname-3.5.0.1-alt1.1.1 1517645428 installed
<13>Oct 25 06:45:29 rpmi: python-module-urllib3-2:1.25.6-alt1 sisyphus+238720.100.2.1 1570349439 installed
<13>Oct 25 06:45:29 rpmi: python-module-requests-2.22.0-alt1 sisyphus+238756.100.1.1 1570338316 installed
<13>Oct 25 06:45:29 rpmi: python-module-typing-3.6.6-alt2 sisyphus+220108.100.1.1 1548749697 installed
<13>Oct 25 06:45:29 rpmi: python-module-markupsafe-0.23-alt1.2.1.1 sisyphus+225625.12200.91.1 1555290677 installed
<13>Oct 25 06:45:29 rpmi: python-module-jinja2-2.10.1-alt1 sisyphus+237301.100.1.1 1568032479 installed
<13>Oct 25 06:45:29 rpmi: python-modules-sqlite3-2.7.16-alt1 sisyphus+226365.200.2.1 1554143277 installed
<13>Oct 25 06:45:29 rpmi: python-module-SQLAlchemy-1.3.8-alt1 sisyphus+237031.100.1.1 1567432466 installed
<13>Oct 25 06:45:29 rpmi: python-module-py-1.8.0-alt4 sisyphus+235493.3100.7.1 1565453944 installed
<13>Oct 25 06:45:29 rpmi: python-module-mpmath-0.19-alt1.git20150621.1.1.1.1 sisyphus+227503.2100.1.3 1555860908 installed
<13>Oct 25 06:45:30 rpmi: python-module-sympy-tests-1:1.1.1-alt1.1.1 sisyphus+228334.100.1.1 1556542452 installed
<13>Oct 25 06:45:30 rpmi: python-module-sympy-1:1.1.1-alt1.1.1 sisyphus+228334.100.1.1 1556542452 installed
<13>Oct 25 06:45:30 rpmi: python-module-xapian-1.4.5-alt4 sisyphus+237555.100.1.1 1568564577 installed
<86>Oct 25 06:45:30 groupadd[60342]: group added to /etc/group: name=sasl, GID=498
<86>Oct 25 06:45:30 groupadd[60342]: group added to /etc/gshadow: name=sasl
<86>Oct 25 06:45:30 groupadd[60342]: new group: name=sasl, GID=498
<13>Oct 25 06:45:30 rpmi: libsasl2-3-2.1.27-alt2 sisyphus+228101.100.1.1 1556139861 installed
<13>Oct 25 06:45:30 rpmi: libldap-2.4.48-alt3 sisyphus+238816.100.1.1 1570449061 installed
<13>Oct 25 06:45:30 rpmi: libcurl-7.66.0-alt1 sisyphus+237384.100.1.1 1568183536 installed
<13>Oct 25 06:45:30 rpmi: libssh-0.8.7-alt1 sisyphus+223596.100.1.1 1551707803 installed
<13>Oct 25 06:45:30 rpmi: libneon-0.30.2-alt1 sisyphus+226834.100.1.1 1554686299 installed
<13>Oct 25 06:45:30 rpmi: lynx-2.8.9-alt1.pre.1.1 1535763485 installed
<13>Oct 25 06:45:30 rpmi: openssl-1.1.1d-alt1.1 sisyphus+237931.100.2.1 1569235630 installed
<13>Oct 25 06:45:31 rpmi: ruby-rubygems-update-3.0.4-alt1 sisyphus+231621.240.57.1 1567243682 installed
<13>Oct 25 06:45:31 rpmi: gem-did-you-mean-1.3.0-alt2.1 sisyphus+237310.1100.2.1 1568211939 installed
<13>Oct 25 06:45:31 rpmi: ruby-minitest-5.11.3-alt1 sisyphus+219345.3500.8.1 1547631954 installed
<13>Oct 25 06:45:31 rpmi: ruby-net-telnet-0.2.0-alt1 sisyphus+219345.2700.8.1 1547631566 installed
<13>Oct 25 06:45:31 rpmi: gem-power-assert-1.1.4-alt1 sisyphus+226411.3200.6.1 1554380195 installed
<13>Oct 25 06:45:31 rpmi: bundle-2.0.2-alt2 sisyphus+237310.400.2.1 1568211679 installed
<13>Oct 25 06:45:32 rpmi: ruby-bundler-2.0.2-alt2 sisyphus+237310.400.2.1 1568211679 installed
<13>Oct 25 06:45:32 rpmi: rake-12.3.3-alt1 sisyphus+238087.3100.11.1 1569616589 installed
<13>Oct 25 06:45:32 rpmi: ruby-rake-12.3.3-alt1 sisyphus+238087.3100.11.1 1569616589 installed
<13>Oct 25 06:45:32 rpmi: ruby-test-unit-1:3.3.1-alt1 sisyphus+226411.5300.6.1 1554381151 installed
<13>Oct 25 06:45:32 rpmi: ruby-xmlrpc-0.3.0-alt1 sisyphus+219345.3300.8.1 1547631818 installed
<13>Oct 25 06:45:32 rpmi: gem-2.5.5-alt4.1 sisyphus+237310.40.2.1 1568211289 installed
<13>Oct 25 06:45:32 rpmi: ri-6.1.1-alt3 sisyphus+220149.7500.44.1 1552167568 installed
<13>Oct 25 06:45:32 rpmi: rdoc-6.1.1-alt3 sisyphus+220149.7500.44.1 1552167568 installed
<13>Oct 25 06:45:32 rpmi: ruby-rdoc-6.1.1-alt3 sisyphus+220149.7500.44.1 1552167568 installed
<13>Oct 25 06:45:32 rpmi: ruby-stdlibs-2.5.5-alt4.1 sisyphus+237310.40.2.1 1568211289 installed
<13>Oct 25 06:45:32 rpmi: erb-2.5.5-alt4.1 sisyphus+237310.40.2.1 1568211289 installed
<13>Oct 25 06:45:32 rpmi: irb-2.5.5-alt4.1 sisyphus+237310.40.2.1 1568211289 installed
<13>Oct 25 06:45:32 rpmi: ruby-2.5.5-alt4.1 sisyphus+237310.40.2.1 1568211289 installed
<13>Oct 25 06:45:32 rpmi: gem-asciidoctor-2.0.10-alt1 sisyphus+231621.4700.57.1 1567245604 installed
<13>Oct 25 06:45:32 rpmi: perl-Net-SSLeay-1.88-alt1 sisyphus+231287.100.1.1 1559389265 installed
<13>Oct 25 06:45:32 rpmi: perl-IO-Socket-SSL-2.066-alt1 sisyphus+223890.100.1.1 1551873760 installed
<13>Oct 25 06:45:32 rpmi: perl-Net-HTTPS-6.19-alt1 sisyphus+229756.100.1.1 1558454558 installed
<13>Oct 25 06:45:32 rpmi: perl-LWP-Protocol-https-6.07-alt1 1494527383 installed
<13>Oct 25 06:45:32 rpmi: perl-Net-SMTP-SSL-1.04-alt1 1479470835 installed
<13>Oct 25 06:45:32 rpmi: perl-MailTools-2.21-alt1 sisyphus+230038.100.1.1 1558716056 installed
<13>Oct 25 06:45:32 rpmi: perl-MIME-Lite-3.030-alt1 1383865152 installed
<13>Oct 25 06:45:32 rpmi: perl-Log-Dispatch-2.68-alt2 sisyphus.218872.100 1546338428 installed
<13>Oct 25 06:45:32 rpmi: perl-Log-Log4perl-1.49-alt1 1489613295 installed
<13>Oct 25 06:45:32 rpmi: gdcm-2.8.4-alt3_11 sisyphus+238653.100.1.1 1570182186 installed
<86>Oct 25 06:45:32 groupadd[63293]: group added to /etc/group: name=iputils, GID=497
<86>Oct 25 06:45:32 groupadd[63293]: group added to /etc/gshadow: name=iputils
<86>Oct 25 06:45:32 groupadd[63293]: new group: name=iputils, GID=497
<86>Oct 25 06:45:32 useradd[63300]: new user: name=iputils, UID=499, GID=497, home=/dev/null, shell=/dev/null
<86>Oct 25 06:45:32 groupadd[63314]: group added to /etc/group: name=netadmin, GID=496
<86>Oct 25 06:45:32 groupadd[63314]: group added to /etc/gshadow: name=netadmin
<86>Oct 25 06:45:32 groupadd[63314]: new group: name=netadmin, GID=496
<13>Oct 25 06:45:32 rpmi: iputils-20190709-alt1 sisyphus+236473.100.1.1 1566493578 installed
sysctl: cannot stat /proc/sys/net/ipv4/ping_group_range: No such file or directory
<13>Oct 25 06:45:32 rpmi: iproute2-5.3.0-alt1 sisyphus+238584.100.2.1 1570062599 installed
<13>Oct 25 06:45:33 rpmi: gambit-4.9.3-alt1 sisyphus+220998.100.1.4 1549742897 installed
<13>Oct 25 06:45:33 rpmi: libnss-3.46.0-alt1 sisyphus+237323.200.2.1 1568109322 installed
<13>Oct 25 06:45:33 rpmi: foomatic-db-engine-4.0.12-alt1 1449527980 installed
<13>Oct 25 06:45:33 rpmi: libwmflite-0.2.8.4-alt13 1506519334 installed
<13>Oct 25 06:45:33 rpmi: liblqr-0.4.2-alt1 1383038436 installed
<13>Oct 25 06:45:33 rpmi: djvu-common-3.5.25.3-alt1 1365826139 installed
<13>Oct 25 06:45:33 rpmi: libdjvu-3.5.25.3-alt1 1365826137 installed
<13>Oct 25 06:45:33 rpmi: libgts-0.7.6-alt2.drc20130205.1 sisyphus+225727.500.8.1 1553672625 installed
<13>Oct 25 06:45:33 rpmi: libgpg-error-1.36-alt1 sisyphus+225621.300.1.1 1553521088 installed
<13>Oct 25 06:45:33 rpmi: libgcrypt20-1.8.5-alt3 sisyphus+239622.100.1.1 1571746563 installed
<13>Oct 25 06:45:33 rpmi: libsystemd-1:243-alt3 sisyphus+239239.100.1.1 1571079023 installed
<13>Oct 25 06:45:33 rpmi: libdbus-1.12.12-alt2 sisyphus+221234.100.1.2 1549918037 installed
<13>Oct 25 06:45:33 rpmi: libxslt-1.1.33-alt2 sisyphus+237506.100.1.1 1568316627 installed
<13>Oct 25 06:45:33 rpmi: python-module-cssselect-0.9.1-alt1.2 sisyphus+227479.1100.1.2 1555757152 installed
<13>Oct 25 06:45:33 rpmi: python-module-html5lib-1:1.0.1-alt1 sisyphus+238807.100.2.1 1570465973 installed
<13>Oct 25 06:45:33 rpmi: python-module-lxml-4.4.1-alt1 sisyphus+236738.100.2.3 1567016364 installed
<13>Oct 25 06:45:33 rpmi: python-module-docutils-0.14-alt2 1535729778 installed
<13>Oct 25 06:45:33 rpmi: dbus-tools-1.12.12-alt2 sisyphus+221234.100.1.2 1549918037 installed
<86>Oct 25 06:45:33 groupadd[64181]: group added to /etc/group: name=messagebus, GID=495
<86>Oct 25 06:45:33 groupadd[64181]: group added to /etc/gshadow: name=messagebus
<86>Oct 25 06:45:33 groupadd[64181]: new group: name=messagebus, GID=495
<86>Oct 25 06:45:33 useradd[64186]: new user: name=messagebus, UID=498, GID=495, home=/run/dbus, shell=/dev/null
<13>Oct 25 06:45:33 rpmi: dbus-1.12.12-alt2 sisyphus+221234.100.1.2 1549918037 installed
<13>Oct 25 06:45:33 rpmi: xsltproc-1.1.33-alt2 sisyphus+237506.100.1.1 1568316627 installed
<13>Oct 25 06:45:33 rpmi: python-module-alabaster-0.7.6-alt3 sisyphus+228351.700.4.1 1556637370 installed
<13>Oct 25 06:45:33 rpmi: python-module-sphinxcontrib-websupport-1.0.1-alt5 sisyphus+238085.40.2.1 1569316750 installed
<13>Oct 25 06:45:33 rpmi: python-module-sphinx-1:1.6.5-alt7 sisyphus+238085.300.2.1 1569317039 installed
<13>Oct 25 06:45:33 rpmi: python-module-Pygments-2.4.2-alt1 sisyphus+233443.20.3.1 1561904164 installed
<13>Oct 25 06:45:33 rpmi: libraptor2-2.0.15-alt1 1417013328 installed
<13>Oct 25 06:45:33 rpmi: liblrdf-0.6.1-alt1 1493047569 installed
<13>Oct 25 06:45:34 rpmi: libavahi-0.7-alt1 sisyphus+237493.100.1.1 1568299460 installed
<13>Oct 25 06:45:34 rpmi: libcups-2.2.12-alt2 sisyphus+236663.100.1.1 1566900250 installed
<13>Oct 25 06:45:34 rpmi: libqt5-dbus-5.12.5-alt1 sisyphus+238768.340.19.1 1571500911 installed
<13>Oct 25 06:45:34 rpmi: libqt5-network-5.12.5-alt1 sisyphus+238768.340.19.1 1571500911 installed
<13>Oct 25 06:45:34 rpmi: libcryptsetup-2.2.0-alt1 sisyphus+236388.100.1.1 1566341901 installed
<13>Oct 25 06:45:34 rpmi: startup-0.9.9.6-alt1 sisyphus.215964.200 1542884274 installed
<13>Oct 25 06:45:34 rpmi: systemd-utils-1:243-alt3 sisyphus+239239.100.1.1 1571079023 installed
<13>Oct 25 06:45:34 rpmi: dmsetup-1.02.163-alt1 sisyphus+235860.260.6.1 1565551887 installed
<86>Oct 25 06:45:34 groupadd[65439]: group added to /etc/group: name=tape, GID=494
<86>Oct 25 06:45:34 groupadd[65439]: group added to /etc/gshadow: name=tape
<86>Oct 25 06:45:34 groupadd[65439]: new group: name=tape, GID=494
<86>Oct 25 06:45:34 groupadd[65457]: group added to /etc/group: name=dialout, GID=493
<86>Oct 25 06:45:34 groupadd[65457]: group added to /etc/gshadow: name=dialout
<86>Oct 25 06:45:34 groupadd[65457]: new group: name=dialout, GID=493
<86>Oct 25 06:45:34 groupadd[65471]: group added to /etc/group: name=input, GID=492
<86>Oct 25 06:45:34 groupadd[65471]: group added to /etc/gshadow: name=input
<86>Oct 25 06:45:34 groupadd[65471]: new group: name=input, GID=492
<86>Oct 25 06:45:34 groupadd[65486]: group added to /etc/group: name=video, GID=491
<86>Oct 25 06:45:34 groupadd[65486]: group added to /etc/gshadow: name=video
<86>Oct 25 06:45:34 groupadd[65486]: new group: name=video, GID=491
<86>Oct 25 06:45:34 groupadd[65499]: group added to /etc/group: name=render, GID=490
<86>Oct 25 06:45:34 groupadd[65499]: group added to /etc/gshadow: name=render
<86>Oct 25 06:45:34 groupadd[65499]: new group: name=render, GID=490
<13>Oct 25 06:45:34 rpmi: udev-1:243-alt3 sisyphus+239239.100.1.1 1571079023 installed
<13>Oct 25 06:45:34 rpmi: rdma-core-24.0-alt3 sisyphus+233653.100.1.1 1562118434 installed
<13>Oct 25 06:45:34 rpmi: ibacm-24.0-alt3 sisyphus+233653.100.1.1 1562118434 installed
<13>Oct 25 06:45:34 rpmi: rdma-core-devel-24.0-alt3 sisyphus+233653.100.1.1 1562118434 installed
<13>Oct 25 06:45:34 rpmi: icon-theme-hicolor-0.17-alt1 1505715846 installed
<13>Oct 25 06:45:34 rpmi: shared-mime-info-1.13.1-alt1 sisyphus+238155.100.2.1 1569407984 installed
<13>Oct 25 06:45:34 rpmi: gsettings-desktop-schemas-data-3.34.0-alt1 sisyphus+237956.300.4.2 1569331130 installed
<13>Oct 25 06:45:34 rpmi: libgio-2.62.2-alt1 sisyphus+239591.100.1.1 1571692074 installed
<13>Oct 25 06:45:34 rpmi: gsettings-desktop-schemas-3.34.0-alt1 sisyphus+237956.300.4.2 1569331130 installed
<13>Oct 25 06:45:34 rpmi: libgstreamer1.0-1.16.1-alt1 sisyphus+238106.200.2.2 1569421652 installed
<13>Oct 25 06:45:34 rpmi: gstreamer1.0-1.16.1-alt1 sisyphus+238106.200.2.2 1569421652 installed
<13>Oct 25 06:45:34 rpmi: gobject-introspection-1.62.0-alt1 sisyphus+237956.200.4.2 1569331053 installed
<13>Oct 25 06:45:34 rpmi: libgstreamer1.0-gir-1.16.1-alt1 sisyphus+238106.200.2.2 1569421652 installed
<13>Oct 25 06:45:34 rpmi: libgusb-0.3.0-alt1 1518891733 installed
<13>Oct 25 06:45:34 rpmi: libcolord-1.4.4-alt2 sisyphus+229904.100.1.1 1558606512 installed
<13>Oct 25 06:45:34 rpmi: glib-networking-2.62.1-alt1 sisyphus+238952.4100.5.1 1570662063 installed
<13>Oct 25 06:45:34 rpmi: libsoup-2.68.2-alt1 sisyphus+238952.4140.5.1 1570662161 installed
<13>Oct 25 06:45:34 rpmi: libgssdp-1.0.3-alt1 sisyphus+219951.100.1.1 1548401419 installed
<13>Oct 25 06:45:34 rpmi: libgupnp-1.0.4-alt1 sisyphus+231343.100.1.1 1559502080 installed
<13>Oct 25 06:45:34 rpmi: libgupnp-igd-0.2.5-alt2 sisyphus+226525.100.2.3 1554592980 installed
<13>Oct 25 06:45:34 rpmi: libnice-0.1.16-alt1 sisyphus+229216.100.1.1 1557584949 installed
<13>Oct 25 06:45:34 rpmi: libsoup-gnome-2.68.2-alt1 sisyphus+238952.4140.5.1 1570662161 installed
<13>Oct 25 06:45:34 rpmi: librest-0.8.1-alt1 1508266396 installed
<13>Oct 25 06:45:34 rpmi: libdconf-0.34.0-alt1 sisyphus+237956.1500.4.2 1569334199 installed
<13>Oct 25 06:45:34 rpmi: dconf-0.34.0-alt1 sisyphus+237956.1500.4.2 1569334199 installed
<13>Oct 25 06:45:34 rpmi: libgtk+3-schemas-3.24.12-alt1 sisyphus+238952.400.5.1 1570658028 installed
<13>Oct 25 06:45:34 rpmi: libpolkit-0.116-alt1 sisyphus+228976.400.4.1 1557128960 installed
<86>Oct 25 06:45:34 groupadd[66309]: group added to /etc/group: name=colord, GID=489
<86>Oct 25 06:45:34 groupadd[66309]: group added to /etc/gshadow: name=colord
<86>Oct 25 06:45:34 groupadd[66309]: new group: name=colord, GID=489
<86>Oct 25 06:45:34 useradd[66316]: new user: name=colord, UID=497, GID=489, home=/var/colord, shell=/dev/null
<13>Oct 25 06:45:34 rpmi: colord-1.4.4-alt2 sisyphus+229904.100.1.1 1558606512 installed
<13>Oct 25 06:45:34 rpmi: libjson-glib-1.4.4-alt1 sisyphus.213175.100 1537249583 installed
<13>Oct 25 06:45:34 rpmi: libgdk-pixbuf-locales-2.40.0-alt1 sisyphus+238952.140.2.1 1570644607 installed
<13>Oct 25 06:45:34 rpmi: libgdk-pixbuf-2.40.0-alt1 sisyphus+238952.140.2.1 1570644607 installed
<13>Oct 25 06:45:34 rpmi: gtk-update-icon-cache-3.24.12-alt1 sisyphus+238952.400.5.1 1570658028 installed
<13>Oct 25 06:45:35 rpmi: libgtk+2-locales-2.24.32-alt3 sisyphus+227306.100.1.3 1555646039 installed
<13>Oct 25 06:45:35 rpmi: libatk-locales-2.34.1-alt1 sisyphus+237956.700.4.2 1569332333 installed
<13>Oct 25 06:45:35 rpmi: libatk-2.34.1-alt1 sisyphus+237956.700.4.2 1569332333 installed
<13>Oct 25 06:45:35 rpmi: libdatrie-0.2.9-alt1_6 1511686677 installed
<13>Oct 25 06:45:35 rpmi: libthai-0.1.28-alt1_1 sisyphus+226107.100.1.1 1554123079 installed
<13>Oct 25 06:45:35 rpmi: libsombok-2.4.0-alt1_8 sisyphus+226104.100.1.1 1554121176 installed
<13>Oct 25 06:45:35 rpmi: perl-Unicode-LineBreak-2019.001-alt1.1 sisyphus+219907.4700.1.1 1548349872 installed
<13>Oct 25 06:45:35 rpmi: libxshmfence-1.3-alt1 sisyphus+223149.1000.2.1 1551268594 installed
<13>Oct 25 06:45:35 rpmi: libpciaccess-1:0.16-alt1 sisyphus+234814.100.1.1 1563438297 installed
<13>Oct 25 06:45:35 rpmi: libdrm-1:2.4.99-alt1 sisyphus+234110.100.1.1 1562593655 installed
<13>Oct 25 06:45:35 rpmi: libgbm-4:19.2.1-alt1 sisyphus+239033.100.1.1 1570716435 installed
<13>Oct 25 06:45:35 rpmi: libgraphite2-1.3.13-alt2 sisyphus+226799.100.1.1 1554648233 installed
<13>Oct 25 06:45:35 rpmi: libharfbuzz-2.6.2-alt1 sisyphus+238768.140.16.1 1571427539 installed
<13>Oct 25 06:45:35 rpmi: libfreetype-2.10.1-alt1 sisyphus+237471.100.1.1 1568276349 installed
<13>Oct 25 06:45:35 rpmi: fontconfig-2.13.1-alt1 sisyphus+226691.100.2.2 1554598717 installed
Updating fonts cache: <29>Oct 25 06:45:36 fontconfig: Updating fonts cache: succeeded
[ DONE ]
<13>Oct 25 06:45:37 rpmi: libgs-9.28-alt0.rc1.1 sisyphus+237325.100.1.1 1568103940 installed
<13>Oct 25 06:45:37 rpmi: libass9-0.14.0-alt1 sisyphus+220287.100.1.1 1548927393 installed
<13>Oct 25 06:45:37 rpmi: fonts-type1-urw-3:1.0.7pre44-alt3 sisyphus+224082.100.2.1 1552406640 installed
<13>Oct 25 06:45:38 rpmi: ghostscript-common-9.28-alt0.rc1.1 sisyphus+237325.100.1.1 1568103940 installed
<13>Oct 25 06:45:38 rpmi: ghostscript-classic-9.28-alt0.rc1.1 sisyphus+237325.100.1.1 1568103940 installed
<13>Oct 25 06:45:38 rpmi: libpoppler91-0.81.0-alt1 sisyphus+238642.100.1.1 1570176624 installed
<13>Oct 25 06:45:38 rpmi: libbluray-1.0.2-alt2 sisyphus+238344.100.1.1 1569839171 installed
<13>Oct 25 06:45:38 rpmi: ttf2pt1-3.4.4-alt1.qa1 1366267504 installed
<13>Oct 25 06:45:38 rpmi: libX11-locales-3:1.6.9-alt1 sisyphus+239210.100.1.1 1571056781 installed
<13>Oct 25 06:45:38 rpmi: libXdmcp-1.1.3-alt1 sisyphus+225206.600.1.2 1552949347 installed
<13>Oct 25 06:45:38 rpmi: libXau-1.0.9-alt1 sisyphus+223149.200.2.1 1551268156 installed
<13>Oct 25 06:45:38 rpmi: libxcb-1.13.1-alt1 sisyphus+226527.100.2.2 1554593799 installed
<13>Oct 25 06:45:38 rpmi: libX11-3:1.6.9-alt1 sisyphus+239210.100.1.1 1571056781 installed
<13>Oct 25 06:45:38 rpmi: libXext-1.3.4-alt1 sisyphus+225206.700.1.2 1552949422 installed
<13>Oct 25 06:45:38 rpmi: libXrender-0.9.8-alt1 1371312110 installed
<13>Oct 25 06:45:38 rpmi: libXfixes-5.0.3-alt1 sisyphus+226736.100.2.2 1554614842 installed
<13>Oct 25 06:45:38 rpmi: libXt-1.1.4-alt1 1369984716 installed
<13>Oct 25 06:45:38 rpmi: libXdamage-1.1.5-alt1 sisyphus+225206.500.1.2 1552949282 installed
<13>Oct 25 06:45:38 rpmi: libpulseaudio-13.0-alt1 sisyphus+237619.100.1.1 1568646711 installed
<13>Oct 25 06:45:38 rpmi: libXmu-1.1.3-alt1 sisyphus+225206.1200.1.2 1552949629 installed
<13>Oct 25 06:45:38 rpmi: libXft-2.3.3-alt1 sisyphus+225206.1000.3.2 1552987714 installed
<13>Oct 25 06:45:38 rpmi: libXrandr-1.5.2-alt1 sisyphus+225206.1300.1.2 1552949698 installed
<13>Oct 25 06:45:38 rpmi: libXpm-3.5.12-alt1 sisyphus+223149.400.2.1 1551268300 installed
<13>Oct 25 06:45:38 rpmi: libgd3-2.2.5-alt3 sisyphus+226800.200.2.1 1554649314 installed
<13>Oct 25 06:45:38 rpmi: libXcursor-1.2.0-alt1 sisyphus+225206.400.1.2 1552949214 installed
<13>Oct 25 06:45:38 rpmi: libXi-1.7.10-alt1 sisyphus+232786.300.1.1 1561106975 installed
<13>Oct 25 06:45:38 rpmi: libXinerama-1.1.4-alt1 sisyphus+223149.300.2.1 1551268223 installed
<13>Oct 25 06:45:38 rpmi: libvdpau-1:1.3-alt1 sisyphus+236768.100.1.1 1567066111 installed
<13>Oct 25 06:45:38 rpmi: libXv-1.0.11-alt1 1527685497 installed
<13>Oct 25 06:45:38 rpmi: libXcomposite-0.4.5-alt1 sisyphus+225206.300.1.2 1552949136 installed
<13>Oct 25 06:45:38 rpmi: libat-spi2-core-2.34.0-alt1 sisyphus+237956.1100.4.2 1569332544 installed
<13>Oct 25 06:45:38 rpmi: libzbar-0.10-alt10 sisyphus+233613.200.3.1 1565018971 installed
<13>Oct 25 06:45:38 rpmi: libXaw-1.0.12-alt1 1391072621 installed
<13>Oct 25 06:45:38 rpmi: libSDL-1.2.14-alt8 sisyphus+232545.100.1.1 1560879158 installed
<13>Oct 25 06:45:38 rpmi: libmjpegtools2.1-2.1.0-alt3 sisyphus+227903.100.1.1 1555879017 installed
<13>Oct 25 06:45:38 rpmi: perl-Tk-804.034-alt1.2 sisyphus+219907.4300.1.1 1548345831 installed
<13>Oct 25 06:45:38 rpmi: libtk-8.6.9-alt1 sisyphus+227145.200.1.2 1555606663 installed
<13>Oct 25 06:45:38 rpmi: tk-8.6.9-alt1 sisyphus+227145.200.1.2 1555606663 installed
<13>Oct 25 06:45:38 rpmi: xset-1.2.4-alt1 sisyphus.213358.100 1537438593 installed
<13>Oct 25 06:45:38 rpmi: libfluidsynth-2.0.7-alt1 sisyphus+238288.100.1.1 1569760528 installed
<13>Oct 25 06:45:38 rpmi: ghostscript-module-X-9.28-alt0.rc1.1 sisyphus+237325.100.1.1 1568103940 installed
<13>Oct 25 06:45:38 rpmi: libXxf86vm-1.1.4-alt2 1527672159 installed
<13>Oct 25 06:45:38 rpmi: libGLX-mesa-4:19.2.1-alt1 sisyphus+239033.100.1.1 1570716435 installed
<13>Oct 25 06:45:38 rpmi: libEGL-mesa-4:19.2.1-alt1 sisyphus+239033.100.1.1 1570716435 installed
<13>Oct 25 06:45:38 rpmi: libEGL-7:1.1.1-alt1 sisyphus+224993.100.4.1 1552634540 installed
<13>Oct 25 06:45:38 rpmi: libGLX-7:1.1.1-alt1 sisyphus+224993.100.4.1 1552634540 installed
<13>Oct 25 06:45:38 rpmi: libGL-7:1.1.1-alt1 sisyphus+224993.100.4.1 1552634540 installed
<13>Oct 25 06:45:38 rpmi: libcairo-1:1.16.0-alt1 sisyphus+226534.100.2.3 1554515520 installed
<13>Oct 25 06:45:38 rpmi: libpango-1.44.6-alt1 sisyphus+237086.200.1.1 1567541051 installed
<13>Oct 25 06:45:39 rpmi: libgst-plugins1.0-1.16.1-alt1 sisyphus+238106.300.2.2 1569421872 installed
<13>Oct 25 06:45:39 rpmi: librsvg-1:2.46.3-alt1 sisyphus+239688.100.1.1 1571895526 installed
<13>Oct 25 06:45:39 rpmi: libva-2.5.0-alt1 sisyphus+236121.100.2.1 1565965463 installed
<13>Oct 25 06:45:39 rpmi: libavutil56-2:4.2.1-alt1 sisyphus+237383.100.1.1 1568180264 installed
<13>Oct 25 06:45:39 rpmi: libswscale5-2:4.2.1-alt1 sisyphus+237383.100.1.1 1568180264 installed
<13>Oct 25 06:45:39 rpmi: libcairo-gobject-1:1.16.0-alt1 sisyphus+226534.100.2.3 1554515520 installed
<13>Oct 25 06:45:39 rpmi: libswresample3-2:4.2.1-alt1 sisyphus+237383.100.1.1 1568180264 installed
<13>Oct 25 06:45:39 rpmi: libpostproc55-2:4.2.1-alt1 sisyphus+237383.100.1.1 1568180264 installed
<13>Oct 25 06:45:39 rpmi: libavresample4-2:4.2.1-alt1 sisyphus+237383.100.1.1 1568180264 installed
<13>Oct 25 06:45:39 rpmi: libgst-plugins1.0-gir-1.16.1-alt1 sisyphus+238106.300.2.2 1569421872 installed
<13>Oct 25 06:45:39 rpmi: gst-plugins-base1.0-1.16.1-alt1 sisyphus+238106.300.2.2 1569421872 installed
<13>Oct 25 06:45:39 rpmi: gst-plugins-ugly1.0-1.16.1-alt1 sisyphus+238106.600.2.2 1569422247 installed
<13>Oct 25 06:45:39 rpmi: liblasi-1.1.3-alt2 sisyphus+239300.100.1.1 1571209619 installed
<13>Oct 25 06:45:39 rpmi: libgtk+2-2.24.32-alt3 sisyphus+227306.100.1.3 1555646039 installed
<13>Oct 25 06:45:39 rpmi: libgraphviz-2.40.1-alt8 sisyphus+239300.200.2.1 1571210533 installed
<13>Oct 25 06:45:39 rpmi: libucil2-0.9.10-alt3_12 sisyphus+233445.100.1.1 1561809430 installed
<13>Oct 25 06:45:39 rpmi: libglvnd-devel-7:1.1.1-alt1 sisyphus+224993.100.4.1 1552634540 installed
<13>Oct 25 06:45:39 rpmi: libXtst-1.2.2-alt1 1369984880 installed
<13>Oct 25 06:45:39 rpmi: netpbm-10.85.04-alt1 sisyphus+225727.140.8.1 1553672201 installed
<13>Oct 25 06:45:39 rpmi: ghostscript-utils-9.28-alt0.rc1.1 sisyphus+237325.100.1.1 1568103940 installed
<13>Oct 25 06:45:40 rpmi: texlive-2019-alt1_2 sisyphus+238768.1400.17.1 1571467400 installed
<13>Oct 25 06:45:51 rpmi: texlive-collection-basic-2018-alt2_5 sisyphus+237082.100.1.1 1567529072 installed
<13>Oct 25 06:45:51 rpmi: xprop-1.2.4-alt1 sisyphus+225764.100.1.1 1553680701 installed
<13>Oct 25 06:45:51 rpmi: xdg-utils-1.1.3-alt6 sisyphus+233067.100.1.1 1561332512 installed
<13>Oct 25 06:45:51 rpmi: texlive-texmf-2018-alt2_5 sisyphus+237082.100.1.1 1567529072 installed
<13>Oct 25 06:46:44 rpmi: texlive-dist-2018-alt2_5 sisyphus+237082.100.1.1 1567529072 installed
<13>Oct 25 06:46:44 rpmi: dbus-tools-gui-1.12.12-alt2 sisyphus+221234.100.1.2 1549918037 installed
<13>Oct 25 06:46:44 rpmi: at-spi2-core-2.34.0-alt1 sisyphus+237956.1100.4.2 1569332544 installed
<13>Oct 25 06:46:44 rpmi: at-spi2-atk-2.34.1-alt1 sisyphus+238952.300.2.1 1570644690 installed
<13>Oct 25 06:46:44 rpmi: libgtk+3-3.24.12-alt1 sisyphus+238952.400.5.1 1570658028 installed
<13>Oct 25 06:46:44 rpmi: gst-plugins-good1.0-1.16.1-alt2 sisyphus+239176.200.4.1 1571612210 installed
<13>Oct 25 06:46:44 rpmi: libzvbi-0.2.35-alt1 sisyphus+223374.100.1.1 1551507904 installed
<13>Oct 25 06:46:45 rpmi: libavcodec58-2:4.2.1-alt1 sisyphus+237383.100.1.1 1568180264 installed
<13>Oct 25 06:46:45 rpmi: libavformat58-2:4.2.1-alt1 sisyphus+237383.100.1.1 1568180264 installed
<13>Oct 25 06:46:45 rpmi: libavfilter7-2:4.2.1-alt1 sisyphus+237383.100.1.1 1568180264 installed
<13>Oct 25 06:46:45 rpmi: gst-libav-1.16.1-alt1 sisyphus+238106.1000.2.2 1569422377 installed
<13>Oct 25 06:46:46 rpmi: libxcb-devel-1.13.1-alt1 sisyphus+226527.100.2.2 1554593799 installed
<13>Oct 25 06:46:46 rpmi: libX11-devel-3:1.6.9-alt1 sisyphus+239210.100.1.1 1571056781 installed
<13>Oct 25 06:46:46 rpmi: libEGL-devel-4:19.2.1-alt1 sisyphus+239033.100.1.1 1570716435 installed
<13>Oct 25 06:46:46 rpmi: libGL-devel-4:19.2.1-alt1 sisyphus+239033.100.1.1 1570716435 installed
<13>Oct 25 06:46:46 rpmi: libxcbutil-icccm-0.4.1-alt2 sisyphus+229000.100.1.1 1557152218 installed
<13>Oct 25 06:46:46 rpmi: libxcbutil-1:0.4.0-alt1 1413392888 installed
<13>Oct 25 06:46:46 rpmi: libxcbutil-image-0.4.0-alt1 1446204177 installed
<13>Oct 25 06:46:46 rpmi: libxcbutil-keysyms-0.4.0-alt1 1446204121 installed
<13>Oct 25 06:46:46 rpmi: libxcb-render-util-0.3.9-alt3 sisyphus+222674.100.1.1 1550989885 installed
<13>Oct 25 06:46:46 rpmi: libxkbcommon-x11-0.9.1-alt1 sisyphus+239553.100.1.1 1571659623 installed
<13>Oct 25 06:46:46 rpmi: libqt5-xcbqpa-5.12.5-alt1 sisyphus+238768.340.19.1 1571500911 installed
<13>Oct 25 06:46:46 rpmi: libqt5-eglfskmssupport-5.12.5-alt1 sisyphus+238768.340.19.1 1571500911 installed
<13>Oct 25 06:46:46 rpmi: libqt5-eglfsdeviceintegration-5.12.5-alt1 sisyphus+238768.340.19.1 1571500911 installed
<13>Oct 25 06:46:46 rpmi: libqt5-gui-5.12.5-alt1 sisyphus+238768.340.19.1 1571500911 installed
<13>Oct 25 06:46:47 rpmi: libqt5-widgets-5.12.5-alt1 sisyphus+238768.340.19.1 1571500911 installed
<13>Oct 25 06:46:47 rpmi: libqt5-quickshapes-5.12.5-alt2 sisyphus+239426.100.1.1 1571479035 installed
<13>Oct 25 06:46:47 rpmi: libqt5-quick-5.12.5-alt2 sisyphus+239426.100.1.1 1571479035 installed
<13>Oct 25 06:46:47 rpmi: libqt5-qml-5.12.5-alt2 sisyphus+239426.100.1.1 1571479035 installed
<13>Oct 25 06:46:47 rpmi: libqt5-opengl-5.12.5-alt1 sisyphus+238768.340.19.1 1571500911 installed
<13>Oct 25 06:46:47 rpmi: libqt5-printsupport-5.12.5-alt1 sisyphus+238768.340.19.1 1571500911 installed
<13>Oct 25 06:46:47 rpmi: qt5-base-devel-5.12.5-alt1 sisyphus+238768.340.19.1 1571500911 installed
<13>Oct 25 06:46:47 rpmi: openexr22-common-2.2.0-alt5 sisyphus+238339.100.1.1 1569837251 installed
<13>Oct 25 06:46:47 rpmi: libilmimf22-2.2.0-alt5 sisyphus+238339.100.1.1 1569837251 installed
<13>Oct 25 06:46:48 rpmi: libImageMagick6.6-6.9.10.65-alt1 sisyphus+237878.100.1.1 1568961878 installed
<13>Oct 25 06:46:48 rpmi: ImageMagick-tools-6.9.10.65-alt1 sisyphus+237878.100.1.1 1568961878 installed
<13>Oct 25 06:46:48 rpmi: dblatex-0.3.10-alt2 sisyphus.213935.100 1538494563 installed
<13>Oct 25 06:46:48 rpmi: libopencv3.4-1:3.4.6-alt1 sisyphus+233908.200.1.1 1562316750 installed
<13>Oct 25 06:46:49 rpmi: gst-plugins-bad1.0-1.16.1-alt2 sisyphus+238689.100.1.1 1570213671 installed
<13>Oct 25 06:46:49 rpmi: libqt5-multimedia-5.12.5-alt1 sisyphus+239023.600.5.2 1571277997 installed
<13>Oct 25 06:46:49 rpmi: qt5-multimedia-devel-5.12.5-alt1 sisyphus+239023.600.5.2 1571277997 installed
<13>Oct 25 06:46:49 rpmi: asciidoc-a2x-8.6.9-alt1.1 1520284178 installed
<13>Oct 25 06:46:49 rpmi: qt5-serialport-devel-5.12.5-alt1 sisyphus+239023.700.5.2 1571278140 installed
<13>Oct 25 06:46:49 rpmi: openmpi-devel-2.0.1-alt8 sisyphus+229856.100.1.1 1558540100 installed
<13>Oct 25 06:46:49 rpmi: libxslt-devel-1.1.33-alt2 sisyphus+237506.100.1.1 1568316627 installed
<13>Oct 25 06:46:49 rpmi: asciidoctor-2.0.10-alt1 sisyphus+231621.4700.57.1 1567245604 installed
<13>Oct 25 06:46:49 rpmi: cmake-3.15.4-alt1 sisyphus+239520.100.1.1 1571611942 installed
<13>Oct 25 06:46:49 rpmi: boost-program_options-devel-1:1.67.0-alt8 sisyphus+238768.500.16.1 1571430204 installed
<13>Oct 25 06:46:49 rpmi: makeinfo-6.5-alt2 sisyphus+220294.200.2.1 1548933637 installed
<13>Oct 25 06:46:49 rpmi: libportaudio2-devel-19-alt7 1528701664 installed
<13>Oct 25 06:46:49 rpmi: libgomp-devel-9-alt1 sisyphus+239632.300.3.1 1571789214 installed
<13>Oct 25 06:46:49 rpmi: hamlib-devel-3.3-alt1.1 sisyphus+219907.22400.1.1 1548371027 installed
<13>Oct 25 06:46:49 rpmi: libfftw3-devel-3.3.8-alt1 sisyphus+226899.100.1.1 1554782385 installed
<13>Oct 25 06:46:49 rpmi: libusb-devel-1.0.23-alt1 sisyphus+237317.100.1.1 1568059904 installed
<13>Oct 25 06:46:49 rpmi: desktop-file-utils-0.23-alt2 sisyphus+226879.100.1.1 1554744353 installed
<13>Oct 25 06:46:49 rpmi: libudev-devel-1:243-alt3 sisyphus+239239.100.1.1 1571079023 installed
<13>Oct 25 06:46:49 rpmi: ctags-5.8-alt2 1296604766 installed
Building target platforms: x86_64
Building for target x86_64
Wrote: /usr/src/in/nosrpm/wsjtx-2.0.0-alt1.nosrc.rpm
Installing wsjtx-2.0.0-alt1.src.rpm
Building target platforms: x86_64
Building for target x86_64
Executing(%prep): /bin/sh -e /usr/src/tmp/rpm-tmp.19455
+ umask 022
+ /bin/mkdir -p /usr/src/RPM/BUILD
+ cd /usr/src/RPM/BUILD
+ cd /usr/src/RPM/BUILD
+ rm -rf wsjtx-2.0.0
+ echo 'Source #0 (wsjtx-2.0.0.tar):'
Source #0 (wsjtx-2.0.0.tar):
+ /bin/tar -xf /usr/src/RPM/SOURCES/wsjtx-2.0.0.tar
+ cd wsjtx-2.0.0
+ /bin/chmod -c -Rf u+rwX,go-w .
+ rm -f src/hamlib.tgz src/hamlib.tgz.md5sum
+ tar -xzf src/wsjtx.tgz
+ rm -f src/wsjtx.tgz src/wsjtx.tgz.md5sum
+ echo 'Patch #0 (wsjtx-1.8.0-compile-fix.patch):'
Patch #0 (wsjtx-1.8.0-compile-fix.patch):
+ /usr/bin/patch -p1
patching file wsjtx/CMakeLists.txt
Hunk #1 succeeded at 819 (offset 41 lines).
Hunk #2 succeeded at 841 (offset 41 lines).
Hunk #3 succeeded at 1391 with fuzz 2 (offset 37 lines).
patching file wsjtx/HamlibTransceiver.hpp
+ echo 'Patch #1 (wsjtx-1.9-alt-cmake.patch):'
Patch #1 (wsjtx-1.9-alt-cmake.patch):
+ /usr/bin/patch -p2
patching file wsjtx/CMake/Modules/Findhamlib.cmake
Hunk #1 succeeded at 75 (offset -1 lines).
+ pushd wsjtx
~/RPM/BUILD/wsjtx-2.0.0/wsjtx ~/RPM/BUILD/wsjtx-2.0.0
+ rm -rf boost
+ dos2unix Configuration.ui wf_palette_design_dialog.ui wsjtx.iss wsjtx_opti.iss wsjtx_update.iss wsjtx.rc CMakeLists.txt GUIcontrols.txt Release_Notes.txt displayWidgets.txt jt9.txt mouse_commands.txt prefixes.txt shortcuts.txt steps.txt v1.7_Features.txt wsjtx_changelog.txt
dos2unix: converting file Configuration.ui to Unix format...
dos2unix: converting file wf_palette_design_dialog.ui to Unix format...
dos2unix: converting file wsjtx.iss to Unix format...
dos2unix: converting file wsjtx_opti.iss to Unix format...
dos2unix: converting file wsjtx_update.iss to Unix format...
dos2unix: converting file wsjtx.rc to Unix format...
dos2unix: converting file CMakeLists.txt to Unix format...
dos2unix: converting file GUIcontrols.txt to Unix format...
dos2unix: converting file Release_Notes.txt to Unix format...
dos2unix: converting file displayWidgets.txt to Unix format...
dos2unix: converting file jt9.txt to Unix format...
dos2unix: converting file mouse_commands.txt to Unix format...
dos2unix: converting file prefixes.txt to Unix format...
dos2unix: converting file shortcuts.txt to Unix format...
dos2unix: converting file steps.txt to Unix format...
dos2unix: converting file v1.7_Features.txt to Unix format...
dos2unix: converting file wsjtx_changelog.txt to Unix format...
+ popd
~/RPM/BUILD/wsjtx-2.0.0
+ exit 0
Executing(%build): /bin/sh -e /usr/src/tmp/rpm-tmp.38984
+ umask 022
+ /bin/mkdir -p /usr/src/RPM/BUILD
+ cd /usr/src/RPM/BUILD
+ cd wsjtx-2.0.0
+ pushd wsjtx
~/RPM/BUILD/wsjtx-2.0.0/wsjtx ~/RPM/BUILD/wsjtx-2.0.0
+ mkdir -p BUILD
+ __cmake -DWSJT_GENERATE_DOCS=TRUE -Dhamlib_STATIC=FALSE -DBoost_NO_SYSTEM_PATHS=FALSE
+ pushd BUILD
~/RPM/BUILD/wsjtx-2.0.0/wsjtx/BUILD ~/RPM/BUILD/wsjtx-2.0.0/wsjtx ~/RPM/BUILD/wsjtx-2.0.0
+ cmake .. -DCMAKE_SKIP_RPATH:BOOL=ON -DCMAKE_SKIP_INSTALL_RPATH:BOOL=yes '-DCMAKE_C_FLAGS:STRING=-pipe -frecord-gcc-switches -Wall -g -O2' '-DCMAKE_CXX_FLAGS:STRING=-pipe -frecord-gcc-switches -Wall -g -O2' '-DCMAKE_Fortran_FLAGS:STRING=-pipe -frecord-gcc-switches -Wall -g -O2' -DCMAKE_INSTALL_PREFIX=/usr -DINCLUDE_INSTALL_DIR:PATH=/usr/include -DLIB_INSTALL_DIR:PATH=/usr/lib64 -DSYSCONF_INSTALL_DIR:PATH=/etc -DSHARE_INSTALL_PREFIX:PATH=/usr/share -DLIB_DESTINATION=lib64 -DLIB_SUFFIX=64 -DWSJT_GENERATE_DOCS=TRUE -Dhamlib_STATIC=FALSE -DBoost_NO_SYSTEM_PATHS=FALSE
-- The C compiler identification is GNU 9.2.1
-- The CXX compiler identification is GNU 9.2.1
-- The Fortran compiler identification is GNU 9.2.1
-- Check for working C compiler: /usr/bin/cc
-- Check for working C compiler: /usr/bin/cc -- works
-- Detecting C compiler ABI info
-- Detecting C compiler ABI info - done
-- Detecting C compile features
-- Detecting C compile features - done
-- Check for working CXX compiler: /usr/bin/c++
-- Check for working CXX compiler: /usr/bin/c++ -- works
-- Detecting CXX compiler ABI info
-- Detecting CXX compiler ABI info - done
-- Detecting CXX compile features
-- Detecting CXX compile features - done
-- Check for working Fortran compiler: /usr/bin/gfortran
-- Check for working Fortran compiler: /usr/bin/gfortran  -- works
-- Detecting Fortran compiler ABI info
-- Detecting Fortran compiler ABI info - done
-- Checking whether /usr/bin/gfortran supports Fortran 90
-- Checking whether /usr/bin/gfortran supports Fortran 90 -- yes
-- Building wsjtx-2.0.0
-- ******************************************************
-- Building for for: Linux-x86_64
-- ******************************************************
-- Found Boost: /usr/include (found suitable version "1.67.0", minimum required is "1.60")  
-- Found OpenMP_C: -fopenmp (found version "4.5") 
-- Found OpenMP_CXX: -fopenmp (found version "4.5") 
-- Found OpenMP_Fortran: -fopenmp (found version "4.5") 
-- Found OpenMP: TRUE (found version "4.5")  
-- Found FFTW3: /usr/lib64/libfftw3_threads.so  
CMake Warning (dev) at CMake/Modules/Findhamlib.cmake:22 (set):
  Only the first value argument is used when setting an environment variable.
  Argument '' and later are unused.
Call Stack (most recent call first):
  CMakeLists.txt:845 (find_package)
This warning is for project developers.  Use -Wno-dev to suppress it.

-- Found PkgConfig: /usr/bin/pkg-config (found version "0.29.2") 
-- Checking for module 'hamlib'
--   Found hamlib, version 3.3
-- Found hamlib 
-- Found hamlib: /usr/include/libusb-1.0 (Required is at least version "3") 
-- hamlib_INCLUDE_DIRS: /usr/include/libusb-1.0
-- hamlib_LIBRARIES: -lhamlib
-- hamlib_LIBRARY_DIRS: 
-- Detecting Fortran/C Interface
-- Detecting Fortran/C Interface - Found GLOBAL and MODULE mangling
-- Verifying Fortran/CXX Compiler Compatibility
-- Verifying Fortran/CXX Compiler Compatibility - Success
-- Asking qmake for QT_PLUGINS_DIR and got /usr/lib64/qt5/plugins
-- Asking qmake for QT_IMPORTS_DIR and got /usr/lib64/qt5/imports
-- Asking qmake for QT_DATA_DIR and got /usr/lib64/qt5
-- Performing Test COMPILER_HAS_HIDDEN_VISIBILITY
-- Performing Test COMPILER_HAS_HIDDEN_VISIBILITY - Success
-- Performing Test COMPILER_HAS_HIDDEN_INLINE_VISIBILITY
-- Performing Test COMPILER_HAS_HIDDEN_INLINE_VISIBILITY - Success
-- Performing Test COMPILER_HAS_DEPRECATED_ATTR
-- Performing Test COMPILER_HAS_DEPRECATED_ATTR - Success
-- Configuring done
-- Generating done
CMake Warning:
  Manually-specified variables were not used by the project:

    CMAKE_SKIP_INSTALL_RPATH
    INCLUDE_INSTALL_DIR
    LIB_DESTINATION
    LIB_INSTALL_DIR
    LIB_SUFFIX
    SHARE_INSTALL_PREFIX
    SYSCONF_INSTALL_DIR


-- Build files have been written to: /usr/src/RPM/BUILD/wsjtx-2.0.0/wsjtx/BUILD
+ popd
~/RPM/BUILD/wsjtx-2.0.0/wsjtx ~/RPM/BUILD/wsjtx-2.0.0
+ make -j8 -C BUILD
make[2]: Entering directory '/usr/src/RPM/BUILD/wsjtx-2.0.0/wsjtx/BUILD'
Scanning dependencies of target wsjt_cxx_autogen
make[2]: Leaving directory '/usr/src/RPM/BUILD/wsjtx-2.0.0/wsjtx/BUILD'
make[2]: Entering directory '/usr/src/RPM/BUILD/wsjtx-2.0.0/wsjtx/BUILD'
Scanning dependencies of target wsjtx_udp-static_autogen
make[2]: Leaving directory '/usr/src/RPM/BUILD/wsjtx-2.0.0/wsjtx/BUILD'
make[2]: Entering directory '/usr/src/RPM/BUILD/wsjtx-2.0.0/wsjtx/BUILD'
Scanning dependencies of target wsjt_fort_omp_autogen
make[2]: Leaving directory '/usr/src/RPM/BUILD/wsjtx-2.0.0/wsjtx/BUILD'
make[2]: Entering directory '/usr/src/RPM/BUILD/wsjtx-2.0.0/wsjtx/BUILD'
Scanning dependencies of target manpages
make[2]: Leaving directory '/usr/src/RPM/BUILD/wsjtx-2.0.0/wsjtx/BUILD'
make[2]: Entering directory '/usr/src/RPM/BUILD/wsjtx-2.0.0/wsjtx/BUILD'
Scanning dependencies of target qcp_autogen
make[2]: Leaving directory '/usr/src/RPM/BUILD/wsjtx-2.0.0/wsjtx/BUILD'
make[2]: Entering directory '/usr/src/RPM/BUILD/wsjtx-2.0.0/wsjtx/BUILD'
Scanning dependencies of target debian
make[2]: Leaving directory '/usr/src/RPM/BUILD/wsjtx-2.0.0/wsjtx/BUILD'
make[2]: Entering directory '/usr/src/RPM/BUILD/wsjtx-2.0.0/wsjtx/BUILD'
Scanning dependencies of target revisiontag
make[2]: Leaving directory '/usr/src/RPM/BUILD/wsjtx-2.0.0/wsjtx/BUILD'
make[2]: Entering directory '/usr/src/RPM/BUILD/wsjtx-2.0.0/wsjtx/BUILD'
Scanning dependencies of target wsjt_qtmm_autogen
make[2]: Leaving directory '/usr/src/RPM/BUILD/wsjtx-2.0.0/wsjtx/BUILD'
make[2]: Entering directory '/usr/src/RPM/BUILD/wsjtx-2.0.0/wsjtx/BUILD'
[  0%] Compressing Debian changelog
make[2]: Leaving directory '/usr/src/RPM/BUILD/wsjtx-2.0.0/wsjtx/BUILD'
make[1]: Entering directory '/usr/src/RPM/BUILD/wsjtx-2.0.0/wsjtx/BUILD'
[  1%] Built target debian
make[1]: Leaving directory '/usr/src/RPM/BUILD/wsjtx-2.0.0/wsjtx/BUILD'
make[2]: Entering directory '/usr/src/RPM/BUILD/wsjtx-2.0.0/wsjtx/BUILD'
[  0%] Automatic MOC for target wsjt_cxx
make[2]: Leaving directory '/usr/src/RPM/BUILD/wsjtx-2.0.0/wsjtx/BUILD'
make[2]: Entering directory '/usr/src/RPM/BUILD/wsjtx-2.0.0/wsjtx/BUILD'
Scanning dependencies of target wsjt_fort_autogen
make[2]: Leaving directory '/usr/src/RPM/BUILD/wsjtx-2.0.0/wsjtx/BUILD'
make[2]: Entering directory '/usr/src/RPM/BUILD/wsjtx-2.0.0/wsjtx/BUILD'
[  0%] Automatic MOC for target wsjt_fort_omp
make[2]: Leaving directory '/usr/src/RPM/BUILD/wsjtx-2.0.0/wsjtx/BUILD'
make[1]: Entering directory '/usr/src/RPM/BUILD/wsjtx-2.0.0/wsjtx/BUILD'
[  1%] Built target wsjt_cxx_autogen
make[1]: Leaving directory '/usr/src/RPM/BUILD/wsjtx-2.0.0/wsjtx/BUILD'
make[2]: Entering directory '/usr/src/RPM/BUILD/wsjtx-2.0.0/wsjtx/BUILD'
[  1%] Generating Subversion revision information
-- Checking for revision information
-- No SCS found
make[2]: Leaving directory '/usr/src/RPM/BUILD/wsjtx-2.0.0/wsjtx/BUILD'
make[1]: Entering directory '/usr/src/RPM/BUILD/wsjtx-2.0.0/wsjtx/BUILD'
[  2%] Built target wsjt_fort_omp_autogen
make[1]: Leaving directory '/usr/src/RPM/BUILD/wsjtx-2.0.0/wsjtx/BUILD'
make[1]: Entering directory '/usr/src/RPM/BUILD/wsjtx-2.0.0/wsjtx/BUILD'
[  2%] Built target revisiontag
make[1]: Leaving directory '/usr/src/RPM/BUILD/wsjtx-2.0.0/wsjtx/BUILD'
make[2]: Entering directory '/usr/src/RPM/BUILD/wsjtx-2.0.0/wsjtx/BUILD'
Scanning dependencies of target fmtave_autogen
make[2]: Leaving directory '/usr/src/RPM/BUILD/wsjtx-2.0.0/wsjtx/BUILD'
make[2]: Entering directory '/usr/src/RPM/BUILD/wsjtx-2.0.0/wsjtx/BUILD'
Scanning dependencies of target fmeasure_autogen
make[2]: Leaving directory '/usr/src/RPM/BUILD/wsjtx-2.0.0/wsjtx/BUILD'
make[2]: Entering directory '/usr/src/RPM/BUILD/wsjtx-2.0.0/wsjtx/BUILD'
[  2%] Automatic MOC for target wsjt_fort
make[2]: Leaving directory '/usr/src/RPM/BUILD/wsjtx-2.0.0/wsjtx/BUILD'
make[2]: Entering directory '/usr/src/RPM/BUILD/wsjtx-2.0.0/wsjtx/BUILD'
Scanning dependencies of target wsprd_autogen
make[2]: Leaving directory '/usr/src/RPM/BUILD/wsjtx-2.0.0/wsjtx/BUILD'
make[1]: Entering directory '/usr/src/RPM/BUILD/wsjtx-2.0.0/wsjtx/BUILD'
[  2%] Built target wsjt_fort_autogen
make[1]: Leaving directory '/usr/src/RPM/BUILD/wsjtx-2.0.0/wsjtx/BUILD'
make[2]: Entering directory '/usr/src/RPM/BUILD/wsjtx-2.0.0/wsjtx/BUILD'
[  2%] Automatic MOC for target fmtave
make[2]: Leaving directory '/usr/src/RPM/BUILD/wsjtx-2.0.0/wsjtx/BUILD'
make[1]: Entering directory '/usr/src/RPM/BUILD/wsjtx-2.0.0/wsjtx/BUILD'
[  2%] Built target fmtave_autogen
make[1]: Leaving directory '/usr/src/RPM/BUILD/wsjtx-2.0.0/wsjtx/BUILD'
make[2]: Entering directory '/usr/src/RPM/BUILD/wsjtx-2.0.0/wsjtx/BUILD'
Scanning dependencies of target fcal_autogen
make[2]: Leaving directory '/usr/src/RPM/BUILD/wsjtx-2.0.0/wsjtx/BUILD'
make[2]: Entering directory '/usr/src/RPM/BUILD/wsjtx-2.0.0/wsjtx/BUILD'
[  2%] Automatic MOC for target fmeasure
make[2]: Leaving directory '/usr/src/RPM/BUILD/wsjtx-2.0.0/wsjtx/BUILD'
make[2]: Entering directory '/usr/src/RPM/BUILD/wsjtx-2.0.0/wsjtx/BUILD'
[  2%] Automatic MOC for target wsprd
make[2]: Leaving directory '/usr/src/RPM/BUILD/wsjtx-2.0.0/wsjtx/BUILD'
make[2]: Entering directory '/usr/src/RPM/BUILD/wsjtx-2.0.0/wsjtx/BUILD'
Scanning dependencies of target wsprsim_autogen
make[2]: Leaving directory '/usr/src/RPM/BUILD/wsjtx-2.0.0/wsjtx/BUILD'
make[2]: Entering directory '/usr/src/RPM/BUILD/wsjtx-2.0.0/wsjtx/BUILD'
[  2%] Automatic MOC for target fcal
make[2]: Leaving directory '/usr/src/RPM/BUILD/wsjtx-2.0.0/wsjtx/BUILD'
make[1]: Entering directory '/usr/src/RPM/BUILD/wsjtx-2.0.0/wsjtx/BUILD'
[  2%] Built target fmeasure_autogen
make[1]: Leaving directory '/usr/src/RPM/BUILD/wsjtx-2.0.0/wsjtx/BUILD'
make[1]: Entering directory '/usr/src/RPM/BUILD/wsjtx-2.0.0/wsjtx/BUILD'
[  2%] Built target wsprd_autogen
make[1]: Leaving directory '/usr/src/RPM/BUILD/wsjtx-2.0.0/wsjtx/BUILD'
make[1]: Entering directory '/usr/src/RPM/BUILD/wsjtx-2.0.0/wsjtx/BUILD'
[  3%] Built target fcal_autogen
make[1]: Leaving directory '/usr/src/RPM/BUILD/wsjtx-2.0.0/wsjtx/BUILD'
make[2]: Entering directory '/usr/src/RPM/BUILD/wsjtx-2.0.0/wsjtx/BUILD'
Scanning dependencies of target docs
make[2]: Leaving directory '/usr/src/RPM/BUILD/wsjtx-2.0.0/wsjtx/BUILD'
make[2]: Entering directory '/usr/src/RPM/BUILD/wsjtx-2.0.0/wsjtx/BUILD'
Scanning dependencies of target wsjt_cxx
make[2]: Leaving directory '/usr/src/RPM/BUILD/wsjtx-2.0.0/wsjtx/BUILD'
make[2]: Entering directory '/usr/src/RPM/BUILD/wsjtx-2.0.0/wsjtx/BUILD'
[  3%] Automatic MOC for target wsprsim
make[2]: Leaving directory '/usr/src/RPM/BUILD/wsjtx-2.0.0/wsjtx/BUILD'
make[1]: Entering directory '/usr/src/RPM/BUILD/wsjtx-2.0.0/wsjtx/BUILD'
[  3%] Built target wsprsim_autogen
make[1]: Leaving directory '/usr/src/RPM/BUILD/wsjtx-2.0.0/wsjtx/BUILD'
make[2]: Entering directory '/usr/src/RPM/BUILD/wsjtx-2.0.0/wsjtx/BUILD'
[  3%] Building CXX object CMakeFiles/wsjt_cxx.dir/wsjt_cxx_autogen/mocs_compilation.cpp.o
make[2]: Leaving directory '/usr/src/RPM/BUILD/wsjtx-2.0.0/wsjtx/BUILD'
make[2]: Entering directory '/usr/src/RPM/BUILD/wsjtx-2.0.0/wsjtx/BUILD'
[  1%] Automatic MOC for target wsjt_qtmm
make[2]: Leaving directory '/usr/src/RPM/BUILD/wsjtx-2.0.0/wsjtx/BUILD'
make[2]: Entering directory '/usr/src/RPM/BUILD/wsjtx-2.0.0/wsjtx/BUILD'
[  0%] Automatic MOC for target wsjtx_udp-static
make[2]: Leaving directory '/usr/src/RPM/BUILD/wsjtx-2.0.0/wsjtx/BUILD'
make[1]: Entering directory '/usr/src/RPM/BUILD/wsjtx-2.0.0/wsjtx/BUILD'
[  3%] Built target wsjtx_udp-static_autogen
make[1]: Leaving directory '/usr/src/RPM/BUILD/wsjtx-2.0.0/wsjtx/BUILD'
make[2]: Entering directory '/usr/src/RPM/BUILD/wsjtx-2.0.0/wsjtx/BUILD'
Scanning dependencies of target fmtave
make[2]: Leaving directory '/usr/src/RPM/BUILD/wsjtx-2.0.0/wsjtx/BUILD'
make[1]: Entering directory '/usr/src/RPM/BUILD/wsjtx-2.0.0/wsjtx/BUILD'
[  3%] Built target wsjt_qtmm_autogen
make[1]: Leaving directory '/usr/src/RPM/BUILD/wsjtx-2.0.0/wsjtx/BUILD'
make[2]: Entering directory '/usr/src/RPM/BUILD/wsjtx-2.0.0/wsjtx/BUILD'
Scanning dependencies of target wsjt_fort_omp
make[2]: Leaving directory '/usr/src/RPM/BUILD/wsjtx-2.0.0/wsjtx/BUILD'
make[2]: Entering directory '/usr/src/RPM/BUILD/wsjtx-2.0.0/wsjtx/BUILD'
Scanning dependencies of target wsprd
make[2]: Leaving directory '/usr/src/RPM/BUILD/wsjtx-2.0.0/wsjtx/BUILD'
make[2]: Entering directory '/usr/src/RPM/BUILD/wsjtx-2.0.0/wsjtx/BUILD'
[  4%] Building CXX object CMakeFiles/fmtave.dir/fmtave_autogen/mocs_compilation.cpp.o
make[2]: Leaving directory '/usr/src/RPM/BUILD/wsjtx-2.0.0/wsjtx/BUILD'
make[2]: Entering directory '/usr/src/RPM/BUILD/wsjtx-2.0.0/wsjtx/BUILD'
[  5%] Building CXX object CMakeFiles/wsprd.dir/wsprd_autogen/mocs_compilation.cpp.o
make[2]: Leaving directory '/usr/src/RPM/BUILD/wsjtx-2.0.0/wsjtx/BUILD'
make[2]: Entering directory '/usr/src/RPM/BUILD/wsjtx-2.0.0/wsjtx/BUILD'
Scanning dependencies of target wsjt_fort
make[2]: Leaving directory '/usr/src/RPM/BUILD/wsjtx-2.0.0/wsjtx/BUILD'
make[2]: Entering directory '/usr/src/RPM/BUILD/wsjtx-2.0.0/wsjtx/BUILD'
[  5%] Building Fortran object CMakeFiles/fmtave.dir/lib/fmtave.f90.o
make[2]: Leaving directory '/usr/src/RPM/BUILD/wsjtx-2.0.0/wsjtx/BUILD'
make[2]: Entering directory '/usr/src/RPM/BUILD/wsjtx-2.0.0/wsjtx/BUILD'
[  3%] Building C object CMakeFiles/wsjt_cxx.dir/lib/ftrsd/decode_rs.c.o
make[2]: Leaving directory '/usr/src/RPM/BUILD/wsjtx-2.0.0/wsjtx/BUILD'
make[2]: Entering directory '/usr/src/RPM/BUILD/wsjtx-2.0.0/wsjtx/BUILD'
[  5%] Linking CXX executable fmtave
make[2]: Leaving directory '/usr/src/RPM/BUILD/wsjtx-2.0.0/wsjtx/BUILD'
make[1]: Entering directory '/usr/src/RPM/BUILD/wsjtx-2.0.0/wsjtx/BUILD'
[  5%] Built target fmtave
make[1]: Leaving directory '/usr/src/RPM/BUILD/wsjtx-2.0.0/wsjtx/BUILD'
make[2]: Entering directory '/usr/src/RPM/BUILD/wsjtx-2.0.0/wsjtx/BUILD'
[  5%] Building C object CMakeFiles/wsjt_cxx.dir/lib/ftrsd/encode_rs.c.o
make[2]: Leaving directory '/usr/src/RPM/BUILD/wsjtx-2.0.0/wsjtx/BUILD'
make[2]: Entering directory '/usr/src/RPM/BUILD/wsjtx-2.0.0/wsjtx/BUILD'
Scanning dependencies of target fmeasure
make[2]: Leaving directory '/usr/src/RPM/BUILD/wsjtx-2.0.0/wsjtx/BUILD'
make[2]: Entering directory '/usr/src/RPM/BUILD/wsjtx-2.0.0/wsjtx/BUILD'
[  5%] Building CXX object CMakeFiles/fmeasure.dir/fmeasure_autogen/mocs_compilation.cpp.o
make[2]: Leaving directory '/usr/src/RPM/BUILD/wsjtx-2.0.0/wsjtx/BUILD'
make[2]: Entering directory '/usr/src/RPM/BUILD/wsjtx-2.0.0/wsjtx/BUILD'
[  5%] Building Fortran object CMakeFiles/fmeasure.dir/lib/fmeasure.f90.o
make[2]: Leaving directory '/usr/src/RPM/BUILD/wsjtx-2.0.0/wsjtx/BUILD'
make[2]: Entering directory '/usr/src/RPM/BUILD/wsjtx-2.0.0/wsjtx/BUILD'
[  5%] Linking CXX executable fmeasure
make[2]: Leaving directory '/usr/src/RPM/BUILD/wsjtx-2.0.0/wsjtx/BUILD'
make[1]: Entering directory '/usr/src/RPM/BUILD/wsjtx-2.0.0/wsjtx/BUILD'
[  5%] Built target fmeasure
make[1]: Leaving directory '/usr/src/RPM/BUILD/wsjtx-2.0.0/wsjtx/BUILD'
make[2]: Entering directory '/usr/src/RPM/BUILD/wsjtx-2.0.0/wsjtx/BUILD'
[  5%] Building C object CMakeFiles/wsjt_cxx.dir/lib/ftrsd/init_rs.c.o
make[2]: Leaving directory '/usr/src/RPM/BUILD/wsjtx-2.0.0/wsjtx/BUILD'
make[2]: Entering directory '/usr/src/RPM/BUILD/wsjtx-2.0.0/wsjtx/BUILD'
Scanning dependencies of target fcal
make[2]: Leaving directory '/usr/src/RPM/BUILD/wsjtx-2.0.0/wsjtx/BUILD'
make[2]: Entering directory '/usr/src/RPM/BUILD/wsjtx-2.0.0/wsjtx/BUILD'
[  5%] Building CXX object CMakeFiles/fcal.dir/fcal_autogen/mocs_compilation.cpp.o
make[2]: Leaving directory '/usr/src/RPM/BUILD/wsjtx-2.0.0/wsjtx/BUILD'
make[2]: Entering directory '/usr/src/RPM/BUILD/wsjtx-2.0.0/wsjtx/BUILD'
[  1%] Automatic MOC for target qcp
make[2]: Leaving directory '/usr/src/RPM/BUILD/wsjtx-2.0.0/wsjtx/BUILD'
make[1]: Entering directory '/usr/src/RPM/BUILD/wsjtx-2.0.0/wsjtx/BUILD'
[  7%] Built target qcp_autogen
make[1]: Leaving directory '/usr/src/RPM/BUILD/wsjtx-2.0.0/wsjtx/BUILD'
make[2]: Entering directory '/usr/src/RPM/BUILD/wsjtx-2.0.0/wsjtx/BUILD'
Scanning dependencies of target wsprsim
make[2]: Leaving directory '/usr/src/RPM/BUILD/wsjtx-2.0.0/wsjtx/BUILD'
make[2]: Entering directory '/usr/src/RPM/BUILD/wsjtx-2.0.0/wsjtx/BUILD'
[  7%] Building Fortran object CMakeFiles/fcal.dir/lib/fcal.f90.o
make[2]: Leaving directory '/usr/src/RPM/BUILD/wsjtx-2.0.0/wsjtx/BUILD'
make[2]: Entering directory '/usr/src/RPM/BUILD/wsjtx-2.0.0/wsjtx/BUILD'
[  7%] Building CXX object CMakeFiles/wsprsim.dir/wsprsim_autogen/mocs_compilation.cpp.o
make[2]: Leaving directory '/usr/src/RPM/BUILD/wsjtx-2.0.0/wsjtx/BUILD'
make[2]: Entering directory '/usr/src/RPM/BUILD/wsjtx-2.0.0/wsjtx/BUILD'
[  3%] Generating /usr/src/RPM/BUILD/wsjtx-2.0.0/wsjtx/BUILD/doc/wsjtx-main_en.html
make[2]: Leaving directory '/usr/src/RPM/BUILD/wsjtx-2.0.0/wsjtx/BUILD'
make[1]: Entering directory '/usr/src/RPM/BUILD/wsjtx-2.0.0/wsjtx/BUILD'
[  8%] Built target docs
make[1]: Leaving directory '/usr/src/RPM/BUILD/wsjtx-2.0.0/wsjtx/BUILD'
make[2]: Entering directory '/usr/src/RPM/BUILD/wsjtx-2.0.0/wsjtx/BUILD'
[  6%] Building C object CMakeFiles/wsjt_cxx.dir/lib/ftrsd/ftrsdap.c.o
make[2]: Leaving directory '/usr/src/RPM/BUILD/wsjtx-2.0.0/wsjtx/BUILD'
make[2]: Entering directory '/usr/src/RPM/BUILD/wsjtx-2.0.0/wsjtx/BUILD'
[  7%] Linking CXX executable fcal
make[2]: Leaving directory '/usr/src/RPM/BUILD/wsjtx-2.0.0/wsjtx/BUILD'
make[2]: Entering directory '/usr/src/RPM/BUILD/wsjtx-2.0.0/wsjtx/BUILD'
[  8%] Building C object CMakeFiles/wsjt_cxx.dir/lib/sgran.c.o
make[2]: Leaving directory '/usr/src/RPM/BUILD/wsjtx-2.0.0/wsjtx/BUILD'
make[2]: Entering directory '/usr/src/RPM/BUILD/wsjtx-2.0.0/wsjtx/BUILD'
Scanning dependencies of target wsjtx_udp-static
make[2]: Leaving directory '/usr/src/RPM/BUILD/wsjtx-2.0.0/wsjtx/BUILD'
make[1]: Entering directory '/usr/src/RPM/BUILD/wsjtx-2.0.0/wsjtx/BUILD'
[  8%] Built target fcal
make[1]: Leaving directory '/usr/src/RPM/BUILD/wsjtx-2.0.0/wsjtx/BUILD'
make[2]: Entering directory '/usr/src/RPM/BUILD/wsjtx-2.0.0/wsjtx/BUILD'
[  8%] Building C object CMakeFiles/wsjt_cxx.dir/lib/golay24_table.c.o
make[2]: Leaving directory '/usr/src/RPM/BUILD/wsjtx-2.0.0/wsjtx/BUILD'
make[2]: Entering directory '/usr/src/RPM/BUILD/wsjtx-2.0.0/wsjtx/BUILD'
Scanning dependencies of target wsjt_qtmm
make[2]: Leaving directory '/usr/src/RPM/BUILD/wsjtx-2.0.0/wsjtx/BUILD'
make[2]: Entering directory '/usr/src/RPM/BUILD/wsjtx-2.0.0/wsjtx/BUILD'
[  8%] Building CXX object CMakeFiles/wsjtx_udp-static.dir/wsjtx_udp-static_autogen/mocs_compilation.cpp.o
make[2]: Leaving directory '/usr/src/RPM/BUILD/wsjtx-2.0.0/wsjtx/BUILD'
make[2]: Entering directory '/usr/src/RPM/BUILD/wsjtx-2.0.0/wsjtx/BUILD'
[  8%] Building CXX object CMakeFiles/wsjt_qtmm.dir/wsjt_qtmm_autogen/mocs_compilation.cpp.o
make[2]: Leaving directory '/usr/src/RPM/BUILD/wsjtx-2.0.0/wsjtx/BUILD'
make[2]: Entering directory '/usr/src/RPM/BUILD/wsjtx-2.0.0/wsjtx/BUILD'
[  8%] Building C object CMakeFiles/wsprsim.dir/lib/wsprd/wsprsim.c.o
/usr/src/RPM/BUILD/wsjtx-2.0.0/wsjtx/lib/wsprd/wsprsim.c: In function 'main':
/usr/src/RPM/BUILD/wsjtx-2.0.0/wsjtx/lib/wsprd/wsprsim.c:152:20: warning: this statement may fall through [-Wimplicit-fallthrough=]
  152 |                 f0 = atof(optarg);
      |                 ~~~^~~~~~~~~~~~~~
/usr/src/RPM/BUILD/wsjtx-2.0.0/wsjtx/lib/wsprd/wsprsim.c:153:13: note: here
  153 |             case 'o':
      |             ^~~~
make[2]: Leaving directory '/usr/src/RPM/BUILD/wsjtx-2.0.0/wsjtx/BUILD'
make[2]: Entering directory '/usr/src/RPM/BUILD/wsjtx-2.0.0/wsjtx/BUILD'
[  8%] Building C object CMakeFiles/wsjt_cxx.dir/lib/gran.c.o
make[2]: Leaving directory '/usr/src/RPM/BUILD/wsjtx-2.0.0/wsjtx/BUILD'
make[2]: Entering directory '/usr/src/RPM/BUILD/wsjtx-2.0.0/wsjtx/BUILD'
[  8%] Building C object CMakeFiles/wsjt_cxx.dir/lib/igray.c.o
make[2]: Leaving directory '/usr/src/RPM/BUILD/wsjtx-2.0.0/wsjtx/BUILD'
make[2]: Entering directory '/usr/src/RPM/BUILD/wsjtx-2.0.0/wsjtx/BUILD'
[  8%] Building C object CMakeFiles/wsjt_cxx.dir/lib/init_random_seed.c.o
make[2]: Leaving directory '/usr/src/RPM/BUILD/wsjtx-2.0.0/wsjtx/BUILD'
make[2]: Entering directory '/usr/src/RPM/BUILD/wsjtx-2.0.0/wsjtx/BUILD'
[  8%] Building C object CMakeFiles/wsjt_cxx.dir/lib/ldpc32_table.c.o
make[2]: Leaving directory '/usr/src/RPM/BUILD/wsjtx-2.0.0/wsjtx/BUILD'
make[2]: Entering directory '/usr/src/RPM/BUILD/wsjtx-2.0.0/wsjtx/BUILD'
[  8%] Building C object CMakeFiles/wsprsim.dir/lib/wsprd/wsprsim_utils.c.o
make[2]: Leaving directory '/usr/src/RPM/BUILD/wsjtx-2.0.0/wsjtx/BUILD'
make[2]: Entering directory '/usr/src/RPM/BUILD/wsjtx-2.0.0/wsjtx/BUILD'
[  9%] Building C object CMakeFiles/wsjt_cxx.dir/lib/wsprd/nhash.c.o
/usr/src/RPM/BUILD/wsjtx-2.0.0/wsjtx/lib/wsprd/nhash.c: In function 'nhash':
/usr/src/RPM/BUILD/wsjtx-2.0.0/wsjtx/lib/wsprd/nhash.c:351:15: warning: this statement may fall through [-Wimplicit-fallthrough=]
  351 |     case 12: c+=((uint32_t)k[11])<<24;
      |              ~^~~~~~~~~~~~~~~~~~~~~~~
/usr/src/RPM/BUILD/wsjtx-2.0.0/wsjtx/lib/wsprd/nhash.c:352:5: note: here
  352 |     case 11: c+=((uint32_t)k[10])<<16;
      |     ^~~~
/usr/src/RPM/BUILD/wsjtx-2.0.0/wsjtx/lib/wsprd/nhash.c:352:15: warning: this statement may fall through [-Wimplicit-fallthrough=]
  352 |     case 11: c+=((uint32_t)k[10])<<16;
      |              ~^~~~~~~~~~~~~~~~~~~~~~~
/usr/src/RPM/BUILD/wsjtx-2.0.0/wsjtx/lib/wsprd/nhash.c:353:5: note: here
  353 |     case 10: c+=((uint32_t)k[9])<<8;
      |     ^~~~
/usr/src/RPM/BUILD/wsjtx-2.0.0/wsjtx/lib/wsprd/nhash.c:353:15: warning: this statement may fall through [-Wimplicit-fallthrough=]
  353 |     case 10: c+=((uint32_t)k[9])<<8;
      |              ~^~~~~~~~~~~~~~~~~~~~~
/usr/src/RPM/BUILD/wsjtx-2.0.0/wsjtx/lib/wsprd/nhash.c:354:5: note: here
  354 |     case 9 : c+=k[8];
      |     ^~~~
/usr/src/RPM/BUILD/wsjtx-2.0.0/wsjtx/lib/wsprd/nhash.c:354:15: warning: this statement may fall through [-Wimplicit-fallthrough=]
  354 |     case 9 : c+=k[8];
      |              ~^~~~~~
/usr/src/RPM/BUILD/wsjtx-2.0.0/wsjtx/lib/wsprd/nhash.c:355:5: note: here
  355 |     case 8 : b+=((uint32_t)k[7])<<24;
      |     ^~~~
/usr/src/RPM/BUILD/wsjtx-2.0.0/wsjtx/lib/wsprd/nhash.c:355:15: warning: this statement may fall through [-Wimplicit-fallthrough=]
  355 |     case 8 : b+=((uint32_t)k[7])<<24;
      |              ~^~~~~~~~~~~~~~~~~~~~~~
/usr/src/RPM/BUILD/wsjtx-2.0.0/wsjtx/lib/wsprd/nhash.c:356:5: note: here
  356 |     case 7 : b+=((uint32_t)k[6])<<16;
      |     ^~~~
/usr/src/RPM/BUILD/wsjtx-2.0.0/wsjtx/lib/wsprd/nhash.c:356:15: warning: this statement may fall through [-Wimplicit-fallthrough=]
  356 |     case 7 : b+=((uint32_t)k[6])<<16;
      |              ~^~~~~~~~~~~~~~~~~~~~~~
/usr/src/RPM/BUILD/wsjtx-2.0.0/wsjtx/lib/wsprd/nhash.c:357:5: note: here
  357 |     case 6 : b+=((uint32_t)k[5])<<8;
      |     ^~~~
/usr/src/RPM/BUILD/wsjtx-2.0.0/wsjtx/lib/wsprd/nhash.c:357:15: warning: this statement may fall through [-Wimplicit-fallthrough=]
  357 |     case 6 : b+=((uint32_t)k[5])<<8;
      |              ~^~~~~~~~~~~~~~~~~~~~~
/usr/src/RPM/BUILD/wsjtx-2.0.0/wsjtx/lib/wsprd/nhash.c:358:5: note: here
  358 |     case 5 : b+=k[4];
      |     ^~~~
/usr/src/RPM/BUILD/wsjtx-2.0.0/wsjtx/lib/wsprd/nhash.c:358:15: warning: this statement may fall through [-Wimplicit-fallthrough=]
  358 |     case 5 : b+=k[4];
      |              ~^~~~~~
/usr/src/RPM/BUILD/wsjtx-2.0.0/wsjtx/lib/wsprd/nhash.c:359:5: note: here
  359 |     case 4 : a+=((uint32_t)k[3])<<24;
      |     ^~~~
/usr/src/RPM/BUILD/wsjtx-2.0.0/wsjtx/lib/wsprd/nhash.c:359:15: warning: this statement may fall through [-Wimplicit-fallthrough=]
  359 |     case 4 : a+=((uint32_t)k[3])<<24;
      |              ~^~~~~~~~~~~~~~~~~~~~~~
/usr/src/RPM/BUILD/wsjtx-2.0.0/wsjtx/lib/wsprd/nhash.c:360:5: note: here
  360 |     case 3 : a+=((uint32_t)k[2])<<16;
      |     ^~~~
/usr/src/RPM/BUILD/wsjtx-2.0.0/wsjtx/lib/wsprd/nhash.c:360:15: warning: this statement may fall through [-Wimplicit-fallthrough=]
  360 |     case 3 : a+=((uint32_t)k[2])<<16;
      |              ~^~~~~~~~~~~~~~~~~~~~~~
/usr/src/RPM/BUILD/wsjtx-2.0.0/wsjtx/lib/wsprd/nhash.c:361:5: note: here
  361 |     case 2 : a+=((uint32_t)k[1])<<8;
      |     ^~~~
/usr/src/RPM/BUILD/wsjtx-2.0.0/wsjtx/lib/wsprd/nhash.c:361:15: warning: this statement may fall through [-Wimplicit-fallthrough=]
  361 |     case 2 : a+=((uint32_t)k[1])<<8;
      |              ~^~~~~~~~~~~~~~~~~~~~~
/usr/src/RPM/BUILD/wsjtx-2.0.0/wsjtx/lib/wsprd/nhash.c:362:5: note: here
  362 |     case 1 : a+=k[0];
      |     ^~~~
make[2]: Leaving directory '/usr/src/RPM/BUILD/wsjtx-2.0.0/wsjtx/BUILD'
make[2]: Entering directory '/usr/src/RPM/BUILD/wsjtx-2.0.0/wsjtx/BUILD'
[  9%] Building C object CMakeFiles/wsjt_cxx.dir/lib/tab.c.o
make[2]: Leaving directory '/usr/src/RPM/BUILD/wsjtx-2.0.0/wsjtx/BUILD'
make[2]: Entering directory '/usr/src/RPM/BUILD/wsjtx-2.0.0/wsjtx/BUILD'
[  9%] Building C object CMakeFiles/wsprsim.dir/lib/wsprd/wsprd_utils.c.o
In file included from /usr/include/string.h:507,
                 from /usr/src/RPM/BUILD/wsjtx-2.0.0/wsjtx/lib/wsprd/wsprd_utils.h:8,
                 from /usr/src/RPM/BUILD/wsjtx-2.0.0/wsjtx/lib/wsprd/wsprd_utils.c:29:
In function 'strncat',
    inlined from 'unpackpfx' at /usr/src/RPM/BUILD/wsjtx-2.0.0/wsjtx/lib/wsprd/wsprd_utils.c:199:13:
/usr/include/bits/string_fortified.h:136:10: warning: '__builtin_strncat' output truncated before terminating nul copying 2 bytes from a string of the same length [-Wstringop-truncation]
  136 |   return __builtin___strncat_chk (__dest, __src, __len, __bos (__dest));
      |          ^~~~~~~~~~~~~~~~~~~~~~~~~~~~~~~~~~~~~~~~~~~~~~~~~~~~~~~~~~~~~~
In function 'strncat',
    inlined from 'unpackpfx' at /usr/src/RPM/BUILD/wsjtx-2.0.0/wsjtx/lib/wsprd/wsprd_utils.c:192:13:
/usr/include/bits/string_fortified.h:136:10: warning: '__builtin_strncat' output truncated before terminating nul copying 1 byte from a string of the same length [-Wstringop-truncation]
  136 |   return __builtin___strncat_chk (__dest, __src, __len, __bos (__dest));
      |          ^~~~~~~~~~~~~~~~~~~~~~~~~~~~~~~~~~~~~~~~~~~~~~~~~~~~~~~~~~~~~~
In function 'strncat',
    inlined from 'unpackpfx' at /usr/src/RPM/BUILD/wsjtx-2.0.0/wsjtx/lib/wsprd/wsprd_utils.c:186:13:
/usr/include/bits/string_fortified.h:136:10: warning: '__builtin_strncat' output truncated before terminating nul copying 1 byte from a string of the same length [-Wstringop-truncation]
  136 |   return __builtin___strncat_chk (__dest, __src, __len, __bos (__dest));
      |          ^~~~~~~~~~~~~~~~~~~~~~~~~~~~~~~~~~~~~~~~~~~~~~~~~~~~~~~~~~~~~~
In function 'strncat',
    inlined from 'unpackpfx' at /usr/src/RPM/BUILD/wsjtx-2.0.0/wsjtx/lib/wsprd/wsprd_utils.c:177:9:
/usr/include/bits/string_fortified.h:136:10: warning: '__builtin_strncat' specified bound depends on the length of the source argument [-Wstringop-overflow=]
  136 |   return __builtin___strncat_chk (__dest, __src, __len, __bos (__dest));
      |          ^~~~~~~~~~~~~~~~~~~~~~~~~~~~~~~~~~~~~~~~~~~~~~~~~~~~~~~~~~~~~~
/usr/src/RPM/BUILD/wsjtx-2.0.0/wsjtx/lib/wsprd/wsprd_utils.c: In function 'unpackpfx':
/usr/src/RPM/BUILD/wsjtx-2.0.0/wsjtx/lib/wsprd/wsprd_utils.c:177:9: note: length computed here
  177 |         strncat(call,tmpcall,strlen(tmpcall));
      |         ^~~~~~~~~~~~~~~~~~~~~~~~~~~~~~~~~~~~~
In file included from /usr/include/string.h:507,
                 from /usr/src/RPM/BUILD/wsjtx-2.0.0/wsjtx/lib/wsprd/wsprd_utils.h:8,
                 from /usr/src/RPM/BUILD/wsjtx-2.0.0/wsjtx/lib/wsprd/wsprd_utils.c:29:
In function 'strncat',
    inlined from 'unpk_' at /usr/src/RPM/BUILD/wsjtx-2.0.0/wsjtx/lib/wsprd/wsprd_utils.c:327:9:
/usr/include/bits/string_fortified.h:136:10: warning: '__builtin_strncat' output truncated before terminating nul copying as many bytes from a string as its length [-Wstringop-truncation]
  136 |   return __builtin___strncat_chk (__dest, __src, __len, __bos (__dest));
      |          ^~~~~~~~~~~~~~~~~~~~~~~~~~~~~~~~~~~~~~~~~~~~~~~~~~~~~~~~~~~~~~
/usr/src/RPM/BUILD/wsjtx-2.0.0/wsjtx/lib/wsprd/wsprd_utils.c: In function 'unpk_':
/usr/src/RPM/BUILD/wsjtx-2.0.0/wsjtx/lib/wsprd/wsprd_utils.c:327:9: note: length computed here
  327 |         strncat(call_loc_pow,callsign,strlen(callsign));
      |         ^~~~~~~~~~~~~~~~~~~~~~~~~~~~~~~~~~~~~~~~~~~~~~~
In file included from /usr/include/string.h:507,
                 from /usr/src/RPM/BUILD/wsjtx-2.0.0/wsjtx/lib/wsprd/wsprd_utils.h:8,
                 from /usr/src/RPM/BUILD/wsjtx-2.0.0/wsjtx/lib/wsprd/wsprd_utils.c:29:
In function 'strncat',
    inlined from 'unpk_' at /usr/src/RPM/BUILD/wsjtx-2.0.0/wsjtx/lib/wsprd/wsprd_utils.c:329:9:
/usr/include/bits/string_fortified.h:136:10: warning: '__builtin_strncat' output truncated before terminating nul copying as many bytes from a string as its length [-Wstringop-truncation]
  136 |   return __builtin___strncat_chk (__dest, __src, __len, __bos (__dest));
      |          ^~~~~~~~~~~~~~~~~~~~~~~~~~~~~~~~~~~~~~~~~~~~~~~~~~~~~~~~~~~~~~
/usr/src/RPM/BUILD/wsjtx-2.0.0/wsjtx/lib/wsprd/wsprd_utils.c: In function 'unpk_':
/usr/src/RPM/BUILD/wsjtx-2.0.0/wsjtx/lib/wsprd/wsprd_utils.c:329:9: note: length computed here
  329 |         strncat(call_loc_pow,grid6,strlen(grid6));
      |         ^~~~~~~~~~~~~~~~~~~~~~~~~~~~~~~~~~~~~~~~~
In file included from /usr/include/string.h:507,
                 from /usr/src/RPM/BUILD/wsjtx-2.0.0/wsjtx/lib/wsprd/wsprd_utils.h:8,
                 from /usr/src/RPM/BUILD/wsjtx-2.0.0/wsjtx/lib/wsprd/wsprd_utils.c:29:
In function 'strncat',
    inlined from 'unpk_' at /usr/src/RPM/BUILD/wsjtx-2.0.0/wsjtx/lib/wsprd/wsprd_utils.c:331:9:
/usr/include/bits/string_fortified.h:136:10: warning: '__builtin_strncat' output may be truncated copying 2 bytes from a string of length 2 [-Wstringop-truncation]
  136 |   return __builtin___strncat_chk (__dest, __src, __len, __bos (__dest));
      |          ^~~~~~~~~~~~~~~~~~~~~~~~~~~~~~~~~~~~~~~~~~~~~~~~~~~~~~~~~~~~~~
In function 'strncat',
    inlined from 'unpk_' at /usr/src/RPM/BUILD/wsjtx-2.0.0/wsjtx/lib/wsprd/wsprd_utils.c:291:13:
/usr/include/bits/string_fortified.h:136:10: warning: '__builtin_strncat' output truncated before terminating nul copying as many bytes from a string as its length [-Wstringop-truncation]
  136 |   return __builtin___strncat_chk (__dest, __src, __len, __bos (__dest));
      |          ^~~~~~~~~~~~~~~~~~~~~~~~~~~~~~~~~~~~~~~~~~~~~~~~~~~~~~~~~~~~~~
/usr/src/RPM/BUILD/wsjtx-2.0.0/wsjtx/lib/wsprd/wsprd_utils.c: In function 'unpk_':
/usr/src/RPM/BUILD/wsjtx-2.0.0/wsjtx/lib/wsprd/wsprd_utils.c:291:13: note: length computed here
  291 |             strncat(call_loc_pow,callsign,strlen(callsign));
      |             ^~~~~~~~~~~~~~~~~~~~~~~~~~~~~~~~~~~~~~~~~~~~~~~
In file included from /usr/include/string.h:507,
                 from /usr/src/RPM/BUILD/wsjtx-2.0.0/wsjtx/lib/wsprd/wsprd_utils.h:8,
                 from /usr/src/RPM/BUILD/wsjtx-2.0.0/wsjtx/lib/wsprd/wsprd_utils.c:29:
In function 'strncat',
    inlined from 'unpk_' at /usr/src/RPM/BUILD/wsjtx-2.0.0/wsjtx/lib/wsprd/wsprd_utils.c:293:13:
/usr/include/bits/string_fortified.h:136:10: warning: '__builtin_strncat' output may be truncated copying 2 bytes from a string of length 2 [-Wstringop-truncation]
  136 |   return __builtin___strncat_chk (__dest, __src, __len, __bos (__dest));
      |          ^~~~~~~~~~~~~~~~~~~~~~~~~~~~~~~~~~~~~~~~~~~~~~~~~~~~~~~~~~~~~~
In function 'strncat',
    inlined from 'unpk_' at /usr/src/RPM/BUILD/wsjtx-2.0.0/wsjtx/lib/wsprd/wsprd_utils.c:274:13:
/usr/include/bits/string_fortified.h:136:10: warning: '__builtin_strncat' output truncated before terminating nul copying as many bytes from a string as its length [-Wstringop-truncation]
  136 |   return __builtin___strncat_chk (__dest, __src, __len, __bos (__dest));
      |          ^~~~~~~~~~~~~~~~~~~~~~~~~~~~~~~~~~~~~~~~~~~~~~~~~~~~~~~~~~~~~~
/usr/src/RPM/BUILD/wsjtx-2.0.0/wsjtx/lib/wsprd/wsprd_utils.c: In function 'unpk_':
/usr/src/RPM/BUILD/wsjtx-2.0.0/wsjtx/lib/wsprd/wsprd_utils.c:274:13: note: length computed here
  274 |             strncat(call_loc_pow,callsign,strlen(callsign));
      |             ^~~~~~~~~~~~~~~~~~~~~~~~~~~~~~~~~~~~~~~~~~~~~~~
In file included from /usr/include/string.h:507,
                 from /usr/src/RPM/BUILD/wsjtx-2.0.0/wsjtx/lib/wsprd/wsprd_utils.h:8,
                 from /usr/src/RPM/BUILD/wsjtx-2.0.0/wsjtx/lib/wsprd/wsprd_utils.c:29:
In function 'strncat',
    inlined from 'unpk_' at /usr/src/RPM/BUILD/wsjtx-2.0.0/wsjtx/lib/wsprd/wsprd_utils.c:276:13:
/usr/include/bits/string_fortified.h:136:10: warning: '__builtin_strncat' output may be truncated copying 4 bytes from a string of length 4 [-Wstringop-truncation]
  136 |   return __builtin___strncat_chk (__dest, __src, __len, __bos (__dest));
      |          ^~~~~~~~~~~~~~~~~~~~~~~~~~~~~~~~~~~~~~~~~~~~~~~~~~~~~~~~~~~~~~
In function 'strncat',
    inlined from 'unpk_' at /usr/src/RPM/BUILD/wsjtx-2.0.0/wsjtx/lib/wsprd/wsprd_utils.c:278:13:
/usr/include/bits/string_fortified.h:136:10: warning: '__builtin_strncat' output may be truncated copying 2 bytes from a string of length 2 [-Wstringop-truncation]
  136 |   return __builtin___strncat_chk (__dest, __src, __len, __bos (__dest));
      |          ^~~~~~~~~~~~~~~~~~~~~~~~~~~~~~~~~~~~~~~~~~~~~~~~~~~~~~~~~~~~~~
make[2]: Leaving directory '/usr/src/RPM/BUILD/wsjtx-2.0.0/wsjtx/BUILD'
make[2]: Entering directory '/usr/src/RPM/BUILD/wsjtx-2.0.0/wsjtx/BUILD'
[  9%] Building C object CMakeFiles/wsprsim.dir/lib/wsprd/fano.c.o
make[2]: Leaving directory '/usr/src/RPM/BUILD/wsjtx-2.0.0/wsjtx/BUILD'
make[2]: Entering directory '/usr/src/RPM/BUILD/wsjtx-2.0.0/wsjtx/BUILD'
[  9%] Building C object CMakeFiles/wsprsim.dir/lib/wsprd/tab.c.o
make[2]: Leaving directory '/usr/src/RPM/BUILD/wsjtx-2.0.0/wsjtx/BUILD'
make[2]: Entering directory '/usr/src/RPM/BUILD/wsjtx-2.0.0/wsjtx/BUILD'
[  5%] Building Fortran object CMakeFiles/wsjt_fort.dir/lib/packjt.f90.o
make[2]: Leaving directory '/usr/src/RPM/BUILD/wsjtx-2.0.0/wsjtx/BUILD'
make[2]: Entering directory '/usr/src/RPM/BUILD/wsjtx-2.0.0/wsjtx/BUILD'
[ 10%] Building Fortran object CMakeFiles/wsjt_fort.dir/lib/crc.f90.o
make[2]: Leaving directory '/usr/src/RPM/BUILD/wsjtx-2.0.0/wsjtx/BUILD'
make[2]: Entering directory '/usr/src/RPM/BUILD/wsjtx-2.0.0/wsjtx/BUILD'
[  9%] Building C object CMakeFiles/wsjt_cxx.dir/lib/tmoonsub.c.o
make[2]: Leaving directory '/usr/src/RPM/BUILD/wsjtx-2.0.0/wsjtx/BUILD'
make[2]: Entering directory '/usr/src/RPM/BUILD/wsjtx-2.0.0/wsjtx/BUILD'
[  9%] Building C object CMakeFiles/wsprsim.dir/lib/wsprd/nhash.c.o
/usr/src/RPM/BUILD/wsjtx-2.0.0/wsjtx/lib/wsprd/nhash.c: In function 'nhash':
/usr/src/RPM/BUILD/wsjtx-2.0.0/wsjtx/lib/wsprd/nhash.c:351:15: warning: this statement may fall through [-Wimplicit-fallthrough=]
  351 |     case 12: c+=((uint32_t)k[11])<<24;
      |              ~^~~~~~~~~~~~~~~~~~~~~~~
/usr/src/RPM/BUILD/wsjtx-2.0.0/wsjtx/lib/wsprd/nhash.c:352:5: note: here
  352 |     case 11: c+=((uint32_t)k[10])<<16;
      |     ^~~~
/usr/src/RPM/BUILD/wsjtx-2.0.0/wsjtx/lib/wsprd/nhash.c:352:15: warning: this statement may fall through [-Wimplicit-fallthrough=]
  352 |     case 11: c+=((uint32_t)k[10])<<16;
      |              ~^~~~~~~~~~~~~~~~~~~~~~~
/usr/src/RPM/BUILD/wsjtx-2.0.0/wsjtx/lib/wsprd/nhash.c:353:5: note: here
  353 |     case 10: c+=((uint32_t)k[9])<<8;
      |     ^~~~
/usr/src/RPM/BUILD/wsjtx-2.0.0/wsjtx/lib/wsprd/nhash.c:353:15: warning: this statement may fall through [-Wimplicit-fallthrough=]
  353 |     case 10: c+=((uint32_t)k[9])<<8;
      |              ~^~~~~~~~~~~~~~~~~~~~~
/usr/src/RPM/BUILD/wsjtx-2.0.0/wsjtx/lib/wsprd/nhash.c:354:5: note: here
  354 |     case 9 : c+=k[8];
      |     ^~~~
/usr/src/RPM/BUILD/wsjtx-2.0.0/wsjtx/lib/wsprd/nhash.c:354:15: warning: this statement may fall through [-Wimplicit-fallthrough=]
  354 |     case 9 : c+=k[8];
      |              ~^~~~~~
/usr/src/RPM/BUILD/wsjtx-2.0.0/wsjtx/lib/wsprd/nhash.c:355:5: note: here
  355 |     case 8 : b+=((uint32_t)k[7])<<24;
      |     ^~~~
/usr/src/RPM/BUILD/wsjtx-2.0.0/wsjtx/lib/wsprd/nhash.c:355:15: warning: this statement may fall through [-Wimplicit-fallthrough=]
  355 |     case 8 : b+=((uint32_t)k[7])<<24;
      |              ~^~~~~~~~~~~~~~~~~~~~~~
/usr/src/RPM/BUILD/wsjtx-2.0.0/wsjtx/lib/wsprd/nhash.c:356:5: note: here
  356 |     case 7 : b+=((uint32_t)k[6])<<16;
      |     ^~~~
/usr/src/RPM/BUILD/wsjtx-2.0.0/wsjtx/lib/wsprd/nhash.c:356:15: warning: this statement may fall through [-Wimplicit-fallthrough=]
  356 |     case 7 : b+=((uint32_t)k[6])<<16;
      |              ~^~~~~~~~~~~~~~~~~~~~~~
/usr/src/RPM/BUILD/wsjtx-2.0.0/wsjtx/lib/wsprd/nhash.c:357:5: note: here
  357 |     case 6 : b+=((uint32_t)k[5])<<8;
      |     ^~~~
/usr/src/RPM/BUILD/wsjtx-2.0.0/wsjtx/lib/wsprd/nhash.c:357:15: warning: this statement may fall through [-Wimplicit-fallthrough=]
  357 |     case 6 : b+=((uint32_t)k[5])<<8;
      |              ~^~~~~~~~~~~~~~~~~~~~~
/usr/src/RPM/BUILD/wsjtx-2.0.0/wsjtx/lib/wsprd/nhash.c:358:5: note: here
  358 |     case 5 : b+=k[4];
      |     ^~~~
/usr/src/RPM/BUILD/wsjtx-2.0.0/wsjtx/lib/wsprd/nhash.c:358:15: warning: this statement may fall through [-Wimplicit-fallthrough=]
  358 |     case 5 : b+=k[4];
      |              ~^~~~~~
/usr/src/RPM/BUILD/wsjtx-2.0.0/wsjtx/lib/wsprd/nhash.c:359:5: note: here
  359 |     case 4 : a+=((uint32_t)k[3])<<24;
      |     ^~~~
/usr/src/RPM/BUILD/wsjtx-2.0.0/wsjtx/lib/wsprd/nhash.c:359:15: warning: this statement may fall through [-Wimplicit-fallthrough=]
  359 |     case 4 : a+=((uint32_t)k[3])<<24;
      |              ~^~~~~~~~~~~~~~~~~~~~~~
/usr/src/RPM/BUILD/wsjtx-2.0.0/wsjtx/lib/wsprd/nhash.c:360:5: note: here
  360 |     case 3 : a+=((uint32_t)k[2])<<16;
      |     ^~~~
/usr/src/RPM/BUILD/wsjtx-2.0.0/wsjtx/lib/wsprd/nhash.c:360:15: warning: this statement may fall through [-Wimplicit-fallthrough=]
  360 |     case 3 : a+=((uint32_t)k[2])<<16;
      |              ~^~~~~~~~~~~~~~~~~~~~~~
/usr/src/RPM/BUILD/wsjtx-2.0.0/wsjtx/lib/wsprd/nhash.c:361:5: note: here
  361 |     case 2 : a+=((uint32_t)k[1])<<8;
      |     ^~~~
/usr/src/RPM/BUILD/wsjtx-2.0.0/wsjtx/lib/wsprd/nhash.c:361:15: warning: this statement may fall through [-Wimplicit-fallthrough=]
  361 |     case 2 : a+=((uint32_t)k[1])<<8;
      |              ~^~~~~~~~~~~~~~~~~~~~~
/usr/src/RPM/BUILD/wsjtx-2.0.0/wsjtx/lib/wsprd/nhash.c:362:5: note: here
  362 |     case 1 : a+=k[0];
      |     ^~~~
make[2]: Leaving directory '/usr/src/RPM/BUILD/wsjtx-2.0.0/wsjtx/BUILD'
make[2]: Entering directory '/usr/src/RPM/BUILD/wsjtx-2.0.0/wsjtx/BUILD'
[ 10%] Building Fortran object CMakeFiles/wsjt_fort.dir/lib/fftw3mod.f90.o
make[2]: Leaving directory '/usr/src/RPM/BUILD/wsjtx-2.0.0/wsjtx/BUILD'
make[2]: Entering directory '/usr/src/RPM/BUILD/wsjtx-2.0.0/wsjtx/BUILD'
[ 10%] Building C object CMakeFiles/wsjt_cxx.dir/lib/usleep.c.o
make[2]: Leaving directory '/usr/src/RPM/BUILD/wsjtx-2.0.0/wsjtx/BUILD'
make[2]: Entering directory '/usr/src/RPM/BUILD/wsjtx-2.0.0/wsjtx/BUILD'
[ 10%] Building Fortran object CMakeFiles/wsjt_fort.dir/lib/timer_module.f90.o
make[2]: Leaving directory '/usr/src/RPM/BUILD/wsjtx-2.0.0/wsjtx/BUILD'
make[2]: Entering directory '/usr/src/RPM/BUILD/wsjtx-2.0.0/wsjtx/BUILD'
[ 10%] Building Fortran object CMakeFiles/wsjt_fort.dir/lib/hashing.f90.o
make[2]: Leaving directory '/usr/src/RPM/BUILD/wsjtx-2.0.0/wsjtx/BUILD'
make[2]: Entering directory '/usr/src/RPM/BUILD/wsjtx-2.0.0/wsjtx/BUILD'
[ 10%] Linking CXX executable wsprsim
make[2]: Leaving directory '/usr/src/RPM/BUILD/wsjtx-2.0.0/wsjtx/BUILD'
make[2]: Entering directory '/usr/src/RPM/BUILD/wsjtx-2.0.0/wsjtx/BUILD'
[ 10%] Building Fortran object CMakeFiles/wsjt_fort.dir/lib/iso_c_utilities.f90.o
make[2]: Leaving directory '/usr/src/RPM/BUILD/wsjtx-2.0.0/wsjtx/BUILD'
make[1]: Entering directory '/usr/src/RPM/BUILD/wsjtx-2.0.0/wsjtx/BUILD'
[ 10%] Built target wsprsim
make[1]: Leaving directory '/usr/src/RPM/BUILD/wsjtx-2.0.0/wsjtx/BUILD'
make[2]: Entering directory '/usr/src/RPM/BUILD/wsjtx-2.0.0/wsjtx/BUILD'
[ 10%] Building Fortran object CMakeFiles/wsjt_fort.dir/lib/jt65_mod.f90.o
make[2]: Leaving directory '/usr/src/RPM/BUILD/wsjtx-2.0.0/wsjtx/BUILD'
make[2]: Entering directory '/usr/src/RPM/BUILD/wsjtx-2.0.0/wsjtx/BUILD'
[ 10%] Building Fortran object CMakeFiles/wsjt_fort.dir/lib/jt4.f90.o
make[2]: Leaving directory '/usr/src/RPM/BUILD/wsjtx-2.0.0/wsjtx/BUILD'
make[2]: Entering directory '/usr/src/RPM/BUILD/wsjtx-2.0.0/wsjtx/BUILD'
[ 10%] Building Fortran object CMakeFiles/wsjt_fort.dir/lib/prog_args.f90.o
make[2]: Leaving directory '/usr/src/RPM/BUILD/wsjtx-2.0.0/wsjtx/BUILD'
make[2]: Entering directory '/usr/src/RPM/BUILD/wsjtx-2.0.0/wsjtx/BUILD'
[ 10%] Building C object CMakeFiles/wsjt_cxx.dir/lib/vit213.c.o
make[2]: Leaving directory '/usr/src/RPM/BUILD/wsjtx-2.0.0/wsjtx/BUILD'
make[2]: Entering directory '/usr/src/RPM/BUILD/wsjtx-2.0.0/wsjtx/BUILD'
[  0%] Generating man/man1/wsjtx.1.gz
make[2]: Leaving directory '/usr/src/RPM/BUILD/wsjtx-2.0.0/wsjtx/BUILD'
make[2]: Entering directory '/usr/src/RPM/BUILD/wsjtx-2.0.0/wsjtx/BUILD'
[ 10%] Building C object CMakeFiles/wsjt_cxx.dir/lib/wisdom.c.o
make[2]: Leaving directory '/usr/src/RPM/BUILD/wsjtx-2.0.0/wsjtx/BUILD'
make[2]: Entering directory '/usr/src/RPM/BUILD/wsjtx-2.0.0/wsjtx/BUILD'
[ 10%] Building Fortran object CMakeFiles/wsjt_fort.dir/lib/readwav.f90.o
make[2]: Leaving directory '/usr/src/RPM/BUILD/wsjtx-2.0.0/wsjtx/BUILD'
make[2]: Entering directory '/usr/src/RPM/BUILD/wsjtx-2.0.0/wsjtx/BUILD'
[ 10%] Building Fortran object CMakeFiles/wsjt_fort.dir/lib/options.f90.o
make[2]: Leaving directory '/usr/src/RPM/BUILD/wsjtx-2.0.0/wsjtx/BUILD'
make[2]: Entering directory '/usr/src/RPM/BUILD/wsjtx-2.0.0/wsjtx/BUILD'
[ 10%] Building C object CMakeFiles/wsjt_cxx.dir/lib/wrapkarn.c.o
make[2]: Leaving directory '/usr/src/RPM/BUILD/wsjtx-2.0.0/wsjtx/BUILD'
make[2]: Entering directory '/usr/src/RPM/BUILD/wsjtx-2.0.0/wsjtx/BUILD'
[ 10%] Building CXX object CMakeFiles/wsjt_fort.dir/wsjt_fort_autogen/mocs_compilation.cpp.o
make[2]: Leaving directory '/usr/src/RPM/BUILD/wsjtx-2.0.0/wsjtx/BUILD'
make[2]: Entering directory '/usr/src/RPM/BUILD/wsjtx-2.0.0/wsjtx/BUILD'
[ 10%] Building Fortran object CMakeFiles/wsjt_fort.dir/lib/wavhdr.f90.o
make[2]: Leaving directory '/usr/src/RPM/BUILD/wsjtx-2.0.0/wsjtx/BUILD'
make[2]: Entering directory '/usr/src/RPM/BUILD/wsjtx-2.0.0/wsjtx/BUILD'
[ 11%] Building Fortran object CMakeFiles/wsjt_fort.dir/lib/addit.f90.o
make[2]: Leaving directory '/usr/src/RPM/BUILD/wsjtx-2.0.0/wsjtx/BUILD'
make[2]: Entering directory '/usr/src/RPM/BUILD/wsjtx-2.0.0/wsjtx/BUILD'
[  5%] Building C object CMakeFiles/wsprd.dir/lib/wsprd/wsprd.c.o
/usr/src/RPM/BUILD/wsjtx-2.0.0/wsjtx/lib/wsprd/wsprd.c: In function 'readc2file':
/usr/src/RPM/BUILD/wsjtx-2.0.0/wsjtx/lib/wsprd/wsprd.c:82:5: warning: ignoring return value of 'fread', declared with attribute warn_unused_result [-Wunused-result]
   82 |     fread(c2file,sizeof(char),14,fp);
      |     ^~~~~~~~~~~~~~~~~~~~~~~~~~~~~~~~
/usr/src/RPM/BUILD/wsjtx-2.0.0/wsjtx/lib/wsprd/wsprd.c:83:5: warning: ignoring return value of 'fread', declared with attribute warn_unused_result [-Wunused-result]
   83 |     fread(&ntrmin,sizeof(int),1,fp);
      |     ^~~~~~~~~~~~~~~~~~~~~~~~~~~~~~~
/usr/src/RPM/BUILD/wsjtx-2.0.0/wsjtx/lib/wsprd/wsprd.c:84:5: warning: ignoring return value of 'fread', declared with attribute warn_unused_result [-Wunused-result]
   84 |     fread(&dfreq,sizeof(double),1,fp);
      |     ^~~~~~~~~~~~~~~~~~~~~~~~~~~~~~~~~
/usr/src/RPM/BUILD/wsjtx-2.0.0/wsjtx/lib/wsprd/wsprd.c: In function 'readwavfile':
/usr/src/RPM/BUILD/wsjtx-2.0.0/wsjtx/lib/wsprd/wsprd.c:144:5: warning: ignoring return value of 'fread', declared with attribute warn_unused_result [-Wunused-result]
  144 |     fread(buf2,2,22,fp);      //Read and ignore header
      |     ^~~~~~~~~~~~~~~~~~~
/usr/src/RPM/BUILD/wsjtx-2.0.0/wsjtx/lib/wsprd/wsprd.c:145:5: warning: ignoring return value of 'fread', declared with attribute warn_unused_result [-Wunused-result]
  145 |     fread(buf2,2,npoints,fp); //Read raw data
      |     ^~~~~~~~~~~~~~~~~~~~~~~~
/usr/src/RPM/BUILD/wsjtx-2.0.0/wsjtx/lib/wsprd/wsprd.c: In function 'main':
/usr/src/RPM/BUILD/wsjtx-2.0.0/wsjtx/lib/wsprd/wsprd.c:895:8: warning: ignoring return value of 'fscanf', declared with attribute warn_unused_result [-Wunused-result]
  895 |        fscanf(ftimer,"%f %f %f %f %f %f %f",
      |        ^~~~~~~~~~~~~~~~~~~~~~~~~~~~~~~~~~~~~
  896 |               &treadwav,&tcandidates,&tsync0,&tsync1,&tsync2,&tfano,&ttotal);
      |               ~~~~~~~~~~~~~~~~~~~~~~~~~~~~~~~~~~~~~~~~~~~~~~~~~~~~~~~~~~~~~~
make[2]: Leaving directory '/usr/src/RPM/BUILD/wsjtx-2.0.0/wsjtx/BUILD'
make[2]: Entering directory '/usr/src/RPM/BUILD/wsjtx-2.0.0/wsjtx/BUILD'
[ 11%] Building Fortran object CMakeFiles/wsjt_fort.dir/lib/afc9.f90.o
make[2]: Leaving directory '/usr/src/RPM/BUILD/wsjtx-2.0.0/wsjtx/BUILD'
make[2]: Entering directory '/usr/src/RPM/BUILD/wsjtx-2.0.0/wsjtx/BUILD'
[ 11%] Building C object CMakeFiles/wsjt_cxx.dir/lib/qra/qra64/qra64.c.o
/usr/src/RPM/BUILD/wsjtx-2.0.0/wsjtx/lib/qra/qra64/qra64.c: In function 'qra64_encode':
/usr/src/RPM/BUILD/wsjtx-2.0.0/wsjtx/lib/qra/qra64/qra64.c:245:18: warning: bitwise comparison always evaluates to false [-Wtautological-compare]
  245 |   if ((x[9]&0x80)==1)
      |                  ^~
make[2]: Leaving directory '/usr/src/RPM/BUILD/wsjtx-2.0.0/wsjtx/BUILD'
make[2]: Entering directory '/usr/src/RPM/BUILD/wsjtx-2.0.0/wsjtx/BUILD'
[ 11%] Building Fortran object CMakeFiles/wsjt_fort.dir/lib/afc65b.f90.o
/usr/src/RPM/BUILD/wsjtx-2.0.0/wsjtx/lib/afc65b.f90:40:0:

   40 |   a(2)=a2
      | 
Warning: 'a2' may be used uninitialized in this function [-Wmaybe-uninitialized]
/usr/src/RPM/BUILD/wsjtx-2.0.0/wsjtx/lib/afc65b.f90:39:0:

   39 |   a(1)=a1
      | 
Warning: 'a1' may be used uninitialized in this function [-Wmaybe-uninitialized]
make[2]: Leaving directory '/usr/src/RPM/BUILD/wsjtx-2.0.0/wsjtx/BUILD'
make[2]: Entering directory '/usr/src/RPM/BUILD/wsjtx-2.0.0/wsjtx/BUILD'
[ 12%] Building C object CMakeFiles/wsjt_cxx.dir/lib/qra/qra64/qra64_subs.c.o
make[2]: Leaving directory '/usr/src/RPM/BUILD/wsjtx-2.0.0/wsjtx/BUILD'
make[2]: Entering directory '/usr/src/RPM/BUILD/wsjtx-2.0.0/wsjtx/BUILD'
[ 11%] Building C object CMakeFiles/wsprd.dir/lib/wsprd/wsprsim_utils.c.o
make[2]: Leaving directory '/usr/src/RPM/BUILD/wsjtx-2.0.0/wsjtx/BUILD'
make[2]: Entering directory '/usr/src/RPM/BUILD/wsjtx-2.0.0/wsjtx/BUILD'
[ 12%] Building Fortran object CMakeFiles/wsjt_fort.dir/lib/analytic.f90.o
make[2]: Leaving directory '/usr/src/RPM/BUILD/wsjtx-2.0.0/wsjtx/BUILD'
make[2]: Entering directory '/usr/src/RPM/BUILD/wsjtx-2.0.0/wsjtx/BUILD'
[ 12%] Building Fortran object CMakeFiles/wsjt_fort.dir/lib/ana932.f90.o
make[2]: Leaving directory '/usr/src/RPM/BUILD/wsjtx-2.0.0/wsjtx/BUILD'
make[2]: Entering directory '/usr/src/RPM/BUILD/wsjtx-2.0.0/wsjtx/BUILD'
[  5%] Building Fortran object CMakeFiles/wsjt_fort_omp.dir/lib/packjt.f90.o
make[2]: Leaving directory '/usr/src/RPM/BUILD/wsjtx-2.0.0/wsjtx/BUILD'
make[2]: Entering directory '/usr/src/RPM/BUILD/wsjtx-2.0.0/wsjtx/BUILD'
[ 12%] Building Fortran object CMakeFiles/wsjt_fort_omp.dir/lib/crc.f90.o
make[2]: Leaving directory '/usr/src/RPM/BUILD/wsjtx-2.0.0/wsjtx/BUILD'
make[2]: Entering directory '/usr/src/RPM/BUILD/wsjtx-2.0.0/wsjtx/BUILD'
[ 12%] Building Fortran object CMakeFiles/wsjt_fort.dir/lib/astrosub.f90.o
make[2]: Leaving directory '/usr/src/RPM/BUILD/wsjtx-2.0.0/wsjtx/BUILD'
make[2]: Entering directory '/usr/src/RPM/BUILD/wsjtx-2.0.0/wsjtx/BUILD'
[  8%] Building CXX object CMakeFiles/wsjtx_udp-static.dir/Radio.cpp.o
make[2]: Leaving directory '/usr/src/RPM/BUILD/wsjtx-2.0.0/wsjtx/BUILD'
make[2]: Entering directory '/usr/src/RPM/BUILD/wsjtx-2.0.0/wsjtx/BUILD'
[ 12%] Building Fortran object CMakeFiles/wsjt_fort_omp.dir/lib/fftw3mod.f90.o
make[2]: Leaving directory '/usr/src/RPM/BUILD/wsjtx-2.0.0/wsjtx/BUILD'
make[2]: Entering directory '/usr/src/RPM/BUILD/wsjtx-2.0.0/wsjtx/BUILD'
[ 12%] Building Fortran object CMakeFiles/wsjt_fort.dir/lib/astro.f90.o
make[2]: Leaving directory '/usr/src/RPM/BUILD/wsjtx-2.0.0/wsjtx/BUILD'
make[2]: Entering directory '/usr/src/RPM/BUILD/wsjtx-2.0.0/wsjtx/BUILD'
[ 12%] Building Fortran object CMakeFiles/wsjt_fort_omp.dir/lib/timer_module.f90.o
make[2]: Leaving directory '/usr/src/RPM/BUILD/wsjtx-2.0.0/wsjtx/BUILD'
make[2]: Entering directory '/usr/src/RPM/BUILD/wsjtx-2.0.0/wsjtx/BUILD'
[ 12%] Building Fortran object CMakeFiles/wsjt_fort.dir/lib/astro0.f90.o
make[2]: Leaving directory '/usr/src/RPM/BUILD/wsjtx-2.0.0/wsjtx/BUILD'
make[2]: Entering directory '/usr/src/RPM/BUILD/wsjtx-2.0.0/wsjtx/BUILD'
[ 12%] Building Fortran object CMakeFiles/wsjt_fort_omp.dir/lib/hashing.f90.o
make[2]: Leaving directory '/usr/src/RPM/BUILD/wsjtx-2.0.0/wsjtx/BUILD'
make[2]: Entering directory '/usr/src/RPM/BUILD/wsjtx-2.0.0/wsjtx/BUILD'
[ 12%] Building Fortran object CMakeFiles/wsjt_fort.dir/lib/averms.f90.o
make[2]: Leaving directory '/usr/src/RPM/BUILD/wsjtx-2.0.0/wsjtx/BUILD'
make[2]: Entering directory '/usr/src/RPM/BUILD/wsjtx-2.0.0/wsjtx/BUILD'
[ 12%] Building Fortran object CMakeFiles/wsjt_fort_omp.dir/lib/iso_c_utilities.f90.o
make[2]: Leaving directory '/usr/src/RPM/BUILD/wsjtx-2.0.0/wsjtx/BUILD'
make[2]: Entering directory '/usr/src/RPM/BUILD/wsjtx-2.0.0/wsjtx/BUILD'
[ 12%] Building C object CMakeFiles/wsprd.dir/lib/wsprd/wsprd_utils.c.o
In file included from /usr/include/string.h:507,
                 from /usr/src/RPM/BUILD/wsjtx-2.0.0/wsjtx/lib/wsprd/wsprd_utils.h:8,
                 from /usr/src/RPM/BUILD/wsjtx-2.0.0/wsjtx/lib/wsprd/wsprd_utils.c:29:
In function 'strncat',
    inlined from 'unpackpfx' at /usr/src/RPM/BUILD/wsjtx-2.0.0/wsjtx/lib/wsprd/wsprd_utils.c:199:13:
/usr/include/bits/string_fortified.h:136:10: warning: '__builtin_strncat' output truncated before terminating nul copying 2 bytes from a string of the same length [-Wstringop-truncation]
  136 |   return __builtin___strncat_chk (__dest, __src, __len, __bos (__dest));
      |          ^~~~~~~~~~~~~~~~~~~~~~~~~~~~~~~~~~~~~~~~~~~~~~~~~~~~~~~~~~~~~~
In function 'strncat',
    inlined from 'unpackpfx' at /usr/src/RPM/BUILD/wsjtx-2.0.0/wsjtx/lib/wsprd/wsprd_utils.c:192:13:
/usr/include/bits/string_fortified.h:136:10: warning: '__builtin_strncat' output truncated before terminating nul copying 1 byte from a string of the same length [-Wstringop-truncation]
  136 |   return __builtin___strncat_chk (__dest, __src, __len, __bos (__dest));
      |          ^~~~~~~~~~~~~~~~~~~~~~~~~~~~~~~~~~~~~~~~~~~~~~~~~~~~~~~~~~~~~~
In function 'strncat',
    inlined from 'unpackpfx' at /usr/src/RPM/BUILD/wsjtx-2.0.0/wsjtx/lib/wsprd/wsprd_utils.c:186:13:
/usr/include/bits/string_fortified.h:136:10: warning: '__builtin_strncat' output truncated before terminating nul copying 1 byte from a string of the same length [-Wstringop-truncation]
  136 |   return __builtin___strncat_chk (__dest, __src, __len, __bos (__dest));
      |          ^~~~~~~~~~~~~~~~~~~~~~~~~~~~~~~~~~~~~~~~~~~~~~~~~~~~~~~~~~~~~~
In function 'strncat',
    inlined from 'unpackpfx' at /usr/src/RPM/BUILD/wsjtx-2.0.0/wsjtx/lib/wsprd/wsprd_utils.c:177:9:
/usr/include/bits/string_fortified.h:136:10: warning: '__builtin_strncat' specified bound depends on the length of the source argument [-Wstringop-overflow=]
  136 |   return __builtin___strncat_chk (__dest, __src, __len, __bos (__dest));
      |          ^~~~~~~~~~~~~~~~~~~~~~~~~~~~~~~~~~~~~~~~~~~~~~~~~~~~~~~~~~~~~~
/usr/src/RPM/BUILD/wsjtx-2.0.0/wsjtx/lib/wsprd/wsprd_utils.c: In function 'unpackpfx':
/usr/src/RPM/BUILD/wsjtx-2.0.0/wsjtx/lib/wsprd/wsprd_utils.c:177:9: note: length computed here
  177 |         strncat(call,tmpcall,strlen(tmpcall));
      |         ^~~~~~~~~~~~~~~~~~~~~~~~~~~~~~~~~~~~~
In file included from /usr/include/string.h:507,
                 from /usr/src/RPM/BUILD/wsjtx-2.0.0/wsjtx/lib/wsprd/wsprd_utils.h:8,
                 from /usr/src/RPM/BUILD/wsjtx-2.0.0/wsjtx/lib/wsprd/wsprd_utils.c:29:
In function 'strncat',
    inlined from 'unpk_' at /usr/src/RPM/BUILD/wsjtx-2.0.0/wsjtx/lib/wsprd/wsprd_utils.c:327:9:
/usr/include/bits/string_fortified.h:136:10: warning: '__builtin_strncat' output truncated before terminating nul copying as many bytes from a string as its length [-Wstringop-truncation]
  136 |   return __builtin___strncat_chk (__dest, __src, __len, __bos (__dest));
      |          ^~~~~~~~~~~~~~~~~~~~~~~~~~~~~~~~~~~~~~~~~~~~~~~~~~~~~~~~~~~~~~
/usr/src/RPM/BUILD/wsjtx-2.0.0/wsjtx/lib/wsprd/wsprd_utils.c: In function 'unpk_':
/usr/src/RPM/BUILD/wsjtx-2.0.0/wsjtx/lib/wsprd/wsprd_utils.c:327:9: note: length computed here
  327 |         strncat(call_loc_pow,callsign,strlen(callsign));
      |         ^~~~~~~~~~~~~~~~~~~~~~~~~~~~~~~~~~~~~~~~~~~~~~~
In file included from /usr/include/string.h:507,
                 from /usr/src/RPM/BUILD/wsjtx-2.0.0/wsjtx/lib/wsprd/wsprd_utils.h:8,
                 from /usr/src/RPM/BUILD/wsjtx-2.0.0/wsjtx/lib/wsprd/wsprd_utils.c:29:
In function 'strncat',
    inlined from 'unpk_' at /usr/src/RPM/BUILD/wsjtx-2.0.0/wsjtx/lib/wsprd/wsprd_utils.c:329:9:
/usr/include/bits/string_fortified.h:136:10: warning: '__builtin_strncat' output truncated before terminating nul copying as many bytes from a string as its length [-Wstringop-truncation]
  136 |   return __builtin___strncat_chk (__dest, __src, __len, __bos (__dest));
      |          ^~~~~~~~~~~~~~~~~~~~~~~~~~~~~~~~~~~~~~~~~~~~~~~~~~~~~~~~~~~~~~
/usr/src/RPM/BUILD/wsjtx-2.0.0/wsjtx/lib/wsprd/wsprd_utils.c: In function 'unpk_':
/usr/src/RPM/BUILD/wsjtx-2.0.0/wsjtx/lib/wsprd/wsprd_utils.c:329:9: note: length computed here
  329 |         strncat(call_loc_pow,grid6,strlen(grid6));
      |         ^~~~~~~~~~~~~~~~~~~~~~~~~~~~~~~~~~~~~~~~~
In file included from /usr/include/string.h:507,
                 from /usr/src/RPM/BUILD/wsjtx-2.0.0/wsjtx/lib/wsprd/wsprd_utils.h:8,
                 from /usr/src/RPM/BUILD/wsjtx-2.0.0/wsjtx/lib/wsprd/wsprd_utils.c:29:
In function 'strncat',
    inlined from 'unpk_' at /usr/src/RPM/BUILD/wsjtx-2.0.0/wsjtx/lib/wsprd/wsprd_utils.c:331:9:
/usr/include/bits/string_fortified.h:136:10: warning: '__builtin_strncat' output may be truncated copying 2 bytes from a string of length 2 [-Wstringop-truncation]
  136 |   return __builtin___strncat_chk (__dest, __src, __len, __bos (__dest));
      |          ^~~~~~~~~~~~~~~~~~~~~~~~~~~~~~~~~~~~~~~~~~~~~~~~~~~~~~~~~~~~~~
In function 'strncat',
    inlined from 'unpk_' at /usr/src/RPM/BUILD/wsjtx-2.0.0/wsjtx/lib/wsprd/wsprd_utils.c:291:13:
/usr/include/bits/string_fortified.h:136:10: warning: '__builtin_strncat' output truncated before terminating nul copying as many bytes from a string as its length [-Wstringop-truncation]
  136 |   return __builtin___strncat_chk (__dest, __src, __len, __bos (__dest));
      |          ^~~~~~~~~~~~~~~~~~~~~~~~~~~~~~~~~~~~~~~~~~~~~~~~~~~~~~~~~~~~~~
/usr/src/RPM/BUILD/wsjtx-2.0.0/wsjtx/lib/wsprd/wsprd_utils.c: In function 'unpk_':
/usr/src/RPM/BUILD/wsjtx-2.0.0/wsjtx/lib/wsprd/wsprd_utils.c:291:13: note: length computed here
  291 |             strncat(call_loc_pow,callsign,strlen(callsign));
      |             ^~~~~~~~~~~~~~~~~~~~~~~~~~~~~~~~~~~~~~~~~~~~~~~
In file included from /usr/include/string.h:507,
                 from /usr/src/RPM/BUILD/wsjtx-2.0.0/wsjtx/lib/wsprd/wsprd_utils.h:8,
                 from /usr/src/RPM/BUILD/wsjtx-2.0.0/wsjtx/lib/wsprd/wsprd_utils.c:29:
In function 'strncat',
    inlined from 'unpk_' at /usr/src/RPM/BUILD/wsjtx-2.0.0/wsjtx/lib/wsprd/wsprd_utils.c:293:13:
/usr/include/bits/string_fortified.h:136:10: warning: '__builtin_strncat' output may be truncated copying 2 bytes from a string of length 2 [-Wstringop-truncation]
  136 |   return __builtin___strncat_chk (__dest, __src, __len, __bos (__dest));
      |          ^~~~~~~~~~~~~~~~~~~~~~~~~~~~~~~~~~~~~~~~~~~~~~~~~~~~~~~~~~~~~~
In function 'strncat',
    inlined from 'unpk_' at /usr/src/RPM/BUILD/wsjtx-2.0.0/wsjtx/lib/wsprd/wsprd_utils.c:274:13:
/usr/include/bits/string_fortified.h:136:10: warning: '__builtin_strncat' output truncated before terminating nul copying as many bytes from a string as its length [-Wstringop-truncation]
  136 |   return __builtin___strncat_chk (__dest, __src, __len, __bos (__dest));
      |          ^~~~~~~~~~~~~~~~~~~~~~~~~~~~~~~~~~~~~~~~~~~~~~~~~~~~~~~~~~~~~~
/usr/src/RPM/BUILD/wsjtx-2.0.0/wsjtx/lib/wsprd/wsprd_utils.c: In function 'unpk_':
/usr/src/RPM/BUILD/wsjtx-2.0.0/wsjtx/lib/wsprd/wsprd_utils.c:274:13: note: length computed here
  274 |             strncat(call_loc_pow,callsign,strlen(callsign));
      |             ^~~~~~~~~~~~~~~~~~~~~~~~~~~~~~~~~~~~~~~~~~~~~~~
In file included from /usr/include/string.h:507,
                 from /usr/src/RPM/BUILD/wsjtx-2.0.0/wsjtx/lib/wsprd/wsprd_utils.h:8,
                 from /usr/src/RPM/BUILD/wsjtx-2.0.0/wsjtx/lib/wsprd/wsprd_utils.c:29:
In function 'strncat',
    inlined from 'unpk_' at /usr/src/RPM/BUILD/wsjtx-2.0.0/wsjtx/lib/wsprd/wsprd_utils.c:276:13:
/usr/include/bits/string_fortified.h:136:10: warning: '__builtin_strncat' output may be truncated copying 4 bytes from a string of length 4 [-Wstringop-truncation]
  136 |   return __builtin___strncat_chk (__dest, __src, __len, __bos (__dest));
      |          ^~~~~~~~~~~~~~~~~~~~~~~~~~~~~~~~~~~~~~~~~~~~~~~~~~~~~~~~~~~~~~
In function 'strncat',
    inlined from 'unpk_' at /usr/src/RPM/BUILD/wsjtx-2.0.0/wsjtx/lib/wsprd/wsprd_utils.c:278:13:
/usr/include/bits/string_fortified.h:136:10: warning: '__builtin_strncat' output may be truncated copying 2 bytes from a string of length 2 [-Wstringop-truncation]
  136 |   return __builtin___strncat_chk (__dest, __src, __len, __bos (__dest));
      |          ^~~~~~~~~~~~~~~~~~~~~~~~~~~~~~~~~~~~~~~~~~~~~~~~~~~~~~~~~~~~~~
make[2]: Leaving directory '/usr/src/RPM/BUILD/wsjtx-2.0.0/wsjtx/BUILD'
make[2]: Entering directory '/usr/src/RPM/BUILD/wsjtx-2.0.0/wsjtx/BUILD'
[ 13%] Building Fortran object CMakeFiles/wsjt_fort_omp.dir/lib/jt4.f90.o
make[2]: Leaving directory '/usr/src/RPM/BUILD/wsjtx-2.0.0/wsjtx/BUILD'
make[2]: Entering directory '/usr/src/RPM/BUILD/wsjtx-2.0.0/wsjtx/BUILD'
[ 13%] Building Fortran object CMakeFiles/wsjt_fort_omp.dir/lib/jt65_mod.f90.o
make[2]: Leaving directory '/usr/src/RPM/BUILD/wsjtx-2.0.0/wsjtx/BUILD'
make[2]: Entering directory '/usr/src/RPM/BUILD/wsjtx-2.0.0/wsjtx/BUILD'
[ 13%] Building Fortran object CMakeFiles/wsjt_fort.dir/lib/azdist.f90.o
make[2]: Leaving directory '/usr/src/RPM/BUILD/wsjtx-2.0.0/wsjtx/BUILD'
make[2]: Entering directory '/usr/src/RPM/BUILD/wsjtx-2.0.0/wsjtx/BUILD'
[ 13%] Building C object CMakeFiles/wsprd.dir/lib/wsprd/fano.c.o
make[2]: Leaving directory '/usr/src/RPM/BUILD/wsjtx-2.0.0/wsjtx/BUILD'
make[2]: Entering directory '/usr/src/RPM/BUILD/wsjtx-2.0.0/wsjtx/BUILD'
[ 12%] Building C object CMakeFiles/wsjt_cxx.dir/lib/qra/qracodes/npfwht.c.o
make[2]: Leaving directory '/usr/src/RPM/BUILD/wsjtx-2.0.0/wsjtx/BUILD'
make[2]: Entering directory '/usr/src/RPM/BUILD/wsjtx-2.0.0/wsjtx/BUILD'
[ 13%] Building Fortran object CMakeFiles/wsjt_fort.dir/lib/badmsg.f90.o
make[2]: Leaving directory '/usr/src/RPM/BUILD/wsjtx-2.0.0/wsjtx/BUILD'
make[2]: Entering directory '/usr/src/RPM/BUILD/wsjtx-2.0.0/wsjtx/BUILD'
[ 13%] Building C object CMakeFiles/wsprd.dir/lib/wsprd/jelinek.c.o
make[2]: Leaving directory '/usr/src/RPM/BUILD/wsjtx-2.0.0/wsjtx/BUILD'
make[2]: Entering directory '/usr/src/RPM/BUILD/wsjtx-2.0.0/wsjtx/BUILD'
[ 12%] Building Fortran object CMakeFiles/wsjt_fort.dir/lib/avecho.f90.o
make[2]: Leaving directory '/usr/src/RPM/BUILD/wsjtx-2.0.0/wsjtx/BUILD'
make[2]: Entering directory '/usr/src/RPM/BUILD/wsjtx-2.0.0/wsjtx/BUILD'
[ 13%] Building C object CMakeFiles/wsprd.dir/lib/wsprd/tab.c.o
make[2]: Leaving directory '/usr/src/RPM/BUILD/wsjtx-2.0.0/wsjtx/BUILD'
make[2]: Entering directory '/usr/src/RPM/BUILD/wsjtx-2.0.0/wsjtx/BUILD'
[ 13%] Building Fortran object CMakeFiles/wsjt_fort.dir/lib/ft8/baseline.f90.o
make[2]: Leaving directory '/usr/src/RPM/BUILD/wsjtx-2.0.0/wsjtx/BUILD'
make[2]: Entering directory '/usr/src/RPM/BUILD/wsjtx-2.0.0/wsjtx/BUILD'
[ 13%] Building C object CMakeFiles/wsjt_cxx.dir/lib/qra/qracodes/pdmath.c.o
make[2]: Leaving directory '/usr/src/RPM/BUILD/wsjtx-2.0.0/wsjtx/BUILD'
make[2]: Entering directory '/usr/src/RPM/BUILD/wsjtx-2.0.0/wsjtx/BUILD'
[ 14%] Building C object CMakeFiles/wsprd.dir/lib/wsprd/nhash.c.o
/usr/src/RPM/BUILD/wsjtx-2.0.0/wsjtx/lib/wsprd/nhash.c: In function 'nhash':
/usr/src/RPM/BUILD/wsjtx-2.0.0/wsjtx/lib/wsprd/nhash.c:351:15: warning: this statement may fall through [-Wimplicit-fallthrough=]
  351 |     case 12: c+=((uint32_t)k[11])<<24;
      |              ~^~~~~~~~~~~~~~~~~~~~~~~
/usr/src/RPM/BUILD/wsjtx-2.0.0/wsjtx/lib/wsprd/nhash.c:352:5: note: here
  352 |     case 11: c+=((uint32_t)k[10])<<16;
      |     ^~~~
/usr/src/RPM/BUILD/wsjtx-2.0.0/wsjtx/lib/wsprd/nhash.c:352:15: warning: this statement may fall through [-Wimplicit-fallthrough=]
  352 |     case 11: c+=((uint32_t)k[10])<<16;
      |              ~^~~~~~~~~~~~~~~~~~~~~~~
/usr/src/RPM/BUILD/wsjtx-2.0.0/wsjtx/lib/wsprd/nhash.c:353:5: note: here
  353 |     case 10: c+=((uint32_t)k[9])<<8;
      |     ^~~~
/usr/src/RPM/BUILD/wsjtx-2.0.0/wsjtx/lib/wsprd/nhash.c:353:15: warning: this statement may fall through [-Wimplicit-fallthrough=]
  353 |     case 10: c+=((uint32_t)k[9])<<8;
      |              ~^~~~~~~~~~~~~~~~~~~~~
/usr/src/RPM/BUILD/wsjtx-2.0.0/wsjtx/lib/wsprd/nhash.c:354:5: note: here
  354 |     case 9 : c+=k[8];
      |     ^~~~
/usr/src/RPM/BUILD/wsjtx-2.0.0/wsjtx/lib/wsprd/nhash.c:354:15: warning: this statement may fall through [-Wimplicit-fallthrough=]
  354 |     case 9 : c+=k[8];
      |              ~^~~~~~
/usr/src/RPM/BUILD/wsjtx-2.0.0/wsjtx/lib/wsprd/nhash.c:355:5: note: here
  355 |     case 8 : b+=((uint32_t)k[7])<<24;
      |     ^~~~
/usr/src/RPM/BUILD/wsjtx-2.0.0/wsjtx/lib/wsprd/nhash.c:355:15: warning: this statement may fall through [-Wimplicit-fallthrough=]
  355 |     case 8 : b+=((uint32_t)k[7])<<24;
      |              ~^~~~~~~~~~~~~~~~~~~~~~
/usr/src/RPM/BUILD/wsjtx-2.0.0/wsjtx/lib/wsprd/nhash.c:356:5: note: here
  356 |     case 7 : b+=((uint32_t)k[6])<<16;
      |     ^~~~
/usr/src/RPM/BUILD/wsjtx-2.0.0/wsjtx/lib/wsprd/nhash.c:356:15: warning: this statement may fall through [-Wimplicit-fallthrough=]
  356 |     case 7 : b+=((uint32_t)k[6])<<16;
      |              ~^~~~~~~~~~~~~~~~~~~~~~
/usr/src/RPM/BUILD/wsjtx-2.0.0/wsjtx/lib/wsprd/nhash.c:357:5: note: here
  357 |     case 6 : b+=((uint32_t)k[5])<<8;
      |     ^~~~
/usr/src/RPM/BUILD/wsjtx-2.0.0/wsjtx/lib/wsprd/nhash.c:357:15: warning: this statement may fall through [-Wimplicit-fallthrough=]
  357 |     case 6 : b+=((uint32_t)k[5])<<8;
      |              ~^~~~~~~~~~~~~~~~~~~~~
/usr/src/RPM/BUILD/wsjtx-2.0.0/wsjtx/lib/wsprd/nhash.c:358:5: note: here
  358 |     case 5 : b+=k[4];
      |     ^~~~
/usr/src/RPM/BUILD/wsjtx-2.0.0/wsjtx/lib/wsprd/nhash.c:358:15: warning: this statement may fall through [-Wimplicit-fallthrough=]
  358 |     case 5 : b+=k[4];
      |              ~^~~~~~
/usr/src/RPM/BUILD/wsjtx-2.0.0/wsjtx/lib/wsprd/nhash.c:359:5: note: here
  359 |     case 4 : a+=((uint32_t)k[3])<<24;
      |     ^~~~
/usr/src/RPM/BUILD/wsjtx-2.0.0/wsjtx/lib/wsprd/nhash.c:359:15: warning: this statement may fall through [-Wimplicit-fallthrough=]
  359 |     case 4 : a+=((uint32_t)k[3])<<24;
      |              ~^~~~~~~~~~~~~~~~~~~~~~
/usr/src/RPM/BUILD/wsjtx-2.0.0/wsjtx/lib/wsprd/nhash.c:360:5: note: here
  360 |     case 3 : a+=((uint32_t)k[2])<<16;
      |     ^~~~
/usr/src/RPM/BUILD/wsjtx-2.0.0/wsjtx/lib/wsprd/nhash.c:360:15: warning: this statement may fall through [-Wimplicit-fallthrough=]
  360 |     case 3 : a+=((uint32_t)k[2])<<16;
      |              ~^~~~~~~~~~~~~~~~~~~~~~
/usr/src/RPM/BUILD/wsjtx-2.0.0/wsjtx/lib/wsprd/nhash.c:361:5: note: here
  361 |     case 2 : a+=((uint32_t)k[1])<<8;
      |     ^~~~
/usr/src/RPM/BUILD/wsjtx-2.0.0/wsjtx/lib/wsprd/nhash.c:361:15: warning: this statement may fall through [-Wimplicit-fallthrough=]
  361 |     case 2 : a+=((uint32_t)k[1])<<8;
      |              ~^~~~~~~~~~~~~~~~~~~~~
/usr/src/RPM/BUILD/wsjtx-2.0.0/wsjtx/lib/wsprd/nhash.c:362:5: note: here
  362 |     case 1 : a+=k[0];
      |     ^~~~
make[2]: Leaving directory '/usr/src/RPM/BUILD/wsjtx-2.0.0/wsjtx/BUILD'
make[2]: Entering directory '/usr/src/RPM/BUILD/wsjtx-2.0.0/wsjtx/BUILD'
[ 13%] Building Fortran object CMakeFiles/wsjt_fort_omp.dir/lib/options.f90.o
make[2]: Leaving directory '/usr/src/RPM/BUILD/wsjtx-2.0.0/wsjtx/BUILD'
make[2]: Entering directory '/usr/src/RPM/BUILD/wsjtx-2.0.0/wsjtx/BUILD'
[ 15%] Building Fortran object CMakeFiles/wsjt_fort_omp.dir/lib/prog_args.f90.o
make[2]: Leaving directory '/usr/src/RPM/BUILD/wsjtx-2.0.0/wsjtx/BUILD'
make[2]: Entering directory '/usr/src/RPM/BUILD/wsjtx-2.0.0/wsjtx/BUILD'
[ 14%] Building C object CMakeFiles/wsjt_cxx.dir/lib/qra/qracodes/qra12_63_64_irr_b.c.o
make[2]: Leaving directory '/usr/src/RPM/BUILD/wsjtx-2.0.0/wsjtx/BUILD'
make[2]: Entering directory '/usr/src/RPM/BUILD/wsjtx-2.0.0/wsjtx/BUILD'
[ 15%] Building Fortran object CMakeFiles/wsjt_fort_omp.dir/lib/readwav.f90.o
make[2]: Leaving directory '/usr/src/RPM/BUILD/wsjtx-2.0.0/wsjtx/BUILD'
make[2]: Entering directory '/usr/src/RPM/BUILD/wsjtx-2.0.0/wsjtx/BUILD'
[ 15%] Building C object CMakeFiles/wsjt_cxx.dir/lib/qra/qracodes/qra13_64_64_irr_e.c.o
make[2]: Leaving directory '/usr/src/RPM/BUILD/wsjtx-2.0.0/wsjtx/BUILD'
make[2]: Entering directory '/usr/src/RPM/BUILD/wsjtx-2.0.0/wsjtx/BUILD'
[ 14%] Building Fortran object CMakeFiles/wsjt_fort.dir/lib/baddata.f90.o
make[2]: Leaving directory '/usr/src/RPM/BUILD/wsjtx-2.0.0/wsjtx/BUILD'
make[2]: Entering directory '/usr/src/RPM/BUILD/wsjtx-2.0.0/wsjtx/BUILD'
[ 14%] Building C object CMakeFiles/wsprd.dir/lib/init_random_seed.c.o
make[2]: Leaving directory '/usr/src/RPM/BUILD/wsjtx-2.0.0/wsjtx/BUILD'
make[2]: Entering directory '/usr/src/RPM/BUILD/wsjtx-2.0.0/wsjtx/BUILD'
[ 13%] Building Fortran object CMakeFiles/wsjt_fort.dir/lib/bpdecode40.f90.o
make[2]: Leaving directory '/usr/src/RPM/BUILD/wsjtx-2.0.0/wsjtx/BUILD'
make[2]: Entering directory '/usr/src/RPM/BUILD/wsjtx-2.0.0/wsjtx/BUILD'
[  8%] Building CXX object CMakeFiles/wsjt_qtmm.dir/Audio/BWFFile.cpp.o
/usr/src/RPM/BUILD/wsjtx-2.0.0/wsjtx/Audio/BWFFile.cpp: In member function 'bool BWFFile::impl::update_header()':
/usr/src/RPM/BUILD/wsjtx-2.0.0/wsjtx/Audio/BWFFile.cpp:356:30: warning: this statement may fall through [-Wimplicit-fallthrough=]
  356 |               data->version_ = qToBigEndian<quint32> (data->version_);
      |               ~~~~~~~~~~~~~~~^~~~~~~~~~~~~~~~~~~~~~~~~~~~~~~~~~~~~~~~
/usr/src/RPM/BUILD/wsjtx-2.0.0/wsjtx/Audio/BWFFile.cpp:357:13: note: here
  357 |             default:
      |             ^~~~~~~
/usr/src/RPM/BUILD/wsjtx-2.0.0/wsjtx/Audio/BWFFile.cpp:372:30: warning: this statement may fall through [-Wimplicit-fallthrough=]
  372 |               data->version_ = qToLittleEndian<quint32> (data->version_);
      |               ~~~~~~~~~~~~~~~^~~~~~~~~~~~~~~~~~~~~~~~~~~~~~~~~~~~~~~~~~~
/usr/src/RPM/BUILD/wsjtx-2.0.0/wsjtx/Audio/BWFFile.cpp:373:13: note: here
  373 |             default:
      |             ^~~~~~~
In file included from /usr/include/string.h:507,
                 from /usr/include/qt5/QtCore/qarraydata.h:44,
                 from /usr/include/qt5/QtCore/qbytearray.h:46,
                 from /usr/include/qt5/QtCore/qstring.h:49,
                 from /usr/include/qt5/QtCore/qobject.h:47,
                 from /usr/include/qt5/QtCore/qiodevice.h:45,
                 from /usr/include/qt5/QtCore/qfiledevice.h:43,
                 from /usr/include/qt5/QtCore/qfile.h:44,
                 from /usr/include/qt5/QtCore/QFile:1,
                 from /usr/src/RPM/BUILD/wsjtx-2.0.0/wsjtx/Audio/BWFFile.hpp:6,
                 from /usr/src/RPM/BUILD/wsjtx-2.0.0/wsjtx/Audio/BWFFile.cpp:1:
In function 'char* strncpy(char*, const char*, size_t)',
    inlined from '{anonymous}::BroadcastAudioExtension::BroadcastAudioExtension({anonymous}::BroadcastAudioExtension::Version)' at /usr/src/RPM/BUILD/wsjtx-2.0.0/wsjtx/Audio/BWFFile.cpp:89:20,
    inlined from '{anonymous}::BroadcastAudioExtension* BWFFile::impl::bext()' at /usr/src/RPM/BUILD/wsjtx-2.0.0/wsjtx/Audio/BWFFile.cpp:174:54:
/usr/include/bits/string_fortified.h:106:34: warning: 'char* __builtin_strncpy(char*, const char*, long unsigned int)' specified bound 10 equals destination size [-Wstringop-truncation]
  106 |   return __builtin___strncpy_chk (__dest, __src, __len, __bos (__dest));
      |          ~~~~~~~~~~~~~~~~~~~~~~~~^~~~~~~~~~~~~~~~~~~~~~~~~~~~~~~~~~~~~~
In function 'char* strncpy(char*, const char*, size_t)',
    inlined from '{anonymous}::BroadcastAudioExtension::BroadcastAudioExtension({anonymous}::BroadcastAudioExtension::Version)' at /usr/src/RPM/BUILD/wsjtx-2.0.0/wsjtx/Audio/BWFFile.cpp:92:20,
    inlined from '{anonymous}::BroadcastAudioExtension* BWFFile::impl::bext()' at /usr/src/RPM/BUILD/wsjtx-2.0.0/wsjtx/Audio/BWFFile.cpp:174:54:
/usr/include/bits/string_fortified.h:106:34: warning: 'char* __builtin_strncpy(char*, const char*, long unsigned int)' specified bound 10 equals destination size [-Wstringop-truncation]
  106 |   return __builtin___strncpy_chk (__dest, __src, __len, __bos (__dest));
      |          ~~~~~~~~~~~~~~~~~~~~~~~~^~~~~~~~~~~~~~~~~~~~~~~~~~~~~~~~~~~~~~
In function 'char* strncpy(char*, const char*, size_t)',
    inlined from 'void BWFFile::bext_description(const QByteArray&)' at /usr/src/RPM/BUILD/wsjtx-2.0.0/wsjtx/Audio/BWFFile.cpp:689:16:
/usr/include/bits/string_fortified.h:106:34: warning: 'char* __builtin_strncpy(char*, const char*, long unsigned int)' specified bound 256 equals destination size [-Wstringop-truncation]
  106 |   return __builtin___strncpy_chk (__dest, __src, __len, __bos (__dest));
      |          ~~~~~~~~~~~~~~~~~~~~~~~~^~~~~~~~~~~~~~~~~~~~~~~~~~~~~~~~~~~~~~
In function 'char* strncpy(char*, const char*, size_t)',
    inlined from 'void BWFFile::bext_originator(const QByteArray&)' at /usr/src/RPM/BUILD/wsjtx-2.0.0/wsjtx/Audio/BWFFile.cpp:701:16:
/usr/include/bits/string_fortified.h:106:34: warning: 'char* __builtin_strncpy(char*, const char*, long unsigned int)' specified bound 32 equals destination size [-Wstringop-truncation]
  106 |   return __builtin___strncpy_chk (__dest, __src, __len, __bos (__dest));
      |          ~~~~~~~~~~~~~~~~~~~~~~~~^~~~~~~~~~~~~~~~~~~~~~~~~~~~~~~~~~~~~~
In function 'char* strncpy(char*, const char*, size_t)',
    inlined from 'void BWFFile::bext_originator_reference(const QByteArray&)' at /usr/src/RPM/BUILD/wsjtx-2.0.0/wsjtx/Audio/BWFFile.cpp:713:16:
/usr/include/bits/string_fortified.h:106:34: warning: 'char* __builtin_strncpy(char*, const char*, long unsigned int)' specified bound 32 equals destination size [-Wstringop-truncation]
  106 |   return __builtin___strncpy_chk (__dest, __src, __len, __bos (__dest));
      |          ~~~~~~~~~~~~~~~~~~~~~~~~^~~~~~~~~~~~~~~~~~~~~~~~~~~~~~~~~~~~~~
In function 'char* strncpy(char*, const char*, size_t)',
    inlined from 'void BWFFile::bext_origination_date_time(const QDateTime&)' at /usr/src/RPM/BUILD/wsjtx-2.0.0/wsjtx/Audio/BWFFile.cpp:726:16:
/usr/include/bits/string_fortified.h:106:34: warning: 'char* __builtin_strncpy(char*, const char*, long unsigned int)' specified bound 10 equals destination size [-Wstringop-truncation]
  106 |   return __builtin___strncpy_chk (__dest, __src, __len, __bos (__dest));
      |          ~~~~~~~~~~~~~~~~~~~~~~~~^~~~~~~~~~~~~~~~~~~~~~~~~~~~~~~~~~~~~~
In function 'char* strncpy(char*, const char*, size_t)',
    inlined from 'void BWFFile::bext_origination_date_time(const QDateTime&)' at /usr/src/RPM/BUILD/wsjtx-2.0.0/wsjtx/Audio/BWFFile.cpp:729:16:
/usr/include/bits/string_fortified.h:106:34: warning: 'char* __builtin_strncpy(char*, const char*, long unsigned int)' specified bound 10 equals destination size [-Wstringop-truncation]
  106 |   return __builtin___strncpy_chk (__dest, __src, __len, __bos (__dest));
      |          ~~~~~~~~~~~~~~~~~~~~~~~~^~~~~~~~~~~~~~~~~~~~~~~~~~~~~~~~~~~~~~
make[2]: Leaving directory '/usr/src/RPM/BUILD/wsjtx-2.0.0/wsjtx/BUILD'
make[2]: Entering directory '/usr/src/RPM/BUILD/wsjtx-2.0.0/wsjtx/BUILD'
[ 15%] Building Fortran object CMakeFiles/wsjt_fort_omp.dir/lib/wavhdr.f90.o
make[2]: Leaving directory '/usr/src/RPM/BUILD/wsjtx-2.0.0/wsjtx/BUILD'
make[2]: Entering directory '/usr/src/RPM/BUILD/wsjtx-2.0.0/wsjtx/BUILD'
[ 16%] Linking CXX static library libwsjt_qtmm.a
make[2]: Leaving directory '/usr/src/RPM/BUILD/wsjtx-2.0.0/wsjtx/BUILD'
make[1]: Entering directory '/usr/src/RPM/BUILD/wsjtx-2.0.0/wsjtx/BUILD'
[ 16%] Built target wsjt_qtmm
make[1]: Leaving directory '/usr/src/RPM/BUILD/wsjtx-2.0.0/wsjtx/BUILD'
make[2]: Entering directory '/usr/src/RPM/BUILD/wsjtx-2.0.0/wsjtx/BUILD'
[ 16%] Building CXX object CMakeFiles/wsjt_fort_omp.dir/wsjt_fort_omp_autogen/mocs_compilation.cpp.o
make[2]: Leaving directory '/usr/src/RPM/BUILD/wsjtx-2.0.0/wsjtx/BUILD'
make[2]: Entering directory '/usr/src/RPM/BUILD/wsjtx-2.0.0/wsjtx/BUILD'
[ 16%] Building Fortran object CMakeFiles/wsjt_fort.dir/lib/ccf2.f90.o
make[2]: Leaving directory '/usr/src/RPM/BUILD/wsjtx-2.0.0/wsjtx/BUILD'
make[2]: Entering directory '/usr/src/RPM/BUILD/wsjtx-2.0.0/wsjtx/BUILD'
[ 15%] Building C object CMakeFiles/wsjt_cxx.dir/lib/qra/qracodes/qracodes.c.o
make[2]: Leaving directory '/usr/src/RPM/BUILD/wsjtx-2.0.0/wsjtx/BUILD'
make[2]: Entering directory '/usr/src/RPM/BUILD/wsjtx-2.0.0/wsjtx/BUILD'
[ 16%] Building Fortran object CMakeFiles/wsjt_fort.dir/lib/ccf65.f90.o
make[2]: Leaving directory '/usr/src/RPM/BUILD/wsjtx-2.0.0/wsjtx/BUILD'
make[2]: Entering directory '/usr/src/RPM/BUILD/wsjtx-2.0.0/wsjtx/BUILD'
[ 17%] Building C object CMakeFiles/wsjt_cxx.dir/lib/qra/qracodes/normrnd.c.o
make[2]: Leaving directory '/usr/src/RPM/BUILD/wsjtx-2.0.0/wsjtx/BUILD'
make[2]: Entering directory '/usr/src/RPM/BUILD/wsjtx-2.0.0/wsjtx/BUILD'
[ 15%] Building Fortran object CMakeFiles/wsjt_fort.dir/lib/calibrate.f90.o
make[2]: Leaving directory '/usr/src/RPM/BUILD/wsjtx-2.0.0/wsjtx/BUILD'
make[2]: Entering directory '/usr/src/RPM/BUILD/wsjtx-2.0.0/wsjtx/BUILD'
[ 17%] Building Fortran object CMakeFiles/wsjt_fort.dir/lib/chkhist.f90.o
make[2]: Leaving directory '/usr/src/RPM/BUILD/wsjtx-2.0.0/wsjtx/BUILD'
make[2]: Entering directory '/usr/src/RPM/BUILD/wsjtx-2.0.0/wsjtx/BUILD'
[ 17%] Building Fortran object CMakeFiles/wsjt_fort.dir/lib/chkcall.f90.o
make[2]: Leaving directory '/usr/src/RPM/BUILD/wsjtx-2.0.0/wsjtx/BUILD'
make[2]: Entering directory '/usr/src/RPM/BUILD/wsjtx-2.0.0/wsjtx/BUILD'
Scanning dependencies of target qcp
make[2]: Leaving directory '/usr/src/RPM/BUILD/wsjtx-2.0.0/wsjtx/BUILD'
make[2]: Entering directory '/usr/src/RPM/BUILD/wsjtx-2.0.0/wsjtx/BUILD'
[ 16%] Building Fortran object CMakeFiles/wsprd.dir/lib/indexx.f90.o
make[2]: Leaving directory '/usr/src/RPM/BUILD/wsjtx-2.0.0/wsjtx/BUILD'
make[2]: Entering directory '/usr/src/RPM/BUILD/wsjtx-2.0.0/wsjtx/BUILD'
[ 16%] Building Fortran object CMakeFiles/wsjt_fort_omp.dir/lib/addit.f90.o
make[2]: Leaving directory '/usr/src/RPM/BUILD/wsjtx-2.0.0/wsjtx/BUILD'
make[2]: Entering directory '/usr/src/RPM/BUILD/wsjtx-2.0.0/wsjtx/BUILD'
[ 17%] Building Fortran object CMakeFiles/wsjt_fort.dir/lib/chkmsg.f90.o
make[2]: Leaving directory '/usr/src/RPM/BUILD/wsjtx-2.0.0/wsjtx/BUILD'
make[2]: Entering directory '/usr/src/RPM/BUILD/wsjtx-2.0.0/wsjtx/BUILD'
[ 18%] Building Fortran object CMakeFiles/wsjt_fort.dir/lib/chkss2.f90.o
make[2]: Leaving directory '/usr/src/RPM/BUILD/wsjtx-2.0.0/wsjtx/BUILD'
make[2]: Entering directory '/usr/src/RPM/BUILD/wsjtx-2.0.0/wsjtx/BUILD'
[ 17%] Building CXX object CMakeFiles/wsjt_cxx.dir/lib/crc10.cpp.o
make[2]: Leaving directory '/usr/src/RPM/BUILD/wsjtx-2.0.0/wsjtx/BUILD'
make[2]: Entering directory '/usr/src/RPM/BUILD/wsjtx-2.0.0/wsjtx/BUILD'
[ 19%] Building Fortran object CMakeFiles/wsjt_fort.dir/lib/ft8/compress.f90.o
make[2]: Leaving directory '/usr/src/RPM/BUILD/wsjtx-2.0.0/wsjtx/BUILD'
make[2]: Entering directory '/usr/src/RPM/BUILD/wsjtx-2.0.0/wsjtx/BUILD'
[ 19%] Building Fortran object CMakeFiles/wsjt_fort_omp.dir/lib/afc65b.f90.o
/usr/src/RPM/BUILD/wsjtx-2.0.0/wsjtx/lib/afc65b.f90:40:0:

   40 |   a(2)=a2
      | 
Warning: 'a2' may be used uninitialized in this function [-Wmaybe-uninitialized]
/usr/src/RPM/BUILD/wsjtx-2.0.0/wsjtx/lib/afc65b.f90:39:0:

   39 |   a(1)=a1
      | 
Warning: 'a1' may be used uninitialized in this function [-Wmaybe-uninitialized]
make[2]: Leaving directory '/usr/src/RPM/BUILD/wsjtx-2.0.0/wsjtx/BUILD'
make[2]: Entering directory '/usr/src/RPM/BUILD/wsjtx-2.0.0/wsjtx/BUILD'
[ 10%] Generating man/man1/wsprd.1.gz
make[2]: Leaving directory '/usr/src/RPM/BUILD/wsjtx-2.0.0/wsjtx/BUILD'
make[2]: Entering directory '/usr/src/RPM/BUILD/wsjtx-2.0.0/wsjtx/BUILD'
[ 19%] Building CXX object CMakeFiles/wsjt_cxx.dir/lib/crc13.cpp.o
make[2]: Leaving directory '/usr/src/RPM/BUILD/wsjtx-2.0.0/wsjtx/BUILD'
make[2]: Entering directory '/usr/src/RPM/BUILD/wsjtx-2.0.0/wsjtx/BUILD'
[ 19%] Building Fortran object CMakeFiles/wsjt_fort.dir/lib/coord.f90.o
make[2]: Leaving directory '/usr/src/RPM/BUILD/wsjtx-2.0.0/wsjtx/BUILD'
make[2]: Entering directory '/usr/src/RPM/BUILD/wsjtx-2.0.0/wsjtx/BUILD'
[ 19%] Building Fortran object CMakeFiles/wsjt_fort_omp.dir/lib/afc9.f90.o
make[2]: Leaving directory '/usr/src/RPM/BUILD/wsjtx-2.0.0/wsjtx/BUILD'
make[2]: Entering directory '/usr/src/RPM/BUILD/wsjtx-2.0.0/wsjtx/BUILD'
[ 19%] Building Fortran object CMakeFiles/wsjt_fort.dir/lib/db.f90.o
make[2]: Leaving directory '/usr/src/RPM/BUILD/wsjtx-2.0.0/wsjtx/BUILD'
make[2]: Entering directory '/usr/src/RPM/BUILD/wsjtx-2.0.0/wsjtx/BUILD'
[ 20%] Building Fortran object CMakeFiles/wsjt_fort.dir/lib/decode9w.f90.o
make[2]: Leaving directory '/usr/src/RPM/BUILD/wsjtx-2.0.0/wsjtx/BUILD'
make[2]: Entering directory '/usr/src/RPM/BUILD/wsjtx-2.0.0/wsjtx/BUILD'
[ 20%] Building Fortran object CMakeFiles/wsjt_fort.dir/lib/deg2grid.f90.o
make[2]: Leaving directory '/usr/src/RPM/BUILD/wsjtx-2.0.0/wsjtx/BUILD'
make[2]: Entering directory '/usr/src/RPM/BUILD/wsjtx-2.0.0/wsjtx/BUILD'
[ 20%] Building Fortran object CMakeFiles/wsjt_fort.dir/lib/degrade_snr.f90.o
make[2]: Leaving directory '/usr/src/RPM/BUILD/wsjtx-2.0.0/wsjtx/BUILD'
make[2]: Entering directory '/usr/src/RPM/BUILD/wsjtx-2.0.0/wsjtx/BUILD'
[ 19%] Building Fortran object CMakeFiles/wsjt_fort_omp.dir/lib/ana932.f90.o
make[2]: Leaving directory '/usr/src/RPM/BUILD/wsjtx-2.0.0/wsjtx/BUILD'
make[2]: Entering directory '/usr/src/RPM/BUILD/wsjtx-2.0.0/wsjtx/BUILD'
[ 20%] Building Fortran object CMakeFiles/wsjt_fort.dir/lib/demod64a.f90.o
make[2]: Leaving directory '/usr/src/RPM/BUILD/wsjtx-2.0.0/wsjtx/BUILD'
make[2]: Entering directory '/usr/src/RPM/BUILD/wsjtx-2.0.0/wsjtx/BUILD'
[ 19%] Building CXX object CMakeFiles/wsjt_cxx.dir/lib/crc14.cpp.o
make[2]: Leaving directory '/usr/src/RPM/BUILD/wsjtx-2.0.0/wsjtx/BUILD'
make[2]: Entering directory '/usr/src/RPM/BUILD/wsjtx-2.0.0/wsjtx/BUILD'
[ 20%] Linking CXX static library libwsjt_cxx.a
make[2]: Leaving directory '/usr/src/RPM/BUILD/wsjtx-2.0.0/wsjtx/BUILD'
make[1]: Entering directory '/usr/src/RPM/BUILD/wsjtx-2.0.0/wsjtx/BUILD'
[ 20%] Built target wsjt_cxx
make[1]: Leaving directory '/usr/src/RPM/BUILD/wsjtx-2.0.0/wsjtx/BUILD'
make[2]: Entering directory '/usr/src/RPM/BUILD/wsjtx-2.0.0/wsjtx/BUILD'
[ 20%] Building Fortran object CMakeFiles/wsjt_fort.dir/lib/encode232.f90.o
make[2]: Leaving directory '/usr/src/RPM/BUILD/wsjtx-2.0.0/wsjtx/BUILD'
make[2]: Entering directory '/usr/src/RPM/BUILD/wsjtx-2.0.0/wsjtx/BUILD'
[ 20%] Building Fortran object CMakeFiles/wsjt_fort.dir/lib/encode_msk40.f90.o
make[2]: Leaving directory '/usr/src/RPM/BUILD/wsjtx-2.0.0/wsjtx/BUILD'
make[2]: Entering directory '/usr/src/RPM/BUILD/wsjtx-2.0.0/wsjtx/BUILD'
[ 20%] Building Fortran object CMakeFiles/wsjt_fort.dir/lib/determ.f90.o
make[2]: Leaving directory '/usr/src/RPM/BUILD/wsjtx-2.0.0/wsjtx/BUILD'
make[2]: Entering directory '/usr/src/RPM/BUILD/wsjtx-2.0.0/wsjtx/BUILD'
[ 20%] Building Fortran object CMakeFiles/wsjt_fort_omp.dir/lib/analytic.f90.o
make[2]: Leaving directory '/usr/src/RPM/BUILD/wsjtx-2.0.0/wsjtx/BUILD'
make[2]: Entering directory '/usr/src/RPM/BUILD/wsjtx-2.0.0/wsjtx/BUILD'
[ 21%] Building Fortran object CMakeFiles/wsjt_fort.dir/lib/entail.f90.o
make[2]: Leaving directory '/usr/src/RPM/BUILD/wsjtx-2.0.0/wsjtx/BUILD'
make[2]: Entering directory '/usr/src/RPM/BUILD/wsjtx-2.0.0/wsjtx/BUILD'
[ 20%] Building Fortran object CMakeFiles/wsjt_fort.dir/lib/ft8/encode174.f90.o
make[2]: Leaving directory '/usr/src/RPM/BUILD/wsjtx-2.0.0/wsjtx/BUILD'
make[2]: Entering directory '/usr/src/RPM/BUILD/wsjtx-2.0.0/wsjtx/BUILD'
[ 21%] Building Fortran object CMakeFiles/wsjt_fort_omp.dir/lib/astro.f90.o
make[2]: Leaving directory '/usr/src/RPM/BUILD/wsjtx-2.0.0/wsjtx/BUILD'
make[2]: Entering directory '/usr/src/RPM/BUILD/wsjtx-2.0.0/wsjtx/BUILD'
[ 21%] Building Fortran object CMakeFiles/wsjt_fort_omp.dir/lib/astrosub.f90.o
make[2]: Leaving directory '/usr/src/RPM/BUILD/wsjtx-2.0.0/wsjtx/BUILD'
make[2]: Entering directory '/usr/src/RPM/BUILD/wsjtx-2.0.0/wsjtx/BUILD'
[ 21%] Building Fortran object CMakeFiles/wsjt_fort.dir/lib/ephem.f90.o
make[2]: Leaving directory '/usr/src/RPM/BUILD/wsjtx-2.0.0/wsjtx/BUILD'
make[2]: Entering directory '/usr/src/RPM/BUILD/wsjtx-2.0.0/wsjtx/BUILD'
[ 21%] Building Fortran object CMakeFiles/wsjt_fort_omp.dir/lib/astro0.f90.o
make[2]: Leaving directory '/usr/src/RPM/BUILD/wsjtx-2.0.0/wsjtx/BUILD'
make[2]: Entering directory '/usr/src/RPM/BUILD/wsjtx-2.0.0/wsjtx/BUILD'
[ 21%] Building Fortran object CMakeFiles/wsjt_fort.dir/lib/fano232.f90.o
/usr/src/RPM/BUILD/wsjtx-2.0.0/wsjtx/lib/fano232.f90:9:23:

    9 |   parameter (MAXBYTES=(MAXBITS+7)/8)
      |                       1
Warning: Integer division truncated to constant '13' at (1) [-Winteger-division]
make[2]: Leaving directory '/usr/src/RPM/BUILD/wsjtx-2.0.0/wsjtx/BUILD'
make[2]: Entering directory '/usr/src/RPM/BUILD/wsjtx-2.0.0/wsjtx/BUILD'
[ 23%] Building Fortran object CMakeFiles/wsjt_fort.dir/lib/fast_decode.f90.o
make[2]: Leaving directory '/usr/src/RPM/BUILD/wsjtx-2.0.0/wsjtx/BUILD'
make[2]: Entering directory '/usr/src/RPM/BUILD/wsjtx-2.0.0/wsjtx/BUILD'
[ 22%] Building Fortran object CMakeFiles/wsjt_fort.dir/lib/fast9.f90.o
make[2]: Leaving directory '/usr/src/RPM/BUILD/wsjtx-2.0.0/wsjtx/BUILD'
make[2]: Entering directory '/usr/src/RPM/BUILD/wsjtx-2.0.0/wsjtx/BUILD'
[ 23%] Building Fortran object CMakeFiles/wsjt_fort.dir/lib/fchisq.f90.o
make[2]: Leaving directory '/usr/src/RPM/BUILD/wsjtx-2.0.0/wsjtx/BUILD'
make[2]: Entering directory '/usr/src/RPM/BUILD/wsjtx-2.0.0/wsjtx/BUILD'
[ 23%] Building Fortran object CMakeFiles/wsjt_fort_omp.dir/lib/avecho.f90.o
make[2]: Leaving directory '/usr/src/RPM/BUILD/wsjtx-2.0.0/wsjtx/BUILD'
make[2]: Entering directory '/usr/src/RPM/BUILD/wsjtx-2.0.0/wsjtx/BUILD'
[ 23%] Building Fortran object CMakeFiles/wsjt_fort.dir/lib/fil3.f90.o
/usr/src/RPM/BUILD/wsjtx-2.0.0/wsjtx/lib/fil3.f90:21:21:

   21 |   parameter (NH=NTAPS/2)
      |                     1
Warning: Integer division truncated to constant '56' at (1) [-Winteger-division]
make[2]: Leaving directory '/usr/src/RPM/BUILD/wsjtx-2.0.0/wsjtx/BUILD'
make[2]: Entering directory '/usr/src/RPM/BUILD/wsjtx-2.0.0/wsjtx/BUILD'
[ 23%] Building Fortran object CMakeFiles/wsjt_fort.dir/lib/fchisq0.f90.o
make[2]: Leaving directory '/usr/src/RPM/BUILD/wsjtx-2.0.0/wsjtx/BUILD'
make[2]: Entering directory '/usr/src/RPM/BUILD/wsjtx-2.0.0/wsjtx/BUILD'
[ 23%] Building Fortran object CMakeFiles/wsjt_fort.dir/lib/fil3c.f90.o
/usr/src/RPM/BUILD/wsjtx-2.0.0/wsjtx/lib/fil3c.f90:18:21:

   18 |   parameter (NH=NTAPS/2)
      |                     1
Warning: Integer division truncated to constant '56' at (1) [-Winteger-division]
make[2]: Leaving directory '/usr/src/RPM/BUILD/wsjtx-2.0.0/wsjtx/BUILD'
make[2]: Entering directory '/usr/src/RPM/BUILD/wsjtx-2.0.0/wsjtx/BUILD'
[ 24%] Building Fortran object CMakeFiles/wsjt_fort.dir/lib/fil6521.f90.o
/usr/src/RPM/BUILD/wsjtx-2.0.0/wsjtx/lib/fil6521.f90:16:21:

   16 |   parameter (NH=NTAPS/2)
      |                     1
Warning: Integer division truncated to constant '10' at (1) [-Winteger-division]
make[2]: Leaving directory '/usr/src/RPM/BUILD/wsjtx-2.0.0/wsjtx/BUILD'
make[2]: Entering directory '/usr/src/RPM/BUILD/wsjtx-2.0.0/wsjtx/BUILD'
[ 19%] Generating man/man1/jt65code.1.gz
make[2]: Leaving directory '/usr/src/RPM/BUILD/wsjtx-2.0.0/wsjtx/BUILD'
make[2]: Entering directory '/usr/src/RPM/BUILD/wsjtx-2.0.0/wsjtx/BUILD'
[ 23%] Building Fortran object CMakeFiles/wsjt_fort_omp.dir/lib/averms.f90.o
make[2]: Leaving directory '/usr/src/RPM/BUILD/wsjtx-2.0.0/wsjtx/BUILD'
make[2]: Entering directory '/usr/src/RPM/BUILD/wsjtx-2.0.0/wsjtx/BUILD'
[ 24%] Building Fortran object CMakeFiles/wsjt_fort.dir/lib/fil4.f90.o
make[2]: Leaving directory '/usr/src/RPM/BUILD/wsjtx-2.0.0/wsjtx/BUILD'
make[2]: Entering directory '/usr/src/RPM/BUILD/wsjtx-2.0.0/wsjtx/BUILD'
[ 24%] Building Fortran object CMakeFiles/wsjt_fort.dir/lib/ft8/filt8.f90.o
make[2]: Leaving directory '/usr/src/RPM/BUILD/wsjtx-2.0.0/wsjtx/BUILD'
make[2]: Entering directory '/usr/src/RPM/BUILD/wsjtx-2.0.0/wsjtx/BUILD'
[ 25%] Building Fortran object CMakeFiles/wsjt_fort.dir/lib/fitcal.f90.o
make[2]: Leaving directory '/usr/src/RPM/BUILD/wsjtx-2.0.0/wsjtx/BUILD'
make[2]: Entering directory '/usr/src/RPM/BUILD/wsjtx-2.0.0/wsjtx/BUILD'
[ 25%] Building Fortran object CMakeFiles/wsjt_fort_omp.dir/lib/azdist.f90.o
make[2]: Leaving directory '/usr/src/RPM/BUILD/wsjtx-2.0.0/wsjtx/BUILD'
make[2]: Entering directory '/usr/src/RPM/BUILD/wsjtx-2.0.0/wsjtx/BUILD'
[ 25%] Building Fortran object CMakeFiles/wsjt_fort_omp.dir/lib/badmsg.f90.o
make[2]: Leaving directory '/usr/src/RPM/BUILD/wsjtx-2.0.0/wsjtx/BUILD'
make[2]: Entering directory '/usr/src/RPM/BUILD/wsjtx-2.0.0/wsjtx/BUILD'
[ 25%] Building Fortran object CMakeFiles/wsjt_fort.dir/lib/flat1a.f90.o
make[2]: Leaving directory '/usr/src/RPM/BUILD/wsjtx-2.0.0/wsjtx/BUILD'
make[2]: Entering directory '/usr/src/RPM/BUILD/wsjtx-2.0.0/wsjtx/BUILD'
[ 12%] Building CXX object CMakeFiles/wsjtx_udp-static.dir/RadioMetaType.cpp.o
make[2]: Leaving directory '/usr/src/RPM/BUILD/wsjtx-2.0.0/wsjtx/BUILD'
make[2]: Entering directory '/usr/src/RPM/BUILD/wsjtx-2.0.0/wsjtx/BUILD'
[ 25%] Building Fortran object CMakeFiles/wsjt_fort.dir/lib/flat1.f90.o
make[2]: Leaving directory '/usr/src/RPM/BUILD/wsjtx-2.0.0/wsjtx/BUILD'
make[2]: Entering directory '/usr/src/RPM/BUILD/wsjtx-2.0.0/wsjtx/BUILD'
[ 25%] Building Fortran object CMakeFiles/wsjt_fort_omp.dir/lib/ft8/baseline.f90.o
make[2]: Leaving directory '/usr/src/RPM/BUILD/wsjtx-2.0.0/wsjtx/BUILD'
make[2]: Entering directory '/usr/src/RPM/BUILD/wsjtx-2.0.0/wsjtx/BUILD'
[ 26%] Building Fortran object CMakeFiles/wsjt_fort.dir/lib/flat2.f90.o
make[2]: Leaving directory '/usr/src/RPM/BUILD/wsjtx-2.0.0/wsjtx/BUILD'
make[2]: Entering directory '/usr/src/RPM/BUILD/wsjtx-2.0.0/wsjtx/BUILD'
[ 26%] Building Fortran object CMakeFiles/wsjt_fort.dir/lib/flat4.f90.o
make[2]: Leaving directory '/usr/src/RPM/BUILD/wsjtx-2.0.0/wsjtx/BUILD'
make[2]: Entering directory '/usr/src/RPM/BUILD/wsjtx-2.0.0/wsjtx/BUILD'
[ 26%] Building Fortran object CMakeFiles/wsjt_fort.dir/lib/flat65.f90.o
make[2]: Leaving directory '/usr/src/RPM/BUILD/wsjtx-2.0.0/wsjtx/BUILD'
make[2]: Entering directory '/usr/src/RPM/BUILD/wsjtx-2.0.0/wsjtx/BUILD'
[ 26%] Building Fortran object CMakeFiles/wsjt_fort.dir/lib/fmtmsg.f90.o
make[2]: Leaving directory '/usr/src/RPM/BUILD/wsjtx-2.0.0/wsjtx/BUILD'
make[2]: Entering directory '/usr/src/RPM/BUILD/wsjtx-2.0.0/wsjtx/BUILD'
[ 26%] Building Fortran object CMakeFiles/wsjt_fort.dir/lib/flat1b.f90.o
make[2]: Leaving directory '/usr/src/RPM/BUILD/wsjtx-2.0.0/wsjtx/BUILD'
make[2]: Entering directory '/usr/src/RPM/BUILD/wsjtx-2.0.0/wsjtx/BUILD'
[ 26%] Building Fortran object CMakeFiles/wsjt_fort_omp.dir/lib/bpdecode40.f90.o
make[2]: Leaving directory '/usr/src/RPM/BUILD/wsjtx-2.0.0/wsjtx/BUILD'
make[2]: Entering directory '/usr/src/RPM/BUILD/wsjtx-2.0.0/wsjtx/BUILD'
[ 26%] Building Fortran object CMakeFiles/wsjt_fort_omp.dir/lib/baddata.f90.o
make[2]: Leaving directory '/usr/src/RPM/BUILD/wsjtx-2.0.0/wsjtx/BUILD'
make[2]: Entering directory '/usr/src/RPM/BUILD/wsjtx-2.0.0/wsjtx/BUILD'
[ 26%] Building Fortran object CMakeFiles/wsjt_fort.dir/lib/foldspec9f.f90.o
make[2]: Leaving directory '/usr/src/RPM/BUILD/wsjtx-2.0.0/wsjtx/BUILD'
make[2]: Entering directory '/usr/src/RPM/BUILD/wsjtx-2.0.0/wsjtx/BUILD'
[ 27%] Building Fortran object CMakeFiles/wsjt_fort.dir/lib/ft8/foxfilt.f90.o
make[2]: Leaving directory '/usr/src/RPM/BUILD/wsjtx-2.0.0/wsjtx/BUILD'
make[2]: Entering directory '/usr/src/RPM/BUILD/wsjtx-2.0.0/wsjtx/BUILD'
[ 26%] Building Fortran object CMakeFiles/wsjt_fort.dir/lib/four2a.f90.o
make[2]: Leaving directory '/usr/src/RPM/BUILD/wsjtx-2.0.0/wsjtx/BUILD'
make[2]: Entering directory '/usr/src/RPM/BUILD/wsjtx-2.0.0/wsjtx/BUILD'
[ 27%] Building Fortran object CMakeFiles/wsjt_fort.dir/lib/ft8/foxgen_wrap.f90.o
make[2]: Leaving directory '/usr/src/RPM/BUILD/wsjtx-2.0.0/wsjtx/BUILD'
make[2]: Entering directory '/usr/src/RPM/BUILD/wsjtx-2.0.0/wsjtx/BUILD'
[ 27%] Building Fortran object CMakeFiles/wsjt_fort_omp.dir/lib/calibrate.f90.o
make[2]: Leaving directory '/usr/src/RPM/BUILD/wsjtx-2.0.0/wsjtx/BUILD'
make[2]: Entering directory '/usr/src/RPM/BUILD/wsjtx-2.0.0/wsjtx/BUILD'
[ 27%] Building Fortran object CMakeFiles/wsjt_fort.dir/lib/ft8/foxgen.f90.o
make[2]: Leaving directory '/usr/src/RPM/BUILD/wsjtx-2.0.0/wsjtx/BUILD'
make[2]: Entering directory '/usr/src/RPM/BUILD/wsjtx-2.0.0/wsjtx/BUILD'
[ 18%] Building Fortran object CMakeFiles/wsprd.dir/lib/wsprd/osdwspr.f90.o
/usr/src/RPM/BUILD/wsjtx-2.0.0/wsjtx/lib/wsprd/osdwspr.f90:167:0:

  167 |                dd=d1+sum(e2sub*absrx(K+1:N))
      | 
Warning: 'd1' may be used uninitialized in this function [-Wmaybe-uninitialized]
make[2]: Leaving directory '/usr/src/RPM/BUILD/wsjtx-2.0.0/wsjtx/BUILD'
make[2]: Entering directory '/usr/src/RPM/BUILD/wsjtx-2.0.0/wsjtx/BUILD'
[ 27%] Building Fortran object CMakeFiles/wsjt_fort.dir/lib/fqso_first.f90.o
make[2]: Leaving directory '/usr/src/RPM/BUILD/wsjtx-2.0.0/wsjtx/BUILD'
make[2]: Entering directory '/usr/src/RPM/BUILD/wsjtx-2.0.0/wsjtx/BUILD'
[ 27%] Building Fortran object CMakeFiles/wsjt_fort_omp.dir/lib/ccf2.f90.o
make[2]: Leaving directory '/usr/src/RPM/BUILD/wsjtx-2.0.0/wsjtx/BUILD'
make[2]: Entering directory '/usr/src/RPM/BUILD/wsjtx-2.0.0/wsjtx/BUILD'
[ 27%] Linking CXX executable wsprd
make[2]: Leaving directory '/usr/src/RPM/BUILD/wsjtx-2.0.0/wsjtx/BUILD'
make[1]: Entering directory '/usr/src/RPM/BUILD/wsjtx-2.0.0/wsjtx/BUILD'
[ 27%] Built target wsprd
make[1]: Leaving directory '/usr/src/RPM/BUILD/wsjtx-2.0.0/wsjtx/BUILD'
make[2]: Entering directory '/usr/src/RPM/BUILD/wsjtx-2.0.0/wsjtx/BUILD'
[ 27%] Building Fortran object CMakeFiles/wsjt_fort.dir/lib/ft8/ft8_downsample.f90.o
make[2]: Leaving directory '/usr/src/RPM/BUILD/wsjtx-2.0.0/wsjtx/BUILD'
make[2]: Entering directory '/usr/src/RPM/BUILD/wsjtx-2.0.0/wsjtx/BUILD'
[ 28%] Building Fortran object CMakeFiles/wsjt_fort_omp.dir/lib/chkcall.f90.o
make[2]: Leaving directory '/usr/src/RPM/BUILD/wsjtx-2.0.0/wsjtx/BUILD'
make[2]: Entering directory '/usr/src/RPM/BUILD/wsjtx-2.0.0/wsjtx/BUILD'
[ 28%] Building Fortran object CMakeFiles/wsjt_fort.dir/lib/geniscat.f90.o
make[2]: Leaving directory '/usr/src/RPM/BUILD/wsjtx-2.0.0/wsjtx/BUILD'
make[2]: Entering directory '/usr/src/RPM/BUILD/wsjtx-2.0.0/wsjtx/BUILD'
[ 28%] Building Fortran object CMakeFiles/wsjt_fort_omp.dir/lib/chkhist.f90.o
make[2]: Leaving directory '/usr/src/RPM/BUILD/wsjtx-2.0.0/wsjtx/BUILD'
make[2]: Entering directory '/usr/src/RPM/BUILD/wsjtx-2.0.0/wsjtx/BUILD'
[ 28%] Building Fortran object CMakeFiles/wsjt_fort.dir/lib/ft8/genft8refsig.f90.o
make[2]: Leaving directory '/usr/src/RPM/BUILD/wsjtx-2.0.0/wsjtx/BUILD'
make[2]: Entering directory '/usr/src/RPM/BUILD/wsjtx-2.0.0/wsjtx/BUILD'
[ 27%] Building Fortran object CMakeFiles/wsjt_fort_omp.dir/lib/ccf65.f90.o
make[2]: Leaving directory '/usr/src/RPM/BUILD/wsjtx-2.0.0/wsjtx/BUILD'
make[2]: Entering directory '/usr/src/RPM/BUILD/wsjtx-2.0.0/wsjtx/BUILD'
[ 27%] Building Fortran object CMakeFiles/wsjt_fort.dir/lib/freqcal.f90.o
/usr/src/RPM/BUILD/wsjtx-2.0.0/wsjtx/lib/freqcal.f90:52:0:

   52 |   call peakup(s(ipk-1),s(ipk),s(ipk+1),dx)
      | 
Warning: 'ipk' may be used uninitialized in this function [-Wmaybe-uninitialized]
make[2]: Leaving directory '/usr/src/RPM/BUILD/wsjtx-2.0.0/wsjtx/BUILD'
make[2]: Entering directory '/usr/src/RPM/BUILD/wsjtx-2.0.0/wsjtx/BUILD'
[ 28%] Building Fortran object CMakeFiles/wsjt_fort_omp.dir/lib/chkmsg.f90.o
make[2]: Leaving directory '/usr/src/RPM/BUILD/wsjtx-2.0.0/wsjtx/BUILD'
make[2]: Entering directory '/usr/src/RPM/BUILD/wsjtx-2.0.0/wsjtx/BUILD'
[ 28%] Building Fortran object CMakeFiles/wsjt_fort_omp.dir/lib/chkss2.f90.o
make[2]: Leaving directory '/usr/src/RPM/BUILD/wsjtx-2.0.0/wsjtx/BUILD'
make[2]: Entering directory '/usr/src/RPM/BUILD/wsjtx-2.0.0/wsjtx/BUILD'
[ 28%] Building Fortran object CMakeFiles/wsjt_fort.dir/lib/geodist.f90.o
make[2]: Leaving directory '/usr/src/RPM/BUILD/wsjtx-2.0.0/wsjtx/BUILD'
make[2]: Entering directory '/usr/src/RPM/BUILD/wsjtx-2.0.0/wsjtx/BUILD'
[ 28%] Building Fortran object CMakeFiles/wsjt_fort_omp.dir/lib/coord.f90.o
make[2]: Leaving directory '/usr/src/RPM/BUILD/wsjtx-2.0.0/wsjtx/BUILD'
make[2]: Entering directory '/usr/src/RPM/BUILD/wsjtx-2.0.0/wsjtx/BUILD'
[ 28%] Building Fortran object CMakeFiles/wsjt_fort.dir/lib/getlags.f90.o
make[2]: Leaving directory '/usr/src/RPM/BUILD/wsjtx-2.0.0/wsjtx/BUILD'
make[2]: Entering directory '/usr/src/RPM/BUILD/wsjtx-2.0.0/wsjtx/BUILD'
[ 28%] Building Fortran object CMakeFiles/wsjt_fort_omp.dir/lib/db.f90.o
make[2]: Leaving directory '/usr/src/RPM/BUILD/wsjtx-2.0.0/wsjtx/BUILD'
make[2]: Entering directory '/usr/src/RPM/BUILD/wsjtx-2.0.0/wsjtx/BUILD'
[ 28%] Building Fortran object CMakeFiles/wsjt_fort_omp.dir/lib/ft8/compress.f90.o
make[2]: Leaving directory '/usr/src/RPM/BUILD/wsjtx-2.0.0/wsjtx/BUILD'
make[2]: Entering directory '/usr/src/RPM/BUILD/wsjtx-2.0.0/wsjtx/BUILD'
[ 28%] Building Fortran object CMakeFiles/wsjt_fort.dir/lib/genwspr.f90.o
make[2]: Leaving directory '/usr/src/RPM/BUILD/wsjtx-2.0.0/wsjtx/BUILD'
make[2]: Entering directory '/usr/src/RPM/BUILD/wsjtx-2.0.0/wsjtx/BUILD'
[ 29%] Building Fortran object CMakeFiles/wsjt_fort.dir/lib/graycode.f90.o
make[2]: Leaving directory '/usr/src/RPM/BUILD/wsjtx-2.0.0/wsjtx/BUILD'
make[2]: Entering directory '/usr/src/RPM/BUILD/wsjtx-2.0.0/wsjtx/BUILD'
[ 29%] Building Fortran object CMakeFiles/wsjt_fort.dir/lib/graycode65.f90.o
make[2]: Leaving directory '/usr/src/RPM/BUILD/wsjtx-2.0.0/wsjtx/BUILD'
make[2]: Entering directory '/usr/src/RPM/BUILD/wsjtx-2.0.0/wsjtx/BUILD'
[ 29%] Building Fortran object CMakeFiles/wsjt_fort_omp.dir/lib/deg2grid.f90.o
make[2]: Leaving directory '/usr/src/RPM/BUILD/wsjtx-2.0.0/wsjtx/BUILD'
make[2]: Entering directory '/usr/src/RPM/BUILD/wsjtx-2.0.0/wsjtx/BUILD'
[ 30%] Building Fortran object CMakeFiles/wsjt_fort_omp.dir/lib/degrade_snr.f90.o
make[2]: Leaving directory '/usr/src/RPM/BUILD/wsjtx-2.0.0/wsjtx/BUILD'
make[2]: Entering directory '/usr/src/RPM/BUILD/wsjtx-2.0.0/wsjtx/BUILD'
[ 29%] Building Fortran object CMakeFiles/wsjt_fort.dir/lib/getmet4.f90.o
make[2]: Leaving directory '/usr/src/RPM/BUILD/wsjtx-2.0.0/wsjtx/BUILD'
make[2]: Entering directory '/usr/src/RPM/BUILD/wsjtx-2.0.0/wsjtx/BUILD'
[ 30%] Building Fortran object CMakeFiles/wsjt_fort.dir/lib/grid2deg.f90.o
make[2]: Leaving directory '/usr/src/RPM/BUILD/wsjtx-2.0.0/wsjtx/BUILD'
make[2]: Entering directory '/usr/src/RPM/BUILD/wsjtx-2.0.0/wsjtx/BUILD'
[ 30%] Building Fortran object CMakeFiles/wsjt_fort.dir/lib/grayline.f90.o
make[2]: Leaving directory '/usr/src/RPM/BUILD/wsjtx-2.0.0/wsjtx/BUILD'
make[2]: Entering directory '/usr/src/RPM/BUILD/wsjtx-2.0.0/wsjtx/BUILD'
[ 30%] Building Fortran object CMakeFiles/wsjt_fort_omp.dir/lib/demod64a.f90.o
make[2]: Leaving directory '/usr/src/RPM/BUILD/wsjtx-2.0.0/wsjtx/BUILD'
make[2]: Entering directory '/usr/src/RPM/BUILD/wsjtx-2.0.0/wsjtx/BUILD'
[ 30%] Building Fortran object CMakeFiles/wsjt_fort.dir/lib/ft8/h1.f90.o
make[2]: Leaving directory '/usr/src/RPM/BUILD/wsjtx-2.0.0/wsjtx/BUILD'
make[2]: Entering directory '/usr/src/RPM/BUILD/wsjtx-2.0.0/wsjtx/BUILD'
[ 29%] Building Fortran object CMakeFiles/wsjt_fort_omp.dir/lib/decode9w.f90.o
make[2]: Leaving directory '/usr/src/RPM/BUILD/wsjtx-2.0.0/wsjtx/BUILD'
make[2]: Entering directory '/usr/src/RPM/BUILD/wsjtx-2.0.0/wsjtx/BUILD'
[ 30%] Building Fortran object CMakeFiles/wsjt_fort.dir/lib/hspec.f90.o
/usr/src/RPM/BUILD/wsjtx-2.0.0/wsjtx/lib/hspec.f90:1:60:

    1 | subroutine hspec(id2,k,nutc0,ntrpdepth,nrxfreq,ntol,ncontest,bmsk144,  &
      |                                                            1
Warning: Unused dummy argument 'ncontest' at (1) [-Wunused-dummy-argument]
make[2]: Leaving directory '/usr/src/RPM/BUILD/wsjtx-2.0.0/wsjtx/BUILD'
make[2]: Entering directory '/usr/src/RPM/BUILD/wsjtx-2.0.0/wsjtx/BUILD'
[ 30%] Building Fortran object CMakeFiles/wsjt_fort.dir/lib/indexx.f90.o
make[2]: Leaving directory '/usr/src/RPM/BUILD/wsjtx-2.0.0/wsjtx/BUILD'
make[2]: Entering directory '/usr/src/RPM/BUILD/wsjtx-2.0.0/wsjtx/BUILD'
[ 30%] Building Fortran object CMakeFiles/wsjt_fort_omp.dir/lib/encode232.f90.o
make[2]: Leaving directory '/usr/src/RPM/BUILD/wsjtx-2.0.0/wsjtx/BUILD'
make[2]: Entering directory '/usr/src/RPM/BUILD/wsjtx-2.0.0/wsjtx/BUILD'
[ 30%] Building Fortran object CMakeFiles/wsjt_fort_omp.dir/lib/determ.f90.o
make[2]: Leaving directory '/usr/src/RPM/BUILD/wsjtx-2.0.0/wsjtx/BUILD'
make[2]: Entering directory '/usr/src/RPM/BUILD/wsjtx-2.0.0/wsjtx/BUILD'
[ 30%] Building Fortran object CMakeFiles/wsjt_fort.dir/lib/init_random_seed.f90.o
make[2]: Leaving directory '/usr/src/RPM/BUILD/wsjtx-2.0.0/wsjtx/BUILD'
make[2]: Entering directory '/usr/src/RPM/BUILD/wsjtx-2.0.0/wsjtx/BUILD'
[ 30%] Building Fortran object CMakeFiles/wsjt_fort.dir/lib/interleave4.f90.o
make[2]: Leaving directory '/usr/src/RPM/BUILD/wsjtx-2.0.0/wsjtx/BUILD'
make[2]: Entering directory '/usr/src/RPM/BUILD/wsjtx-2.0.0/wsjtx/BUILD'
[ 30%] Building Fortran object CMakeFiles/wsjt_fort_omp.dir/lib/encode_msk40.f90.o
make[2]: Leaving directory '/usr/src/RPM/BUILD/wsjtx-2.0.0/wsjtx/BUILD'
make[2]: Entering directory '/usr/src/RPM/BUILD/wsjtx-2.0.0/wsjtx/BUILD'
[ 25%] Generating man/man1/rigctl-wsjtx.1.gz
make[2]: Leaving directory '/usr/src/RPM/BUILD/wsjtx-2.0.0/wsjtx/BUILD'
make[2]: Entering directory '/usr/src/RPM/BUILD/wsjtx-2.0.0/wsjtx/BUILD'
[ 31%] Building Fortran object CMakeFiles/wsjt_fort.dir/lib/interleave63.f90.o
make[2]: Leaving directory '/usr/src/RPM/BUILD/wsjtx-2.0.0/wsjtx/BUILD'
make[2]: Entering directory '/usr/src/RPM/BUILD/wsjtx-2.0.0/wsjtx/BUILD'
[ 31%] Building Fortran object CMakeFiles/wsjt_fort_omp.dir/lib/ft8/encode174.f90.o
make[2]: Leaving directory '/usr/src/RPM/BUILD/wsjtx-2.0.0/wsjtx/BUILD'
make[2]: Entering directory '/usr/src/RPM/BUILD/wsjtx-2.0.0/wsjtx/BUILD'
[ 31%] Building Fortran object CMakeFiles/wsjt_fort_omp.dir/lib/entail.f90.o
make[2]: Leaving directory '/usr/src/RPM/BUILD/wsjtx-2.0.0/wsjtx/BUILD'
make[2]: Entering directory '/usr/src/RPM/BUILD/wsjtx-2.0.0/wsjtx/BUILD'
[ 31%] Building Fortran object CMakeFiles/wsjt_fort.dir/lib/interleave9.f90.o
make[2]: Leaving directory '/usr/src/RPM/BUILD/wsjtx-2.0.0/wsjtx/BUILD'
make[2]: Entering directory '/usr/src/RPM/BUILD/wsjtx-2.0.0/wsjtx/BUILD'
[ 32%] Building Fortran object CMakeFiles/wsjt_fort.dir/lib/inter_wspr.f90.o
make[2]: Leaving directory '/usr/src/RPM/BUILD/wsjtx-2.0.0/wsjtx/BUILD'
make[2]: Entering directory '/usr/src/RPM/BUILD/wsjtx-2.0.0/wsjtx/BUILD'
[ 32%] Building Fortran object CMakeFiles/wsjt_fort_omp.dir/lib/ephem.f90.o
make[2]: Leaving directory '/usr/src/RPM/BUILD/wsjtx-2.0.0/wsjtx/BUILD'
make[2]: Entering directory '/usr/src/RPM/BUILD/wsjtx-2.0.0/wsjtx/BUILD'
[ 32%] Building Fortran object CMakeFiles/wsjt_fort_omp.dir/lib/fano232.f90.o
/usr/src/RPM/BUILD/wsjtx-2.0.0/wsjtx/lib/fano232.f90:9:23:

    9 |   parameter (MAXBYTES=(MAXBITS+7)/8)
      |                       1
Warning: Integer division truncated to constant '13' at (1) [-Winteger-division]
make[2]: Leaving directory '/usr/src/RPM/BUILD/wsjtx-2.0.0/wsjtx/BUILD'
make[2]: Entering directory '/usr/src/RPM/BUILD/wsjtx-2.0.0/wsjtx/BUILD'
[ 32%] Building Fortran object CMakeFiles/wsjt_fort_omp.dir/lib/fast_decode.f90.o
make[2]: Leaving directory '/usr/src/RPM/BUILD/wsjtx-2.0.0/wsjtx/BUILD'
make[2]: Entering directory '/usr/src/RPM/BUILD/wsjtx-2.0.0/wsjtx/BUILD'
[ 32%] Building Fortran object CMakeFiles/wsjt_fort_omp.dir/lib/fast9.f90.o
make[2]: Leaving directory '/usr/src/RPM/BUILD/wsjtx-2.0.0/wsjtx/BUILD'
make[2]: Entering directory '/usr/src/RPM/BUILD/wsjtx-2.0.0/wsjtx/BUILD'
[ 32%] Building Fortran object CMakeFiles/wsjt_fort_omp.dir/lib/fchisq.f90.o
make[2]: Leaving directory '/usr/src/RPM/BUILD/wsjtx-2.0.0/wsjtx/BUILD'
make[2]: Entering directory '/usr/src/RPM/BUILD/wsjtx-2.0.0/wsjtx/BUILD'
[ 32%] Building Fortran object CMakeFiles/wsjt_fort_omp.dir/lib/fchisq0.f90.o
make[2]: Leaving directory '/usr/src/RPM/BUILD/wsjtx-2.0.0/wsjtx/BUILD'
make[2]: Entering directory '/usr/src/RPM/BUILD/wsjtx-2.0.0/wsjtx/BUILD'
[ 32%] Building Fortran object CMakeFiles/wsjt_fort_omp.dir/lib/fil3.f90.o
/usr/src/RPM/BUILD/wsjtx-2.0.0/wsjtx/lib/fil3.f90:21:21:

   21 |   parameter (NH=NTAPS/2)
      |                     1
Warning: Integer division truncated to constant '56' at (1) [-Winteger-division]
make[2]: Leaving directory '/usr/src/RPM/BUILD/wsjtx-2.0.0/wsjtx/BUILD'
make[2]: Entering directory '/usr/src/RPM/BUILD/wsjtx-2.0.0/wsjtx/BUILD'
[ 32%] Building Fortran object CMakeFiles/wsjt_fort_omp.dir/lib/fil4.f90.o
make[2]: Leaving directory '/usr/src/RPM/BUILD/wsjtx-2.0.0/wsjtx/BUILD'
make[2]: Entering directory '/usr/src/RPM/BUILD/wsjtx-2.0.0/wsjtx/BUILD'
[ 32%] Building Fortran object CMakeFiles/wsjt_fort.dir/lib/iscat.f90.o
make[2]: Leaving directory '/usr/src/RPM/BUILD/wsjtx-2.0.0/wsjtx/BUILD'
make[2]: Entering directory '/usr/src/RPM/BUILD/wsjtx-2.0.0/wsjtx/BUILD'
[ 26%] Building CXX object CMakeFiles/wsjtx_udp-static.dir/NetworkMessage.cpp.o
make[2]: Leaving directory '/usr/src/RPM/BUILD/wsjtx-2.0.0/wsjtx/BUILD'
make[2]: Entering directory '/usr/src/RPM/BUILD/wsjtx-2.0.0/wsjtx/BUILD'
[ 32%] Building Fortran object CMakeFiles/wsjt_fort_omp.dir/lib/fil3c.f90.o
/usr/src/RPM/BUILD/wsjtx-2.0.0/wsjtx/lib/fil3c.f90:18:21:

   18 |   parameter (NH=NTAPS/2)
      |                     1
Warning: Integer division truncated to constant '56' at (1) [-Winteger-division]
make[2]: Leaving directory '/usr/src/RPM/BUILD/wsjtx-2.0.0/wsjtx/BUILD'
make[2]: Entering directory '/usr/src/RPM/BUILD/wsjtx-2.0.0/wsjtx/BUILD'
[ 32%] Building Fortran object CMakeFiles/wsjt_fort_omp.dir/lib/ft8/filt8.f90.o
make[2]: Leaving directory '/usr/src/RPM/BUILD/wsjtx-2.0.0/wsjtx/BUILD'
make[2]: Entering directory '/usr/src/RPM/BUILD/wsjtx-2.0.0/wsjtx/BUILD'
[ 32%] Building Fortran object CMakeFiles/wsjt_fort_omp.dir/lib/fil6521.f90.o
/usr/src/RPM/BUILD/wsjtx-2.0.0/wsjtx/lib/fil6521.f90:16:21:

   16 |   parameter (NH=NTAPS/2)
      |                     1
Warning: Integer division truncated to constant '10' at (1) [-Winteger-division]
make[2]: Leaving directory '/usr/src/RPM/BUILD/wsjtx-2.0.0/wsjtx/BUILD'
make[2]: Entering directory '/usr/src/RPM/BUILD/wsjtx-2.0.0/wsjtx/BUILD'
[ 33%] Building Fortran object CMakeFiles/wsjt_fort_omp.dir/lib/fitcal.f90.o
make[2]: Leaving directory '/usr/src/RPM/BUILD/wsjtx-2.0.0/wsjtx/BUILD'
make[2]: Entering directory '/usr/src/RPM/BUILD/wsjtx-2.0.0/wsjtx/BUILD'
[ 32%] Building Fortran object CMakeFiles/wsjt_fort.dir/lib/jplsubs.f.o
make[2]: Leaving directory '/usr/src/RPM/BUILD/wsjtx-2.0.0/wsjtx/BUILD'
make[2]: Entering directory '/usr/src/RPM/BUILD/wsjtx-2.0.0/wsjtx/BUILD'
[ 33%] Building Fortran object CMakeFiles/wsjt_fort_omp.dir/lib/flat1a.f90.o
make[2]: Leaving directory '/usr/src/RPM/BUILD/wsjtx-2.0.0/wsjtx/BUILD'
make[2]: Entering directory '/usr/src/RPM/BUILD/wsjtx-2.0.0/wsjtx/BUILD'
[ 31%] Generating man/man1/rigctld-wsjtx.1.gz
make[2]: Leaving directory '/usr/src/RPM/BUILD/wsjtx-2.0.0/wsjtx/BUILD'
make[2]: Entering directory '/usr/src/RPM/BUILD/wsjtx-2.0.0/wsjtx/BUILD'
[ 33%] Building Fortran object CMakeFiles/wsjt_fort.dir/lib/libration.f90.o
make[2]: Leaving directory '/usr/src/RPM/BUILD/wsjtx-2.0.0/wsjtx/BUILD'
make[2]: Entering directory '/usr/src/RPM/BUILD/wsjtx-2.0.0/wsjtx/BUILD'
[ 32%] Building Fortran object CMakeFiles/wsjt_fort.dir/lib/jtmsg.f90.o
make[2]: Leaving directory '/usr/src/RPM/BUILD/wsjtx-2.0.0/wsjtx/BUILD'
make[2]: Entering directory '/usr/src/RPM/BUILD/wsjtx-2.0.0/wsjtx/BUILD'
[ 33%] Building Fortran object CMakeFiles/wsjt_fort_omp.dir/lib/flat1.f90.o
make[2]: Leaving directory '/usr/src/RPM/BUILD/wsjtx-2.0.0/wsjtx/BUILD'
make[2]: Entering directory '/usr/src/RPM/BUILD/wsjtx-2.0.0/wsjtx/BUILD'
[ 34%] Building Fortran object CMakeFiles/wsjt_fort.dir/lib/lpf1.f90.o
make[2]: Leaving directory '/usr/src/RPM/BUILD/wsjtx-2.0.0/wsjtx/BUILD'
make[2]: Entering directory '/usr/src/RPM/BUILD/wsjtx-2.0.0/wsjtx/BUILD'
[ 34%] Building Fortran object CMakeFiles/wsjt_fort_omp.dir/lib/flat2.f90.o
make[2]: Leaving directory '/usr/src/RPM/BUILD/wsjtx-2.0.0/wsjtx/BUILD'
make[2]: Entering directory '/usr/src/RPM/BUILD/wsjtx-2.0.0/wsjtx/BUILD'
[ 33%] Building Fortran object CMakeFiles/wsjt_fort_omp.dir/lib/flat1b.f90.o
make[2]: Leaving directory '/usr/src/RPM/BUILD/wsjtx-2.0.0/wsjtx/BUILD'
make[2]: Entering directory '/usr/src/RPM/BUILD/wsjtx-2.0.0/wsjtx/BUILD'
[ 33%] Building Fortran object CMakeFiles/wsjt_fort.dir/lib/lorentzian.f90.o
make[2]: Leaving directory '/usr/src/RPM/BUILD/wsjtx-2.0.0/wsjtx/BUILD'
make[2]: Entering directory '/usr/src/RPM/BUILD/wsjtx-2.0.0/wsjtx/BUILD'
[ 34%] Building Fortran object CMakeFiles/wsjt_fort.dir/lib/makepings.f90.o
make[2]: Leaving directory '/usr/src/RPM/BUILD/wsjtx-2.0.0/wsjtx/BUILD'
make[2]: Entering directory '/usr/src/RPM/BUILD/wsjtx-2.0.0/wsjtx/BUILD'
[ 34%] Building Fortran object CMakeFiles/wsjt_fort.dir/lib/mixlpf.f90.o
make[2]: Leaving directory '/usr/src/RPM/BUILD/wsjtx-2.0.0/wsjtx/BUILD'
make[2]: Entering directory '/usr/src/RPM/BUILD/wsjtx-2.0.0/wsjtx/BUILD'
[ 34%] Building Fortran object CMakeFiles/wsjt_fort.dir/lib/moondopjpl.f90.o
make[2]: Leaving directory '/usr/src/RPM/BUILD/wsjtx-2.0.0/wsjtx/BUILD'
make[2]: Entering directory '/usr/src/RPM/BUILD/wsjtx-2.0.0/wsjtx/BUILD'
[ 34%] Building Fortran object CMakeFiles/wsjt_fort.dir/lib/move.f90.o
make[2]: Leaving directory '/usr/src/RPM/BUILD/wsjtx-2.0.0/wsjtx/BUILD'
make[2]: Entering directory '/usr/src/RPM/BUILD/wsjtx-2.0.0/wsjtx/BUILD'
[ 34%] Building Fortran object CMakeFiles/wsjt_fort_omp.dir/lib/flat4.f90.o
make[2]: Leaving directory '/usr/src/RPM/BUILD/wsjtx-2.0.0/wsjtx/BUILD'
make[2]: Entering directory '/usr/src/RPM/BUILD/wsjtx-2.0.0/wsjtx/BUILD'
[ 34%] Building Fortran object CMakeFiles/wsjt_fort_omp.dir/lib/flat65.f90.o
make[2]: Leaving directory '/usr/src/RPM/BUILD/wsjtx-2.0.0/wsjtx/BUILD'
make[2]: Entering directory '/usr/src/RPM/BUILD/wsjtx-2.0.0/wsjtx/BUILD'
[ 34%] Building Fortran object CMakeFiles/wsjt_fort.dir/lib/morse.f90.o
make[2]: Leaving directory '/usr/src/RPM/BUILD/wsjtx-2.0.0/wsjtx/BUILD'
make[2]: Entering directory '/usr/src/RPM/BUILD/wsjtx-2.0.0/wsjtx/BUILD'
[ 34%] Building Fortran object CMakeFiles/wsjt_fort_omp.dir/lib/fmtmsg.f90.o
make[2]: Leaving directory '/usr/src/RPM/BUILD/wsjtx-2.0.0/wsjtx/BUILD'
make[2]: Entering directory '/usr/src/RPM/BUILD/wsjtx-2.0.0/wsjtx/BUILD'
[ 35%] Building Fortran object CMakeFiles/wsjt_fort_omp.dir/lib/foldspec9f.f90.o
make[2]: Leaving directory '/usr/src/RPM/BUILD/wsjtx-2.0.0/wsjtx/BUILD'
make[2]: Entering directory '/usr/src/RPM/BUILD/wsjtx-2.0.0/wsjtx/BUILD'
[ 35%] Building Fortran object CMakeFiles/wsjt_fort.dir/lib/msk144sync.f90.o
make[2]: Leaving directory '/usr/src/RPM/BUILD/wsjtx-2.0.0/wsjtx/BUILD'
make[2]: Entering directory '/usr/src/RPM/BUILD/wsjtx-2.0.0/wsjtx/BUILD'
[ 34%] Building Fortran object CMakeFiles/wsjt_fort.dir/lib/msk40sync.f90.o
make[2]: Leaving directory '/usr/src/RPM/BUILD/wsjtx-2.0.0/wsjtx/BUILD'
make[2]: Entering directory '/usr/src/RPM/BUILD/wsjtx-2.0.0/wsjtx/BUILD'
[ 35%] Building Fortran object CMakeFiles/wsjt_fort_omp.dir/lib/four2a.f90.o
make[2]: Leaving directory '/usr/src/RPM/BUILD/wsjtx-2.0.0/wsjtx/BUILD'
make[2]: Entering directory '/usr/src/RPM/BUILD/wsjtx-2.0.0/wsjtx/BUILD'
[ 35%] Building Fortran object CMakeFiles/wsjt_fort_omp.dir/lib/ft8/foxfilt.f90.o
make[2]: Leaving directory '/usr/src/RPM/BUILD/wsjtx-2.0.0/wsjtx/BUILD'
make[2]: Entering directory '/usr/src/RPM/BUILD/wsjtx-2.0.0/wsjtx/BUILD'
[ 35%] Building Fortran object CMakeFiles/wsjt_fort_omp.dir/lib/ft8/foxgen_wrap.f90.o
make[2]: Leaving directory '/usr/src/RPM/BUILD/wsjtx-2.0.0/wsjtx/BUILD'
make[2]: Entering directory '/usr/src/RPM/BUILD/wsjtx-2.0.0/wsjtx/BUILD'
[ 35%] Building Fortran object CMakeFiles/wsjt_fort_omp.dir/lib/ft8/foxgen.f90.o
make[2]: Leaving directory '/usr/src/RPM/BUILD/wsjtx-2.0.0/wsjtx/BUILD'
make[2]: Entering directory '/usr/src/RPM/BUILD/wsjtx-2.0.0/wsjtx/BUILD'
[ 35%] Building Fortran object CMakeFiles/wsjt_fort.dir/lib/msk144_freq_search.f90.o
make[2]: Leaving directory '/usr/src/RPM/BUILD/wsjtx-2.0.0/wsjtx/BUILD'
make[2]: Entering directory '/usr/src/RPM/BUILD/wsjtx-2.0.0/wsjtx/BUILD'
[ 35%] Building Fortran object CMakeFiles/wsjt_fort.dir/lib/msk40_freq_search.f90.o
make[2]: Leaving directory '/usr/src/RPM/BUILD/wsjtx-2.0.0/wsjtx/BUILD'
make[2]: Entering directory '/usr/src/RPM/BUILD/wsjtx-2.0.0/wsjtx/BUILD'
[ 35%] Building Fortran object CMakeFiles/wsjt_fort_omp.dir/lib/fqso_first.f90.o
make[2]: Leaving directory '/usr/src/RPM/BUILD/wsjtx-2.0.0/wsjtx/BUILD'
make[2]: Entering directory '/usr/src/RPM/BUILD/wsjtx-2.0.0/wsjtx/BUILD'
[ 36%] Building Fortran object CMakeFiles/wsjt_fort_omp.dir/lib/ft8/ft8_downsample.f90.o
make[2]: Leaving directory '/usr/src/RPM/BUILD/wsjtx-2.0.0/wsjtx/BUILD'
make[2]: Entering directory '/usr/src/RPM/BUILD/wsjtx-2.0.0/wsjtx/BUILD'
[ 36%] Building Fortran object CMakeFiles/wsjt_fort_omp.dir/lib/geniscat.f90.o
make[2]: Leaving directory '/usr/src/RPM/BUILD/wsjtx-2.0.0/wsjtx/BUILD'
make[2]: Entering directory '/usr/src/RPM/BUILD/wsjtx-2.0.0/wsjtx/BUILD'
[ 33%] Generating man/man1/message_aggregator.1.gz
make[2]: Leaving directory '/usr/src/RPM/BUILD/wsjtx-2.0.0/wsjtx/BUILD'
make[2]: Entering directory '/usr/src/RPM/BUILD/wsjtx-2.0.0/wsjtx/BUILD'
[ 36%] Building Fortran object CMakeFiles/wsjt_fort_omp.dir/lib/ft8/genft8refsig.f90.o
make[2]: Leaving directory '/usr/src/RPM/BUILD/wsjtx-2.0.0/wsjtx/BUILD'
make[2]: Entering directory '/usr/src/RPM/BUILD/wsjtx-2.0.0/wsjtx/BUILD'
[ 35%] Building Fortran object CMakeFiles/wsjt_fort_omp.dir/lib/freqcal.f90.o
/usr/src/RPM/BUILD/wsjtx-2.0.0/wsjtx/lib/freqcal.f90:52:0:

   52 |   call peakup(s(ipk-1),s(ipk),s(ipk+1),dx)
      | 
Warning: 'ipk' may be used uninitialized in this function [-Wmaybe-uninitialized]
make[2]: Leaving directory '/usr/src/RPM/BUILD/wsjtx-2.0.0/wsjtx/BUILD'
make[2]: Entering directory '/usr/src/RPM/BUILD/wsjtx-2.0.0/wsjtx/BUILD'
[ 37%] Building Fortran object CMakeFiles/wsjt_fort_omp.dir/lib/genwspr.f90.o
make[2]: Leaving directory '/usr/src/RPM/BUILD/wsjtx-2.0.0/wsjtx/BUILD'
make[2]: Entering directory '/usr/src/RPM/BUILD/wsjtx-2.0.0/wsjtx/BUILD'
[ 37%] Building Fortran object CMakeFiles/wsjt_fort_omp.dir/lib/getlags.f90.o
make[2]: Leaving directory '/usr/src/RPM/BUILD/wsjtx-2.0.0/wsjtx/BUILD'
make[2]: Entering directory '/usr/src/RPM/BUILD/wsjtx-2.0.0/wsjtx/BUILD'
[ 37%] Building Fortran object CMakeFiles/wsjt_fort_omp.dir/lib/geodist.f90.o
make[2]: Leaving directory '/usr/src/RPM/BUILD/wsjtx-2.0.0/wsjtx/BUILD'
make[2]: Entering directory '/usr/src/RPM/BUILD/wsjtx-2.0.0/wsjtx/BUILD'
[ 37%] Building Fortran object CMakeFiles/wsjt_fort_omp.dir/lib/getmet4.f90.o
make[2]: Leaving directory '/usr/src/RPM/BUILD/wsjtx-2.0.0/wsjtx/BUILD'
make[2]: Entering directory '/usr/src/RPM/BUILD/wsjtx-2.0.0/wsjtx/BUILD'
[ 37%] Building Fortran object CMakeFiles/wsjt_fort_omp.dir/lib/graycode65.f90.o
make[2]: Leaving directory '/usr/src/RPM/BUILD/wsjtx-2.0.0/wsjtx/BUILD'
make[2]: Entering directory '/usr/src/RPM/BUILD/wsjtx-2.0.0/wsjtx/BUILD'
[ 37%] Building Fortran object CMakeFiles/wsjt_fort_omp.dir/lib/graycode.f90.o
make[2]: Leaving directory '/usr/src/RPM/BUILD/wsjtx-2.0.0/wsjtx/BUILD'
make[2]: Entering directory '/usr/src/RPM/BUILD/wsjtx-2.0.0/wsjtx/BUILD'
[ 37%] Building Fortran object CMakeFiles/wsjt_fort_omp.dir/lib/grayline.f90.o
make[2]: Leaving directory '/usr/src/RPM/BUILD/wsjtx-2.0.0/wsjtx/BUILD'
make[2]: Entering directory '/usr/src/RPM/BUILD/wsjtx-2.0.0/wsjtx/BUILD'
[ 38%] Building Fortran object CMakeFiles/wsjt_fort_omp.dir/lib/ft8/h1.f90.o
make[2]: Leaving directory '/usr/src/RPM/BUILD/wsjtx-2.0.0/wsjtx/BUILD'
make[2]: Entering directory '/usr/src/RPM/BUILD/wsjtx-2.0.0/wsjtx/BUILD'
[ 38%] Building Fortran object CMakeFiles/wsjt_fort_omp.dir/lib/grid2deg.f90.o
make[2]: Leaving directory '/usr/src/RPM/BUILD/wsjtx-2.0.0/wsjtx/BUILD'
make[2]: Entering directory '/usr/src/RPM/BUILD/wsjtx-2.0.0/wsjtx/BUILD'
[ 38%] Building Fortran object CMakeFiles/wsjt_fort_omp.dir/lib/indexx.f90.o
make[2]: Leaving directory '/usr/src/RPM/BUILD/wsjtx-2.0.0/wsjtx/BUILD'
make[2]: Entering directory '/usr/src/RPM/BUILD/wsjtx-2.0.0/wsjtx/BUILD'
[ 36%] Building Fortran object CMakeFiles/wsjt_fort.dir/lib/msk144signalquality.f90.o
make[2]: Leaving directory '/usr/src/RPM/BUILD/wsjtx-2.0.0/wsjtx/BUILD'
make[2]: Entering directory '/usr/src/RPM/BUILD/wsjtx-2.0.0/wsjtx/BUILD'
[ 38%] Building Fortran object CMakeFiles/wsjt_fort_omp.dir/lib/hspec.f90.o
/usr/src/RPM/BUILD/wsjtx-2.0.0/wsjtx/lib/hspec.f90:1:60:

    1 | subroutine hspec(id2,k,nutc0,ntrpdepth,nrxfreq,ntol,ncontest,bmsk144,  &
      |                                                            1
Warning: Unused dummy argument 'ncontest' at (1) [-Wunused-dummy-argument]
make[2]: Leaving directory '/usr/src/RPM/BUILD/wsjtx-2.0.0/wsjtx/BUILD'
make[2]: Entering directory '/usr/src/RPM/BUILD/wsjtx-2.0.0/wsjtx/BUILD'
[ 38%] Building Fortran object CMakeFiles/wsjt_fort_omp.dir/lib/init_random_seed.f90.o
make[2]: Leaving directory '/usr/src/RPM/BUILD/wsjtx-2.0.0/wsjtx/BUILD'
make[2]: Entering directory '/usr/src/RPM/BUILD/wsjtx-2.0.0/wsjtx/BUILD'
[ 39%] Building Fortran object CMakeFiles/wsjt_fort_omp.dir/lib/interleave63.f90.o
make[2]: Leaving directory '/usr/src/RPM/BUILD/wsjtx-2.0.0/wsjtx/BUILD'
make[2]: Entering directory '/usr/src/RPM/BUILD/wsjtx-2.0.0/wsjtx/BUILD'
[ 38%] Building Fortran object CMakeFiles/wsjt_fort_omp.dir/lib/interleave4.f90.o
make[2]: Leaving directory '/usr/src/RPM/BUILD/wsjtx-2.0.0/wsjtx/BUILD'
make[2]: Entering directory '/usr/src/RPM/BUILD/wsjtx-2.0.0/wsjtx/BUILD'
[ 39%] Building Fortran object CMakeFiles/wsjt_fort_omp.dir/lib/interleave9.f90.o
make[2]: Leaving directory '/usr/src/RPM/BUILD/wsjtx-2.0.0/wsjtx/BUILD'
make[2]: Entering directory '/usr/src/RPM/BUILD/wsjtx-2.0.0/wsjtx/BUILD'
[ 39%] Building Fortran object CMakeFiles/wsjt_fort_omp.dir/lib/inter_wspr.f90.o
make[2]: Leaving directory '/usr/src/RPM/BUILD/wsjtx-2.0.0/wsjtx/BUILD'
make[2]: Entering directory '/usr/src/RPM/BUILD/wsjtx-2.0.0/wsjtx/BUILD'
[ 39%] Building Fortran object CMakeFiles/wsjt_fort_omp.dir/lib/iscat.f90.o
make[2]: Leaving directory '/usr/src/RPM/BUILD/wsjtx-2.0.0/wsjtx/BUILD'
make[2]: Entering directory '/usr/src/RPM/BUILD/wsjtx-2.0.0/wsjtx/BUILD'
[ 36%] Building Fortran object CMakeFiles/wsjt_fort.dir/lib/wsprd/osdwspr.f90.o
/usr/src/RPM/BUILD/wsjtx-2.0.0/wsjtx/lib/wsprd/osdwspr.f90:167:0:

  167 |                dd=d1+sum(e2sub*absrx(K+1:N))
      | 
Warning: 'd1' may be used uninitialized in this function [-Wmaybe-uninitialized]
make[2]: Leaving directory '/usr/src/RPM/BUILD/wsjtx-2.0.0/wsjtx/BUILD'
make[2]: Entering directory '/usr/src/RPM/BUILD/wsjtx-2.0.0/wsjtx/BUILD'
[ 39%] Building Fortran object CMakeFiles/wsjt_fort_omp.dir/lib/jplsubs.f.o
make[2]: Leaving directory '/usr/src/RPM/BUILD/wsjtx-2.0.0/wsjtx/BUILD'
make[2]: Entering directory '/usr/src/RPM/BUILD/wsjtx-2.0.0/wsjtx/BUILD'
[ 38%] Building Fortran object CMakeFiles/wsjt_fort.dir/lib/ft8/osd174_91.f90.o
/usr/src/RPM/BUILD/wsjtx-2.0.0/wsjtx/lib/ft8/osd174_91.f90:145:0:

  145 | do iorder=1,nord
      | 
Warning: 'nord' may be used uninitialized in this function [-Wmaybe-uninitialized]
/usr/src/RPM/BUILD/wsjtx-2.0.0/wsjtx/lib/ft8/osd174_91.f90:195:0:

  195 | if(npre2.eq.1) then
      | 
Warning: 'npre2' may be used uninitialized in this function [-Wmaybe-uninitialized]
/usr/src/RPM/BUILD/wsjtx-2.0.0/wsjtx/lib/ft8/osd174_91.f90:229:0:

  229 |                if(sum(mi).lt.nord+npre1+npre2.or.any(iand(apmaskr(1:K),mi).eq.1)) cycle
      | 
Warning: 'npre1' may be used uninitialized in this function [-Wmaybe-uninitialized]
/usr/src/RPM/BUILD/wsjtx-2.0.0/wsjtx/lib/ft8/osd174_91.f90:175:0:

  175 |                dd=d1+sum(e2sub*absrx(K+1:N))
      | 
Warning: 'd1' may be used uninitialized in this function [-Wmaybe-uninitialized]
make[2]: Leaving directory '/usr/src/RPM/BUILD/wsjtx-2.0.0/wsjtx/BUILD'
make[2]: Entering directory '/usr/src/RPM/BUILD/wsjtx-2.0.0/wsjtx/BUILD'
[ 39%] Building Fortran object CMakeFiles/wsjt_fort.dir/lib/pctile.f90.o
make[2]: Leaving directory '/usr/src/RPM/BUILD/wsjtx-2.0.0/wsjtx/BUILD'
make[2]: Entering directory '/usr/src/RPM/BUILD/wsjtx-2.0.0/wsjtx/BUILD'
[ 40%] Building Fortran object CMakeFiles/wsjt_fort_omp.dir/lib/libration.f90.o
make[2]: Leaving directory '/usr/src/RPM/BUILD/wsjtx-2.0.0/wsjtx/BUILD'
make[2]: Entering directory '/usr/src/RPM/BUILD/wsjtx-2.0.0/wsjtx/BUILD'
[ 39%] Building Fortran object CMakeFiles/wsjt_fort_omp.dir/lib/jtmsg.f90.o
make[2]: Leaving directory '/usr/src/RPM/BUILD/wsjtx-2.0.0/wsjtx/BUILD'
make[2]: Entering directory '/usr/src/RPM/BUILD/wsjtx-2.0.0/wsjtx/BUILD'
[ 41%] Building Fortran object CMakeFiles/wsjt_fort.dir/lib/peakup.f90.o
make[2]: Leaving directory '/usr/src/RPM/BUILD/wsjtx-2.0.0/wsjtx/BUILD'
make[2]: Entering directory '/usr/src/RPM/BUILD/wsjtx-2.0.0/wsjtx/BUILD'
[ 36%] Generating man/man1/udp_daemon.1.gz
make[2]: Leaving directory '/usr/src/RPM/BUILD/wsjtx-2.0.0/wsjtx/BUILD'
make[2]: Entering directory '/usr/src/RPM/BUILD/wsjtx-2.0.0/wsjtx/BUILD'
[ 40%] Building Fortran object CMakeFiles/wsjt_fort.dir/lib/peakdt9.f90.o
make[2]: Leaving directory '/usr/src/RPM/BUILD/wsjtx-2.0.0/wsjtx/BUILD'
make[1]: Entering directory '/usr/src/RPM/BUILD/wsjtx-2.0.0/wsjtx/BUILD'
[ 41%] Built target manpages
make[1]: Leaving directory '/usr/src/RPM/BUILD/wsjtx-2.0.0/wsjtx/BUILD'
make[2]: Entering directory '/usr/src/RPM/BUILD/wsjtx-2.0.0/wsjtx/BUILD'
[ 41%] Building Fortran object CMakeFiles/wsjt_fort_omp.dir/lib/lorentzian.f90.o
make[2]: Leaving directory '/usr/src/RPM/BUILD/wsjtx-2.0.0/wsjtx/BUILD'
make[2]: Entering directory '/usr/src/RPM/BUILD/wsjtx-2.0.0/wsjtx/BUILD'
[ 41%] Building Fortran object CMakeFiles/wsjt_fort_omp.dir/lib/lpf1.f90.o
make[2]: Leaving directory '/usr/src/RPM/BUILD/wsjtx-2.0.0/wsjtx/BUILD'
make[2]: Entering directory '/usr/src/RPM/BUILD/wsjtx-2.0.0/wsjtx/BUILD'
[ 32%] Building CXX object CMakeFiles/wsjtx_udp-static.dir/MessageServer.cpp.o
make[2]: Leaving directory '/usr/src/RPM/BUILD/wsjtx-2.0.0/wsjtx/BUILD'
make[2]: Entering directory '/usr/src/RPM/BUILD/wsjtx-2.0.0/wsjtx/BUILD'
[ 41%] Building Fortran object CMakeFiles/wsjt_fort.dir/lib/platanh.f90.o
make[2]: Leaving directory '/usr/src/RPM/BUILD/wsjtx-2.0.0/wsjtx/BUILD'
make[2]: Entering directory '/usr/src/RPM/BUILD/wsjtx-2.0.0/wsjtx/BUILD'
[ 41%] Building Fortran object CMakeFiles/wsjt_fort.dir/lib/pltanh.f90.o
make[2]: Leaving directory '/usr/src/RPM/BUILD/wsjtx-2.0.0/wsjtx/BUILD'
make[2]: Entering directory '/usr/src/RPM/BUILD/wsjtx-2.0.0/wsjtx/BUILD'
[ 42%] Linking CXX static library libwsjtx_udp.a
make[2]: Leaving directory '/usr/src/RPM/BUILD/wsjtx-2.0.0/wsjtx/BUILD'
make[1]: Entering directory '/usr/src/RPM/BUILD/wsjtx-2.0.0/wsjtx/BUILD'
[ 42%] Built target wsjtx_udp-static
make[1]: Leaving directory '/usr/src/RPM/BUILD/wsjtx-2.0.0/wsjtx/BUILD'
make[2]: Entering directory '/usr/src/RPM/BUILD/wsjtx-2.0.0/wsjtx/BUILD'
Scanning dependencies of target message_aggregator_autogen
make[2]: Leaving directory '/usr/src/RPM/BUILD/wsjtx-2.0.0/wsjtx/BUILD'
make[2]: Entering directory '/usr/src/RPM/BUILD/wsjtx-2.0.0/wsjtx/BUILD'
[ 41%] Building Fortran object CMakeFiles/wsjt_fort_omp.dir/lib/mixlpf.f90.o
make[2]: Leaving directory '/usr/src/RPM/BUILD/wsjtx-2.0.0/wsjtx/BUILD'
make[2]: Entering directory '/usr/src/RPM/BUILD/wsjtx-2.0.0/wsjtx/BUILD'
[ 41%] Building Fortran object CMakeFiles/wsjt_fort.dir/lib/plotsave.f90.o
make[2]: Leaving directory '/usr/src/RPM/BUILD/wsjtx-2.0.0/wsjtx/BUILD'
make[2]: Entering directory '/usr/src/RPM/BUILD/wsjtx-2.0.0/wsjtx/BUILD'
[ 41%] Building Fortran object CMakeFiles/wsjt_fort_omp.dir/lib/makepings.f90.o
make[2]: Leaving directory '/usr/src/RPM/BUILD/wsjtx-2.0.0/wsjtx/BUILD'
make[2]: Entering directory '/usr/src/RPM/BUILD/wsjtx-2.0.0/wsjtx/BUILD'
[ 42%] Building Fortran object CMakeFiles/wsjt_fort_omp.dir/lib/moondopjpl.f90.o
make[2]: Leaving directory '/usr/src/RPM/BUILD/wsjtx-2.0.0/wsjtx/BUILD'
make[2]: Entering directory '/usr/src/RPM/BUILD/wsjtx-2.0.0/wsjtx/BUILD'
[ 42%] Building Fortran object CMakeFiles/wsjt_fort.dir/lib/ps4.f90.o
make[2]: Leaving directory '/usr/src/RPM/BUILD/wsjtx-2.0.0/wsjtx/BUILD'
make[2]: Entering directory '/usr/src/RPM/BUILD/wsjtx-2.0.0/wsjtx/BUILD'
[ 43%] Building Fortran object CMakeFiles/wsjt_fort_omp.dir/lib/move.f90.o
make[2]: Leaving directory '/usr/src/RPM/BUILD/wsjtx-2.0.0/wsjtx/BUILD'
make[2]: Entering directory '/usr/src/RPM/BUILD/wsjtx-2.0.0/wsjtx/BUILD'
[ 43%] Building Fortran object CMakeFiles/wsjt_fort.dir/lib/savec2.f90.o
make[2]: Leaving directory '/usr/src/RPM/BUILD/wsjtx-2.0.0/wsjtx/BUILD'
make[2]: Entering directory '/usr/src/RPM/BUILD/wsjtx-2.0.0/wsjtx/BUILD'
[ 42%] Building Fortran object CMakeFiles/wsjt_fort_omp.dir/lib/morse.f90.o
make[2]: Leaving directory '/usr/src/RPM/BUILD/wsjtx-2.0.0/wsjtx/BUILD'
make[2]: Entering directory '/usr/src/RPM/BUILD/wsjtx-2.0.0/wsjtx/BUILD'
[ 43%] Building Fortran object CMakeFiles/wsjt_fort.dir/lib/sec_midn.f90.o
make[2]: Leaving directory '/usr/src/RPM/BUILD/wsjtx-2.0.0/wsjtx/BUILD'
make[2]: Entering directory '/usr/src/RPM/BUILD/wsjtx-2.0.0/wsjtx/BUILD'
[ 42%] Building Fortran object CMakeFiles/wsjt_fort.dir/lib/polyfit.f90.o
make[2]: Leaving directory '/usr/src/RPM/BUILD/wsjtx-2.0.0/wsjtx/BUILD'
make[2]: Entering directory '/usr/src/RPM/BUILD/wsjtx-2.0.0/wsjtx/BUILD'
[ 43%] Building Fortran object CMakeFiles/wsjt_fort.dir/lib/sh65.f90.o
make[2]: Leaving directory '/usr/src/RPM/BUILD/wsjtx-2.0.0/wsjtx/BUILD'
make[2]: Entering directory '/usr/src/RPM/BUILD/wsjtx-2.0.0/wsjtx/BUILD'
[ 43%] Building Fortran object CMakeFiles/wsjt_fort.dir/lib/sh65snr.f90.o
make[2]: Leaving directory '/usr/src/RPM/BUILD/wsjtx-2.0.0/wsjtx/BUILD'
make[2]: Entering directory '/usr/src/RPM/BUILD/wsjtx-2.0.0/wsjtx/BUILD'
[ 44%] Building Fortran object CMakeFiles/wsjt_fort.dir/lib/sleep_msec.f90.o
make[2]: Leaving directory '/usr/src/RPM/BUILD/wsjtx-2.0.0/wsjtx/BUILD'
make[2]: Entering directory '/usr/src/RPM/BUILD/wsjtx-2.0.0/wsjtx/BUILD'
[ 43%] Building Fortran object CMakeFiles/wsjt_fort_omp.dir/lib/msk40sync.f90.o
make[2]: Leaving directory '/usr/src/RPM/BUILD/wsjtx-2.0.0/wsjtx/BUILD'
make[2]: Entering directory '/usr/src/RPM/BUILD/wsjtx-2.0.0/wsjtx/BUILD'
[ 42%] Automatic MOC for target message_aggregator
make[2]: Leaving directory '/usr/src/RPM/BUILD/wsjtx-2.0.0/wsjtx/BUILD'
make[1]: Entering directory '/usr/src/RPM/BUILD/wsjtx-2.0.0/wsjtx/BUILD'
[ 45%] Built target message_aggregator_autogen
make[1]: Leaving directory '/usr/src/RPM/BUILD/wsjtx-2.0.0/wsjtx/BUILD'
make[2]: Entering directory '/usr/src/RPM/BUILD/wsjtx-2.0.0/wsjtx/BUILD'
[ 44%] Building Fortran object CMakeFiles/wsjt_fort.dir/lib/slope.f90.o
make[2]: Leaving directory '/usr/src/RPM/BUILD/wsjtx-2.0.0/wsjtx/BUILD'
make[2]: Entering directory '/usr/src/RPM/BUILD/wsjtx-2.0.0/wsjtx/BUILD'
Scanning dependencies of target udp_daemon_autogen
make[2]: Leaving directory '/usr/src/RPM/BUILD/wsjtx-2.0.0/wsjtx/BUILD'
make[2]: Entering directory '/usr/src/RPM/BUILD/wsjtx-2.0.0/wsjtx/BUILD'
[ 42%] Building Fortran object CMakeFiles/wsjt_fort.dir/lib/refspectrum.f90.o
make[2]: Leaving directory '/usr/src/RPM/BUILD/wsjtx-2.0.0/wsjtx/BUILD'
make[2]: Entering directory '/usr/src/RPM/BUILD/wsjtx-2.0.0/wsjtx/BUILD'
[ 43%] Building Fortran object CMakeFiles/wsjt_fort_omp.dir/lib/msk144sync.f90.o
make[2]: Leaving directory '/usr/src/RPM/BUILD/wsjtx-2.0.0/wsjtx/BUILD'
make[2]: Entering directory '/usr/src/RPM/BUILD/wsjtx-2.0.0/wsjtx/BUILD'
[ 45%] Building Fortran object CMakeFiles/wsjt_fort.dir/lib/smo121.f90.o
make[2]: Leaving directory '/usr/src/RPM/BUILD/wsjtx-2.0.0/wsjtx/BUILD'
make[2]: Entering directory '/usr/src/RPM/BUILD/wsjtx-2.0.0/wsjtx/BUILD'
[ 45%] Building Fortran object CMakeFiles/wsjt_fort.dir/lib/softsym9f.f90.o
make[2]: Leaving directory '/usr/src/RPM/BUILD/wsjtx-2.0.0/wsjtx/BUILD'
make[2]: Entering directory '/usr/src/RPM/BUILD/wsjtx-2.0.0/wsjtx/BUILD'
[ 45%] Automatic MOC for target udp_daemon
make[2]: Leaving directory '/usr/src/RPM/BUILD/wsjtx-2.0.0/wsjtx/BUILD'
make[2]: Entering directory '/usr/src/RPM/BUILD/wsjtx-2.0.0/wsjtx/BUILD'
[ 45%] Building Fortran object CMakeFiles/wsjt_fort_omp.dir/lib/msk144_freq_search.f90.o
make[2]: Leaving directory '/usr/src/RPM/BUILD/wsjtx-2.0.0/wsjtx/BUILD'
make[1]: Entering directory '/usr/src/RPM/BUILD/wsjtx-2.0.0/wsjtx/BUILD'
[ 45%] Built target udp_daemon_autogen
make[1]: Leaving directory '/usr/src/RPM/BUILD/wsjtx-2.0.0/wsjtx/BUILD'
make[2]: Entering directory '/usr/src/RPM/BUILD/wsjtx-2.0.0/wsjtx/BUILD'
[ 45%] Building Fortran object CMakeFiles/wsjt_fort.dir/lib/smo.f90.o
make[2]: Leaving directory '/usr/src/RPM/BUILD/wsjtx-2.0.0/wsjtx/BUILD'
make[2]: Entering directory '/usr/src/RPM/BUILD/wsjtx-2.0.0/wsjtx/BUILD'
[ 46%] Generating qrc_message_aggregator.cpp
make[2]: Leaving directory '/usr/src/RPM/BUILD/wsjtx-2.0.0/wsjtx/BUILD'
make[2]: Entering directory '/usr/src/RPM/BUILD/wsjtx-2.0.0/wsjtx/BUILD'
[ 46%] Building Fortran object CMakeFiles/wsjt_fort.dir/lib/shell.f90.o
make[2]: Leaving directory '/usr/src/RPM/BUILD/wsjtx-2.0.0/wsjtx/BUILD'
make[2]: Entering directory '/usr/src/RPM/BUILD/wsjtx-2.0.0/wsjtx/BUILD'
[ 45%] Building Fortran object CMakeFiles/wsjt_fort_omp.dir/lib/msk40_freq_search.f90.o
make[2]: Leaving directory '/usr/src/RPM/BUILD/wsjtx-2.0.0/wsjtx/BUILD'
make[2]: Entering directory '/usr/src/RPM/BUILD/wsjtx-2.0.0/wsjtx/BUILD'
Scanning dependencies of target message_aggregator
make[2]: Leaving directory '/usr/src/RPM/BUILD/wsjtx-2.0.0/wsjtx/BUILD'
make[2]: Entering directory '/usr/src/RPM/BUILD/wsjtx-2.0.0/wsjtx/BUILD'
[ 46%] Building CXX object CMakeFiles/message_aggregator.dir/message_aggregator_autogen/mocs_compilation.cpp.o
make[2]: Leaving directory '/usr/src/RPM/BUILD/wsjtx-2.0.0/wsjtx/BUILD'
make[2]: Entering directory '/usr/src/RPM/BUILD/wsjtx-2.0.0/wsjtx/BUILD'
[ 46%] Building Fortran object CMakeFiles/wsjt_fort.dir/lib/spec64.f90.o
/usr/src/RPM/BUILD/wsjtx-2.0.0/wsjtx/lib/spec64.f90:1:33:

    1 | subroutine spec64(c0,npts2,mode64,jpk,s3,LL,NN)
      |                                 1
Warning: Unused dummy argument 'mode64' at (1) [-Wunused-dummy-argument]
/usr/src/RPM/BUILD/wsjtx-2.0.0/wsjtx/lib/spec64.f90:1:26:

    1 | subroutine spec64(c0,npts2,mode64,jpk,s3,LL,NN)
      |                          1
Warning: Unused dummy argument 'npts2' at (1) [-Wunused-dummy-argument]
make[2]: Leaving directory '/usr/src/RPM/BUILD/wsjtx-2.0.0/wsjtx/BUILD'
make[2]: Entering directory '/usr/src/RPM/BUILD/wsjtx-2.0.0/wsjtx/BUILD'
[ 45%] Building Fortran object CMakeFiles/wsjt_fort.dir/lib/softsym9w.f90.o
make[2]: Leaving directory '/usr/src/RPM/BUILD/wsjtx-2.0.0/wsjtx/BUILD'
make[2]: Entering directory '/usr/src/RPM/BUILD/wsjtx-2.0.0/wsjtx/BUILD'
[ 46%] Building Fortran object CMakeFiles/wsjt_fort.dir/lib/spec9f.f90.o
make[2]: Leaving directory '/usr/src/RPM/BUILD/wsjtx-2.0.0/wsjtx/BUILD'
make[2]: Entering directory '/usr/src/RPM/BUILD/wsjtx-2.0.0/wsjtx/BUILD'
[ 43%] Building Fortran object CMakeFiles/wsjt_fort.dir/lib/slasubs.f.o
make[2]: Leaving directory '/usr/src/RPM/BUILD/wsjtx-2.0.0/wsjtx/BUILD'
make[2]: Entering directory '/usr/src/RPM/BUILD/wsjtx-2.0.0/wsjtx/BUILD'
[ 46%] Building Fortran object CMakeFiles/wsjt_fort.dir/lib/sun.f90.o
make[2]: Leaving directory '/usr/src/RPM/BUILD/wsjtx-2.0.0/wsjtx/BUILD'
make[2]: Entering directory '/usr/src/RPM/BUILD/wsjtx-2.0.0/wsjtx/BUILD'
[ 46%] Building Fortran object CMakeFiles/wsjt_fort_omp.dir/lib/wsprd/osdwspr.f90.o
/usr/src/RPM/BUILD/wsjtx-2.0.0/wsjtx/lib/wsprd/osdwspr.f90:167:0:

  167 |                dd=d1+sum(e2sub*absrx(K+1:N))
      | 
Warning: 'd1' may be used uninitialized in this function [-Wmaybe-uninitialized]
make[2]: Leaving directory '/usr/src/RPM/BUILD/wsjtx-2.0.0/wsjtx/BUILD'
make[2]: Entering directory '/usr/src/RPM/BUILD/wsjtx-2.0.0/wsjtx/BUILD'
[ 45%] Building Fortran object CMakeFiles/wsjt_fort_omp.dir/lib/msk144signalquality.f90.o
make[2]: Leaving directory '/usr/src/RPM/BUILD/wsjtx-2.0.0/wsjtx/BUILD'
make[2]: Entering directory '/usr/src/RPM/BUILD/wsjtx-2.0.0/wsjtx/BUILD'
[ 47%] Building Fortran object CMakeFiles/wsjt_fort.dir/lib/symspec65.f90.o
make[2]: Leaving directory '/usr/src/RPM/BUILD/wsjtx-2.0.0/wsjtx/BUILD'
make[2]: Entering directory '/usr/src/RPM/BUILD/wsjtx-2.0.0/wsjtx/BUILD'
[ 47%] Building Fortran object CMakeFiles/wsjt_fort.dir/lib/symspec2.f90.o
make[2]: Leaving directory '/usr/src/RPM/BUILD/wsjtx-2.0.0/wsjtx/BUILD'
make[2]: Entering directory '/usr/src/RPM/BUILD/wsjtx-2.0.0/wsjtx/BUILD'
[ 48%] Building Fortran object CMakeFiles/wsjt_fort_omp.dir/lib/pctile.f90.o
make[2]: Leaving directory '/usr/src/RPM/BUILD/wsjtx-2.0.0/wsjtx/BUILD'
make[2]: Entering directory '/usr/src/RPM/BUILD/wsjtx-2.0.0/wsjtx/BUILD'
[ 48%] Building Fortran object CMakeFiles/wsjt_fort.dir/lib/sync65.f90.o
/usr/src/RPM/BUILD/wsjtx-2.0.0/wsjtx/lib/sync65.f90:1:37:

    1 | subroutine sync65(nfa,nfb,naggressive,ntol,nqsym,ca,ncand,nrobust,   &
      |                                     1
Warning: Unused dummy argument 'naggressive' at (1) [-Wunused-dummy-argument]
make[2]: Leaving directory '/usr/src/RPM/BUILD/wsjtx-2.0.0/wsjtx/BUILD'
make[2]: Entering directory '/usr/src/RPM/BUILD/wsjtx-2.0.0/wsjtx/BUILD'
[ 47%] Building Fortran object CMakeFiles/wsjt_fort.dir/lib/symspec.f90.o
make[2]: Leaving directory '/usr/src/RPM/BUILD/wsjtx-2.0.0/wsjtx/BUILD'
make[2]: Entering directory '/usr/src/RPM/BUILD/wsjtx-2.0.0/wsjtx/BUILD'
[ 48%] Building Fortran object CMakeFiles/wsjt_fort_omp.dir/lib/peakdt9.f90.o
make[2]: Leaving directory '/usr/src/RPM/BUILD/wsjtx-2.0.0/wsjtx/BUILD'
make[2]: Entering directory '/usr/src/RPM/BUILD/wsjtx-2.0.0/wsjtx/BUILD'
[ 49%] Building Fortran object CMakeFiles/wsjt_fort_omp.dir/lib/peakup.f90.o
make[2]: Leaving directory '/usr/src/RPM/BUILD/wsjtx-2.0.0/wsjtx/BUILD'
make[2]: Entering directory '/usr/src/RPM/BUILD/wsjtx-2.0.0/wsjtx/BUILD'
[ 49%] Building Fortran object CMakeFiles/wsjt_fort.dir/lib/ft8/sync8d.f90.o
make[2]: Leaving directory '/usr/src/RPM/BUILD/wsjtx-2.0.0/wsjtx/BUILD'
make[2]: Entering directory '/usr/src/RPM/BUILD/wsjtx-2.0.0/wsjtx/BUILD'
[ 48%] Building Fortran object CMakeFiles/wsjt_fort.dir/lib/sync4.f90.o
make[2]: Leaving directory '/usr/src/RPM/BUILD/wsjtx-2.0.0/wsjtx/BUILD'
make[2]: Entering directory '/usr/src/RPM/BUILD/wsjtx-2.0.0/wsjtx/BUILD'
[ 49%] Building Fortran object CMakeFiles/wsjt_fort_omp.dir/lib/plotsave.f90.o
make[2]: Leaving directory '/usr/src/RPM/BUILD/wsjtx-2.0.0/wsjtx/BUILD'
make[2]: Entering directory '/usr/src/RPM/BUILD/wsjtx-2.0.0/wsjtx/BUILD'
[ 49%] Building Fortran object CMakeFiles/wsjt_fort_omp.dir/lib/platanh.f90.o
make[2]: Leaving directory '/usr/src/RPM/BUILD/wsjtx-2.0.0/wsjtx/BUILD'
make[2]: Entering directory '/usr/src/RPM/BUILD/wsjtx-2.0.0/wsjtx/BUILD'
[ 49%] Building Fortran object CMakeFiles/wsjt_fort_omp.dir/lib/pltanh.f90.o
make[2]: Leaving directory '/usr/src/RPM/BUILD/wsjtx-2.0.0/wsjtx/BUILD'
make[2]: Entering directory '/usr/src/RPM/BUILD/wsjtx-2.0.0/wsjtx/BUILD'
[ 49%] Building Fortran object CMakeFiles/wsjt_fort.dir/lib/sync9f.f90.o
make[2]: Leaving directory '/usr/src/RPM/BUILD/wsjtx-2.0.0/wsjtx/BUILD'
make[2]: Entering directory '/usr/src/RPM/BUILD/wsjtx-2.0.0/wsjtx/BUILD'
[ 49%] Building Fortran object CMakeFiles/wsjt_fort.dir/lib/sync9w.f90.o
make[2]: Leaving directory '/usr/src/RPM/BUILD/wsjtx-2.0.0/wsjtx/BUILD'
make[2]: Entering directory '/usr/src/RPM/BUILD/wsjtx-2.0.0/wsjtx/BUILD'
[ 48%] Building Fortran object CMakeFiles/wsjt_fort.dir/lib/ft8/sync8.f90.o
make[2]: Leaving directory '/usr/src/RPM/BUILD/wsjtx-2.0.0/wsjtx/BUILD'
make[2]: Entering directory '/usr/src/RPM/BUILD/wsjtx-2.0.0/wsjtx/BUILD'
[ 49%] Building Fortran object CMakeFiles/wsjt_fort_omp.dir/lib/polyfit.f90.o
make[2]: Leaving directory '/usr/src/RPM/BUILD/wsjtx-2.0.0/wsjtx/BUILD'
make[2]: Entering directory '/usr/src/RPM/BUILD/wsjtx-2.0.0/wsjtx/BUILD'
[ 18%] Building CXX object CMakeFiles/qcp.dir/qcp_autogen/mocs_compilation.cpp.o
make[2]: Leaving directory '/usr/src/RPM/BUILD/wsjtx-2.0.0/wsjtx/BUILD'
make[2]: Entering directory '/usr/src/RPM/BUILD/wsjtx-2.0.0/wsjtx/BUILD'
[ 49%] Building Fortran object CMakeFiles/wsjt_fort.dir/lib/sync9.f90.o
make[2]: Leaving directory '/usr/src/RPM/BUILD/wsjtx-2.0.0/wsjtx/BUILD'
make[2]: Entering directory '/usr/src/RPM/BUILD/wsjtx-2.0.0/wsjtx/BUILD'
[ 49%] Building Fortran object CMakeFiles/wsjt_fort_omp.dir/lib/ps4.f90.o
make[2]: Leaving directory '/usr/src/RPM/BUILD/wsjtx-2.0.0/wsjtx/BUILD'
make[2]: Entering directory '/usr/src/RPM/BUILD/wsjtx-2.0.0/wsjtx/BUILD'
Scanning dependencies of target udp_daemon
make[2]: Leaving directory '/usr/src/RPM/BUILD/wsjtx-2.0.0/wsjtx/BUILD'
make[2]: Entering directory '/usr/src/RPM/BUILD/wsjtx-2.0.0/wsjtx/BUILD'
[ 50%] Building CXX object CMakeFiles/udp_daemon.dir/udp_daemon_autogen/mocs_compilation.cpp.o
make[2]: Leaving directory '/usr/src/RPM/BUILD/wsjtx-2.0.0/wsjtx/BUILD'
make[2]: Entering directory '/usr/src/RPM/BUILD/wsjtx-2.0.0/wsjtx/BUILD'
[ 49%] Building Fortran object CMakeFiles/wsjt_fort.dir/lib/tweak1.f90.o
make[2]: Leaving directory '/usr/src/RPM/BUILD/wsjtx-2.0.0/wsjtx/BUILD'
make[2]: Entering directory '/usr/src/RPM/BUILD/wsjtx-2.0.0/wsjtx/BUILD'
[ 46%] Building CXX object CMakeFiles/message_aggregator.dir/UDPExamples/MessageAggregator.cpp.o
make[2]: Leaving directory '/usr/src/RPM/BUILD/wsjtx-2.0.0/wsjtx/BUILD'
make[2]: Entering directory '/usr/src/RPM/BUILD/wsjtx-2.0.0/wsjtx/BUILD'
[ 51%] Building CXX object CMakeFiles/message_aggregator.dir/UDPExamples/BeaconsModel.cpp.o
make[2]: Leaving directory '/usr/src/RPM/BUILD/wsjtx-2.0.0/wsjtx/BUILD'
make[2]: Entering directory '/usr/src/RPM/BUILD/wsjtx-2.0.0/wsjtx/BUILD'
[ 48%] Building Fortran object CMakeFiles/wsjt_fort_omp.dir/lib/ft8/osd174_91.f90.o
/usr/src/RPM/BUILD/wsjtx-2.0.0/wsjtx/lib/ft8/osd174_91.f90:145:0:

  145 | do iorder=1,nord
      | 
Warning: 'nord' may be used uninitialized in this function [-Wmaybe-uninitialized]
/usr/src/RPM/BUILD/wsjtx-2.0.0/wsjtx/lib/ft8/osd174_91.f90:195:0:

  195 | if(npre2.eq.1) then
      | 
Warning: 'npre2' may be used uninitialized in this function [-Wmaybe-uninitialized]
/usr/src/RPM/BUILD/wsjtx-2.0.0/wsjtx/lib/ft8/osd174_91.f90:229:0:

  229 |                if(sum(mi).lt.nord+npre1+npre2.or.any(iand(apmaskr(1:K),mi).eq.1)) cycle
      | 
Warning: 'npre1' may be used uninitialized in this function [-Wmaybe-uninitialized]
/usr/src/RPM/BUILD/wsjtx-2.0.0/wsjtx/lib/ft8/osd174_91.f90:175:0:

  175 |                dd=d1+sum(e2sub*absrx(K+1:N))
      | 
Warning: 'd1' may be used uninitialized in this function [-Wmaybe-uninitialized]
make[2]: Leaving directory '/usr/src/RPM/BUILD/wsjtx-2.0.0/wsjtx/BUILD'
make[2]: Entering directory '/usr/src/RPM/BUILD/wsjtx-2.0.0/wsjtx/BUILD'
[ 51%] Building Fortran object CMakeFiles/wsjt_fort_omp.dir/lib/savec2.f90.o
make[2]: Leaving directory '/usr/src/RPM/BUILD/wsjtx-2.0.0/wsjtx/BUILD'
make[2]: Entering directory '/usr/src/RPM/BUILD/wsjtx-2.0.0/wsjtx/BUILD'
[ 51%] Building Fortran object CMakeFiles/wsjt_fort_omp.dir/lib/sec_midn.f90.o
make[2]: Leaving directory '/usr/src/RPM/BUILD/wsjtx-2.0.0/wsjtx/BUILD'
make[2]: Entering directory '/usr/src/RPM/BUILD/wsjtx-2.0.0/wsjtx/BUILD'
[ 52%] Building Fortran object CMakeFiles/wsjt_fort_omp.dir/lib/sh65.f90.o
make[2]: Leaving directory '/usr/src/RPM/BUILD/wsjtx-2.0.0/wsjtx/BUILD'
make[2]: Entering directory '/usr/src/RPM/BUILD/wsjtx-2.0.0/wsjtx/BUILD'
[ 52%] Building Fortran object CMakeFiles/wsjt_fort_omp.dir/lib/sh65snr.f90.o
make[2]: Leaving directory '/usr/src/RPM/BUILD/wsjtx-2.0.0/wsjtx/BUILD'
make[2]: Entering directory '/usr/src/RPM/BUILD/wsjtx-2.0.0/wsjtx/BUILD'
[ 51%] Building CXX object CMakeFiles/message_aggregator.dir/UDPExamples/DecodesModel.cpp.o
make[2]: Leaving directory '/usr/src/RPM/BUILD/wsjtx-2.0.0/wsjtx/BUILD'
make[2]: Entering directory '/usr/src/RPM/BUILD/wsjtx-2.0.0/wsjtx/BUILD'
[ 51%] Building Fortran object CMakeFiles/wsjt_fort_omp.dir/lib/refspectrum.f90.o
make[2]: Leaving directory '/usr/src/RPM/BUILD/wsjtx-2.0.0/wsjtx/BUILD'
make[2]: Entering directory '/usr/src/RPM/BUILD/wsjtx-2.0.0/wsjtx/BUILD'
[ 52%] Building Fortran object CMakeFiles/wsjt_fort_omp.dir/lib/sleep_msec.f90.o
make[2]: Leaving directory '/usr/src/RPM/BUILD/wsjtx-2.0.0/wsjtx/BUILD'
make[2]: Entering directory '/usr/src/RPM/BUILD/wsjtx-2.0.0/wsjtx/BUILD'
[ 50%] Building CXX object CMakeFiles/udp_daemon.dir/UDPExamples/UDPDaemon.cpp.o
make[2]: Leaving directory '/usr/src/RPM/BUILD/wsjtx-2.0.0/wsjtx/BUILD'
make[2]: Entering directory '/usr/src/RPM/BUILD/wsjtx-2.0.0/wsjtx/BUILD'
[ 52%] Building Fortran object CMakeFiles/wsjt_fort_omp.dir/lib/slasubs.f.o
make[2]: Leaving directory '/usr/src/RPM/BUILD/wsjtx-2.0.0/wsjtx/BUILD'
make[2]: Entering directory '/usr/src/RPM/BUILD/wsjtx-2.0.0/wsjtx/BUILD'
[ 52%] Building Fortran object CMakeFiles/wsjt_fort_omp.dir/lib/slope.f90.o
make[2]: Leaving directory '/usr/src/RPM/BUILD/wsjtx-2.0.0/wsjtx/BUILD'
make[2]: Entering directory '/usr/src/RPM/BUILD/wsjtx-2.0.0/wsjtx/BUILD'
[ 52%] Building Fortran object CMakeFiles/wsjt_fort_omp.dir/lib/smo.f90.o
make[2]: Leaving directory '/usr/src/RPM/BUILD/wsjtx-2.0.0/wsjtx/BUILD'
make[2]: Entering directory '/usr/src/RPM/BUILD/wsjtx-2.0.0/wsjtx/BUILD'
[ 52%] Building Fortran object CMakeFiles/wsjt_fort_omp.dir/lib/smo121.f90.o
make[2]: Leaving directory '/usr/src/RPM/BUILD/wsjtx-2.0.0/wsjtx/BUILD'
make[2]: Entering directory '/usr/src/RPM/BUILD/wsjtx-2.0.0/wsjtx/BUILD'
[ 52%] Linking CXX executable udp_daemon
make[2]: Leaving directory '/usr/src/RPM/BUILD/wsjtx-2.0.0/wsjtx/BUILD'
make[1]: Entering directory '/usr/src/RPM/BUILD/wsjtx-2.0.0/wsjtx/BUILD'
[ 52%] Built target udp_daemon
make[1]: Leaving directory '/usr/src/RPM/BUILD/wsjtx-2.0.0/wsjtx/BUILD'
make[2]: Entering directory '/usr/src/RPM/BUILD/wsjtx-2.0.0/wsjtx/BUILD'
[ 52%] Building Fortran object CMakeFiles/wsjt_fort_omp.dir/lib/softsym9f.f90.o
make[2]: Leaving directory '/usr/src/RPM/BUILD/wsjtx-2.0.0/wsjtx/BUILD'
make[2]: Entering directory '/usr/src/RPM/BUILD/wsjtx-2.0.0/wsjtx/BUILD'
[ 52%] Building Fortran object CMakeFiles/wsjt_fort_omp.dir/lib/shell.f90.o
make[2]: Leaving directory '/usr/src/RPM/BUILD/wsjtx-2.0.0/wsjtx/BUILD'
make[2]: Entering directory '/usr/src/RPM/BUILD/wsjtx-2.0.0/wsjtx/BUILD'
[ 52%] Building CXX object CMakeFiles/message_aggregator.dir/qrc_message_aggregator.cpp.o
make[2]: Leaving directory '/usr/src/RPM/BUILD/wsjtx-2.0.0/wsjtx/BUILD'
make[2]: Entering directory '/usr/src/RPM/BUILD/wsjtx-2.0.0/wsjtx/BUILD'
[ 52%] Building Fortran object CMakeFiles/wsjt_fort_omp.dir/lib/softsym9w.f90.o
make[2]: Leaving directory '/usr/src/RPM/BUILD/wsjtx-2.0.0/wsjtx/BUILD'
make[2]: Entering directory '/usr/src/RPM/BUILD/wsjtx-2.0.0/wsjtx/BUILD'
[ 52%] Building Fortran object CMakeFiles/wsjt_fort_omp.dir/lib/spec9f.f90.o
make[2]: Leaving directory '/usr/src/RPM/BUILD/wsjtx-2.0.0/wsjtx/BUILD'
make[2]: Entering directory '/usr/src/RPM/BUILD/wsjtx-2.0.0/wsjtx/BUILD'
[ 52%] Building Fortran object CMakeFiles/wsjt_fort_omp.dir/lib/spec64.f90.o
/usr/src/RPM/BUILD/wsjtx-2.0.0/wsjtx/lib/spec64.f90:1:33:

    1 | subroutine spec64(c0,npts2,mode64,jpk,s3,LL,NN)
      |                                 1
Warning: Unused dummy argument 'mode64' at (1) [-Wunused-dummy-argument]
/usr/src/RPM/BUILD/wsjtx-2.0.0/wsjtx/lib/spec64.f90:1:26:

    1 | subroutine spec64(c0,npts2,mode64,jpk,s3,LL,NN)
      |                          1
Warning: Unused dummy argument 'npts2' at (1) [-Wunused-dummy-argument]
make[2]: Leaving directory '/usr/src/RPM/BUILD/wsjtx-2.0.0/wsjtx/BUILD'
make[2]: Entering directory '/usr/src/RPM/BUILD/wsjtx-2.0.0/wsjtx/BUILD'
[ 52%] Building Fortran object CMakeFiles/wsjt_fort_omp.dir/lib/sun.f90.o
make[2]: Leaving directory '/usr/src/RPM/BUILD/wsjtx-2.0.0/wsjtx/BUILD'
make[2]: Entering directory '/usr/src/RPM/BUILD/wsjtx-2.0.0/wsjtx/BUILD'
[ 52%] Building Fortran object CMakeFiles/wsjt_fort_omp.dir/lib/symspec.f90.o
make[2]: Leaving directory '/usr/src/RPM/BUILD/wsjtx-2.0.0/wsjtx/BUILD'
make[2]: Entering directory '/usr/src/RPM/BUILD/wsjtx-2.0.0/wsjtx/BUILD'
[ 52%] Building Fortran object CMakeFiles/wsjt_fort_omp.dir/lib/symspec2.f90.o
make[2]: Leaving directory '/usr/src/RPM/BUILD/wsjtx-2.0.0/wsjtx/BUILD'
make[2]: Entering directory '/usr/src/RPM/BUILD/wsjtx-2.0.0/wsjtx/BUILD'
[ 52%] Building Fortran object CMakeFiles/wsjt_fort_omp.dir/lib/symspec65.f90.o
make[2]: Leaving directory '/usr/src/RPM/BUILD/wsjtx-2.0.0/wsjtx/BUILD'
make[2]: Entering directory '/usr/src/RPM/BUILD/wsjtx-2.0.0/wsjtx/BUILD'
[ 52%] Building CXX object CMakeFiles/message_aggregator.dir/validators/MaidenheadLocatorValidator.cpp.o
make[2]: Leaving directory '/usr/src/RPM/BUILD/wsjtx-2.0.0/wsjtx/BUILD'
make[2]: Entering directory '/usr/src/RPM/BUILD/wsjtx-2.0.0/wsjtx/BUILD'
[ 52%] Building Fortran object CMakeFiles/wsjt_fort_omp.dir/lib/sync65.f90.o
/usr/src/RPM/BUILD/wsjtx-2.0.0/wsjtx/lib/sync65.f90:1:37:

    1 | subroutine sync65(nfa,nfb,naggressive,ntol,nqsym,ca,ncand,nrobust,   &
      |                                     1
Warning: Unused dummy argument 'naggressive' at (1) [-Wunused-dummy-argument]
make[2]: Leaving directory '/usr/src/RPM/BUILD/wsjtx-2.0.0/wsjtx/BUILD'
make[2]: Entering directory '/usr/src/RPM/BUILD/wsjtx-2.0.0/wsjtx/BUILD'
[ 52%] Building Fortran object CMakeFiles/wsjt_fort_omp.dir/lib/sync4.f90.o
make[2]: Leaving directory '/usr/src/RPM/BUILD/wsjtx-2.0.0/wsjtx/BUILD'
make[2]: Entering directory '/usr/src/RPM/BUILD/wsjtx-2.0.0/wsjtx/BUILD'
[ 52%] Building Fortran object CMakeFiles/wsjt_fort_omp.dir/lib/ft8/sync8d.f90.o
make[2]: Leaving directory '/usr/src/RPM/BUILD/wsjtx-2.0.0/wsjtx/BUILD'
make[2]: Entering directory '/usr/src/RPM/BUILD/wsjtx-2.0.0/wsjtx/BUILD'
[ 52%] Building Fortran object CMakeFiles/wsjt_fort_omp.dir/lib/sync9f.f90.o
make[2]: Leaving directory '/usr/src/RPM/BUILD/wsjtx-2.0.0/wsjtx/BUILD'
make[2]: Entering directory '/usr/src/RPM/BUILD/wsjtx-2.0.0/wsjtx/BUILD'
[ 49%] Building CXX object CMakeFiles/message_aggregator.dir/UDPExamples/MessageAggregatorMainWindow.cpp.o
make[2]: Leaving directory '/usr/src/RPM/BUILD/wsjtx-2.0.0/wsjtx/BUILD'
make[2]: Entering directory '/usr/src/RPM/BUILD/wsjtx-2.0.0/wsjtx/BUILD'
[ 49%] Building Fortran object CMakeFiles/wsjt_fort.dir/lib/synciscat.f90.o
/usr/src/RPM/BUILD/wsjtx-2.0.0/wsjtx/lib/synciscat.f90:2:12:

    2 |      MouseDF,mousebutton,mode4,nafc,psavg,xsync,sig,ndf0,msglen,         &
      |            1
Warning: Unused dummy argument 'mousedf' at (1) [-Wunused-dummy-argument]
/usr/src/RPM/BUILD/wsjtx-2.0.0/wsjtx/lib/synciscat.f90:1:62:

    1 | subroutine synciscat(cdat,npts,nh,npct,s0,jsym,df,ntol,NFreeze,    &
      |                                                              1
Warning: Unused dummy argument 'nfreeze' at (1) [-Wunused-dummy-argument]
make[2]: Leaving directory '/usr/src/RPM/BUILD/wsjtx-2.0.0/wsjtx/BUILD'
make[2]: Entering directory '/usr/src/RPM/BUILD/wsjtx-2.0.0/wsjtx/BUILD'
[ 49%] Building Fortran object CMakeFiles/wsjt_fort.dir/lib/timf2.f90.o
make[2]: Leaving directory '/usr/src/RPM/BUILD/wsjtx-2.0.0/wsjtx/BUILD'
make[2]: Entering directory '/usr/src/RPM/BUILD/wsjtx-2.0.0/wsjtx/BUILD'
[ 52%] Building Fortran object CMakeFiles/wsjt_fort_omp.dir/lib/sync9.f90.o
make[2]: Leaving directory '/usr/src/RPM/BUILD/wsjtx-2.0.0/wsjtx/BUILD'
make[2]: Entering directory '/usr/src/RPM/BUILD/wsjtx-2.0.0/wsjtx/BUILD'
[ 52%] Building Fortran object CMakeFiles/wsjt_fort_omp.dir/lib/ft8/sync8.f90.o
make[2]: Leaving directory '/usr/src/RPM/BUILD/wsjtx-2.0.0/wsjtx/BUILD'
make[2]: Entering directory '/usr/src/RPM/BUILD/wsjtx-2.0.0/wsjtx/BUILD'
[ 54%] Building Fortran object CMakeFiles/wsjt_fort_omp.dir/lib/tweak1.f90.o
make[2]: Leaving directory '/usr/src/RPM/BUILD/wsjtx-2.0.0/wsjtx/BUILD'
make[2]: Entering directory '/usr/src/RPM/BUILD/wsjtx-2.0.0/wsjtx/BUILD'
[ 53%] Building Fortran object CMakeFiles/wsjt_fort.dir/lib/ft8/twkfreq1.f90.o
make[2]: Leaving directory '/usr/src/RPM/BUILD/wsjtx-2.0.0/wsjtx/BUILD'
make[2]: Entering directory '/usr/src/RPM/BUILD/wsjtx-2.0.0/wsjtx/BUILD'
[ 53%] Building Fortran object CMakeFiles/wsjt_fort.dir/lib/twkfreq.f90.o
make[2]: Leaving directory '/usr/src/RPM/BUILD/wsjtx-2.0.0/wsjtx/BUILD'
make[2]: Entering directory '/usr/src/RPM/BUILD/wsjtx-2.0.0/wsjtx/BUILD'
[ 54%] Building Fortran object CMakeFiles/wsjt_fort_omp.dir/lib/ft8/twkfreq1.f90.o
make[2]: Leaving directory '/usr/src/RPM/BUILD/wsjtx-2.0.0/wsjtx/BUILD'
make[2]: Entering directory '/usr/src/RPM/BUILD/wsjtx-2.0.0/wsjtx/BUILD'
[ 54%] Building Fortran object CMakeFiles/wsjt_fort_omp.dir/lib/twkfreq65.f90.o
make[2]: Leaving directory '/usr/src/RPM/BUILD/wsjtx-2.0.0/wsjtx/BUILD'
make[2]: Entering directory '/usr/src/RPM/BUILD/wsjtx-2.0.0/wsjtx/BUILD'
[ 54%] Building Fortran object CMakeFiles/wsjt_fort_omp.dir/lib/twkfreq.f90.o
make[2]: Leaving directory '/usr/src/RPM/BUILD/wsjtx-2.0.0/wsjtx/BUILD'
make[2]: Entering directory '/usr/src/RPM/BUILD/wsjtx-2.0.0/wsjtx/BUILD'
[ 54%] Building Fortran object CMakeFiles/wsjt_fort.dir/lib/twkfreq65.f90.o
make[2]: Leaving directory '/usr/src/RPM/BUILD/wsjtx-2.0.0/wsjtx/BUILD'
make[2]: Entering directory '/usr/src/RPM/BUILD/wsjtx-2.0.0/wsjtx/BUILD'
[ 54%] Building Fortran object CMakeFiles/wsjt_fort_omp.dir/lib/update_recent_calls.f90.o
make[2]: Leaving directory '/usr/src/RPM/BUILD/wsjtx-2.0.0/wsjtx/BUILD'
make[2]: Entering directory '/usr/src/RPM/BUILD/wsjtx-2.0.0/wsjtx/BUILD'
[ 52%] Building Fortran object CMakeFiles/wsjt_fort_omp.dir/lib/sync9w.f90.o
make[2]: Leaving directory '/usr/src/RPM/BUILD/wsjtx-2.0.0/wsjtx/BUILD'
make[2]: Entering directory '/usr/src/RPM/BUILD/wsjtx-2.0.0/wsjtx/BUILD'
[ 55%] Building Fortran object CMakeFiles/wsjt_fort.dir/lib/update_recent_calls.f90.o
make[2]: Leaving directory '/usr/src/RPM/BUILD/wsjtx-2.0.0/wsjtx/BUILD'
make[2]: Entering directory '/usr/src/RPM/BUILD/wsjtx-2.0.0/wsjtx/BUILD'
[ 55%] Building Fortran object CMakeFiles/wsjt_fort_omp.dir/lib/ft8/watterson.f90.o
make[2]: Leaving directory '/usr/src/RPM/BUILD/wsjtx-2.0.0/wsjtx/BUILD'
make[2]: Entering directory '/usr/src/RPM/BUILD/wsjtx-2.0.0/wsjtx/BUILD'
[ 55%] Building Fortran object CMakeFiles/wsjt_fort_omp.dir/lib/wav11.f90.o
make[2]: Leaving directory '/usr/src/RPM/BUILD/wsjtx-2.0.0/wsjtx/BUILD'
make[2]: Entering directory '/usr/src/RPM/BUILD/wsjtx-2.0.0/wsjtx/BUILD'
[ 55%] Building Fortran object CMakeFiles/wsjt_fort_omp.dir/lib/wav12.f90.o
/usr/src/RPM/BUILD/wsjtx-2.0.0/wsjtx/lib/wav12.f90:30:0:

   30 |         i1=d1a(i)
      | 
Warning: 'MEM[(integer(kind=1) *)&d1a]' may be used uninitialized in this function [-Wmaybe-uninitialized]
make[2]: Leaving directory '/usr/src/RPM/BUILD/wsjtx-2.0.0/wsjtx/BUILD'
make[2]: Entering directory '/usr/src/RPM/BUILD/wsjtx-2.0.0/wsjtx/BUILD'
[ 55%] Building Fortran object CMakeFiles/wsjt_fort.dir/lib/ft8/watterson.f90.o
make[2]: Leaving directory '/usr/src/RPM/BUILD/wsjtx-2.0.0/wsjtx/BUILD'
make[2]: Entering directory '/usr/src/RPM/BUILD/wsjtx-2.0.0/wsjtx/BUILD'
[ 55%] Building Fortran object CMakeFiles/wsjt_fort.dir/lib/wav12.f90.o
make[2]: Leaving directory '/usr/src/RPM/BUILD/wsjtx-2.0.0/wsjtx/BUILD'
make[2]: Entering directory '/usr/src/RPM/BUILD/wsjtx-2.0.0/wsjtx/BUILD'
[ 55%] Building Fortran object CMakeFiles/wsjt_fort.dir/lib/wav11.f90.o
make[2]: Leaving directory '/usr/src/RPM/BUILD/wsjtx-2.0.0/wsjtx/BUILD'
make[2]: Entering directory '/usr/src/RPM/BUILD/wsjtx-2.0.0/wsjtx/BUILD'
[ 54%] Building Fortran object CMakeFiles/wsjt_fort_omp.dir/lib/timf2.f90.o
make[2]: Leaving directory '/usr/src/RPM/BUILD/wsjtx-2.0.0/wsjtx/BUILD'
make[2]: Entering directory '/usr/src/RPM/BUILD/wsjtx-2.0.0/wsjtx/BUILD'
[ 53%] Building Fortran object CMakeFiles/wsjt_fort_omp.dir/lib/synciscat.f90.o
/usr/src/RPM/BUILD/wsjtx-2.0.0/wsjtx/lib/synciscat.f90:2:12:

    2 |      MouseDF,mousebutton,mode4,nafc,psavg,xsync,sig,ndf0,msglen,         &
      |            1
Warning: Unused dummy argument 'mousedf' at (1) [-Wunused-dummy-argument]
/usr/src/RPM/BUILD/wsjtx-2.0.0/wsjtx/lib/synciscat.f90:1:62:

    1 | subroutine synciscat(cdat,npts,nh,npct,s0,jsym,df,ntol,NFreeze,    &
      |                                                              1
Warning: Unused dummy argument 'nfreeze' at (1) [-Wunused-dummy-argument]
make[2]: Leaving directory '/usr/src/RPM/BUILD/wsjtx-2.0.0/wsjtx/BUILD'
make[2]: Entering directory '/usr/src/RPM/BUILD/wsjtx-2.0.0/wsjtx/BUILD'
[ 56%] Building Fortran object CMakeFiles/wsjt_fort_omp.dir/lib/wspr_downsample.f90.o
make[2]: Leaving directory '/usr/src/RPM/BUILD/wsjtx-2.0.0/wsjtx/BUILD'
make[2]: Entering directory '/usr/src/RPM/BUILD/wsjtx-2.0.0/wsjtx/BUILD'
[ 55%] Building Fortran object CMakeFiles/wsjt_fort.dir/lib/xcor4.f90.o
make[2]: Leaving directory '/usr/src/RPM/BUILD/wsjtx-2.0.0/wsjtx/BUILD'
make[2]: Entering directory '/usr/src/RPM/BUILD/wsjtx-2.0.0/wsjtx/BUILD'
[ 55%] Building Fortran object CMakeFiles/wsjt_fort_omp.dir/lib/xcor4.f90.o
make[2]: Leaving directory '/usr/src/RPM/BUILD/wsjtx-2.0.0/wsjtx/BUILD'
make[2]: Entering directory '/usr/src/RPM/BUILD/wsjtx-2.0.0/wsjtx/BUILD'
[ 56%] Building Fortran object CMakeFiles/wsjt_fort_omp.dir/lib/zplot9.f90.o
make[2]: Leaving directory '/usr/src/RPM/BUILD/wsjtx-2.0.0/wsjtx/BUILD'
make[2]: Entering directory '/usr/src/RPM/BUILD/wsjtx-2.0.0/wsjtx/BUILD'
[ 56%] Building Fortran object CMakeFiles/wsjt_fort.dir/lib/wspr_downsample.f90.o
make[2]: Leaving directory '/usr/src/RPM/BUILD/wsjtx-2.0.0/wsjtx/BUILD'
make[2]: Entering directory '/usr/src/RPM/BUILD/wsjtx-2.0.0/wsjtx/BUILD'
[ 56%] Building Fortran object CMakeFiles/wsjt_fort_omp.dir/lib/timer_C_wrapper.f90.o
make[2]: Leaving directory '/usr/src/RPM/BUILD/wsjtx-2.0.0/wsjtx/BUILD'
make[2]: Entering directory '/usr/src/RPM/BUILD/wsjtx-2.0.0/wsjtx/BUILD'
[ 55%] Building Fortran object CMakeFiles/wsjt_fort_omp.dir/lib/wqdecode.f90.o
/usr/src/RPM/BUILD/wsjtx-2.0.0/wsjtx/lib/wqdecode.f90:59:26:

   59 |         write(cdbm,'(i3)'),ntype
      |                          1
Warning: Legacy Extension: Comma before i/o item list at (1)
/usr/src/RPM/BUILD/wsjtx-2.0.0/wsjtx/lib/wqdecode.f90:319:26:

  319 |      call1=pfx//'/'//call1
      |                          1
Warning: CHARACTER expression will be truncated in assignment (12/16) at (1) [-Wcharacter-truncation]
/usr/src/RPM/BUILD/wsjtx-2.0.0/wsjtx/lib/wqdecode.f90:72:26:

   72 |         write(cdbm,'(i3)'),ndbm
      |                          1
Warning: Legacy Extension: Comma before i/o item list at (1)
/usr/src/RPM/BUILD/wsjtx-2.0.0/wsjtx/lib/wqdecode.f90:85:23:

   85 |      write(cdbm,'(i3)'),ndbm
      |                       1
Warning: Legacy Extension: Comma before i/o item list at (1)
make[2]: Leaving directory '/usr/src/RPM/BUILD/wsjtx-2.0.0/wsjtx/BUILD'
make[2]: Entering directory '/usr/src/RPM/BUILD/wsjtx-2.0.0/wsjtx/BUILD'
[ 56%] Building Fortran object CMakeFiles/wsjt_fort.dir/lib/zplot9.f90.o
make[2]: Leaving directory '/usr/src/RPM/BUILD/wsjtx-2.0.0/wsjtx/BUILD'
make[2]: Entering directory '/usr/src/RPM/BUILD/wsjtx-2.0.0/wsjtx/BUILD'
[ 56%] Building Fortran object CMakeFiles/wsjt_fort_omp.dir/lib/jt9_decode.f90.o
make[2]: Leaving directory '/usr/src/RPM/BUILD/wsjtx-2.0.0/wsjtx/BUILD'
make[2]: Entering directory '/usr/src/RPM/BUILD/wsjtx-2.0.0/wsjtx/BUILD'
[ 56%] Building Fortran object CMakeFiles/wsjt_fort.dir/lib/timer_C_wrapper.f90.o
make[2]: Leaving directory '/usr/src/RPM/BUILD/wsjtx-2.0.0/wsjtx/BUILD'
make[2]: Entering directory '/usr/src/RPM/BUILD/wsjtx-2.0.0/wsjtx/BUILD'
[ 56%] Building Fortran object CMakeFiles/wsjt_fort_omp.dir/lib/ana64.f90.o
make[2]: Leaving directory '/usr/src/RPM/BUILD/wsjtx-2.0.0/wsjtx/BUILD'
make[2]: Entering directory '/usr/src/RPM/BUILD/wsjtx-2.0.0/wsjtx/BUILD'
[ 57%] Building Fortran object CMakeFiles/wsjt_fort.dir/lib/timer_impl.f90.o
make[2]: Leaving directory '/usr/src/RPM/BUILD/wsjtx-2.0.0/wsjtx/BUILD'
make[2]: Entering directory '/usr/src/RPM/BUILD/wsjtx-2.0.0/wsjtx/BUILD'
[ 55%] Building Fortran object CMakeFiles/wsjt_fort.dir/lib/wqdecode.f90.o
/usr/src/RPM/BUILD/wsjtx-2.0.0/wsjtx/lib/wqdecode.f90:59:26:

   59 |         write(cdbm,'(i3)'),ntype
      |                          1
Warning: Legacy Extension: Comma before i/o item list at (1)
/usr/src/RPM/BUILD/wsjtx-2.0.0/wsjtx/lib/wqdecode.f90:319:26:

  319 |      call1=pfx//'/'//call1
      |                          1
Warning: CHARACTER expression will be truncated in assignment (12/16) at (1) [-Wcharacter-truncation]
/usr/src/RPM/BUILD/wsjtx-2.0.0/wsjtx/lib/wqdecode.f90:72:26:

   72 |         write(cdbm,'(i3)'),ndbm
      |                          1
Warning: Legacy Extension: Comma before i/o item list at (1)
/usr/src/RPM/BUILD/wsjtx-2.0.0/wsjtx/lib/wqdecode.f90:85:23:

   85 |      write(cdbm,'(i3)'),ndbm
      |                       1
Warning: Legacy Extension: Comma before i/o item list at (1)
make[2]: Leaving directory '/usr/src/RPM/BUILD/wsjtx-2.0.0/wsjtx/BUILD'
make[2]: Entering directory '/usr/src/RPM/BUILD/wsjtx-2.0.0/wsjtx/BUILD'
[ 58%] Building Fortran object CMakeFiles/wsjt_fort.dir/lib/ana64.f90.o
make[2]: Leaving directory '/usr/src/RPM/BUILD/wsjtx-2.0.0/wsjtx/BUILD'
make[2]: Entering directory '/usr/src/RPM/BUILD/wsjtx-2.0.0/wsjtx/BUILD'
[ 57%] Building Fortran object CMakeFiles/wsjt_fort_omp.dir/lib/bpdecode128_90.f90.o
/usr/src/RPM/BUILD/wsjtx-2.0.0/wsjtx/lib/bpdecode128_90.f90:70:0:

   70 |       nd=ncheck-nclast
      | 
Warning: 'nclast' may be used uninitialized in this function [-Wmaybe-uninitialized]
make[2]: Leaving directory '/usr/src/RPM/BUILD/wsjtx-2.0.0/wsjtx/BUILD'
make[2]: Entering directory '/usr/src/RPM/BUILD/wsjtx-2.0.0/wsjtx/BUILD'
[ 52%] Building CXX object CMakeFiles/message_aggregator.dir/UDPExamples/ClientWidget.cpp.o
make[2]: Leaving directory '/usr/src/RPM/BUILD/wsjtx-2.0.0/wsjtx/BUILD'
make[2]: Entering directory '/usr/src/RPM/BUILD/wsjtx-2.0.0/wsjtx/BUILD'
[ 58%] Building Fortran object CMakeFiles/wsjt_fort_omp.dir/lib/ft8/chkcrc13a.f90.o
/usr/src/RPM/BUILD/wsjtx-2.0.0/wsjtx/lib/ft8/chkcrc13a.f90:16:26:

   16 |   i1Dec8BitBytes(10)=iand(i1Dec8BitBytes(10),128+64+32+16+8)
      |                          1
Error: Arguments of 'iand' have different kind type parameters at (1)
make[2]: *** [CMakeFiles/wsjt_fort_omp.dir/build.make:583: CMakeFiles/wsjt_fort_omp.dir/lib/ft8/chkcrc13a.f90.o] Error 1
make[2]: Leaving directory '/usr/src/RPM/BUILD/wsjtx-2.0.0/wsjtx/BUILD'
make[2]: *** Waiting for unfinished jobs....
make[2]: Entering directory '/usr/src/RPM/BUILD/wsjtx-2.0.0/wsjtx/BUILD'
[ 56%] Building Fortran object CMakeFiles/wsjt_fort.dir/lib/jt9_decode.f90.o
make[2]: Leaving directory '/usr/src/RPM/BUILD/wsjtx-2.0.0/wsjtx/BUILD'
make[2]: Entering directory '/usr/src/RPM/BUILD/wsjtx-2.0.0/wsjtx/BUILD'
[ 56%] Building Fortran object CMakeFiles/wsjt_fort_omp.dir/lib/timer_impl.f90.o
make[2]: Leaving directory '/usr/src/RPM/BUILD/wsjtx-2.0.0/wsjtx/BUILD'
make[2]: Entering directory '/usr/src/RPM/BUILD/wsjtx-2.0.0/wsjtx/BUILD'
[ 58%] Building Fortran object CMakeFiles/wsjt_fort.dir/lib/ft8/chkcrc13a.f90.o
/usr/src/RPM/BUILD/wsjtx-2.0.0/wsjtx/lib/ft8/chkcrc13a.f90:16:26:

   16 |   i1Dec8BitBytes(10)=iand(i1Dec8BitBytes(10),128+64+32+16+8)
      |                          1
Error: Arguments of 'iand' have different kind type parameters at (1)
make[2]: *** [CMakeFiles/wsjt_fort.dir/build.make:583: CMakeFiles/wsjt_fort.dir/lib/ft8/chkcrc13a.f90.o] Error 1
make[2]: Leaving directory '/usr/src/RPM/BUILD/wsjtx-2.0.0/wsjtx/BUILD'
make[2]: *** Waiting for unfinished jobs....
make[2]: Entering directory '/usr/src/RPM/BUILD/wsjtx-2.0.0/wsjtx/BUILD'
[ 58%] Building Fortran object CMakeFiles/wsjt_fort.dir/lib/ft8/chkcrc14a.f90.o
/usr/src/RPM/BUILD/wsjtx-2.0.0/wsjtx/lib/ft8/chkcrc14a.f90:16:26:

   16 |   i1Dec8BitBytes(10)=iand(i1Dec8BitBytes(10),128+64+32+16+8)
      |                          1
Error: Arguments of 'iand' have different kind type parameters at (1)
make[2]: *** [CMakeFiles/wsjt_fort.dir/build.make:596: CMakeFiles/wsjt_fort.dir/lib/ft8/chkcrc14a.f90.o] Error 1
make[2]: Leaving directory '/usr/src/RPM/BUILD/wsjtx-2.0.0/wsjtx/BUILD'
make[2]: Entering directory '/usr/src/RPM/BUILD/wsjtx-2.0.0/wsjtx/BUILD'
[ 58%] Building Fortran object CMakeFiles/wsjt_fort_omp.dir/lib/ft8/bpdecode174_91.f90.o
/usr/src/RPM/BUILD/wsjtx-2.0.0/wsjtx/lib/ft8/bpdecode174_91.f90:70:0:

   70 |     nd=ncheck-nclast
      | 
Warning: 'nclast' may be used uninitialized in this function [-Wmaybe-uninitialized]
make[2]: Leaving directory '/usr/src/RPM/BUILD/wsjtx-2.0.0/wsjtx/BUILD'
make[1]: *** [CMakeFiles/Makefile2:737: CMakeFiles/wsjt_fort_omp.dir/all] Error 2
make[1]: *** Waiting for unfinished jobs....
make[2]: Entering directory '/usr/src/RPM/BUILD/wsjtx-2.0.0/wsjtx/BUILD'
[ 58%] Building Fortran object CMakeFiles/wsjt_fort.dir/lib/decode4.f90.o
make[2]: Leaving directory '/usr/src/RPM/BUILD/wsjtx-2.0.0/wsjtx/BUILD'
make[2]: Entering directory '/usr/src/RPM/BUILD/wsjtx-2.0.0/wsjtx/BUILD'
[ 58%] Building Fortran object CMakeFiles/wsjt_fort.dir/lib/bpdecode128_90.f90.o
/usr/src/RPM/BUILD/wsjtx-2.0.0/wsjtx/lib/bpdecode128_90.f90:70:0:

   70 |       nd=ncheck-nclast
      | 
Warning: 'nclast' may be used uninitialized in this function [-Wmaybe-uninitialized]
make[2]: Leaving directory '/usr/src/RPM/BUILD/wsjtx-2.0.0/wsjtx/BUILD'
make[2]: Entering directory '/usr/src/RPM/BUILD/wsjtx-2.0.0/wsjtx/BUILD'
[ 58%] Building Fortran object CMakeFiles/wsjt_fort.dir/lib/ft8/bpdecode174_91.f90.o
/usr/src/RPM/BUILD/wsjtx-2.0.0/wsjtx/lib/ft8/bpdecode174_91.f90:70:0:

   70 |     nd=ncheck-nclast
      | 
Warning: 'nclast' may be used uninitialized in this function [-Wmaybe-uninitialized]
make[2]: Leaving directory '/usr/src/RPM/BUILD/wsjtx-2.0.0/wsjtx/BUILD'
make[1]: *** [CMakeFiles/Makefile2:1087: CMakeFiles/wsjt_fort.dir/all] Error 2
make[2]: Entering directory '/usr/src/RPM/BUILD/wsjtx-2.0.0/wsjtx/BUILD'
[ 58%] Linking CXX executable message_aggregator
make[2]: Leaving directory '/usr/src/RPM/BUILD/wsjtx-2.0.0/wsjtx/BUILD'
make[1]: Entering directory '/usr/src/RPM/BUILD/wsjtx-2.0.0/wsjtx/BUILD'
[ 58%] Built target message_aggregator
make[1]: Leaving directory '/usr/src/RPM/BUILD/wsjtx-2.0.0/wsjtx/BUILD'
make[2]: Entering directory '/usr/src/RPM/BUILD/wsjtx-2.0.0/wsjtx/BUILD'
[ 19%] Building CXX object CMakeFiles/qcp.dir/qcustomplot-source/qcustomplot.cpp.o
make[2]: Leaving directory '/usr/src/RPM/BUILD/wsjtx-2.0.0/wsjtx/BUILD'
make[2]: Entering directory '/usr/src/RPM/BUILD/wsjtx-2.0.0/wsjtx/BUILD'
[ 58%] Linking CXX static library libqcp.a
make[2]: Leaving directory '/usr/src/RPM/BUILD/wsjtx-2.0.0/wsjtx/BUILD'
make[1]: Entering directory '/usr/src/RPM/BUILD/wsjtx-2.0.0/wsjtx/BUILD'
[ 58%] Built target qcp
make[1]: Leaving directory '/usr/src/RPM/BUILD/wsjtx-2.0.0/wsjtx/BUILD'
make: *** [Makefile:152: all] Error 2
error: Bad exit status from /usr/src/tmp/rpm-tmp.38984 (%build)


RPM build errors:
    Bad exit status from /usr/src/tmp/rpm-tmp.38984 (%build)
Command exited with non-zero status 1
111.36user 10.12system 0:50.68elapsed 239%CPU (0avgtext+0avgdata 788300maxresident)k
0inputs+0outputs (0major+3920851minor)pagefaults 0swaps
hsh-rebuild: rebuild of `wsjtx-2.0.0-alt1.src.rpm' failed.
Command exited with non-zero status 1
236.16user 20.78system 3:09.64elapsed 135%CPU (0avgtext+0avgdata 788300maxresident)k
1184inputs+0outputs (0major+5265317minor)pagefaults 0swaps