<86>Jul 19 04:41:34 userdel[129473]: delete user 'rooter'
<86>Jul 19 04:41:34 groupadd[129480]: group added to /etc/group: name=rooter, GID=699
<86>Jul 19 04:41:34 groupadd[129480]: group added to /etc/gshadow: name=rooter
<86>Jul 19 04:41:34 groupadd[129480]: new group: name=rooter, GID=699
<86>Jul 19 04:41:34 useradd[129484]: new user: name=rooter, UID=699, GID=699, home=/root, shell=/bin/bash
<86>Jul 19 04:41:34 userdel[129494]: delete user 'builder'
<86>Jul 19 04:41:34 userdel[129494]: removed group 'builder' owned by 'builder'
<86>Jul 19 04:41:34 userdel[129494]: removed shadow group 'builder' owned by 'builder'
<86>Jul 19 04:41:34 groupadd[129500]: group added to /etc/group: name=builder, GID=700
<86>Jul 19 04:41:34 groupadd[129500]: group added to /etc/gshadow: name=builder
<86>Jul 19 04:41:34 groupadd[129500]: new group: name=builder, GID=700
<86>Jul 19 04:41:34 useradd[129505]: new user: name=builder, UID=700, GID=700, home=/usr/src, shell=/bin/bash
<13>Jul 19 04:41:35 rpmi: rpm-macros-kde-common-devel-14.12.1-alt1 1422279175 installed
<13>Jul 19 04:41:35 rpmi: strace-5.2-alt1 sisyphus+234303.100.1.1 1562937939 installed
<13>Jul 19 04:41:35 rpmi: ed-1:0.2-alt10 1449768441 installed
<13>Jul 19 04:41:35 rpmi: rpm-utils-0.10.2-alt1 sisyphus+232744.200.2.1 1561066420 installed
<13>Jul 19 04:41:35 rpmi: kde-common-devel-14.12.1-alt1 1422279175 installed
<13>Jul 19 04:41:48 rpmi: xorg-proto-devel-2019.1-alt1 sisyphus+232786.100.1.1 1561106722 installed
<13>Jul 19 04:41:48 rpmi: libjpeg-2:2.0.2-alt1 sisyphus+226996.100.1.1 1554902884 installed
<13>Jul 19 04:41:48 rpmi: libgpg-error-1.36-alt1 sisyphus+225621.300.1.1 1553521088 installed
<13>Jul 19 04:41:48 rpmi: libexpat-2.2.4-alt1 1503305341 installed
<13>Jul 19 04:41:48 rpmi: libboost_system1.67.0-1:1.67.0-alt8 sisyphus+231326.100.1.1 1559468166 installed
<13>Jul 19 04:41:48 rpmi: libICE-1.0.9-alt1 1409902719 installed
<13>Jul 19 04:41:48 rpmi: libpng16-1.6.36-alt1 sisyphus+219478.100.1.1 1547633315 installed
<13>Jul 19 04:41:49 rpmi: libicu64-1:6.4.2-alt1 sisyphus+227580.100.1.2 1555784315 installed
<13>Jul 19 04:41:49 rpmi: libSM-1.2.3-alt1 sisyphus+226734.100.2.1 1554586157 installed
<13>Jul 19 04:41:49 rpmi: libglvnd-7:1.1.1-alt1 sisyphus+224993.100.4.1 1552634540 installed
<13>Jul 19 04:41:49 rpmi: xml-utils-1:2.9.9.0.52.f824-alt1 sisyphus+229881.200.3.1 1558978732 installed
<13>Jul 19 04:41:49 rpmi: libgcrypt20-1.8.4-alt3 sisyphus+232944.100.1.1 1561281796 installed
<13>Jul 19 04:41:49 rpmi: libxslt-1.1.33-alt1 sisyphus+226936.100.1.1 1554820927 installed
<13>Jul 19 04:41:49 rpmi: shared-mime-info-1.12-alt1 sisyphus+219597.100.2.2 1548056998 installed
<13>Jul 19 04:41:49 rpmi: libogg-1.3.3-alt1 sisyphus+221902.4000.4.1 1550598413 installed
<13>Jul 19 04:41:49 rpmi: kde-common-15.12.1-alt1 1453450782 installed
<13>Jul 19 04:41:49 rpmi: kde4pimlibs-common-4.14.11-alt10 sisyphus+232167.100.2.2 1560772087 installed
<13>Jul 19 04:41:49 rpmi: libsqlite3-3.28.0-alt1 sisyphus+231334.100.1.1 1559488286 installed
<13>Jul 19 04:41:49 rpmi: libidn2-2.2.0-alt1 sisyphus+229970.100.1.1 1558625623 installed
<13>Jul 19 04:41:49 rpmi: libnettle6-3.4.1-alt1 sisyphus+226533.100.2.1 1554512181 installed
<13>Jul 19 04:41:49 rpmi: libopenblas-0.2.20-alt2 sisyphus+229410.100.1.1 1557920443 installed
<13>Jul 19 04:41:49 rpmi: libical-3.0.5-alt1 sisyphus+231133.400.1.1 1559164312 installed
<13>Jul 19 04:41:49 rpmi: libICE-devel-1.0.9-alt1 1409902719 installed
<13>Jul 19 04:41:49 rpmi: libSM-devel-1.2.3-alt1 sisyphus+226734.100.2.1 1554586157 installed
<13>Jul 19 04:41:49 rpmi: libassuan-2.5.3-alt1 sisyphus+225621.400.1.1 1553521229 installed
<13>Jul 19 04:41:49 rpmi: libgpg-error-devel-1.36-alt1 sisyphus+225621.300.1.1 1553521088 installed
<86>Jul 19 04:41:49 groupadd[32272]: group added to /etc/group: name=utempter, GID=499
<86>Jul 19 04:41:49 groupadd[32272]: group added to /etc/gshadow: name=utempter
<86>Jul 19 04:41:50 groupadd[32272]: new group: name=utempter, GID=499
<13>Jul 19 04:41:50 rpmi: libutempter-1.1.6-alt2 1299636222 installed
<13>Jul 19 04:41:50 rpmi: libgif-4.1.6-alt3 1299634266 installed
<13>Jul 19 04:41:50 rpmi: libwebp7-1.0.3-alt1 sisyphus+234493.100.1.1 1563090161 installed
<13>Jul 19 04:41:50 rpmi: libXdmcp-1.1.3-alt1 sisyphus+225206.600.1.2 1552949347 installed
<13>Jul 19 04:41:50 rpmi: libXau-1.0.9-alt1 sisyphus+223149.200.2.1 1551268156 installed
<13>Jul 19 04:41:50 rpmi: libxcb-1.13.1-alt1 sisyphus+226527.100.2.2 1554593799 installed
<13>Jul 19 04:41:50 rpmi: libwayland-server-1.17.0-alt1 sisyphus+225894.100.1.1 1553872803 installed
<13>Jul 19 04:41:50 rpmi: zlib-devel-1.2.11-alt1 sisyphus+221902.6000.4.1 1550600768 installed
<13>Jul 19 04:41:50 rpmi: ilmbase12-common-2.2.0-alt1.1 1434451064 installed
<13>Jul 19 04:41:50 rpmi: libiex12-2.2.0-alt1.1 1434451064 installed
<13>Jul 19 04:41:50 rpmi: libhalf12-2.2.0-alt1.1 1434451064 installed
<13>Jul 19 04:41:50 rpmi: su-0.60-alt35 1484567251 installed
<13>Jul 19 04:41:50 rpmi: libgraphite2-1.3.13-alt2 sisyphus+226799.100.1.1 1554648233 installed
<13>Jul 19 04:41:50 rpmi: libharfbuzz-2.5.3-alt1 sisyphus+233337.100.1.1 1561643295 installed
<13>Jul 19 04:41:50 rpmi: libfreetype-2.10.0-alt2 sisyphus+226881.100.2.1 1555676284 installed
<13>Jul 19 04:41:50 rpmi: fontconfig-2.13.1-alt1 sisyphus+226691.100.2.2 1554598717 installed
Updating fonts cache: <29>Jul 19 04:41:51 fontconfig: Updating fonts cache: succeeded
[ DONE ]
<13>Jul 19 04:41:51 rpmi: libgdbm-1.8.3-alt10 1454943313 installed
<13>Jul 19 04:41:51 rpmi: libp11-kit-0.23.15-alt1 sisyphus+226408.100.2.1 1554288187 installed
<13>Jul 19 04:41:51 rpmi: libtasn1-4.13-alt2 1521133848 installed
<13>Jul 19 04:41:51 rpmi: qt4-common-4.8.7-alt16 sisyphus+226856.100.2.1 1554784839 installed
<13>Jul 19 04:41:51 rpmi: libqt4-core-4.8.7-alt16 sisyphus+226856.100.2.1 1554784839 installed
<13>Jul 19 04:41:51 rpmi: libqt4-xml-4.8.7-alt16 sisyphus+226856.100.2.1 1554784839 installed
<13>Jul 19 04:41:51 rpmi: libqt4-sql-4.8.7-alt16 sisyphus+226856.100.2.1 1554784839 installed
<13>Jul 19 04:41:51 rpmi: libqjson-0.8.1-alt2 1446565444 installed
<13>Jul 19 04:41:51 rpmi: icon-theme-hicolor-0.17-alt1 1505715846 installed
<13>Jul 19 04:41:51 rpmi: menu-icons-default-0.2.0.20-alt1 1479213521 installed
<13>Jul 19 04:41:51 rpmi: altlinux-freedesktop-menu-icon-theme-default-0.0.26-alt1 1366231495 installed
<13>Jul 19 04:41:51 rpmi: libqt4-sql-sqlite-4.8.7-alt16 sisyphus+226856.100.2.1 1554784839 installed
<13>Jul 19 04:41:51 rpmi: automoc-0.9.88-alt1.qa1 1366273810 installed
<13>Jul 19 04:41:51 rpmi: libqt4-test-4.8.7-alt16 sisyphus+226856.100.2.1 1554784839 installed
<13>Jul 19 04:41:51 rpmi: libqt4-clucene-4.8.7-alt16 sisyphus+226856.100.2.1 1554784839 installed
<13>Jul 19 04:41:51 rpmi: rpm-macros-qt4-4.8.7-alt16 sisyphus+226856.100.2.1 1554784839 installed
<13>Jul 19 04:41:51 rpmi: libharfbuzz-icu-2.5.3-alt1 sisyphus+233337.100.1.1 1561643295 installed
<13>Jul 19 04:41:51 rpmi: libgraphite2-devel-1.3.13-alt2 sisyphus+226799.100.1.1 1554648233 installed
<13>Jul 19 04:41:51 rpmi: libilmthread12-2.2.0-alt1.1 1434451064 installed
<13>Jul 19 04:41:51 rpmi: libpng-devel-1.6.36-alt1 sisyphus+219478.100.1.1 1547633315 installed
<13>Jul 19 04:41:53 rpmi: libxcb-devel-1.13.1-alt1 sisyphus+226527.100.2.2 1554593799 installed
<13>Jul 19 04:41:53 rpmi: libXau-devel-1.0.9-alt1 sisyphus+223149.200.2.1 1551268156 installed
<13>Jul 19 04:41:53 rpmi: libXdmcp-devel-1.1.3-alt1 sisyphus+225206.600.1.2 1552949347 installed
<13>Jul 19 04:41:53 rpmi: libgif-devel-4.1.6-alt3 1299634266 installed
<13>Jul 19 04:41:53 rpmi: libutempter-devel-1.1.6-alt2 1299636222 installed
<13>Jul 19 04:41:53 rpmi: libarchive13-3.3.1-alt2 sisyphus.219343.100 1547461968 installed
<13>Jul 19 04:41:53 rpmi: libhogweed4-3.4.1-alt1 sisyphus+226533.100.2.1 1554512181 installed
<13>Jul 19 04:41:53 rpmi: libgnutls30-3.6.8-alt1 sisyphus+231079.100.1.1 1559063519 installed
<13>Jul 19 04:41:53 rpmi: libakonadi4-kabc-4.14.11-alt10 sisyphus+232167.100.2.2 1560772087 installed
<13>Jul 19 04:41:53 rpmi: libflac8-1.3.2-alt2 sisyphus+220898.4400.11.1 1551972983 installed
<13>Jul 19 04:41:53 rpmi: libvorbis-1.3.6-alt2 sisyphus+220072.200.2.2 1548744467 installed
<13>Jul 19 04:41:53 rpmi: rpm-build-gir-0.7.3-alt2 sisyphus+234037.40.2.1 1562495133 installed
<13>Jul 19 04:41:53 rpmi: libOpenGL-7:1.1.1-alt1 sisyphus+224993.100.4.1 1552634540 installed
<13>Jul 19 04:41:53 rpmi: libGLES-7:1.1.1-alt1 sisyphus+224993.100.4.1 1552634540 installed
<13>Jul 19 04:41:53 rpmi: libboost_regex1.67.0-1:1.67.0-alt8 sisyphus+231326.100.1.1 1559468166 installed
<13>Jul 19 04:41:53 rpmi: libboost_graph1.67.0-1:1.67.0-alt8 sisyphus+231326.100.1.1 1559468166 installed
<13>Jul 19 04:41:53 rpmi: icu-utils-1:6.4.2-alt1 sisyphus+227580.100.1.2 1555784315 installed
<13>Jul 19 04:41:53 rpmi: libicu-devel-1:6.4.2-alt1 sisyphus+227580.100.1.2 1555784315 installed
<13>Jul 19 04:41:53 rpmi: libboost_atomic1.67.0-1:1.67.0-alt8 sisyphus+231326.100.1.1 1559468166 installed
<13>Jul 19 04:41:53 rpmi: libboost_contract1.67.0-1:1.67.0-alt8 sisyphus+231326.100.1.1 1559468166 installed
<13>Jul 19 04:41:53 rpmi: libboost_random1.67.0-1:1.67.0-alt8 sisyphus+231326.100.1.1 1559468166 installed
<13>Jul 19 04:41:53 rpmi: libboost_chrono1.67.0-1:1.67.0-alt8 sisyphus+231326.100.1.1 1559468166 installed
<13>Jul 19 04:41:53 rpmi: libboost_timer1.67.0-1:1.67.0-alt8 sisyphus+231326.100.1.1 1559468166 installed
<13>Jul 19 04:41:53 rpmi: libboost_filesystem1.67.0-1:1.67.0-alt8 sisyphus+231326.100.1.1 1559468166 installed
<13>Jul 19 04:41:53 rpmi: libboost_thread1.67.0-1:1.67.0-alt8 sisyphus+231326.100.1.1 1559468166 installed
<13>Jul 19 04:41:53 rpmi: libboost_type_erasure1.67.0-1:1.67.0-alt8 sisyphus+231326.100.1.1 1559468166 installed
<13>Jul 19 04:41:53 rpmi: libksba-1.3.6-alt8 sisyphus+225621.540.3.1 1553596295 installed
<13>Jul 19 04:41:53 rpmi: libjasper-2.0.16-alt1 sisyphus+231386.100.1.1 1559568071 installed
<13>Jul 19 04:41:53 rpmi: xorg-xf86miscproto-devel-0.9.3-alt1 1303464883 installed
<13>Jul 19 04:41:53 rpmi: qt5-base-common-5.12.4-alt1 sisyphus+233177.100.3.4 1561670619 installed
<13>Jul 19 04:41:53 rpmi: libpcre2-10.33-alt1.1 sisyphus+227856.100.1.2 1555786372 installed
<13>Jul 19 04:41:53 rpmi: libqt5-core-5.12.4-alt1 sisyphus+233177.100.3.4 1561670619 installed
<13>Jul 19 04:41:53 rpmi: libqrencode4-4.0.2-alt1 sisyphus.213106.400 1537186495 installed
<13>Jul 19 04:41:53 rpmi: libdmtx-0.7.2-alt8 sisyphus+225269.5200.12.1 1553611407 installed
<13>Jul 19 04:41:53 rpmi: libhunspell-1.7.0-alt1 sisyphus+226731.100.2.1 1554585900 installed
<13>Jul 19 04:41:53 rpmi: libenchant-1.6.0-alt3.qa1 1460409846 installed
<13>Jul 19 04:41:53 rpmi: openexr22-common-2.2.0-alt3 sisyphus+221267.100.1.2 1549944980 installed
<13>Jul 19 04:41:53 rpmi: libilmimf22-2.2.0-alt3 sisyphus+221267.100.1.2 1549944980 installed
<13>Jul 19 04:41:53 rpmi: url_handler-0.3.1-alt1 1290564262 installed
<13>Jul 19 04:41:53 rpmi: desktop-file-utils-0.23-alt2 sisyphus+226879.100.1.1 1554744353 installed
<13>Jul 19 04:41:53 rpmi: sgml-common-0.6.3-alt15 1423664786 installed
<13>Jul 19 04:41:53 rpmi: docbook-dtds-4.5-alt1 1223476557 installed
<13>Jul 19 04:41:53 rpmi: docbook-style-xsl-1.79.1-alt4 sisyphus+232871.100.1.1 1561238010 installed
<13>Jul 19 04:41:53 rpmi: shared-desktop-ontologies-1:0.11.0-alt1 1378390330 installed
<13>Jul 19 04:41:53 rpmi: shared-desktop-ontologies-devel-1:0.11.0-alt1 1378390330 installed
<13>Jul 19 04:41:53 rpmi: libpcre16-8.43-alt1 sisyphus+222771.100.1.1 1551029667 installed
<13>Jul 19 04:41:53 rpmi: pcretest-8.43-alt1 sisyphus+222771.100.1.1 1551029667 installed
<13>Jul 19 04:41:53 rpmi: libpcre-devel-8.43-alt1 sisyphus+222771.100.1.1 1551029667 installed
<13>Jul 19 04:41:53 rpmi: libalsa-1:1.1.9-alt2 sisyphus+229323.100.1.1 1557826762 installed
<13>Jul 19 04:41:54 rpmi: libltdl7-2.4.6-alt1 sisyphus+226971.100.2.1 1554906326 installed
<13>Jul 19 04:41:54 rpmi: libunixODBC2-2.3.7-alt1 sisyphus+228027.100.1.1 1556027337 installed
<13>Jul 19 04:41:54 rpmi: libunixODBC-devel-compat-2.3.7-alt1 sisyphus+228027.100.1.1 1556027337 installed
<13>Jul 19 04:41:54 rpmi: libunixODBC-devel-2.3.7-alt1 sisyphus+228027.100.1.1 1556027337 installed
<13>Jul 19 04:41:54 rpmi: libgsm-1.0.17-alt1 1523356157 installed
<13>Jul 19 04:41:54 rpmi: libsndfile-1.0.28-alt2 sisyphus.212728.100 1536333060 installed
<13>Jul 19 04:41:54 rpmi: libasyncns-0.8-alt2.qa1 1365949819 installed
<13>Jul 19 04:41:54 rpmi: libjbig-2.1-alt1 1401380921 installed
<13>Jul 19 04:41:54 rpmi: libtiff5-4.0.10.0.93.91480d3d-alt1 sisyphus+231496.100.1.1 1559668975 installed
<13>Jul 19 04:41:54 rpmi: liblcms2-2.9-alt1 1516411888 installed
<13>Jul 19 04:41:54 rpmi: libmng-2.0.3-alt2 sisyphus+222619.100.1.1 1550943871 installed
<13>Jul 19 04:41:54 rpmi: liblz4-1:1.9.1-alt1 sisyphus+228057.100.1.1 1556059262 installed
<13>Jul 19 04:41:54 rpmi: libsystemd-1:242-alt10 sisyphus+234731.100.1.1 1563376198 installed
<13>Jul 19 04:41:54 rpmi: libdbus-1.12.12-alt2 sisyphus+221234.100.1.2 1549918037 installed
<13>Jul 19 04:41:54 rpmi: libqt4-dbus-4.8.7-alt16 sisyphus+226856.100.2.1 1554784839 installed
<13>Jul 19 04:41:54 rpmi: libqt4-script-4.8.7-alt16 sisyphus+226856.100.2.1 1554784839 installed
<13>Jul 19 04:41:54 rpmi: libstrigi-0.7.8-alt8 1529687716 installed
<13>Jul 19 04:41:54 rpmi: libstrigi-devel-0.7.8-alt8 1529687716 installed
<13>Jul 19 04:41:54 rpmi: libdbus-devel-1.12.12-alt2 sisyphus+221234.100.1.2 1549918037 installed
<13>Jul 19 04:41:54 rpmi: libpulseaudio-12.2-alt3 sisyphus+233325.100.1.1 1561640571 installed
<13>Jul 19 04:41:54 rpmi: libxshmfence-1.3-alt1 sisyphus+223149.1000.2.1 1551268594 installed
<13>Jul 19 04:41:54 rpmi: libX11-locales-3:1.6.8-alt1 sisyphus+232786.200.1.1 1561106874 installed
<13>Jul 19 04:41:54 rpmi: libX11-3:1.6.8-alt1 sisyphus+232786.200.1.1 1561106874 installed
<13>Jul 19 04:41:54 rpmi: libXext-1.3.4-alt1 sisyphus+225206.700.1.2 1552949422 installed
<13>Jul 19 04:41:54 rpmi: libX11-devel-3:1.6.8-alt1 sisyphus+232786.200.1.1 1561106874 installed
<13>Jul 19 04:41:54 rpmi: libXrender-0.9.8-alt1 1371312110 installed
<13>Jul 19 04:41:54 rpmi: libXfixes-5.0.3-alt1 sisyphus+226736.100.2.2 1554614842 installed
<13>Jul 19 04:41:54 rpmi: libXfixes-devel-5.0.3-alt1 sisyphus+226736.100.2.2 1554614842 installed
<13>Jul 19 04:41:54 rpmi: libXrender-devel-0.9.8-alt1 1371312110 installed
<13>Jul 19 04:41:54 rpmi: libXext-devel-1.3.4-alt1 sisyphus+225206.700.1.2 1552949422 installed
<13>Jul 19 04:41:54 rpmi: libXcursor-1.2.0-alt1 sisyphus+225206.400.1.2 1552949214 installed
<13>Jul 19 04:41:54 rpmi: libXt-1.1.4-alt1 1369984716 installed
<13>Jul 19 04:41:54 rpmi: libXrandr-1.5.2-alt1 sisyphus+225206.1300.1.2 1552949698 installed
<13>Jul 19 04:41:54 rpmi: libXxf86vm-1.1.4-alt2 1527672159 installed
<13>Jul 19 04:41:54 rpmi: libXi-1.7.10-alt1 sisyphus+232786.300.1.1 1561106975 installed
<13>Jul 19 04:41:54 rpmi: libXi-devel-1.7.10-alt1 sisyphus+232786.300.1.1 1561106975 installed
<13>Jul 19 04:41:54 rpmi: libXinerama-1.1.4-alt1 sisyphus+223149.300.2.1 1551268223 installed
<13>Jul 19 04:41:54 rpmi: libqt4-gui-4.8.7-alt16 sisyphus+226856.100.2.1 1554784839 installed
<13>Jul 19 04:41:54 rpmi: libphonon-4.8.3-alt1 1418134063 installed
<13>Jul 19 04:41:55 rpmi: libqt4-designer-4.8.7-alt16 sisyphus+226856.100.2.1 1554784839 installed
<13>Jul 19 04:41:55 rpmi: libqt4-uitools-4.8.7-alt16 sisyphus+226856.100.2.1 1554784839 installed
<13>Jul 19 04:41:55 rpmi: libqt4-svg-4.8.7-alt16 sisyphus+226856.100.2.1 1554784839 installed
<13>Jul 19 04:41:55 rpmi: libXtst-1.2.2-alt1 1369984880 installed
<13>Jul 19 04:41:55 rpmi: libXtst-devel-1.2.2-alt1 1369984880 installed
<13>Jul 19 04:41:55 rpmi: libXScrnSaver-1.2.3-alt1 sisyphus+223149.500.2.1 1551268370 installed
<13>Jul 19 04:41:55 rpmi: libXdamage-1.1.5-alt1 sisyphus+225206.500.1.2 1552949282 installed
<13>Jul 19 04:41:55 rpmi: libXdamage-devel-1.1.5-alt1 sisyphus+225206.500.1.2 1552949282 installed
<13>Jul 19 04:41:55 rpmi: libXScrnSaver-devel-1.2.3-alt1 sisyphus+223149.500.2.1 1551268370 installed
<13>Jul 19 04:41:55 rpmi: libphononexperimental-4.8.3-alt1 1418134063 installed
<13>Jul 19 04:41:55 rpmi: libqt4-scripttools-4.8.7-alt16 sisyphus+226856.100.2.1 1554784839 installed
<13>Jul 19 04:41:55 rpmi: libqt4-multimedia-4.8.7-alt16 sisyphus+226856.100.2.1 1554784839 installed
<13>Jul 19 04:41:55 rpmi: libdbusmenu-qt2-0.9.3-alt0.2 1463760655 installed
<13>Jul 19 04:41:55 rpmi: libprison0-1.1.1-alt1 sisyphus+223025.400.3.1 1551263464 installed
<13>Jul 19 04:41:55 rpmi: libXinerama-devel-1.1.4-alt1 sisyphus+223149.300.2.1 1551268223 installed
<13>Jul 19 04:41:55 rpmi: libXxf86vm-devel-1.1.4-alt2 1527672159 installed
<13>Jul 19 04:41:55 rpmi: libXrandr-devel-1.5.2-alt1 sisyphus+225206.1300.1.2 1552949698 installed
<13>Jul 19 04:41:55 rpmi: libXpm-3.5.12-alt1 sisyphus+223149.400.2.1 1551268300 installed
<13>Jul 19 04:41:55 rpmi: libXpm-devel-3.5.12-alt1 sisyphus+223149.400.2.1 1551268300 installed
<13>Jul 19 04:41:55 rpmi: libXt-devel-1.1.4-alt1 1369984716 installed
<13>Jul 19 04:41:55 rpmi: libXmu-1.1.3-alt1 sisyphus+225206.1200.1.2 1552949629 installed
<13>Jul 19 04:41:55 rpmi: xset-1.2.4-alt1 sisyphus.213358.100 1537438593 installed
<13>Jul 19 04:41:55 rpmi: libXcursor-devel-1.2.0-alt1 sisyphus+225206.400.1.2 1552949214 installed
<13>Jul 19 04:41:55 rpmi: libXft-2.3.3-alt1 sisyphus+225206.1000.3.2 1552987714 installed
<13>Jul 19 04:41:55 rpmi: libXv-1.0.11-alt1 1527685497 installed
<13>Jul 19 04:41:55 rpmi: libXv-devel-1.0.11-alt1 1527685497 installed
<13>Jul 19 04:41:55 rpmi: libXxf86misc-1.0.4-alt1 sisyphus+223149.600.2.1 1551268437 installed
<13>Jul 19 04:41:55 rpmi: libXcomposite-0.4.5-alt1 sisyphus+225206.300.1.2 1552949136 installed
<13>Jul 19 04:41:55 rpmi: libXcomposite-devel-0.4.5-alt1 sisyphus+225206.300.1.2 1552949136 installed
<13>Jul 19 04:41:55 rpmi: libxkbfile-1.1.0-alt1 sisyphus+225206.1100.1.2 1552949559 installed
<13>Jul 19 04:41:55 rpmi: libxkbfile-devel-1.1.0-alt1 sisyphus+225206.1100.1.2 1552949559 installed
<13>Jul 19 04:41:55 rpmi: xprop-1.2.4-alt1 sisyphus+225764.100.1.1 1553680701 installed
<13>Jul 19 04:41:55 rpmi: xdg-utils-1.1.3-alt6 sisyphus+233067.100.1.1 1561332512 installed
<13>Jul 19 04:41:55 rpmi: libwayland-client-1.17.0-alt1 sisyphus+225894.100.1.1 1553872803 installed
<13>Jul 19 04:41:55 rpmi: libpciaccess-1:0.16-alt1 sisyphus+234814.100.1.1 1563438297 installed
<13>Jul 19 04:41:55 rpmi: libdrm-1:2.4.99-alt1 sisyphus+234110.100.1.1 1562593655 installed
<13>Jul 19 04:41:55 rpmi: libGLX-mesa-4:19.1.2-alt1 sisyphus+234172.100.1.1 1562677875 installed
<13>Jul 19 04:41:55 rpmi: libGLX-7:1.1.1-alt1 sisyphus+224993.100.4.1 1552634540 installed
<13>Jul 19 04:41:55 rpmi: libGL-7:1.1.1-alt1 sisyphus+224993.100.4.1 1552634540 installed
<13>Jul 19 04:41:55 rpmi: libqt4-opengl-4.8.7-alt16 sisyphus+226856.100.2.1 1554784839 installed
<13>Jul 19 04:41:55 rpmi: libGLU-4:9.0.0-alt1 1347643776 installed
<13>Jul 19 04:41:55 rpmi: libgbm-4:19.1.2-alt1 sisyphus+234172.100.1.1 1562677875 installed
<13>Jul 19 04:41:55 rpmi: libEGL-mesa-4:19.1.2-alt1 sisyphus+234172.100.1.1 1562677875 installed
<13>Jul 19 04:41:55 rpmi: libEGL-7:1.1.1-alt1 sisyphus+224993.100.4.1 1552634540 installed
<13>Jul 19 04:41:55 rpmi: libglvnd-devel-7:1.1.1-alt1 sisyphus+224993.100.4.1 1552634540 installed
<13>Jul 19 04:41:55 rpmi: libEGL-devel-4:19.1.2-alt1 sisyphus+234172.100.1.1 1562677875 installed
<13>Jul 19 04:41:55 rpmi: libGL-devel-4:19.1.2-alt1 sisyphus+234172.100.1.1 1562677875 installed
<13>Jul 19 04:41:55 rpmi: libGLU-devel-4:9.0.0-alt1 1347643776 installed
<13>Jul 19 04:41:55 rpmi: gsettings-desktop-schemas-data-3.32.0-alt1 sisyphus+225059.300.3.2 1552843929 installed
<13>Jul 19 04:41:56 rpmi: libgio-2.60.5-alt1 sisyphus+234179.100.1.1 1562688710 installed
<13>Jul 19 04:41:56 rpmi: gsettings-desktop-schemas-3.32.0-alt1 sisyphus+225059.300.3.2 1552843929 installed
<13>Jul 19 04:41:56 rpmi: libpolkit-0.116-alt1 sisyphus+228976.400.4.1 1557128960 installed
<13>Jul 19 04:41:56 rpmi: libpolkit-qt-core-1-0.112.0-alt1 1407931989 installed
<13>Jul 19 04:41:56 rpmi: gpgme-common-1.11.1-alt2 sisyphus+225625.1200.90.1 1555274957 installed
<13>Jul 19 04:41:56 rpmi: libusb-1.0.22-alt1 1525452011 installed
<13>Jul 19 04:41:56 rpmi: libnpth-1.6-alt1_1 sisyphus+226100.100.1.1 1554119253 installed
<13>Jul 19 04:41:56 rpmi: gcc-c++-common-1.4.23-alt1 sisyphus+221902.2500.4.1 1550596716 installed
<13>Jul 19 04:41:56 rpmi: libstdc++8-devel-8.3.1-alt3 sisyphus+228100.100.1.1 1556142139 installed
<13>Jul 19 04:41:57 rpmi: gcc8-c++-8.3.1-alt3 sisyphus+228100.100.1.1 1556142139 installed
<13>Jul 19 04:41:57 rpmi: rpm-macros-cmake-3.13.4-alt3 sisyphus+229386.100.1.1 1557907621 installed
<13>Jul 19 04:41:57 rpmi: cmake-modules-3.13.4-alt3 sisyphus+229386.100.1.1 1557907621 installed
<13>Jul 19 04:41:57 rpmi: libuv-1.28.0-alt1 sisyphus+231674.100.1.1 1559848900 installed
<13>Jul 19 04:41:57 rpmi: librhash-1.3.5-alt2 1505156277 installed
<13>Jul 19 04:41:57 rpmi: libjsoncpp19-1.8.4-alt4 sisyphus+232904.100.1.1 1561247384 installed
<13>Jul 19 04:41:57 rpmi: publicsuffix-list-dafsa-20190329-alt1 sisyphus+226347.100.1.2 1554127434 installed
<13>Jul 19 04:41:57 rpmi: libpsl-0.21.0-alt1 sisyphus+227314.100.1.2 1555618432 installed
<13>Jul 19 04:41:57 rpmi: libnghttp2-1.34.0-alt1 sisyphus+222625.100.1.1 1550947249 installed
<13>Jul 19 04:41:57 rpmi: libbrotlicommon-1.0.7-alt1 sisyphus+226738.100.2.1 1554554565 installed
<13>Jul 19 04:41:57 rpmi: libbrotlidec-1.0.7-alt1 sisyphus+226738.100.2.1 1554554565 installed
<13>Jul 19 04:41:57 rpmi: bzlib-devel-1:1.0.6-alt6 sisyphus+224341.100.1.1 1552254551 installed
<13>Jul 19 04:41:57 rpmi: libboost_context1.67.0-1:1.67.0-alt8 sisyphus+231326.100.1.1 1559468166 installed
<13>Jul 19 04:41:57 rpmi: libboost_fiber1.67.0-1:1.67.0-alt8 sisyphus+231326.100.1.1 1559468166 installed
<13>Jul 19 04:41:57 rpmi: libboost_stacktrace1.67.0-1:1.67.0-alt8 sisyphus+231326.100.1.1 1559468166 installed
<13>Jul 19 04:41:57 rpmi: libnumpy-py3-1:1.15.4-alt2 sisyphus+231908.140.2.1 1560334251 installed
<13>Jul 19 04:41:57 rpmi: libboost_python1.67.0-1:1.67.0-alt8 sisyphus+231326.100.1.1 1559468166 installed
<13>Jul 19 04:41:57 rpmi: libnumpy-1:1.15.4-alt2 sisyphus+231908.140.2.1 1560334251 installed
<13>Jul 19 04:41:57 rpmi: libxblas-1.0.248-alt1.3 sisyphus+229150.100.1.1 1557388758 installed
<13>Jul 19 04:41:57 rpmi: libquadmath0-8.3.1-alt3 sisyphus+228100.100.1.1 1556142139 installed
<13>Jul 19 04:41:57 rpmi: libgfortran5-8.3.1-alt3 sisyphus+228100.100.1.1 1556142139 installed
<13>Jul 19 04:41:58 rpmi: liblapack-1:3.8.0-alt3 sisyphus+221521.100.1.1 1550134909 installed
<13>Jul 19 04:41:58 rpmi: python-modules-curses-2.7.16-alt1 sisyphus+226365.200.2.1 1554143277 installed
<13>Jul 19 04:41:58 rpmi: libverto-0.3.0-alt1_7 sisyphus+225932.100.1.1 1553994917 installed
<13>Jul 19 04:41:58 rpmi: libkeyutils-1.6-alt2 sisyphus+226520.100.2.1 1554512088 installed
<13>Jul 19 04:41:58 rpmi: libcom_err-1.44.6-alt1 sisyphus+224154.100.1.1 1552091653 installed
<13>Jul 19 04:41:58 rpmi: libboost_test1.67.0-1:1.67.0-alt8 sisyphus+231326.100.1.1 1559468166 installed
<13>Jul 19 04:41:58 rpmi: libboost_serialization1.67.0-1:1.67.0-alt8 sisyphus+231326.100.1.1 1559468166 installed
<13>Jul 19 04:41:58 rpmi: libboost_iostreams1.67.0-1:1.67.0-alt8 sisyphus+231326.100.1.1 1559468166 installed
<13>Jul 19 04:41:58 rpmi: libboost_date_time1.67.0-1:1.67.0-alt8 sisyphus+231326.100.1.1 1559468166 installed
<13>Jul 19 04:41:58 rpmi: libboost_container1.67.0-1:1.67.0-alt8 sisyphus+231326.100.1.1 1559468166 installed
<13>Jul 19 04:41:58 rpmi: bash-builtin-lockf-0.3.1-alt1.qa1 1366318149 installed
<13>Jul 19 04:41:58 rpmi: altlinux-mime-defaults-0.435-alt1 sisyphus+233225.100.1.1 1561540568 installed
<13>Jul 19 04:41:58 rpmi: wm-common-freedesktop-1.3-alt1 1303402115 installed
<13>Jul 19 04:41:58 rpmi: altlinux-freedesktop-menu-common-0.67-alt1 sisyphus+232521.100.1.2 1560890506 installed
<13>Jul 19 04:41:58 rpmi: rpm-macros-alternatives-0.5.1-alt1 sisyphus+226946.100.1.1 1554830426 installed
<13>Jul 19 04:41:58 rpmi: alternatives-0.5.1-alt1 sisyphus+226946.100.1.1 1554830426 installed
<13>Jul 19 04:41:58 rpmi: ca-certificates-2019.07.11-alt1 sisyphus+234280.200.1.1 1562839906 installed
<13>Jul 19 04:41:58 rpmi: ca-trust-0.1.2-alt1 sisyphus+233348.100.1.1 1561653823 installed
<13>Jul 19 04:41:58 rpmi: p11-kit-trust-0.23.15-alt1 sisyphus+226408.100.2.1 1554288187 installed
<13>Jul 19 04:41:58 rpmi: libcrypto1.1-1.1.1b-alt2 sisyphus+227249.100.2.1 1555667802 installed
<13>Jul 19 04:41:58 rpmi: libssl1.1-1.1.1b-alt2 sisyphus+227249.100.2.1 1555667802 installed
<13>Jul 19 04:41:58 rpmi: libqt4-network-4.8.7-alt16 sisyphus+226856.100.2.1 1554784839 installed
<86>Jul 19 04:41:58 groupadd[49072]: group added to /etc/group: name=_keytab, GID=498
<86>Jul 19 04:41:58 groupadd[49072]: group added to /etc/gshadow: name=_keytab
<86>Jul 19 04:41:58 groupadd[49072]: new group: name=_keytab, GID=498
<13>Jul 19 04:41:58 rpmi: libkrb5-1.16.3-alt1 sisyphus+223678.100.1.1 1551746443 installed
<86>Jul 19 04:41:58 groupadd[49296]: group added to /etc/group: name=sasl, GID=497
<86>Jul 19 04:41:58 groupadd[49296]: group added to /etc/gshadow: name=sasl
<86>Jul 19 04:41:58 groupadd[49296]: new group: name=sasl, GID=497
<13>Jul 19 04:41:58 rpmi: libsasl2-3-2.1.27-alt2 sisyphus+228101.100.1.1 1556139861 installed
<13>Jul 19 04:41:58 rpmi: libpython3-3.7.3-alt1 sisyphus+225625.574.90.1 1555274084 installed
<13>Jul 19 04:41:58 rpmi: python3-3.7.3-alt1 sisyphus+225625.574.90.1 1555274084 installed
<13>Jul 19 04:41:59 rpmi: python3-base-3.7.3-alt1 sisyphus+225625.574.90.1 1555274084 installed
<13>Jul 19 04:41:59 rpmi: libldap-2.4.47-alt2 sisyphus+232098.100.1.1 1560524395 installed
<13>Jul 19 04:41:59 rpmi: libqt4-qt3support-4.8.7-alt16 sisyphus+226856.100.2.1 1554784839 installed
<13>Jul 19 04:41:59 rpmi: libcurl-7.65.1-alt1 sisyphus+231533.100.2.1 1559746627 installed
<13>Jul 19 04:41:59 rpmi: cmake-3.13.4-alt3 sisyphus+229386.100.1.1 1557907621 installed
<13>Jul 19 04:41:59 rpmi: gnupg2-2.2.17-alt1 sisyphus+234180.200.3.1 1562790367 installed
<13>Jul 19 04:41:59 rpmi: libgpgme11-1.11.1-alt2 sisyphus+225625.1200.90.1 1555274957 installed
<13>Jul 19 04:41:59 rpmi: libgpgmexx4-4.14.11-alt10 sisyphus+232167.100.2.2 1560772087 installed
<13>Jul 19 04:41:59 rpmi: libgpgmexx4-pthread-4.14.11-alt10 sisyphus+232167.100.2.2 1560772087 installed
<13>Jul 19 04:41:59 rpmi: libqgpgme4-4.14.11-alt10 sisyphus+232167.100.2.2 1560772087 installed
<13>Jul 19 04:41:59 rpmi: libgpgmepp6-1.11.1-alt2 sisyphus+225625.1200.90.1 1555274957 installed
<13>Jul 19 04:41:59 rpmi: libqgpgme7-1.11.1-alt2 sisyphus+225625.1200.90.1 1555274957 installed
<13>Jul 19 04:41:59 rpmi: libgpgme-devel-1.11.1-alt2 sisyphus+225625.1200.90.1 1555274957 installed
<13>Jul 19 04:42:00 rpmi: python3-module-numpy-1:1.15.4-alt2 sisyphus+231908.140.2.1 1560334251 installed
<13>Jul 19 04:42:00 rpmi: glib2-devel-2.60.5-alt1 sisyphus+234179.100.1.1 1562688710 installed
<13>Jul 19 04:42:00 rpmi: libharfbuzz-devel-2.5.3-alt1 sisyphus+233337.100.1.1 1561643295 installed
<13>Jul 19 04:42:00 rpmi: libfreetype-devel-2.10.0-alt2 sisyphus+226881.100.2.1 1555676284 installed
<13>Jul 19 04:42:00 rpmi: fontconfig-devel-2.13.1-alt1 sisyphus+226691.100.2.2 1554598717 installed
<13>Jul 19 04:42:00 rpmi: libXft-devel-2.3.3-alt1 sisyphus+225206.1000.3.2 1552987714 installed
<13>Jul 19 04:42:00 rpmi: libboost_python3-1.67.0-1:1.67.0-alt8 sisyphus+231326.100.1.1 1559468166 installed
<13>Jul 19 04:42:00 rpmi: libboost_numpy3-1.67.0-1:1.67.0-alt8 sisyphus+231326.100.1.1 1559468166 installed
<13>Jul 19 04:42:00 rpmi: libtirpc-1.0.3-alt1 1532008015 installed
<13>Jul 19 04:42:00 rpmi: libnsl2-1.1.0-alt1_1 1511548748 installed
<13>Jul 19 04:42:00 rpmi: python-modules-compiler-2.7.16-alt1 sisyphus+226365.200.2.1 1554143277 installed
<13>Jul 19 04:42:00 rpmi: python-modules-email-2.7.16-alt1 sisyphus+226365.200.2.1 1554143277 installed
<13>Jul 19 04:42:00 rpmi: python-modules-unittest-2.7.16-alt1 sisyphus+226365.200.2.1 1554143277 installed
<13>Jul 19 04:42:00 rpmi: python-modules-nis-2.7.16-alt1 sisyphus+226365.200.2.1 1554143277 installed
<13>Jul 19 04:42:00 rpmi: python-modules-encodings-2.7.16-alt1 sisyphus+226365.200.2.1 1554143277 installed
<13>Jul 19 04:42:00 rpmi: python-modules-2.7.16-alt1 sisyphus+226365.200.2.1 1554143277 installed
<13>Jul 19 04:42:00 rpmi: python-modules-xml-2.7.16-alt1 sisyphus+226365.200.2.1 1554143277 installed
<13>Jul 19 04:42:00 rpmi: python-modules-hotshot-2.7.16-alt1 sisyphus+226365.200.2.1 1554143277 installed
<13>Jul 19 04:42:00 rpmi: python-modules-bsddb-2.7.16-alt1 sisyphus+226365.200.2.1 1554143277 installed
<13>Jul 19 04:42:00 rpmi: python-modules-ctypes-2.7.16-alt1 sisyphus+226365.200.2.1 1554143277 installed
<13>Jul 19 04:42:00 rpmi: python-modules-multiprocessing-2.7.16-alt1 sisyphus+226365.200.2.1 1554143277 installed
<13>Jul 19 04:42:00 rpmi: python-modules-logging-2.7.16-alt1 sisyphus+226365.200.2.1 1554143277 installed
<13>Jul 19 04:42:00 rpmi: python-2.7.16-alt1 sisyphus+226365.200.2.1 1554143277 installed
<13>Jul 19 04:42:00 rpmi: python-strict-2.7.16-alt1 sisyphus+226365.200.2.1 1554143277 installed
<13>Jul 19 04:42:01 rpmi: python-module-numpy-1:1.15.4-alt2 sisyphus+231908.140.2.1 1560334251 installed
<13>Jul 19 04:42:01 rpmi: libboost_numpy1.67.0-1:1.67.0-alt8 sisyphus+231326.100.1.1 1559468166 installed
<13>Jul 19 04:42:02 rpmi: boost-devel-headers-1:1.67.0-alt8 sisyphus+231326.100.1.1 1559468166 installed
<13>Jul 19 04:42:02 rpmi: boost-devel-1:1.67.0-alt8 sisyphus+231326.100.1.1 1559468166 installed
<13>Jul 19 04:42:02 rpmi: libqt4-xmlpatterns-4.8.7-alt16 sisyphus+226856.100.2.1 1554784839 installed
<13>Jul 19 04:42:02 rpmi: libqt4-declarative-4.8.7-alt16 sisyphus+226856.100.2.1 1554784839 installed
<13>Jul 19 04:42:03 rpmi: libqt4-webkit-1:2.3.4-alt7 sisyphus+233170.100.1.1 1561477183 installed
<13>Jul 19 04:42:03 rpmi: libqt4-help-4.8.7-alt16 sisyphus+226856.100.2.1 1554784839 installed
<13>Jul 19 04:42:03 rpmi: libattica0.4-0.4.2-alt1 1375339025 installed
<13>Jul 19 04:42:03 rpmi: libssl-devel-1.1.1b-alt2 sisyphus+227249.100.2.1 1555667802 installed
<13>Jul 19 04:42:03 rpmi: phonon-devel-4.8.3-alt1 1418134063 installed
<13>Jul 19 04:42:03 rpmi: libqt4-webkit-devel-1:2.3.4-alt7 sisyphus+233170.100.1.1 1561477183 installed
<13>Jul 19 04:42:03 rpmi: libqt4-devel-4.8.7-alt16 sisyphus+226856.100.2.1 1554784839 installed
<13>Jul 19 04:42:03 rpmi: libqca2-2.2.0-alt1.1 sisyphus+232230.100.1.1 1560638438 installed
<13>Jul 19 04:42:03 rpmi: altlinux-freedesktop-menu-shallow-menu-0.67-alt1 sisyphus+232521.100.1.2 1560890506 installed
<13>Jul 19 04:42:03 rpmi: altlinux-freedesktop-menu-generic-0.67-alt1 sisyphus+232521.100.1.2 1560890506 installed
<13>Jul 19 04:42:03 rpmi: altlinux-freedesktop-menu-kde4-0.67-alt1 sisyphus+232521.100.1.2 1560890506 installed
<13>Jul 19 04:42:04 rpmi: kde4libs-4.14.38-alt4 sisyphus+234011.100.1.1 1562425099 installed
<13>Jul 19 04:42:04 rpmi: libkmime4-4.14.11-alt10 sisyphus+232167.100.2.2 1560772087 installed
<13>Jul 19 04:42:04 rpmi: libkpimutils4-4.14.11-alt10 sisyphus+232167.100.2.2 1560772087 installed
<13>Jul 19 04:42:04 rpmi: libkcalcore4-4.14.11-alt10 sisyphus+232167.100.2.2 1560772087 installed
<13>Jul 19 04:42:04 rpmi: libmicroblog4-4.14.11-alt10 sisyphus+232167.100.2.2 1560772087 installed
<13>Jul 19 04:42:04 rpmi: libkpimtextedit4-4.14.11-alt10 sisyphus+232167.100.2.2 1560772087 installed
<13>Jul 19 04:42:04 rpmi: libkpimidentities4-4.14.11-alt10 sisyphus+232167.100.2.2 1560772087 installed
<13>Jul 19 04:42:04 rpmi: libkcalutils4-4.14.11-alt10 sisyphus+232167.100.2.2 1560772087 installed
<13>Jul 19 04:42:04 rpmi: libakonadi4-notes-4.14.11-alt10 sisyphus+232167.100.2.2 1560772087 installed
<13>Jul 19 04:42:04 rpmi: libkimap4-4.14.11-alt10 sisyphus+232167.100.2.2 1560772087 installed
<13>Jul 19 04:42:04 rpmi: libkmbox4-4.14.11-alt10 sisyphus+232167.100.2.2 1560772087 installed
<13>Jul 19 04:42:04 rpmi: kde4libs-devel-4.14.38-alt4 sisyphus+234011.100.1.1 1562425099 installed
<13>Jul 19 04:42:04 rpmi: libkresources4-4.14.11-alt10 sisyphus+232167.100.2.2 1560772087 installed
<13>Jul 19 04:42:04 rpmi: libkabc4-4.14.11-alt10 sisyphus+232167.100.2.2 1560772087 installed
<13>Jul 19 04:42:04 rpmi: libkcal4-4.14.11-alt10 sisyphus+232167.100.2.2 1560772087 installed
<13>Jul 19 04:42:04 rpmi: libktnef4-4.14.11-alt10 sisyphus+232167.100.2.2 1560772087 installed
<13>Jul 19 04:42:04 rpmi: libkabc4_file_core-4.14.11-alt10 sisyphus+232167.100.2.2 1560772087 installed
<13>Jul 19 04:42:04 rpmi: libkholidays4-4.14.11-alt10 sisyphus+232167.100.2.2 1560772087 installed
<13>Jul 19 04:42:04 rpmi: libkxmlrpcclient4-4.14.11-alt10 sisyphus+232167.100.2.2 1560772087 installed
<13>Jul 19 04:42:04 rpmi: libsyndication4-4.14.11-alt10 sisyphus+232167.100.2.2 1560772087 installed
<13>Jul 19 04:42:04 rpmi: libkblog4-4.14.11-alt10 sisyphus+232167.100.2.2 1560772087 installed
<13>Jul 19 04:42:04 rpmi: libkldap4-4.14.11-alt10 sisyphus+232167.100.2.2 1560772087 installed
<13>Jul 19 04:42:04 rpmi: libkontactinterface4-4.14.11-alt10 sisyphus+232167.100.2.2 1560772087 installed
<13>Jul 19 04:42:04 rpmi: akonadi-common-1.13.1-alt0.6 sisyphus+226337.100.1.1 1554108833 installed
<13>Jul 19 04:42:04 rpmi: libakonadiprotocolinternals-1.13.1-alt0.6 sisyphus+226337.100.1.1 1554108833 installed
<13>Jul 19 04:42:05 rpmi: libakonadi4-kde-4.14.11-alt10 sisyphus+232167.100.2.2 1560772087 installed
<13>Jul 19 04:42:05 rpmi: libakonadi4-xml-4.14.11-alt10 sisyphus+232167.100.2.2 1560772087 installed
<13>Jul 19 04:42:05 rpmi: libakonadi4-contact-4.14.11-alt10 sisyphus+232167.100.2.2 1560772087 installed
<13>Jul 19 04:42:05 rpmi: libakonadi4-kmime-4.14.11-alt10 sisyphus+232167.100.2.2 1560772087 installed
<13>Jul 19 04:42:05 rpmi: libmailtransport4-4.14.11-alt10 sisyphus+232167.100.2.2 1560772087 installed
<13>Jul 19 04:42:05 rpmi: libakonadi4-calendar-4.14.11-alt10 sisyphus+232167.100.2.2 1560772087 installed
<13>Jul 19 04:42:05 rpmi: libakonadi4-kcal-4.14.11-alt10 sisyphus+232167.100.2.2 1560772087 installed
<13>Jul 19 04:42:05 rpmi: libakonadi4-socialutils-4.14.11-alt10 sisyphus+232167.100.2.2 1560772087 installed
<13>Jul 19 04:42:05 rpmi: libkalarmcal4-4.14.11-alt10 sisyphus+232167.100.2.2 1560772087 installed
<13>Jul 19 04:42:05 rpmi: kde4pimlibs-4.14.11-alt10 sisyphus+232167.100.2.2 1560772087 installed
<13>Jul 19 04:42:05 rpmi: kde4pimlibs-devel-4.14.11-alt10 sisyphus+232167.100.2.2 1560772087 installed
<13>Jul 19 04:42:05 rpmi: qjson-devel-0.8.1-alt2 1446565444 installed
<13>Jul 19 04:42:05 rpmi: gcc-c++-8-alt1 sisyphus+222164.100.1.1 1550685957 installed
<13>Jul 19 04:42:05 rpmi: libXxf86misc-devel-1.0.4-alt1 sisyphus+223149.600.2.1 1551268437 installed
<13>Jul 19 04:42:05 rpmi: xsltproc-1.1.33-alt1 sisyphus+226936.100.1.1 1554820927 installed
Building target platforms: x86_64
Building for target x86_64
Wrote: /usr/src/in/nosrpm/libkfbapi-1.0-alt2.nosrc.rpm
Installing libkfbapi-1.0-alt2.src.rpm
Building target platforms: x86_64
Building for target x86_64
Executing(%prep): /bin/sh -e /usr/src/tmp/rpm-tmp.39196
+ umask 022
+ /bin/mkdir -p /usr/src/RPM/BUILD
+ cd /usr/src/RPM/BUILD
+ cd /usr/src/RPM/BUILD
+ rm -rf libkfbapi-1.0
+ echo 'Source #0 (libkfbapi-1.0.tar):'
Source #0 (libkfbapi-1.0.tar):
+ /bin/tar -xf /usr/src/RPM/SOURCES/libkfbapi-1.0.tar
+ cd libkfbapi-1.0
+ /bin/chmod -c -Rf u+rwX,go-w .
+ echo 'Patch #1 (libkfbapi-1.0-alt-pkgconfig.patch):'
Patch #1 (libkfbapi-1.0-alt-pkgconfig.patch):
+ /usr/bin/patch -p1
patching file LibKFbAPI.pc.in
+ exit 0
Executing(%build): /bin/sh -e /usr/src/tmp/rpm-tmp.39196
+ umask 022
+ /bin/mkdir -p /usr/src/RPM/BUILD
+ cd /usr/src/RPM/BUILD
+ cd libkfbapi-1.0
+ __kde4_build
+ mkdir -p BUILD-x86_64-alt-linux
+ __kde4_cmake
+ export PATH=/usr/lib/kde4/bin:/usr/src/bin:/bin:/usr/bin:/usr/X11R6/bin:/usr/games
+ PATH=/usr/lib/kde4/bin:/usr/src/bin:/bin:/usr/bin:/usr/X11R6/bin:/usr/games
+ pushd BUILD-x86_64-alt-linux
~/RPM/BUILD/libkfbapi-1.0/BUILD-x86_64-alt-linux ~/RPM/BUILD/libkfbapi-1.0
+ cmake .. -DCMAKE_SKIP_RPATH:BOOL=yes -DCMAKE_BUILD_TYPE=Release '-DCMAKE_C_FLAGS:STRING=-pipe -frecord-gcc-switches -Wall -g -O2' '-DCMAKE_CXX_FLAGS:STRING=-pipe -frecord-gcc-switches -Wall -g -O2' '-DCMAKE_EXE_LINKER_FLAGS:STRING=-L/usr/lib64/kde4link -L/usr/lib64/kde4/devel' '-DCMAKE_MODULE_LINKER_FLAGS:STRING=-L/usr/lib64/kde4link -L/usr/lib64/kde4/devel' '-DCMAKE_SHARED_LINKER_FLAGS:STRING=-L/usr/lib64/kde4link -L/usr/lib64/kde4/devel' '-DCMAKE_LIBRARY_PATH:LIST=/usr/lib64/kde4/devel;/usr/lib64/kde4link;/usr/lib64;/lib64' -DLIB_DESTINATION=lib64 -DLIB_SUFFIX=64 -DCMAKE_INSTALL_PREFIX=/usr -DBIN_INSTALL_DIR=/usr/bin -DSBIN_INSTALL_DIR=/usr/sbin -DICON_INSTALL_DIR=/usr/share/icons -DXDG_APPS_INSTALL_DIR=/usr/share/applications/kde4 -DXDG_DIRECTORY_INSTALL_DIR=/usr/share/desktop-directories -DLIB_INSTALL_DIR=/usr/lib64 -DLIBEXEC_INSTALL_DIR=/usr/lib64/kde4/libexec -DINCLUDE_INSTALL_DIR=/usr/include/kde4 -DKDE4_INCLUDE_INSTALL_DIR=/usr/include/kde4 -DSYSCONF_INSTALL_DIR=/etc -DDATA_INSTALL_DIR=/usr/share/kde4/apps -DCONFIG_INSTALL_DIR=/usr/share/kde4/config -DKCFG_INSTALL_DIR=/usr/share/kde4/config.kcfg -DHTML_INSTALL_DIR=/usr/share/kde4/doc/HTML -DAPPLNK_INSTALL_DIR=/usr/share/applnk -DLOCALE_INSTALL_DIR=/usr/share/kde4/locale -DSERVICES_INSTALL_DIR=/usr/share/kde4/services -DSERVICETYPES_INSTALL_DIR=/usr/share/kde4/servicetypes -DKCONF_UPDATE_INSTALL_DIR=/usr/share/kde4/apps/kconf_update -DXDG_MIME_INSTALL_DIR=/usr/share/mime/packages -DAUTOSTART_INSTALL_DIR=/usr/share/kde4/autostart -DSOUND_INSTALL_DIR=/usr/share/kde4/sounds -DTEMPLATES_INSTALL_DIR=/usr/share/kde4/templates -DWALLPAPER_INSTALL_DIR=/usr/share/wallpapers -DDBUS_INTERFACES_INSTALL_DIR=/usr/share/dbus-1/interfaces -DDBUS_SERVICES_INSTALL_DIR=/usr/share/dbus-1/services -DDBUS_SYSTEM_SERVICES_INSTALL_DIR=/usr/share/dbus-1/system-services -DMAN_INSTALL_DIR=/usr/share/man -DINFO_INSTALL_DIR=/usr/share/info -DINSTALL_PYTHON_FILES_IN_PYTHON_PREFIX:BOOL=yes
-- The C compiler identification is GNU 8.3.1
-- The CXX compiler identification is GNU 8.3.1
-- Check for working C compiler: /usr/bin/cc
-- Check for working C compiler: /usr/bin/cc -- works
-- Detecting C compiler ABI info
-- Detecting C compiler ABI info - done
-- Detecting C compile features
-- Detecting C compile features - done
-- Check for working CXX compiler: /usr/bin/c++
-- Check for working CXX compiler: /usr/bin/c++ -- works
-- Detecting CXX compiler ABI info
-- Detecting CXX compiler ABI info - done
-- Detecting CXX compile features
-- Detecting CXX compile features - done
-- Looking for Q_WS_X11
-- Looking for Q_WS_X11 - found
-- Looking for Q_WS_WIN
-- Looking for Q_WS_WIN - not found
-- Looking for Q_WS_QWS
-- Looking for Q_WS_QWS - not found
-- Looking for Q_WS_MAC
-- Looking for Q_WS_MAC - not found
-- Found Qt-Version 4.8.7 (using /usr/bin/qmake-qt4)
-- Looking for XOpenDisplay in /usr/lib64/libX11.so;/usr/lib64/libXext.so;/usr/lib64/libXft.so;/usr/lib64/libXau.so;/usr/lib64/libXdmcp.so;/usr/lib64/libXpm.so
-- Looking for XOpenDisplay in /usr/lib64/libX11.so;/usr/lib64/libXext.so;/usr/lib64/libXft.so;/usr/lib64/libXau.so;/usr/lib64/libXdmcp.so;/usr/lib64/libXpm.so - found
-- Looking for gethostbyname
-- Looking for gethostbyname - found
-- Looking for connect
-- Looking for connect - found
-- Looking for remove
-- Looking for remove - found
-- Looking for shmat
-- Looking for shmat - found
-- Looking for IceConnectionNumber in ICE
-- Looking for IceConnectionNumber in ICE - found
-- Found X11: /usr/lib64/libX11.so
-- Looking for pthread.h
-- Looking for pthread.h - found
-- Looking for pthread_create
-- Looking for pthread_create - not found
-- Looking for pthread_create in pthreads
-- Looking for pthread_create in pthreads - not found
-- Looking for pthread_create in pthread
-- Looking for pthread_create in pthread - found
-- Found Threads: TRUE  
-- Found OpenSSL: /usr/lib64/libcrypto.so (found version "1.1.1b")  
-- Looking for _POSIX_TIMERS
-- Looking for _POSIX_TIMERS - found
-- Found Automoc4: /usr/bin/automoc4  
-- Found Perl: /usr/bin/perl (found version "5.28.2") 
-- Found Phonon: /usr/include/kde4 (Required is at least version "4.3.80") 
-- Performing Test _OFFT_IS_64BIT
-- Performing Test _OFFT_IS_64BIT - Success
-- Performing Test HAVE_FPIE_SUPPORT
-- Performing Test HAVE_FPIE_SUPPORT - Success
-- Performing Test __KDE_HAVE_W_OVERLOADED_VIRTUAL
-- Performing Test __KDE_HAVE_W_OVERLOADED_VIRTUAL - Success
-- Performing Test __KDE_HAVE_GCC_VISIBILITY
-- Performing Test __KDE_HAVE_GCC_VISIBILITY - Success
-- Found KDE 4.12 include dir: /usr/include/kde4
-- Found KDE 4.12 library dir: /usr/lib64/kde4/devel
-- Found the KDE4 kconfig_compiler4 preprocessor: /usr/lib/kde4/bin/kconfig_compiler4
-- Found automoc4: /usr/bin/automoc4
-- Found KdepimLibs: /usr/lib64/cmake/KdepimLibs/KdepimLibsConfig.cmake (Required is at least version "4.5.63") 
CMake Deprecation Warning at /usr/share/cmake/Modules/FeatureSummary.cmake:671 (message):
  SET_PACKAGE_INFO is deprecated.  Use SET_PACKAGE_PROPERTIES instead.
Call Stack (most recent call first):
  /usr/share/kde4/apps/cmake/modules/MacroLogFeature.cmake:98 (SET_PACKAGE_INFO)
  CMakeLists.txt:19 (macro_log_feature)


CMake Deprecation Warning at /usr/share/cmake/Modules/FeatureSummary.cmake:671 (message):
  SET_PACKAGE_INFO is deprecated.  Use SET_PACKAGE_PROPERTIES instead.
Call Stack (most recent call first):
  /usr/share/kde4/apps/cmake/modules/MacroLogFeature.cmake:98 (SET_PACKAGE_INFO)
  CMakeLists.txt:23 (macro_log_feature)


CMake Warning (dev) at /usr/lib64/automoc4/Automoc4Config.cmake:179 (get_directory_property):
  Policy CMP0059 is not set: Do not treat DEFINITIONS as a built-in directory
  property.  Run "cmake --help-policy CMP0059" for policy details.  Use the
  cmake_policy command to set the policy and suppress this warning.
Call Stack (most recent call first):
  /usr/lib64/automoc4/Automoc4Config.cmake:243 (_add_automoc4_target)
  /usr/share/kde4/apps/cmake/modules/KDE4Macros.cmake:1081 (_automoc4_kde4_pre_target_handling)
  libkfbapi/CMakeLists.txt:67 (kde4_add_library)
This warning is for project developers.  Use -Wno-dev to suppress it.

-- Looking for dgettext
-- Looking for dgettext - found
-- Found Gettext: built in libc
CMake Warning (dev) in CMakeLists.txt:
  No cmake_minimum_required command is present.  A line of code such as

    cmake_minimum_required(VERSION 3.13)

  should be added at the top of the file.  The version specified may be lower
  if you wish to support older CMake versions for this project.  For more
  information run "cmake --help-policy CMP0000".
This warning is for project developers.  Use -Wno-dev to suppress it.

-- Configuring done
CMake Warning (dev) at /usr/share/kde4/apps/cmake/modules/KDE4Macros.cmake:1088 (add_library):
  Policy CMP0003 should be set before this line.  Add code such as

    if(COMMAND cmake_policy)
      cmake_policy(SET CMP0003 NEW)
    endif(COMMAND cmake_policy)

  as early as possible but after the most recent call to
  cmake_minimum_required or cmake_policy(VERSION).  This warning appears
  because target "kfbapi" links to some libraries for which the linker must
  search:

    -lpthread

  and other libraries with known full path:

    /usr/lib64/libQtGui.so

  CMake is adding directories in the second list to the linker search path in
  case they are needed to find libraries from the first list (for backwards
  compatibility with CMake 2.4).  Set policy CMP0003 to OLD or NEW to enable
  or disable this behavior explicitly.  Run "cmake --help-policy CMP0003" for
  more information.
Call Stack (most recent call first):
  libkfbapi/CMakeLists.txt:67 (kde4_add_library)
This warning is for project developers.  Use -Wno-dev to suppress it.

CMake Warning (dev) in libkfbapi/CMakeLists.txt:
  Policy CMP0022 is not set: INTERFACE_LINK_LIBRARIES defines the link
  interface.  Run "cmake --help-policy CMP0022" for policy details.  Use the
  cmake_policy command to set the policy and suppress this warning.

  Target "kfbapi" has an INTERFACE_LINK_LIBRARIES property which differs from
  its LINK_INTERFACE_LIBRARIES properties.

  INTERFACE_LINK_LIBRARIES:

    KDE4__kdecore;KDE4__kdeui;Qt4::QtGui;Qt4::QtWebKit;KDE4__kdewebkit;KDE4__kio;qjson;KDEPIMLibs__kabc;KDEPIMLibs__kpimutils;KDEPIMLibs__kmime;KDEPIMLibs__kcalcore

  LINK_INTERFACE_LIBRARIES:

    

This warning is for project developers.  Use -Wno-dev to suppress it.

-- Generating done
CMake Warning:
  Manually-specified variables were not used by the project:

    APPLNK_INSTALL_DIR
    INSTALL_PYTHON_FILES_IN_PYTHON_PREFIX
    LIB_DESTINATION


-- Build files have been written to: /usr/src/RPM/BUILD/libkfbapi-1.0/BUILD-x86_64-alt-linux
+ popd
~/RPM/BUILD/libkfbapi-1.0
+ __kde4_make
+ pushd BUILD-x86_64-alt-linux
~/RPM/BUILD/libkfbapi-1.0/BUILD-x86_64-alt-linux ~/RPM/BUILD/libkfbapi-1.0
+ make -j8
make[2]: Entering directory '/usr/src/RPM/BUILD/libkfbapi-1.0/BUILD-x86_64-alt-linux'
Scanning dependencies of target kfbapi_automoc
make[2]: Leaving directory '/usr/src/RPM/BUILD/libkfbapi-1.0/BUILD-x86_64-alt-linux'
make[2]: Entering directory '/usr/src/RPM/BUILD/libkfbapi-1.0/BUILD-x86_64-alt-linux'
Scanning dependencies of target pofiles_1
make[2]: Leaving directory '/usr/src/RPM/BUILD/libkfbapi-1.0/BUILD-x86_64-alt-linux'
make[2]: Entering directory '/usr/src/RPM/BUILD/libkfbapi-1.0/BUILD-x86_64-alt-linux'
Scanning dependencies of target pofiles_2
make[2]: Leaving directory '/usr/src/RPM/BUILD/libkfbapi-1.0/BUILD-x86_64-alt-linux'
make[2]: Entering directory '/usr/src/RPM/BUILD/libkfbapi-1.0/BUILD-x86_64-alt-linux'
Scanning dependencies of target pofiles_3
make[2]: Leaving directory '/usr/src/RPM/BUILD/libkfbapi-1.0/BUILD-x86_64-alt-linux'
make[2]: Entering directory '/usr/src/RPM/BUILD/libkfbapi-1.0/BUILD-x86_64-alt-linux'
[  1%] Generating libkfbapi.gmo
make[2]: Leaving directory '/usr/src/RPM/BUILD/libkfbapi-1.0/BUILD-x86_64-alt-linux'
make[2]: Entering directory '/usr/src/RPM/BUILD/libkfbapi-1.0/BUILD-x86_64-alt-linux'
Scanning dependencies of target pofiles_6
make[2]: Leaving directory '/usr/src/RPM/BUILD/libkfbapi-1.0/BUILD-x86_64-alt-linux'
make[2]: Entering directory '/usr/src/RPM/BUILD/libkfbapi-1.0/BUILD-x86_64-alt-linux'
Scanning dependencies of target pofiles_7
make[2]: Leaving directory '/usr/src/RPM/BUILD/libkfbapi-1.0/BUILD-x86_64-alt-linux'
make[2]: Entering directory '/usr/src/RPM/BUILD/libkfbapi-1.0/BUILD-x86_64-alt-linux'
Scanning dependencies of target pofiles_4
make[2]: Leaving directory '/usr/src/RPM/BUILD/libkfbapi-1.0/BUILD-x86_64-alt-linux'
make[2]: Entering directory '/usr/src/RPM/BUILD/libkfbapi-1.0/BUILD-x86_64-alt-linux'
Scanning dependencies of target pofiles_5
make[2]: Leaving directory '/usr/src/RPM/BUILD/libkfbapi-1.0/BUILD-x86_64-alt-linux'
make[1]: Entering directory '/usr/src/RPM/BUILD/libkfbapi-1.0/BUILD-x86_64-alt-linux'
[  1%] Built target pofiles_1
make[1]: Leaving directory '/usr/src/RPM/BUILD/libkfbapi-1.0/BUILD-x86_64-alt-linux'
make[2]: Entering directory '/usr/src/RPM/BUILD/libkfbapi-1.0/BUILD-x86_64-alt-linux'
[  3%] Generating libkfbapi.gmo
make[2]: Leaving directory '/usr/src/RPM/BUILD/libkfbapi-1.0/BUILD-x86_64-alt-linux'
make[2]: Entering directory '/usr/src/RPM/BUILD/libkfbapi-1.0/BUILD-x86_64-alt-linux'
[  5%] Generating libkfbapi.gmo
make[2]: Leaving directory '/usr/src/RPM/BUILD/libkfbapi-1.0/BUILD-x86_64-alt-linux'
make[2]: Entering directory '/usr/src/RPM/BUILD/libkfbapi-1.0/BUILD-x86_64-alt-linux'
[  2%] Generating libkfbapi.gmo
make[2]: Leaving directory '/usr/src/RPM/BUILD/libkfbapi-1.0/BUILD-x86_64-alt-linux'
make[2]: Entering directory '/usr/src/RPM/BUILD/libkfbapi-1.0/BUILD-x86_64-alt-linux'
[  6%] Generating libkfbapi.gmo
make[2]: Leaving directory '/usr/src/RPM/BUILD/libkfbapi-1.0/BUILD-x86_64-alt-linux'
make[2]: Entering directory '/usr/src/RPM/BUILD/libkfbapi-1.0/BUILD-x86_64-alt-linux'
[  4%] Generating libkfbapi.gmo
make[2]: Leaving directory '/usr/src/RPM/BUILD/libkfbapi-1.0/BUILD-x86_64-alt-linux'
make[2]: Entering directory '/usr/src/RPM/BUILD/libkfbapi-1.0/BUILD-x86_64-alt-linux'
[  7%] Generating libkfbapi.gmo
make[2]: Leaving directory '/usr/src/RPM/BUILD/libkfbapi-1.0/BUILD-x86_64-alt-linux'
make[2]: Entering directory '/usr/src/RPM/BUILD/libkfbapi-1.0/BUILD-x86_64-alt-linux'
Scanning dependencies of target pofiles_8
make[2]: Leaving directory '/usr/src/RPM/BUILD/libkfbapi-1.0/BUILD-x86_64-alt-linux'
make[1]: Entering directory '/usr/src/RPM/BUILD/libkfbapi-1.0/BUILD-x86_64-alt-linux'
[  7%] Built target pofiles_3
make[1]: Leaving directory '/usr/src/RPM/BUILD/libkfbapi-1.0/BUILD-x86_64-alt-linux'
make[1]: Entering directory '/usr/src/RPM/BUILD/libkfbapi-1.0/BUILD-x86_64-alt-linux'
[  7%] Built target pofiles_4
make[1]: Leaving directory '/usr/src/RPM/BUILD/libkfbapi-1.0/BUILD-x86_64-alt-linux'
make[1]: Entering directory '/usr/src/RPM/BUILD/libkfbapi-1.0/BUILD-x86_64-alt-linux'
[  7%] Built target pofiles_7
make[1]: Leaving directory '/usr/src/RPM/BUILD/libkfbapi-1.0/BUILD-x86_64-alt-linux'
make[2]: Entering directory '/usr/src/RPM/BUILD/libkfbapi-1.0/BUILD-x86_64-alt-linux'
Scanning dependencies of target pofiles_9
make[2]: Leaving directory '/usr/src/RPM/BUILD/libkfbapi-1.0/BUILD-x86_64-alt-linux'
make[1]: Entering directory '/usr/src/RPM/BUILD/libkfbapi-1.0/BUILD-x86_64-alt-linux'
[  7%] Built target pofiles_2
make[1]: Leaving directory '/usr/src/RPM/BUILD/libkfbapi-1.0/BUILD-x86_64-alt-linux'
make[1]: Entering directory '/usr/src/RPM/BUILD/libkfbapi-1.0/BUILD-x86_64-alt-linux'
[  7%] Built target pofiles_6
make[1]: Leaving directory '/usr/src/RPM/BUILD/libkfbapi-1.0/BUILD-x86_64-alt-linux'
make[2]: Entering directory '/usr/src/RPM/BUILD/libkfbapi-1.0/BUILD-x86_64-alt-linux'
Scanning dependencies of target pofiles_10
make[2]: Leaving directory '/usr/src/RPM/BUILD/libkfbapi-1.0/BUILD-x86_64-alt-linux'
make[2]: Entering directory '/usr/src/RPM/BUILD/libkfbapi-1.0/BUILD-x86_64-alt-linux'
Scanning dependencies of target pofiles_11
make[2]: Leaving directory '/usr/src/RPM/BUILD/libkfbapi-1.0/BUILD-x86_64-alt-linux'
make[1]: Entering directory '/usr/src/RPM/BUILD/libkfbapi-1.0/BUILD-x86_64-alt-linux'
[  8%] Built target pofiles_5
make[1]: Leaving directory '/usr/src/RPM/BUILD/libkfbapi-1.0/BUILD-x86_64-alt-linux'
make[2]: Entering directory '/usr/src/RPM/BUILD/libkfbapi-1.0/BUILD-x86_64-alt-linux'
Scanning dependencies of target pofiles_14
make[2]: Leaving directory '/usr/src/RPM/BUILD/libkfbapi-1.0/BUILD-x86_64-alt-linux'
make[2]: Entering directory '/usr/src/RPM/BUILD/libkfbapi-1.0/BUILD-x86_64-alt-linux'
[  8%] Generating libkfbapi.gmo
make[2]: Leaving directory '/usr/src/RPM/BUILD/libkfbapi-1.0/BUILD-x86_64-alt-linux'
make[2]: Entering directory '/usr/src/RPM/BUILD/libkfbapi-1.0/BUILD-x86_64-alt-linux'
[  9%] Generating libkfbapi.gmo
make[2]: Leaving directory '/usr/src/RPM/BUILD/libkfbapi-1.0/BUILD-x86_64-alt-linux'
make[2]: Entering directory '/usr/src/RPM/BUILD/libkfbapi-1.0/BUILD-x86_64-alt-linux'
[ 10%] Generating libkfbapi.gmo
make[2]: Leaving directory '/usr/src/RPM/BUILD/libkfbapi-1.0/BUILD-x86_64-alt-linux'
make[2]: Entering directory '/usr/src/RPM/BUILD/libkfbapi-1.0/BUILD-x86_64-alt-linux'
Scanning dependencies of target pofiles_12
make[2]: Leaving directory '/usr/src/RPM/BUILD/libkfbapi-1.0/BUILD-x86_64-alt-linux'
make[2]: Entering directory '/usr/src/RPM/BUILD/libkfbapi-1.0/BUILD-x86_64-alt-linux'
Scanning dependencies of target pofiles_13
make[2]: Leaving directory '/usr/src/RPM/BUILD/libkfbapi-1.0/BUILD-x86_64-alt-linux'
make[2]: Entering directory '/usr/src/RPM/BUILD/libkfbapi-1.0/BUILD-x86_64-alt-linux'
[ 11%] Generating libkfbapi.gmo
make[2]: Leaving directory '/usr/src/RPM/BUILD/libkfbapi-1.0/BUILD-x86_64-alt-linux'
make[1]: Entering directory '/usr/src/RPM/BUILD/libkfbapi-1.0/BUILD-x86_64-alt-linux'
[ 11%] Built target pofiles_8
make[1]: Leaving directory '/usr/src/RPM/BUILD/libkfbapi-1.0/BUILD-x86_64-alt-linux'
make[1]: Entering directory '/usr/src/RPM/BUILD/libkfbapi-1.0/BUILD-x86_64-alt-linux'
[ 12%] Built target pofiles_10
make[1]: Leaving directory '/usr/src/RPM/BUILD/libkfbapi-1.0/BUILD-x86_64-alt-linux'
make[2]: Entering directory '/usr/src/RPM/BUILD/libkfbapi-1.0/BUILD-x86_64-alt-linux'
[ 12%] Generating libkfbapi.gmo
make[2]: Leaving directory '/usr/src/RPM/BUILD/libkfbapi-1.0/BUILD-x86_64-alt-linux'
make[1]: Entering directory '/usr/src/RPM/BUILD/libkfbapi-1.0/BUILD-x86_64-alt-linux'
[ 13%] Built target pofiles_9
make[1]: Leaving directory '/usr/src/RPM/BUILD/libkfbapi-1.0/BUILD-x86_64-alt-linux'
make[2]: Entering directory '/usr/src/RPM/BUILD/libkfbapi-1.0/BUILD-x86_64-alt-linux'
Scanning dependencies of target pofiles_15
make[2]: Leaving directory '/usr/src/RPM/BUILD/libkfbapi-1.0/BUILD-x86_64-alt-linux'
make[2]: Entering directory '/usr/src/RPM/BUILD/libkfbapi-1.0/BUILD-x86_64-alt-linux'
[ 13%] Generating libkfbapi.gmo
make[2]: Leaving directory '/usr/src/RPM/BUILD/libkfbapi-1.0/BUILD-x86_64-alt-linux'
make[2]: Entering directory '/usr/src/RPM/BUILD/libkfbapi-1.0/BUILD-x86_64-alt-linux'
Scanning dependencies of target pofiles_16
make[2]: Leaving directory '/usr/src/RPM/BUILD/libkfbapi-1.0/BUILD-x86_64-alt-linux'
make[1]: Entering directory '/usr/src/RPM/BUILD/libkfbapi-1.0/BUILD-x86_64-alt-linux'
[ 13%] Built target pofiles_14
make[1]: Leaving directory '/usr/src/RPM/BUILD/libkfbapi-1.0/BUILD-x86_64-alt-linux'
make[2]: Entering directory '/usr/src/RPM/BUILD/libkfbapi-1.0/BUILD-x86_64-alt-linux'
Scanning dependencies of target pofiles_17
make[2]: Leaving directory '/usr/src/RPM/BUILD/libkfbapi-1.0/BUILD-x86_64-alt-linux'
make[2]: Entering directory '/usr/src/RPM/BUILD/libkfbapi-1.0/BUILD-x86_64-alt-linux'
Scanning dependencies of target pofiles_18
make[2]: Leaving directory '/usr/src/RPM/BUILD/libkfbapi-1.0/BUILD-x86_64-alt-linux'
make[1]: Entering directory '/usr/src/RPM/BUILD/libkfbapi-1.0/BUILD-x86_64-alt-linux'
[ 14%] Built target pofiles_12
make[1]: Leaving directory '/usr/src/RPM/BUILD/libkfbapi-1.0/BUILD-x86_64-alt-linux'
make[1]: Entering directory '/usr/src/RPM/BUILD/libkfbapi-1.0/BUILD-x86_64-alt-linux'
[ 13%] Built target pofiles_11
make[1]: Leaving directory '/usr/src/RPM/BUILD/libkfbapi-1.0/BUILD-x86_64-alt-linux'
make[2]: Entering directory '/usr/src/RPM/BUILD/libkfbapi-1.0/BUILD-x86_64-alt-linux'
[ 15%] Generating libkfbapi.gmo
make[2]: Leaving directory '/usr/src/RPM/BUILD/libkfbapi-1.0/BUILD-x86_64-alt-linux'
make[2]: Entering directory '/usr/src/RPM/BUILD/libkfbapi-1.0/BUILD-x86_64-alt-linux'
[ 14%] Generating libkfbapi.gmo
make[2]: Leaving directory '/usr/src/RPM/BUILD/libkfbapi-1.0/BUILD-x86_64-alt-linux'
make[2]: Entering directory '/usr/src/RPM/BUILD/libkfbapi-1.0/BUILD-x86_64-alt-linux'
Scanning dependencies of target pofiles_19
make[2]: Leaving directory '/usr/src/RPM/BUILD/libkfbapi-1.0/BUILD-x86_64-alt-linux'
make[2]: Entering directory '/usr/src/RPM/BUILD/libkfbapi-1.0/BUILD-x86_64-alt-linux'
Scanning dependencies of target pofiles_20
make[2]: Leaving directory '/usr/src/RPM/BUILD/libkfbapi-1.0/BUILD-x86_64-alt-linux'
make[1]: Entering directory '/usr/src/RPM/BUILD/libkfbapi-1.0/BUILD-x86_64-alt-linux'
[ 16%] Built target pofiles_17
make[1]: Leaving directory '/usr/src/RPM/BUILD/libkfbapi-1.0/BUILD-x86_64-alt-linux'
make[2]: Entering directory '/usr/src/RPM/BUILD/libkfbapi-1.0/BUILD-x86_64-alt-linux'
[ 16%] Generating libkfbapi.gmo
make[2]: Leaving directory '/usr/src/RPM/BUILD/libkfbapi-1.0/BUILD-x86_64-alt-linux'
make[2]: Entering directory '/usr/src/RPM/BUILD/libkfbapi-1.0/BUILD-x86_64-alt-linux'
[ 17%] Generating libkfbapi.gmo
make[2]: Leaving directory '/usr/src/RPM/BUILD/libkfbapi-1.0/BUILD-x86_64-alt-linux'
make[2]: Entering directory '/usr/src/RPM/BUILD/libkfbapi-1.0/BUILD-x86_64-alt-linux'
Scanning dependencies of target pofiles_21
make[2]: Leaving directory '/usr/src/RPM/BUILD/libkfbapi-1.0/BUILD-x86_64-alt-linux'
make[1]: Entering directory '/usr/src/RPM/BUILD/libkfbapi-1.0/BUILD-x86_64-alt-linux'
[ 17%] Built target pofiles_13
make[1]: Leaving directory '/usr/src/RPM/BUILD/libkfbapi-1.0/BUILD-x86_64-alt-linux'
make[2]: Entering directory '/usr/src/RPM/BUILD/libkfbapi-1.0/BUILD-x86_64-alt-linux'
[ 18%] Generating libkfbapi.gmo
make[2]: Leaving directory '/usr/src/RPM/BUILD/libkfbapi-1.0/BUILD-x86_64-alt-linux'
make[2]: Entering directory '/usr/src/RPM/BUILD/libkfbapi-1.0/BUILD-x86_64-alt-linux'
[ 21%] Generating libkfbapi.gmo
make[2]: Leaving directory '/usr/src/RPM/BUILD/libkfbapi-1.0/BUILD-x86_64-alt-linux'
make[1]: Entering directory '/usr/src/RPM/BUILD/libkfbapi-1.0/BUILD-x86_64-alt-linux'
[ 21%] Built target pofiles_16
make[1]: Leaving directory '/usr/src/RPM/BUILD/libkfbapi-1.0/BUILD-x86_64-alt-linux'
make[2]: Entering directory '/usr/src/RPM/BUILD/libkfbapi-1.0/BUILD-x86_64-alt-linux'
[ 20%] Generating libkfbapi.gmo
make[2]: Leaving directory '/usr/src/RPM/BUILD/libkfbapi-1.0/BUILD-x86_64-alt-linux'
make[2]: Entering directory '/usr/src/RPM/BUILD/libkfbapi-1.0/BUILD-x86_64-alt-linux'
[ 22%] Generating libkfbapi.gmo
make[2]: Leaving directory '/usr/src/RPM/BUILD/libkfbapi-1.0/BUILD-x86_64-alt-linux'
make[1]: Entering directory '/usr/src/RPM/BUILD/libkfbapi-1.0/BUILD-x86_64-alt-linux'
[ 21%] Built target pofiles_15
make[1]: Leaving directory '/usr/src/RPM/BUILD/libkfbapi-1.0/BUILD-x86_64-alt-linux'
make[1]: Entering directory '/usr/src/RPM/BUILD/libkfbapi-1.0/BUILD-x86_64-alt-linux'
[ 22%] Built target pofiles_19
make[1]: Leaving directory '/usr/src/RPM/BUILD/libkfbapi-1.0/BUILD-x86_64-alt-linux'
make[1]: Entering directory '/usr/src/RPM/BUILD/libkfbapi-1.0/BUILD-x86_64-alt-linux'
[ 22%] Built target pofiles_18
make[1]: Leaving directory '/usr/src/RPM/BUILD/libkfbapi-1.0/BUILD-x86_64-alt-linux'
make[1]: Entering directory '/usr/src/RPM/BUILD/libkfbapi-1.0/BUILD-x86_64-alt-linux'
[ 22%] Built target pofiles_21
make[1]: Leaving directory '/usr/src/RPM/BUILD/libkfbapi-1.0/BUILD-x86_64-alt-linux'
make[1]: Entering directory '/usr/src/RPM/BUILD/libkfbapi-1.0/BUILD-x86_64-alt-linux'
[ 22%] Built target pofiles_20
make[1]: Leaving directory '/usr/src/RPM/BUILD/libkfbapi-1.0/BUILD-x86_64-alt-linux'
make[2]: Entering directory '/usr/src/RPM/BUILD/libkfbapi-1.0/BUILD-x86_64-alt-linux'
Scanning dependencies of target pofiles_23
make[2]: Leaving directory '/usr/src/RPM/BUILD/libkfbapi-1.0/BUILD-x86_64-alt-linux'
make[2]: Entering directory '/usr/src/RPM/BUILD/libkfbapi-1.0/BUILD-x86_64-alt-linux'
Scanning dependencies of target pofiles_25
make[2]: Leaving directory '/usr/src/RPM/BUILD/libkfbapi-1.0/BUILD-x86_64-alt-linux'
make[2]: Entering directory '/usr/src/RPM/BUILD/libkfbapi-1.0/BUILD-x86_64-alt-linux'
Scanning dependencies of target pofiles_22
make[2]: Leaving directory '/usr/src/RPM/BUILD/libkfbapi-1.0/BUILD-x86_64-alt-linux'
make[2]: Entering directory '/usr/src/RPM/BUILD/libkfbapi-1.0/BUILD-x86_64-alt-linux'
Scanning dependencies of target pofiles_26
make[2]: Leaving directory '/usr/src/RPM/BUILD/libkfbapi-1.0/BUILD-x86_64-alt-linux'
make[2]: Entering directory '/usr/src/RPM/BUILD/libkfbapi-1.0/BUILD-x86_64-alt-linux'
Scanning dependencies of target pofiles_27
make[2]: Leaving directory '/usr/src/RPM/BUILD/libkfbapi-1.0/BUILD-x86_64-alt-linux'
make[2]: Entering directory '/usr/src/RPM/BUILD/libkfbapi-1.0/BUILD-x86_64-alt-linux'
[ 24%] Generating libkfbapi.gmo
make[2]: Leaving directory '/usr/src/RPM/BUILD/libkfbapi-1.0/BUILD-x86_64-alt-linux'
make[2]: Entering directory '/usr/src/RPM/BUILD/libkfbapi-1.0/BUILD-x86_64-alt-linux'
[ 24%] Generating libkfbapi.gmo
make[2]: Leaving directory '/usr/src/RPM/BUILD/libkfbapi-1.0/BUILD-x86_64-alt-linux'
make[2]: Entering directory '/usr/src/RPM/BUILD/libkfbapi-1.0/BUILD-x86_64-alt-linux'
Scanning dependencies of target pofiles_24
make[2]: Leaving directory '/usr/src/RPM/BUILD/libkfbapi-1.0/BUILD-x86_64-alt-linux'
make[2]: Entering directory '/usr/src/RPM/BUILD/libkfbapi-1.0/BUILD-x86_64-alt-linux'
[ 25%] Generating libkfbapi.gmo
make[2]: Leaving directory '/usr/src/RPM/BUILD/libkfbapi-1.0/BUILD-x86_64-alt-linux'
make[1]: Entering directory '/usr/src/RPM/BUILD/libkfbapi-1.0/BUILD-x86_64-alt-linux'
[ 26%] Built target pofiles_25
make[1]: Leaving directory '/usr/src/RPM/BUILD/libkfbapi-1.0/BUILD-x86_64-alt-linux'
make[2]: Entering directory '/usr/src/RPM/BUILD/libkfbapi-1.0/BUILD-x86_64-alt-linux'
[ 26%] Generating libkfbapi.gmo
make[2]: Leaving directory '/usr/src/RPM/BUILD/libkfbapi-1.0/BUILD-x86_64-alt-linux'
make[2]: Entering directory '/usr/src/RPM/BUILD/libkfbapi-1.0/BUILD-x86_64-alt-linux'
Scanning dependencies of target pofiles_29
make[2]: Leaving directory '/usr/src/RPM/BUILD/libkfbapi-1.0/BUILD-x86_64-alt-linux'
make[2]: Entering directory '/usr/src/RPM/BUILD/libkfbapi-1.0/BUILD-x86_64-alt-linux'
[ 27%] Generating libkfbapi.gmo
make[2]: Leaving directory '/usr/src/RPM/BUILD/libkfbapi-1.0/BUILD-x86_64-alt-linux'
make[2]: Entering directory '/usr/src/RPM/BUILD/libkfbapi-1.0/BUILD-x86_64-alt-linux'
[ 28%] Generating libkfbapi.gmo
make[2]: Leaving directory '/usr/src/RPM/BUILD/libkfbapi-1.0/BUILD-x86_64-alt-linux'
make[1]: Entering directory '/usr/src/RPM/BUILD/libkfbapi-1.0/BUILD-x86_64-alt-linux'
[ 28%] Built target pofiles_26
make[1]: Leaving directory '/usr/src/RPM/BUILD/libkfbapi-1.0/BUILD-x86_64-alt-linux'
make[1]: Entering directory '/usr/src/RPM/BUILD/libkfbapi-1.0/BUILD-x86_64-alt-linux'
[ 28%] Built target pofiles_27
make[1]: Leaving directory '/usr/src/RPM/BUILD/libkfbapi-1.0/BUILD-x86_64-alt-linux'
make[1]: Entering directory '/usr/src/RPM/BUILD/libkfbapi-1.0/BUILD-x86_64-alt-linux'
[ 28%] Built target pofiles_23
make[1]: Leaving directory '/usr/src/RPM/BUILD/libkfbapi-1.0/BUILD-x86_64-alt-linux'
make[2]: Entering directory '/usr/src/RPM/BUILD/libkfbapi-1.0/BUILD-x86_64-alt-linux'
[ 29%] Generating libkfbapi.gmo
make[2]: Leaving directory '/usr/src/RPM/BUILD/libkfbapi-1.0/BUILD-x86_64-alt-linux'
make[2]: Entering directory '/usr/src/RPM/BUILD/libkfbapi-1.0/BUILD-x86_64-alt-linux'
Scanning dependencies of target pofiles_28
make[2]: Leaving directory '/usr/src/RPM/BUILD/libkfbapi-1.0/BUILD-x86_64-alt-linux'
make[2]: Entering directory '/usr/src/RPM/BUILD/libkfbapi-1.0/BUILD-x86_64-alt-linux'
Scanning dependencies of target pofiles_31
make[2]: Leaving directory '/usr/src/RPM/BUILD/libkfbapi-1.0/BUILD-x86_64-alt-linux'
make[1]: Entering directory '/usr/src/RPM/BUILD/libkfbapi-1.0/BUILD-x86_64-alt-linux'
[ 29%] Built target pofiles_22
make[1]: Leaving directory '/usr/src/RPM/BUILD/libkfbapi-1.0/BUILD-x86_64-alt-linux'
make[1]: Entering directory '/usr/src/RPM/BUILD/libkfbapi-1.0/BUILD-x86_64-alt-linux'
[ 29%] Built target pofiles_29
make[1]: Leaving directory '/usr/src/RPM/BUILD/libkfbapi-1.0/BUILD-x86_64-alt-linux'
make[1]: Entering directory '/usr/src/RPM/BUILD/libkfbapi-1.0/BUILD-x86_64-alt-linux'
[ 29%] Built target pofiles_24
make[1]: Leaving directory '/usr/src/RPM/BUILD/libkfbapi-1.0/BUILD-x86_64-alt-linux'
make[2]: Entering directory '/usr/src/RPM/BUILD/libkfbapi-1.0/BUILD-x86_64-alt-linux'
Scanning dependencies of target pofiles_32
make[2]: Leaving directory '/usr/src/RPM/BUILD/libkfbapi-1.0/BUILD-x86_64-alt-linux'
make[2]: Entering directory '/usr/src/RPM/BUILD/libkfbapi-1.0/BUILD-x86_64-alt-linux'
Scanning dependencies of target pofiles_30
make[2]: Leaving directory '/usr/src/RPM/BUILD/libkfbapi-1.0/BUILD-x86_64-alt-linux'
make[2]: Entering directory '/usr/src/RPM/BUILD/libkfbapi-1.0/BUILD-x86_64-alt-linux'
Scanning dependencies of target pofiles_33
make[2]: Leaving directory '/usr/src/RPM/BUILD/libkfbapi-1.0/BUILD-x86_64-alt-linux'
make[2]: Entering directory '/usr/src/RPM/BUILD/libkfbapi-1.0/BUILD-x86_64-alt-linux'
[ 30%] Generating libkfbapi.gmo
make[2]: Leaving directory '/usr/src/RPM/BUILD/libkfbapi-1.0/BUILD-x86_64-alt-linux'
make[2]: Entering directory '/usr/src/RPM/BUILD/libkfbapi-1.0/BUILD-x86_64-alt-linux'
Scanning dependencies of target pofiles_35
make[2]: Leaving directory '/usr/src/RPM/BUILD/libkfbapi-1.0/BUILD-x86_64-alt-linux'
make[2]: Entering directory '/usr/src/RPM/BUILD/libkfbapi-1.0/BUILD-x86_64-alt-linux'
[ 32%] Generating libkfbapi.gmo
make[2]: Leaving directory '/usr/src/RPM/BUILD/libkfbapi-1.0/BUILD-x86_64-alt-linux'
make[2]: Entering directory '/usr/src/RPM/BUILD/libkfbapi-1.0/BUILD-x86_64-alt-linux'
[ 33%] Generating libkfbapi.gmo
make[2]: Leaving directory '/usr/src/RPM/BUILD/libkfbapi-1.0/BUILD-x86_64-alt-linux'
make[1]: Entering directory '/usr/src/RPM/BUILD/libkfbapi-1.0/BUILD-x86_64-alt-linux'
[ 33%] Built target pofiles_28
make[1]: Leaving directory '/usr/src/RPM/BUILD/libkfbapi-1.0/BUILD-x86_64-alt-linux'
make[1]: Entering directory '/usr/src/RPM/BUILD/libkfbapi-1.0/BUILD-x86_64-alt-linux'
[ 33%] Built target pofiles_32
make[1]: Leaving directory '/usr/src/RPM/BUILD/libkfbapi-1.0/BUILD-x86_64-alt-linux'
make[1]: Entering directory '/usr/src/RPM/BUILD/libkfbapi-1.0/BUILD-x86_64-alt-linux'
[ 33%] Built target pofiles_30
make[1]: Leaving directory '/usr/src/RPM/BUILD/libkfbapi-1.0/BUILD-x86_64-alt-linux'
make[2]: Entering directory '/usr/src/RPM/BUILD/libkfbapi-1.0/BUILD-x86_64-alt-linux'
[ 31%] Generating libkfbapi.gmo
make[2]: Leaving directory '/usr/src/RPM/BUILD/libkfbapi-1.0/BUILD-x86_64-alt-linux'
make[2]: Entering directory '/usr/src/RPM/BUILD/libkfbapi-1.0/BUILD-x86_64-alt-linux'
Scanning dependencies of target pofiles_38
make[2]: Leaving directory '/usr/src/RPM/BUILD/libkfbapi-1.0/BUILD-x86_64-alt-linux'
make[2]: Entering directory '/usr/src/RPM/BUILD/libkfbapi-1.0/BUILD-x86_64-alt-linux'
Scanning dependencies of target pofiles_36
make[2]: Leaving directory '/usr/src/RPM/BUILD/libkfbapi-1.0/BUILD-x86_64-alt-linux'
make[2]: Entering directory '/usr/src/RPM/BUILD/libkfbapi-1.0/BUILD-x86_64-alt-linux'
Scanning dependencies of target pofiles_37
make[2]: Leaving directory '/usr/src/RPM/BUILD/libkfbapi-1.0/BUILD-x86_64-alt-linux'
make[2]: Entering directory '/usr/src/RPM/BUILD/libkfbapi-1.0/BUILD-x86_64-alt-linux'
[ 35%] Generating libkfbapi.gmo
make[2]: Leaving directory '/usr/src/RPM/BUILD/libkfbapi-1.0/BUILD-x86_64-alt-linux'
make[1]: Entering directory '/usr/src/RPM/BUILD/libkfbapi-1.0/BUILD-x86_64-alt-linux'
[ 35%] Built target pofiles_36
make[1]: Leaving directory '/usr/src/RPM/BUILD/libkfbapi-1.0/BUILD-x86_64-alt-linux'
make[2]: Entering directory '/usr/src/RPM/BUILD/libkfbapi-1.0/BUILD-x86_64-alt-linux'
Scanning dependencies of target pofiles_34
make[2]: Leaving directory '/usr/src/RPM/BUILD/libkfbapi-1.0/BUILD-x86_64-alt-linux'
make[2]: Entering directory '/usr/src/RPM/BUILD/libkfbapi-1.0/BUILD-x86_64-alt-linux'
[ 34%] Generating libkfbapi.gmo
make[2]: Leaving directory '/usr/src/RPM/BUILD/libkfbapi-1.0/BUILD-x86_64-alt-linux'
make[2]: Entering directory '/usr/src/RPM/BUILD/libkfbapi-1.0/BUILD-x86_64-alt-linux'
[ 36%] Generating libkfbapi.gmo
make[2]: Leaving directory '/usr/src/RPM/BUILD/libkfbapi-1.0/BUILD-x86_64-alt-linux'
make[2]: Entering directory '/usr/src/RPM/BUILD/libkfbapi-1.0/BUILD-x86_64-alt-linux'
Scanning dependencies of target pofiles_39
make[2]: Leaving directory '/usr/src/RPM/BUILD/libkfbapi-1.0/BUILD-x86_64-alt-linux'
make[2]: Entering directory '/usr/src/RPM/BUILD/libkfbapi-1.0/BUILD-x86_64-alt-linux'
[ 40%] Generating libkfbapi.gmo
make[2]: Leaving directory '/usr/src/RPM/BUILD/libkfbapi-1.0/BUILD-x86_64-alt-linux'
make[1]: Entering directory '/usr/src/RPM/BUILD/libkfbapi-1.0/BUILD-x86_64-alt-linux'
[ 40%] Built target pofiles_34
make[1]: Leaving directory '/usr/src/RPM/BUILD/libkfbapi-1.0/BUILD-x86_64-alt-linux'
make[2]: Entering directory '/usr/src/RPM/BUILD/libkfbapi-1.0/BUILD-x86_64-alt-linux'
[ 37%] Generating libkfbapi.gmo
make[2]: Leaving directory '/usr/src/RPM/BUILD/libkfbapi-1.0/BUILD-x86_64-alt-linux'
make[1]: Entering directory '/usr/src/RPM/BUILD/libkfbapi-1.0/BUILD-x86_64-alt-linux'
[ 40%] Built target pofiles_33
make[1]: Leaving directory '/usr/src/RPM/BUILD/libkfbapi-1.0/BUILD-x86_64-alt-linux'
make[2]: Entering directory '/usr/src/RPM/BUILD/libkfbapi-1.0/BUILD-x86_64-alt-linux'
Scanning dependencies of target pofiles_40
make[2]: Leaving directory '/usr/src/RPM/BUILD/libkfbapi-1.0/BUILD-x86_64-alt-linux'
make[1]: Entering directory '/usr/src/RPM/BUILD/libkfbapi-1.0/BUILD-x86_64-alt-linux'
[ 40%] Built target pofiles_37
make[1]: Leaving directory '/usr/src/RPM/BUILD/libkfbapi-1.0/BUILD-x86_64-alt-linux'
make[1]: Entering directory '/usr/src/RPM/BUILD/libkfbapi-1.0/BUILD-x86_64-alt-linux'
[ 40%] Built target pofiles_31
make[1]: Leaving directory '/usr/src/RPM/BUILD/libkfbapi-1.0/BUILD-x86_64-alt-linux'
make[2]: Entering directory '/usr/src/RPM/BUILD/libkfbapi-1.0/BUILD-x86_64-alt-linux'
[ 38%] Generating libkfbapi.gmo
make[2]: Leaving directory '/usr/src/RPM/BUILD/libkfbapi-1.0/BUILD-x86_64-alt-linux'
make[2]: Entering directory '/usr/src/RPM/BUILD/libkfbapi-1.0/BUILD-x86_64-alt-linux'
Scanning dependencies of target pofiles_41
make[2]: Leaving directory '/usr/src/RPM/BUILD/libkfbapi-1.0/BUILD-x86_64-alt-linux'
make[1]: Entering directory '/usr/src/RPM/BUILD/libkfbapi-1.0/BUILD-x86_64-alt-linux'
[ 42%] Built target pofiles_35
make[1]: Leaving directory '/usr/src/RPM/BUILD/libkfbapi-1.0/BUILD-x86_64-alt-linux'
make[1]: Entering directory '/usr/src/RPM/BUILD/libkfbapi-1.0/BUILD-x86_64-alt-linux'
[ 42%] Built target pofiles_38
make[1]: Leaving directory '/usr/src/RPM/BUILD/libkfbapi-1.0/BUILD-x86_64-alt-linux'
make[2]: Entering directory '/usr/src/RPM/BUILD/libkfbapi-1.0/BUILD-x86_64-alt-linux'
[ 42%] Generating libkfbapi.gmo
make[2]: Leaving directory '/usr/src/RPM/BUILD/libkfbapi-1.0/BUILD-x86_64-alt-linux'
make[2]: Entering directory '/usr/src/RPM/BUILD/libkfbapi-1.0/BUILD-x86_64-alt-linux'
[ 41%] Generating libkfbapi.gmo
make[2]: Leaving directory '/usr/src/RPM/BUILD/libkfbapi-1.0/BUILD-x86_64-alt-linux'
make[2]: Entering directory '/usr/src/RPM/BUILD/libkfbapi-1.0/BUILD-x86_64-alt-linux'
Scanning dependencies of target pofiles_42
make[2]: Leaving directory '/usr/src/RPM/BUILD/libkfbapi-1.0/BUILD-x86_64-alt-linux'
make[2]: Entering directory '/usr/src/RPM/BUILD/libkfbapi-1.0/BUILD-x86_64-alt-linux'
[ 43%] Generating libkfbapi.gmo
make[2]: Leaving directory '/usr/src/RPM/BUILD/libkfbapi-1.0/BUILD-x86_64-alt-linux'
make[1]: Entering directory '/usr/src/RPM/BUILD/libkfbapi-1.0/BUILD-x86_64-alt-linux'
[ 43%] Built target pofiles_39
make[1]: Leaving directory '/usr/src/RPM/BUILD/libkfbapi-1.0/BUILD-x86_64-alt-linux'
make[1]: Entering directory '/usr/src/RPM/BUILD/libkfbapi-1.0/BUILD-x86_64-alt-linux'
[ 43%] Built target pofiles_40
make[1]: Leaving directory '/usr/src/RPM/BUILD/libkfbapi-1.0/BUILD-x86_64-alt-linux'
make[1]: Entering directory '/usr/src/RPM/BUILD/libkfbapi-1.0/BUILD-x86_64-alt-linux'
[ 44%] Built target pofiles_41
make[1]: Leaving directory '/usr/src/RPM/BUILD/libkfbapi-1.0/BUILD-x86_64-alt-linux'
make[2]: Entering directory '/usr/src/RPM/BUILD/libkfbapi-1.0/BUILD-x86_64-alt-linux'
[ 44%] Generating libkfbapi.gmo
make[2]: Leaving directory '/usr/src/RPM/BUILD/libkfbapi-1.0/BUILD-x86_64-alt-linux'
make[1]: Entering directory '/usr/src/RPM/BUILD/libkfbapi-1.0/BUILD-x86_64-alt-linux'
[ 44%] Built target pofiles_42
make[1]: Leaving directory '/usr/src/RPM/BUILD/libkfbapi-1.0/BUILD-x86_64-alt-linux'
make[2]: Entering directory '/usr/src/RPM/BUILD/libkfbapi-1.0/BUILD-x86_64-alt-linux'
Generating notejob.moc
Generating notificationsmarkreadjob.moc
Generating authenticationdialog.moc
Generating postaddjob.moc
Generating userinfojob.moc
Generating friendjob.moc
Generating photojob.moc
Generating eventjob.moc
Generating postjob.moc
Generating friendlistjob.moc
Generating facebookjobs.moc
Generating noteaddjob.moc
Generating moc_eventslistjob.cpp
Generating moc_listjobbase.cpp
Generating moc_notificationslistjob.cpp
Generating moc_allpostslistjob.cpp
Generating moc_getcommentsjob.cpp
Generating moc_noteslistjob.cpp
Generating moc_getlikesjob.cpp
Generating moc_pagedlistjob.cpp
Generating moc_alleventslistjob.cpp
Generating moc_postslistjob.cpp
Generating moc_allnoteslistjob.cpp
make[2]: Leaving directory '/usr/src/RPM/BUILD/libkfbapi-1.0/BUILD-x86_64-alt-linux'
make[1]: Entering directory '/usr/src/RPM/BUILD/libkfbapi-1.0/BUILD-x86_64-alt-linux'
[ 44%] Built target kfbapi_automoc
make[1]: Leaving directory '/usr/src/RPM/BUILD/libkfbapi-1.0/BUILD-x86_64-alt-linux'
make[2]: Entering directory '/usr/src/RPM/BUILD/libkfbapi-1.0/BUILD-x86_64-alt-linux'
[ 48%] Generating moc_notificationinfoparser_p.cpp
make[2]: Leaving directory '/usr/src/RPM/BUILD/libkfbapi-1.0/BUILD-x86_64-alt-linux'
make[2]: Entering directory '/usr/src/RPM/BUILD/libkfbapi-1.0/BUILD-x86_64-alt-linux'
[ 49%] Generating moc_postinfoparser_p.cpp
make[2]: Leaving directory '/usr/src/RPM/BUILD/libkfbapi-1.0/BUILD-x86_64-alt-linux'
make[2]: Entering directory '/usr/src/RPM/BUILD/libkfbapi-1.0/BUILD-x86_64-alt-linux'
[ 46%] Generating moc_likeinfoparser_p.cpp
make[2]: Leaving directory '/usr/src/RPM/BUILD/libkfbapi-1.0/BUILD-x86_64-alt-linux'
make[2]: Entering directory '/usr/src/RPM/BUILD/libkfbapi-1.0/BUILD-x86_64-alt-linux'
[ 53%] Generating moc_propertyinfoparser_p.cpp
make[2]: Leaving directory '/usr/src/RPM/BUILD/libkfbapi-1.0/BUILD-x86_64-alt-linux'
make[2]: Entering directory '/usr/src/RPM/BUILD/libkfbapi-1.0/BUILD-x86_64-alt-linux'
[ 45%] Generating moc_eventinfoparser_p.cpp
make[2]: Leaving directory '/usr/src/RPM/BUILD/libkfbapi-1.0/BUILD-x86_64-alt-linux'
make[2]: Entering directory '/usr/src/RPM/BUILD/libkfbapi-1.0/BUILD-x86_64-alt-linux'
[ 47%] Generating moc_commentinfoparser_p.cpp
make[2]: Leaving directory '/usr/src/RPM/BUILD/libkfbapi-1.0/BUILD-x86_64-alt-linux'
make[2]: Entering directory '/usr/src/RPM/BUILD/libkfbapi-1.0/BUILD-x86_64-alt-linux'
[ 51%] Generating moc_appinfoparser_p.cpp
make[2]: Leaving directory '/usr/src/RPM/BUILD/libkfbapi-1.0/BUILD-x86_64-alt-linux'
make[2]: Entering directory '/usr/src/RPM/BUILD/libkfbapi-1.0/BUILD-x86_64-alt-linux'
[ 50%] Generating moc_userinfoparser_p.cpp
make[2]: Leaving directory '/usr/src/RPM/BUILD/libkfbapi-1.0/BUILD-x86_64-alt-linux'
make[2]: Entering directory '/usr/src/RPM/BUILD/libkfbapi-1.0/BUILD-x86_64-alt-linux'
[ 52%] Generating moc_noteinfoparser_p.cpp
make[2]: Leaving directory '/usr/src/RPM/BUILD/libkfbapi-1.0/BUILD-x86_64-alt-linux'
make[2]: Entering directory '/usr/src/RPM/BUILD/libkfbapi-1.0/BUILD-x86_64-alt-linux'
Scanning dependencies of target kfbapi
make[2]: Leaving directory '/usr/src/RPM/BUILD/libkfbapi-1.0/BUILD-x86_64-alt-linux'
make[2]: Entering directory '/usr/src/RPM/BUILD/libkfbapi-1.0/BUILD-x86_64-alt-linux'
[ 57%] Building CXX object libkfbapi/CMakeFiles/kfbapi.dir/userinfojob.o
make[2]: Leaving directory '/usr/src/RPM/BUILD/libkfbapi-1.0/BUILD-x86_64-alt-linux'
make[2]: Entering directory '/usr/src/RPM/BUILD/libkfbapi-1.0/BUILD-x86_64-alt-linux'
[ 58%] Building CXX object libkfbapi/CMakeFiles/kfbapi.dir/userinfo.o
make[2]: Leaving directory '/usr/src/RPM/BUILD/libkfbapi-1.0/BUILD-x86_64-alt-linux'
make[2]: Entering directory '/usr/src/RPM/BUILD/libkfbapi-1.0/BUILD-x86_64-alt-linux'
[ 62%] Building CXX object libkfbapi/CMakeFiles/kfbapi.dir/friendlistjob.o
make[2]: Leaving directory '/usr/src/RPM/BUILD/libkfbapi-1.0/BUILD-x86_64-alt-linux'
make[2]: Entering directory '/usr/src/RPM/BUILD/libkfbapi-1.0/BUILD-x86_64-alt-linux'
[ 56%] Building CXX object libkfbapi/CMakeFiles/kfbapi.dir/authenticationdialog.o
make[2]: Leaving directory '/usr/src/RPM/BUILD/libkfbapi-1.0/BUILD-x86_64-alt-linux'
make[2]: Entering directory '/usr/src/RPM/BUILD/libkfbapi-1.0/BUILD-x86_64-alt-linux'
[ 65%] Building CXX object libkfbapi/CMakeFiles/kfbapi.dir/util.o
make[2]: Leaving directory '/usr/src/RPM/BUILD/libkfbapi-1.0/BUILD-x86_64-alt-linux'
make[2]: Entering directory '/usr/src/RPM/BUILD/libkfbapi-1.0/BUILD-x86_64-alt-linux'
[ 64%] Building CXX object libkfbapi/CMakeFiles/kfbapi.dir/eventinfo.o
/usr/src/RPM/BUILD/libkfbapi-1.0/libkfbapi/eventinfo.cpp: In member function 'KFbAPI::EventPtr KFbAPI::EventInfo::asEvent() const':
/usr/src/RPM/BUILD/libkfbapi-1.0/libkfbapi/eventinfo.cpp:134:45: warning: 'void KCalCore::Event::setHasEndDate(bool)' is deprecated [-Wdeprecated-declarations]
     event->setHasEndDate(endTime().isValid());
                                             ^
In file included from /usr/include/kde4/KDE/KCalCore/Event:1,
                 from /usr/src/RPM/BUILD/libkfbapi-1.0/libkfbapi/eventinfo.h:27,
                 from /usr/src/RPM/BUILD/libkfbapi-1.0/libkfbapi/eventinfo.cpp:20:
/usr/include/kde4/KDE/KCalCore/../../kcalcore/event.h:142:30: note: declared here
     KCALCORE_DEPRECATED void setHasEndDate(bool b);
                              ^~~~~~~~~~~~~
make[2]: Leaving directory '/usr/src/RPM/BUILD/libkfbapi-1.0/BUILD-x86_64-alt-linux'
make[2]: Entering directory '/usr/src/RPM/BUILD/libkfbapi-1.0/BUILD-x86_64-alt-linux'
[ 54%] Building CXX object libkfbapi/CMakeFiles/kfbapi.dir/kfbapi_automoc.o
make[2]: Leaving directory '/usr/src/RPM/BUILD/libkfbapi-1.0/BUILD-x86_64-alt-linux'
make[2]: Entering directory '/usr/src/RPM/BUILD/libkfbapi-1.0/BUILD-x86_64-alt-linux'
[ 60%] Building CXX object libkfbapi/CMakeFiles/kfbapi.dir/friendjob.o
make[2]: Leaving directory '/usr/src/RPM/BUILD/libkfbapi-1.0/BUILD-x86_64-alt-linux'
make[2]: Entering directory '/usr/src/RPM/BUILD/libkfbapi-1.0/BUILD-x86_64-alt-linux'
[ 61%] Building CXX object libkfbapi/CMakeFiles/kfbapi.dir/photojob.o
make[2]: Leaving directory '/usr/src/RPM/BUILD/libkfbapi-1.0/BUILD-x86_64-alt-linux'
make[2]: Entering directory '/usr/src/RPM/BUILD/libkfbapi-1.0/BUILD-x86_64-alt-linux'
[ 66%] Building CXX object libkfbapi/CMakeFiles/kfbapi.dir/alleventslistjob.o
make[2]: Leaving directory '/usr/src/RPM/BUILD/libkfbapi-1.0/BUILD-x86_64-alt-linux'
make[2]: Entering directory '/usr/src/RPM/BUILD/libkfbapi-1.0/BUILD-x86_64-alt-linux'
[ 55%] Building CXX object libkfbapi/CMakeFiles/kfbapi.dir/allpostslistjob.o
make[2]: Leaving directory '/usr/src/RPM/BUILD/libkfbapi-1.0/BUILD-x86_64-alt-linux'
make[2]: Entering directory '/usr/src/RPM/BUILD/libkfbapi-1.0/BUILD-x86_64-alt-linux'
[ 68%] Building CXX object libkfbapi/CMakeFiles/kfbapi.dir/noteinfo.o
make[2]: Leaving directory '/usr/src/RPM/BUILD/libkfbapi-1.0/BUILD-x86_64-alt-linux'
make[2]: Entering directory '/usr/src/RPM/BUILD/libkfbapi-1.0/BUILD-x86_64-alt-linux'
[ 72%] Building CXX object libkfbapi/CMakeFiles/kfbapi.dir/noteaddjob.o
make[2]: Leaving directory '/usr/src/RPM/BUILD/libkfbapi-1.0/BUILD-x86_64-alt-linux'
make[2]: Entering directory '/usr/src/RPM/BUILD/libkfbapi-1.0/BUILD-x86_64-alt-linux'
[ 63%] Building CXX object libkfbapi/CMakeFiles/kfbapi.dir/eventslistjob.o
make[2]: Leaving directory '/usr/src/RPM/BUILD/libkfbapi-1.0/BUILD-x86_64-alt-linux'
make[2]: Entering directory '/usr/src/RPM/BUILD/libkfbapi-1.0/BUILD-x86_64-alt-linux'
[ 71%] Building CXX object libkfbapi/CMakeFiles/kfbapi.dir/notejob.o
make[2]: Leaving directory '/usr/src/RPM/BUILD/libkfbapi-1.0/BUILD-x86_64-alt-linux'
make[2]: Entering directory '/usr/src/RPM/BUILD/libkfbapi-1.0/BUILD-x86_64-alt-linux'
[ 70%] Building CXX object libkfbapi/CMakeFiles/kfbapi.dir/allnoteslistjob.o
make[2]: Leaving directory '/usr/src/RPM/BUILD/libkfbapi-1.0/BUILD-x86_64-alt-linux'
make[2]: Entering directory '/usr/src/RPM/BUILD/libkfbapi-1.0/BUILD-x86_64-alt-linux'
[ 75%] Building CXX object libkfbapi/CMakeFiles/kfbapi.dir/listjobbase.o
/usr/src/RPM/BUILD/libkfbapi-1.0/libkfbapi/listjobbase.cpp: In member function 'virtual void KFbAPI::ListJobBase::handleItems(const QVariant&)':
/usr/src/RPM/BUILD/libkfbapi-1.0/libkfbapi/listjobbase.cpp:55:47: warning: unused parameter 'root' [-Wunused-parameter]
 void ListJobBase::handleItems(const QVariant &root)
                               ~~~~~~~~~~~~~~~~^~~~
make[2]: Leaving directory '/usr/src/RPM/BUILD/libkfbapi-1.0/BUILD-x86_64-alt-linux'
make[2]: Entering directory '/usr/src/RPM/BUILD/libkfbapi-1.0/BUILD-x86_64-alt-linux'
[ 74%] Building CXX object libkfbapi/CMakeFiles/kfbapi.dir/pagedlistjob.o
make[2]: Leaving directory '/usr/src/RPM/BUILD/libkfbapi-1.0/BUILD-x86_64-alt-linux'
make[2]: Entering directory '/usr/src/RPM/BUILD/libkfbapi-1.0/BUILD-x86_64-alt-linux'
[ 69%] Building CXX object libkfbapi/CMakeFiles/kfbapi.dir/noteslistjob.o
make[2]: Leaving directory '/usr/src/RPM/BUILD/libkfbapi-1.0/BUILD-x86_64-alt-linux'
make[2]: Entering directory '/usr/src/RPM/BUILD/libkfbapi-1.0/BUILD-x86_64-alt-linux'
[ 78%] Building CXX object libkfbapi/CMakeFiles/kfbapi.dir/postaddjob.o
make[2]: Leaving directory '/usr/src/RPM/BUILD/libkfbapi-1.0/BUILD-x86_64-alt-linux'
make[2]: Entering directory '/usr/src/RPM/BUILD/libkfbapi-1.0/BUILD-x86_64-alt-linux'
[ 77%] Building CXX object libkfbapi/CMakeFiles/kfbapi.dir/postinfo.o
make[2]: Leaving directory '/usr/src/RPM/BUILD/libkfbapi-1.0/BUILD-x86_64-alt-linux'
make[2]: Entering directory '/usr/src/RPM/BUILD/libkfbapi-1.0/BUILD-x86_64-alt-linux'
[ 80%] Building CXX object libkfbapi/CMakeFiles/kfbapi.dir/postslistjob.o
make[2]: Leaving directory '/usr/src/RPM/BUILD/libkfbapi-1.0/BUILD-x86_64-alt-linux'
make[2]: Entering directory '/usr/src/RPM/BUILD/libkfbapi-1.0/BUILD-x86_64-alt-linux'
[ 76%] Building CXX object libkfbapi/CMakeFiles/kfbapi.dir/postjob.o
make[2]: Leaving directory '/usr/src/RPM/BUILD/libkfbapi-1.0/BUILD-x86_64-alt-linux'
make[2]: Entering directory '/usr/src/RPM/BUILD/libkfbapi-1.0/BUILD-x86_64-alt-linux'
[ 67%] Building CXX object libkfbapi/CMakeFiles/kfbapi.dir/eventjob.o
make[2]: Leaving directory '/usr/src/RPM/BUILD/libkfbapi-1.0/BUILD-x86_64-alt-linux'
make[2]: Entering directory '/usr/src/RPM/BUILD/libkfbapi-1.0/BUILD-x86_64-alt-linux'
[ 82%] Building CXX object libkfbapi/CMakeFiles/kfbapi.dir/appinfo.o
make[2]: Leaving directory '/usr/src/RPM/BUILD/libkfbapi-1.0/BUILD-x86_64-alt-linux'
make[2]: Entering directory '/usr/src/RPM/BUILD/libkfbapi-1.0/BUILD-x86_64-alt-linux'
[ 81%] Building CXX object libkfbapi/CMakeFiles/kfbapi.dir/propertyinfo.o
make[2]: Leaving directory '/usr/src/RPM/BUILD/libkfbapi-1.0/BUILD-x86_64-alt-linux'
make[2]: Entering directory '/usr/src/RPM/BUILD/libkfbapi-1.0/BUILD-x86_64-alt-linux'
[ 83%] Building CXX object libkfbapi/CMakeFiles/kfbapi.dir/commentinfo.o
make[2]: Leaving directory '/usr/src/RPM/BUILD/libkfbapi-1.0/BUILD-x86_64-alt-linux'
make[2]: Entering directory '/usr/src/RPM/BUILD/libkfbapi-1.0/BUILD-x86_64-alt-linux'
[ 86%] Building CXX object libkfbapi/CMakeFiles/kfbapi.dir/notificationslistjob.o
make[2]: Leaving directory '/usr/src/RPM/BUILD/libkfbapi-1.0/BUILD-x86_64-alt-linux'
make[2]: Entering directory '/usr/src/RPM/BUILD/libkfbapi-1.0/BUILD-x86_64-alt-linux'
[ 88%] Building CXX object libkfbapi/CMakeFiles/kfbapi.dir/getcommentsjob.o
make[2]: Leaving directory '/usr/src/RPM/BUILD/libkfbapi-1.0/BUILD-x86_64-alt-linux'
make[2]: Entering directory '/usr/src/RPM/BUILD/libkfbapi-1.0/BUILD-x86_64-alt-linux'
[ 87%] Building CXX object libkfbapi/CMakeFiles/kfbapi.dir/getlikesjob.o
make[2]: Leaving directory '/usr/src/RPM/BUILD/libkfbapi-1.0/BUILD-x86_64-alt-linux'
make[2]: Entering directory '/usr/src/RPM/BUILD/libkfbapi-1.0/BUILD-x86_64-alt-linux'
[ 85%] Building CXX object libkfbapi/CMakeFiles/kfbapi.dir/notificationinfo.o
make[2]: Leaving directory '/usr/src/RPM/BUILD/libkfbapi-1.0/BUILD-x86_64-alt-linux'
make[2]: Entering directory '/usr/src/RPM/BUILD/libkfbapi-1.0/BUILD-x86_64-alt-linux'
[ 84%] Building CXX object libkfbapi/CMakeFiles/kfbapi.dir/likeinfo.o
make[2]: Leaving directory '/usr/src/RPM/BUILD/libkfbapi-1.0/BUILD-x86_64-alt-linux'
make[2]: Entering directory '/usr/src/RPM/BUILD/libkfbapi-1.0/BUILD-x86_64-alt-linux'
[ 73%] Building CXX object libkfbapi/CMakeFiles/kfbapi.dir/facebookjobs.o
make[2]: Leaving directory '/usr/src/RPM/BUILD/libkfbapi-1.0/BUILD-x86_64-alt-linux'
make[2]: Entering directory '/usr/src/RPM/BUILD/libkfbapi-1.0/BUILD-x86_64-alt-linux'
[ 93%] Building CXX object libkfbapi/CMakeFiles/kfbapi.dir/moc_noteinfoparser_p.o
make[2]: Leaving directory '/usr/src/RPM/BUILD/libkfbapi-1.0/BUILD-x86_64-alt-linux'
make[2]: Entering directory '/usr/src/RPM/BUILD/libkfbapi-1.0/BUILD-x86_64-alt-linux'
[ 90%] Building CXX object libkfbapi/CMakeFiles/kfbapi.dir/moc_appinfoparser_p.o
make[2]: Leaving directory '/usr/src/RPM/BUILD/libkfbapi-1.0/BUILD-x86_64-alt-linux'
make[2]: Entering directory '/usr/src/RPM/BUILD/libkfbapi-1.0/BUILD-x86_64-alt-linux'
[ 89%] Building CXX object libkfbapi/CMakeFiles/kfbapi.dir/notificationsmarkreadjob.o
make[2]: Leaving directory '/usr/src/RPM/BUILD/libkfbapi-1.0/BUILD-x86_64-alt-linux'
make[2]: Entering directory '/usr/src/RPM/BUILD/libkfbapi-1.0/BUILD-x86_64-alt-linux'
[ 94%] Building CXX object libkfbapi/CMakeFiles/kfbapi.dir/moc_likeinfoparser_p.o
make[2]: Leaving directory '/usr/src/RPM/BUILD/libkfbapi-1.0/BUILD-x86_64-alt-linux'
make[2]: Entering directory '/usr/src/RPM/BUILD/libkfbapi-1.0/BUILD-x86_64-alt-linux'
[ 97%] Building CXX object libkfbapi/CMakeFiles/kfbapi.dir/moc_propertyinfoparser_p.o
make[2]: Leaving directory '/usr/src/RPM/BUILD/libkfbapi-1.0/BUILD-x86_64-alt-linux'
make[2]: Entering directory '/usr/src/RPM/BUILD/libkfbapi-1.0/BUILD-x86_64-alt-linux'
[ 92%] Building CXX object libkfbapi/CMakeFiles/kfbapi.dir/moc_eventinfoparser_p.o
make[2]: Leaving directory '/usr/src/RPM/BUILD/libkfbapi-1.0/BUILD-x86_64-alt-linux'
make[2]: Entering directory '/usr/src/RPM/BUILD/libkfbapi-1.0/BUILD-x86_64-alt-linux'
[ 91%] Building CXX object libkfbapi/CMakeFiles/kfbapi.dir/moc_commentinfoparser_p.o
make[2]: Leaving directory '/usr/src/RPM/BUILD/libkfbapi-1.0/BUILD-x86_64-alt-linux'
make[2]: Entering directory '/usr/src/RPM/BUILD/libkfbapi-1.0/BUILD-x86_64-alt-linux'
[ 96%] Building CXX object libkfbapi/CMakeFiles/kfbapi.dir/moc_postinfoparser_p.o
make[2]: Leaving directory '/usr/src/RPM/BUILD/libkfbapi-1.0/BUILD-x86_64-alt-linux'
make[2]: Entering directory '/usr/src/RPM/BUILD/libkfbapi-1.0/BUILD-x86_64-alt-linux'
[ 95%] Building CXX object libkfbapi/CMakeFiles/kfbapi.dir/moc_notificationinfoparser_p.o
make[2]: Leaving directory '/usr/src/RPM/BUILD/libkfbapi-1.0/BUILD-x86_64-alt-linux'
make[2]: Entering directory '/usr/src/RPM/BUILD/libkfbapi-1.0/BUILD-x86_64-alt-linux'
[ 98%] Building CXX object libkfbapi/CMakeFiles/kfbapi.dir/moc_userinfoparser_p.o
make[2]: Leaving directory '/usr/src/RPM/BUILD/libkfbapi-1.0/BUILD-x86_64-alt-linux'
make[2]: Entering directory '/usr/src/RPM/BUILD/libkfbapi-1.0/BUILD-x86_64-alt-linux'
[100%] Linking CXX shared library ../lib/libkfbapi.so
make[2]: Leaving directory '/usr/src/RPM/BUILD/libkfbapi-1.0/BUILD-x86_64-alt-linux'
make[1]: Entering directory '/usr/src/RPM/BUILD/libkfbapi-1.0/BUILD-x86_64-alt-linux'
[100%] Built target kfbapi
make[1]: Leaving directory '/usr/src/RPM/BUILD/libkfbapi-1.0/BUILD-x86_64-alt-linux'
+ popd
~/RPM/BUILD/libkfbapi-1.0
+ exit 0
Executing(%install): /bin/sh -e /usr/src/tmp/rpm-tmp.2944
+ umask 022
+ /bin/mkdir -p /usr/src/RPM/BUILD
+ cd /usr/src/RPM/BUILD
+ /bin/chmod -Rf u+rwX -- /usr/src/tmp/libkfbapi-buildroot
+ :
+ /bin/rm -rf -- /usr/src/tmp/libkfbapi-buildroot
+ cd libkfbapi-1.0
+ __kde_install
+ make -C BUILD-x86_64-alt-linux DESTDIR=/usr/src/tmp/libkfbapi-buildroot install
make: Entering directory '/usr/src/RPM/BUILD/libkfbapi-1.0/BUILD-x86_64-alt-linux'
make[1]: Entering directory '/usr/src/RPM/BUILD/libkfbapi-1.0/BUILD-x86_64-alt-linux'
make[2]: Entering directory '/usr/src/RPM/BUILD/libkfbapi-1.0/BUILD-x86_64-alt-linux'
make[2]: Leaving directory '/usr/src/RPM/BUILD/libkfbapi-1.0/BUILD-x86_64-alt-linux'
make[2]: Entering directory '/usr/src/RPM/BUILD/libkfbapi-1.0/BUILD-x86_64-alt-linux'
make[2]: Leaving directory '/usr/src/RPM/BUILD/libkfbapi-1.0/BUILD-x86_64-alt-linux'
[  0%] Built target kfbapi_automoc
make[2]: Entering directory '/usr/src/RPM/BUILD/libkfbapi-1.0/BUILD-x86_64-alt-linux'
make[2]: Leaving directory '/usr/src/RPM/BUILD/libkfbapi-1.0/BUILD-x86_64-alt-linux'
[ 55%] Built target kfbapi
make[2]: Entering directory '/usr/src/RPM/BUILD/libkfbapi-1.0/BUILD-x86_64-alt-linux'
make[2]: Leaving directory '/usr/src/RPM/BUILD/libkfbapi-1.0/BUILD-x86_64-alt-linux'
[ 56%] Built target pofiles_1
make[2]: Entering directory '/usr/src/RPM/BUILD/libkfbapi-1.0/BUILD-x86_64-alt-linux'
make[2]: Leaving directory '/usr/src/RPM/BUILD/libkfbapi-1.0/BUILD-x86_64-alt-linux'
[ 57%] Built target pofiles_2
make[2]: Entering directory '/usr/src/RPM/BUILD/libkfbapi-1.0/BUILD-x86_64-alt-linux'
make[2]: Leaving directory '/usr/src/RPM/BUILD/libkfbapi-1.0/BUILD-x86_64-alt-linux'
[ 58%] Built target pofiles_3
make[2]: Entering directory '/usr/src/RPM/BUILD/libkfbapi-1.0/BUILD-x86_64-alt-linux'
make[2]: Leaving directory '/usr/src/RPM/BUILD/libkfbapi-1.0/BUILD-x86_64-alt-linux'
[ 60%] Built target pofiles_4
make[2]: Entering directory '/usr/src/RPM/BUILD/libkfbapi-1.0/BUILD-x86_64-alt-linux'
make[2]: Leaving directory '/usr/src/RPM/BUILD/libkfbapi-1.0/BUILD-x86_64-alt-linux'
[ 61%] Built target pofiles_5
make[2]: Entering directory '/usr/src/RPM/BUILD/libkfbapi-1.0/BUILD-x86_64-alt-linux'
make[2]: Leaving directory '/usr/src/RPM/BUILD/libkfbapi-1.0/BUILD-x86_64-alt-linux'
[ 62%] Built target pofiles_6
make[2]: Entering directory '/usr/src/RPM/BUILD/libkfbapi-1.0/BUILD-x86_64-alt-linux'
make[2]: Leaving directory '/usr/src/RPM/BUILD/libkfbapi-1.0/BUILD-x86_64-alt-linux'
[ 63%] Built target pofiles_7
make[2]: Entering directory '/usr/src/RPM/BUILD/libkfbapi-1.0/BUILD-x86_64-alt-linux'
make[2]: Leaving directory '/usr/src/RPM/BUILD/libkfbapi-1.0/BUILD-x86_64-alt-linux'
[ 64%] Built target pofiles_8
make[2]: Entering directory '/usr/src/RPM/BUILD/libkfbapi-1.0/BUILD-x86_64-alt-linux'
make[2]: Leaving directory '/usr/src/RPM/BUILD/libkfbapi-1.0/BUILD-x86_64-alt-linux'
[ 65%] Built target pofiles_9
make[2]: Entering directory '/usr/src/RPM/BUILD/libkfbapi-1.0/BUILD-x86_64-alt-linux'
make[2]: Leaving directory '/usr/src/RPM/BUILD/libkfbapi-1.0/BUILD-x86_64-alt-linux'
[ 66%] Built target pofiles_10
make[2]: Entering directory '/usr/src/RPM/BUILD/libkfbapi-1.0/BUILD-x86_64-alt-linux'
make[2]: Leaving directory '/usr/src/RPM/BUILD/libkfbapi-1.0/BUILD-x86_64-alt-linux'
[ 67%] Built target pofiles_11
make[2]: Entering directory '/usr/src/RPM/BUILD/libkfbapi-1.0/BUILD-x86_64-alt-linux'
make[2]: Leaving directory '/usr/src/RPM/BUILD/libkfbapi-1.0/BUILD-x86_64-alt-linux'
[ 68%] Built target pofiles_12
make[2]: Entering directory '/usr/src/RPM/BUILD/libkfbapi-1.0/BUILD-x86_64-alt-linux'
make[2]: Leaving directory '/usr/src/RPM/BUILD/libkfbapi-1.0/BUILD-x86_64-alt-linux'
[ 69%] Built target pofiles_13
make[2]: Entering directory '/usr/src/RPM/BUILD/libkfbapi-1.0/BUILD-x86_64-alt-linux'
make[2]: Leaving directory '/usr/src/RPM/BUILD/libkfbapi-1.0/BUILD-x86_64-alt-linux'
[ 70%] Built target pofiles_14
make[2]: Entering directory '/usr/src/RPM/BUILD/libkfbapi-1.0/BUILD-x86_64-alt-linux'
make[2]: Leaving directory '/usr/src/RPM/BUILD/libkfbapi-1.0/BUILD-x86_64-alt-linux'
[ 71%] Built target pofiles_15
make[2]: Entering directory '/usr/src/RPM/BUILD/libkfbapi-1.0/BUILD-x86_64-alt-linux'
make[2]: Leaving directory '/usr/src/RPM/BUILD/libkfbapi-1.0/BUILD-x86_64-alt-linux'
[ 72%] Built target pofiles_16
make[2]: Entering directory '/usr/src/RPM/BUILD/libkfbapi-1.0/BUILD-x86_64-alt-linux'
make[2]: Leaving directory '/usr/src/RPM/BUILD/libkfbapi-1.0/BUILD-x86_64-alt-linux'
[ 73%] Built target pofiles_17
make[2]: Entering directory '/usr/src/RPM/BUILD/libkfbapi-1.0/BUILD-x86_64-alt-linux'
make[2]: Leaving directory '/usr/src/RPM/BUILD/libkfbapi-1.0/BUILD-x86_64-alt-linux'
[ 74%] Built target pofiles_18
make[2]: Entering directory '/usr/src/RPM/BUILD/libkfbapi-1.0/BUILD-x86_64-alt-linux'
make[2]: Leaving directory '/usr/src/RPM/BUILD/libkfbapi-1.0/BUILD-x86_64-alt-linux'
[ 75%] Built target pofiles_19
make[2]: Entering directory '/usr/src/RPM/BUILD/libkfbapi-1.0/BUILD-x86_64-alt-linux'
make[2]: Leaving directory '/usr/src/RPM/BUILD/libkfbapi-1.0/BUILD-x86_64-alt-linux'
[ 76%] Built target pofiles_20
make[2]: Entering directory '/usr/src/RPM/BUILD/libkfbapi-1.0/BUILD-x86_64-alt-linux'
make[2]: Leaving directory '/usr/src/RPM/BUILD/libkfbapi-1.0/BUILD-x86_64-alt-linux'
[ 77%] Built target pofiles_21
make[2]: Entering directory '/usr/src/RPM/BUILD/libkfbapi-1.0/BUILD-x86_64-alt-linux'
make[2]: Leaving directory '/usr/src/RPM/BUILD/libkfbapi-1.0/BUILD-x86_64-alt-linux'
[ 78%] Built target pofiles_22
make[2]: Entering directory '/usr/src/RPM/BUILD/libkfbapi-1.0/BUILD-x86_64-alt-linux'
make[2]: Leaving directory '/usr/src/RPM/BUILD/libkfbapi-1.0/BUILD-x86_64-alt-linux'
[ 80%] Built target pofiles_23
make[2]: Entering directory '/usr/src/RPM/BUILD/libkfbapi-1.0/BUILD-x86_64-alt-linux'
make[2]: Leaving directory '/usr/src/RPM/BUILD/libkfbapi-1.0/BUILD-x86_64-alt-linux'
[ 81%] Built target pofiles_24
make[2]: Entering directory '/usr/src/RPM/BUILD/libkfbapi-1.0/BUILD-x86_64-alt-linux'
make[2]: Leaving directory '/usr/src/RPM/BUILD/libkfbapi-1.0/BUILD-x86_64-alt-linux'
[ 82%] Built target pofiles_25
make[2]: Entering directory '/usr/src/RPM/BUILD/libkfbapi-1.0/BUILD-x86_64-alt-linux'
make[2]: Leaving directory '/usr/src/RPM/BUILD/libkfbapi-1.0/BUILD-x86_64-alt-linux'
[ 83%] Built target pofiles_26
make[2]: Entering directory '/usr/src/RPM/BUILD/libkfbapi-1.0/BUILD-x86_64-alt-linux'
make[2]: Leaving directory '/usr/src/RPM/BUILD/libkfbapi-1.0/BUILD-x86_64-alt-linux'
[ 84%] Built target pofiles_27
make[2]: Entering directory '/usr/src/RPM/BUILD/libkfbapi-1.0/BUILD-x86_64-alt-linux'
make[2]: Leaving directory '/usr/src/RPM/BUILD/libkfbapi-1.0/BUILD-x86_64-alt-linux'
[ 85%] Built target pofiles_28
make[2]: Entering directory '/usr/src/RPM/BUILD/libkfbapi-1.0/BUILD-x86_64-alt-linux'
make[2]: Leaving directory '/usr/src/RPM/BUILD/libkfbapi-1.0/BUILD-x86_64-alt-linux'
[ 86%] Built target pofiles_29
make[2]: Entering directory '/usr/src/RPM/BUILD/libkfbapi-1.0/BUILD-x86_64-alt-linux'
make[2]: Leaving directory '/usr/src/RPM/BUILD/libkfbapi-1.0/BUILD-x86_64-alt-linux'
[ 87%] Built target pofiles_30
make[2]: Entering directory '/usr/src/RPM/BUILD/libkfbapi-1.0/BUILD-x86_64-alt-linux'
make[2]: Leaving directory '/usr/src/RPM/BUILD/libkfbapi-1.0/BUILD-x86_64-alt-linux'
[ 88%] Built target pofiles_31
make[2]: Entering directory '/usr/src/RPM/BUILD/libkfbapi-1.0/BUILD-x86_64-alt-linux'
make[2]: Leaving directory '/usr/src/RPM/BUILD/libkfbapi-1.0/BUILD-x86_64-alt-linux'
[ 89%] Built target pofiles_32
make[2]: Entering directory '/usr/src/RPM/BUILD/libkfbapi-1.0/BUILD-x86_64-alt-linux'
make[2]: Leaving directory '/usr/src/RPM/BUILD/libkfbapi-1.0/BUILD-x86_64-alt-linux'
[ 90%] Built target pofiles_33
make[2]: Entering directory '/usr/src/RPM/BUILD/libkfbapi-1.0/BUILD-x86_64-alt-linux'
make[2]: Leaving directory '/usr/src/RPM/BUILD/libkfbapi-1.0/BUILD-x86_64-alt-linux'
[ 91%] Built target pofiles_34
make[2]: Entering directory '/usr/src/RPM/BUILD/libkfbapi-1.0/BUILD-x86_64-alt-linux'
make[2]: Leaving directory '/usr/src/RPM/BUILD/libkfbapi-1.0/BUILD-x86_64-alt-linux'
[ 92%] Built target pofiles_35
make[2]: Entering directory '/usr/src/RPM/BUILD/libkfbapi-1.0/BUILD-x86_64-alt-linux'
make[2]: Leaving directory '/usr/src/RPM/BUILD/libkfbapi-1.0/BUILD-x86_64-alt-linux'
[ 93%] Built target pofiles_36
make[2]: Entering directory '/usr/src/RPM/BUILD/libkfbapi-1.0/BUILD-x86_64-alt-linux'
make[2]: Leaving directory '/usr/src/RPM/BUILD/libkfbapi-1.0/BUILD-x86_64-alt-linux'
[ 94%] Built target pofiles_37
make[2]: Entering directory '/usr/src/RPM/BUILD/libkfbapi-1.0/BUILD-x86_64-alt-linux'
make[2]: Leaving directory '/usr/src/RPM/BUILD/libkfbapi-1.0/BUILD-x86_64-alt-linux'
[ 95%] Built target pofiles_38
make[2]: Entering directory '/usr/src/RPM/BUILD/libkfbapi-1.0/BUILD-x86_64-alt-linux'
make[2]: Leaving directory '/usr/src/RPM/BUILD/libkfbapi-1.0/BUILD-x86_64-alt-linux'
[ 96%] Built target pofiles_39
make[2]: Entering directory '/usr/src/RPM/BUILD/libkfbapi-1.0/BUILD-x86_64-alt-linux'
make[2]: Leaving directory '/usr/src/RPM/BUILD/libkfbapi-1.0/BUILD-x86_64-alt-linux'
[ 97%] Built target pofiles_40
make[2]: Entering directory '/usr/src/RPM/BUILD/libkfbapi-1.0/BUILD-x86_64-alt-linux'
make[2]: Leaving directory '/usr/src/RPM/BUILD/libkfbapi-1.0/BUILD-x86_64-alt-linux'
[ 98%] Built target pofiles_41
make[2]: Entering directory '/usr/src/RPM/BUILD/libkfbapi-1.0/BUILD-x86_64-alt-linux'
make[2]: Leaving directory '/usr/src/RPM/BUILD/libkfbapi-1.0/BUILD-x86_64-alt-linux'
[100%] Built target pofiles_42
make[1]: Leaving directory '/usr/src/RPM/BUILD/libkfbapi-1.0/BUILD-x86_64-alt-linux'
Install the project...
-- Install configuration: "Release"
-- Installing: /usr/src/tmp/libkfbapi-buildroot/usr/lib64/pkgconfig/LibKFbAPI.pc
-- Installing: /usr/src/tmp/libkfbapi-buildroot/usr/lib64/cmake/LibKFbAPI/LibKFbAPIConfig.cmake
-- Installing: /usr/src/tmp/libkfbapi-buildroot/usr/lib64/cmake/LibKFbAPI/LibKFbAPIConfigVersion.cmake
-- Installing: /usr/src/tmp/libkfbapi-buildroot/usr/lib64/cmake/LibKFbAPI/LibKFbAPITargetsWithPrefix.cmake
-- Installing: /usr/src/tmp/libkfbapi-buildroot/usr/lib64/cmake/LibKFbAPI/LibKFbAPITargetsWithPrefix-release.cmake
-- Installing: /usr/src/tmp/libkfbapi-buildroot/usr/lib64/libkfbapi.so.1.0
-- Installing: /usr/src/tmp/libkfbapi-buildroot/usr/lib64/libkfbapi.so.1
-- Installing: /usr/src/tmp/libkfbapi-buildroot/usr/lib64/libkfbapi.so
-- Installing: /usr/src/tmp/libkfbapi-buildroot/usr/include/kde4/libkfbapi/alleventslistjob.h
-- Installing: /usr/src/tmp/libkfbapi-buildroot/usr/include/kde4/libkfbapi/allnoteslistjob.h
-- Installing: /usr/src/tmp/libkfbapi-buildroot/usr/include/kde4/libkfbapi/allpostslistjob.h
-- Installing: /usr/src/tmp/libkfbapi-buildroot/usr/include/kde4/libkfbapi/appinfo.h
-- Installing: /usr/src/tmp/libkfbapi-buildroot/usr/include/kde4/libkfbapi/authenticationdialog.h
-- Installing: /usr/src/tmp/libkfbapi-buildroot/usr/include/kde4/libkfbapi/commentinfo.h
-- Installing: /usr/src/tmp/libkfbapi-buildroot/usr/include/kde4/libkfbapi/eventjob.h
-- Installing: /usr/src/tmp/libkfbapi-buildroot/usr/include/kde4/libkfbapi/eventinfo.h
-- Installing: /usr/src/tmp/libkfbapi-buildroot/usr/include/kde4/libkfbapi/eventslistjob.h
-- Installing: /usr/src/tmp/libkfbapi-buildroot/usr/include/kde4/libkfbapi/facebookjobs.h
-- Installing: /usr/src/tmp/libkfbapi-buildroot/usr/include/kde4/libkfbapi/friendlistjob.h
-- Installing: /usr/src/tmp/libkfbapi-buildroot/usr/include/kde4/libkfbapi/friendjob.h
-- Installing: /usr/src/tmp/libkfbapi-buildroot/usr/include/kde4/libkfbapi/getcommentsjob.h
-- Installing: /usr/src/tmp/libkfbapi-buildroot/usr/include/kde4/libkfbapi/getlikesjob.h
-- Installing: /usr/src/tmp/libkfbapi-buildroot/usr/include/kde4/libkfbapi/libkfbapi_export.h
-- Installing: /usr/src/tmp/libkfbapi-buildroot/usr/include/kde4/libkfbapi/likeinfo.h
-- Installing: /usr/src/tmp/libkfbapi-buildroot/usr/include/kde4/libkfbapi/listjobbase.h
-- Installing: /usr/src/tmp/libkfbapi-buildroot/usr/include/kde4/libkfbapi/noteinfo.h
-- Installing: /usr/src/tmp/libkfbapi-buildroot/usr/include/kde4/libkfbapi/noteslistjob.h
-- Installing: /usr/src/tmp/libkfbapi-buildroot/usr/include/kde4/libkfbapi/notejob.h
-- Installing: /usr/src/tmp/libkfbapi-buildroot/usr/include/kde4/libkfbapi/noteaddjob.h
-- Installing: /usr/src/tmp/libkfbapi-buildroot/usr/include/kde4/libkfbapi/notificationinfo.h
-- Installing: /usr/src/tmp/libkfbapi-buildroot/usr/include/kde4/libkfbapi/notificationslistjob.h
-- Installing: /usr/src/tmp/libkfbapi-buildroot/usr/include/kde4/libkfbapi/notificationsmarkreadjob.h
-- Installing: /usr/src/tmp/libkfbapi-buildroot/usr/include/kde4/libkfbapi/pagedlistjob.h
-- Installing: /usr/src/tmp/libkfbapi-buildroot/usr/include/kde4/libkfbapi/photojob.h
-- Installing: /usr/src/tmp/libkfbapi-buildroot/usr/include/kde4/libkfbapi/postinfo.h
-- Installing: /usr/src/tmp/libkfbapi-buildroot/usr/include/kde4/libkfbapi/postjob.h
-- Installing: /usr/src/tmp/libkfbapi-buildroot/usr/include/kde4/libkfbapi/postaddjob.h
-- Installing: /usr/src/tmp/libkfbapi-buildroot/usr/include/kde4/libkfbapi/postslistjob.h
-- Installing: /usr/src/tmp/libkfbapi-buildroot/usr/include/kde4/libkfbapi/propertyinfo.h
-- Installing: /usr/src/tmp/libkfbapi-buildroot/usr/include/kde4/libkfbapi/userinfojob.h
-- Installing: /usr/src/tmp/libkfbapi-buildroot/usr/include/kde4/libkfbapi/userinfo.h
-- Installing: /usr/src/tmp/libkfbapi-buildroot/usr/share/kde4/locale/ar/LC_MESSAGES/libkfbapi.mo
-- Installing: /usr/src/tmp/libkfbapi-buildroot/usr/share/kde4/locale/be/LC_MESSAGES/libkfbapi.mo
-- Installing: /usr/src/tmp/libkfbapi-buildroot/usr/share/kde4/locale/bs/LC_MESSAGES/libkfbapi.mo
-- Installing: /usr/src/tmp/libkfbapi-buildroot/usr/share/kde4/locale/cs/LC_MESSAGES/libkfbapi.mo
-- Installing: /usr/src/tmp/libkfbapi-buildroot/usr/share/kde4/locale/da/LC_MESSAGES/libkfbapi.mo
-- Installing: /usr/src/tmp/libkfbapi-buildroot/usr/share/kde4/locale/de/LC_MESSAGES/libkfbapi.mo
-- Installing: /usr/src/tmp/libkfbapi-buildroot/usr/share/kde4/locale/el/LC_MESSAGES/libkfbapi.mo
-- Installing: /usr/src/tmp/libkfbapi-buildroot/usr/share/kde4/locale/en_GB/LC_MESSAGES/libkfbapi.mo
-- Installing: /usr/src/tmp/libkfbapi-buildroot/usr/share/kde4/locale/eo/LC_MESSAGES/libkfbapi.mo
-- Installing: /usr/src/tmp/libkfbapi-buildroot/usr/share/kde4/locale/es/LC_MESSAGES/libkfbapi.mo
-- Installing: /usr/src/tmp/libkfbapi-buildroot/usr/share/kde4/locale/et/LC_MESSAGES/libkfbapi.mo
-- Installing: /usr/src/tmp/libkfbapi-buildroot/usr/share/kde4/locale/fi/LC_MESSAGES/libkfbapi.mo
-- Installing: /usr/src/tmp/libkfbapi-buildroot/usr/share/kde4/locale/fr/LC_MESSAGES/libkfbapi.mo
-- Installing: /usr/src/tmp/libkfbapi-buildroot/usr/share/kde4/locale/ga/LC_MESSAGES/libkfbapi.mo
-- Installing: /usr/src/tmp/libkfbapi-buildroot/usr/share/kde4/locale/gl/LC_MESSAGES/libkfbapi.mo
-- Installing: /usr/src/tmp/libkfbapi-buildroot/usr/share/kde4/locale/hi/LC_MESSAGES/libkfbapi.mo
-- Installing: /usr/src/tmp/libkfbapi-buildroot/usr/share/kde4/locale/hu/LC_MESSAGES/libkfbapi.mo
-- Installing: /usr/src/tmp/libkfbapi-buildroot/usr/share/kde4/locale/it/LC_MESSAGES/libkfbapi.mo
-- Installing: /usr/src/tmp/libkfbapi-buildroot/usr/share/kde4/locale/ja/LC_MESSAGES/libkfbapi.mo
-- Installing: /usr/src/tmp/libkfbapi-buildroot/usr/share/kde4/locale/kk/LC_MESSAGES/libkfbapi.mo
-- Installing: /usr/src/tmp/libkfbapi-buildroot/usr/share/kde4/locale/km/LC_MESSAGES/libkfbapi.mo
-- Installing: /usr/src/tmp/libkfbapi-buildroot/usr/share/kde4/locale/lt/LC_MESSAGES/libkfbapi.mo
-- Installing: /usr/src/tmp/libkfbapi-buildroot/usr/share/kde4/locale/mai/LC_MESSAGES/libkfbapi.mo
-- Installing: /usr/src/tmp/libkfbapi-buildroot/usr/share/kde4/locale/mr/LC_MESSAGES/libkfbapi.mo
-- Installing: /usr/src/tmp/libkfbapi-buildroot/usr/share/kde4/locale/nb/LC_MESSAGES/libkfbapi.mo
-- Installing: /usr/src/tmp/libkfbapi-buildroot/usr/share/kde4/locale/nds/LC_MESSAGES/libkfbapi.mo
-- Installing: /usr/src/tmp/libkfbapi-buildroot/usr/share/kde4/locale/nl/LC_MESSAGES/libkfbapi.mo
-- Installing: /usr/src/tmp/libkfbapi-buildroot/usr/share/kde4/locale/nn/LC_MESSAGES/libkfbapi.mo
-- Installing: /usr/src/tmp/libkfbapi-buildroot/usr/share/kde4/locale/oc/LC_MESSAGES/libkfbapi.mo
-- Installing: /usr/src/tmp/libkfbapi-buildroot/usr/share/kde4/locale/pa/LC_MESSAGES/libkfbapi.mo
-- Installing: /usr/src/tmp/libkfbapi-buildroot/usr/share/kde4/locale/pl/LC_MESSAGES/libkfbapi.mo
-- Installing: /usr/src/tmp/libkfbapi-buildroot/usr/share/kde4/locale/pt/LC_MESSAGES/libkfbapi.mo
-- Installing: /usr/src/tmp/libkfbapi-buildroot/usr/share/kde4/locale/pt_BR/LC_MESSAGES/libkfbapi.mo
-- Installing: /usr/src/tmp/libkfbapi-buildroot/usr/share/kde4/locale/ro/LC_MESSAGES/libkfbapi.mo
-- Installing: /usr/src/tmp/libkfbapi-buildroot/usr/share/kde4/locale/ru/LC_MESSAGES/libkfbapi.mo
-- Installing: /usr/src/tmp/libkfbapi-buildroot/usr/share/kde4/locale/sk/LC_MESSAGES/libkfbapi.mo
-- Installing: /usr/src/tmp/libkfbapi-buildroot/usr/share/kde4/locale/sl/LC_MESSAGES/libkfbapi.mo
-- Installing: /usr/src/tmp/libkfbapi-buildroot/usr/share/kde4/locale/sv/LC_MESSAGES/libkfbapi.mo
-- Installing: /usr/src/tmp/libkfbapi-buildroot/usr/share/kde4/locale/tr/LC_MESSAGES/libkfbapi.mo
-- Installing: /usr/src/tmp/libkfbapi-buildroot/usr/share/kde4/locale/ug/LC_MESSAGES/libkfbapi.mo
-- Installing: /usr/src/tmp/libkfbapi-buildroot/usr/share/kde4/locale/uk/LC_MESSAGES/libkfbapi.mo
-- Installing: /usr/src/tmp/libkfbapi-buildroot/usr/share/kde4/locale/zh_TW/LC_MESSAGES/libkfbapi.mo
make: Leaving directory '/usr/src/RPM/BUILD/libkfbapi-1.0/BUILD-x86_64-alt-linux'
+ mkdir -p /usr/src/tmp/libkfbapi-buildroot//usr/lib64/kde4/devel
+ pushd /usr/src/tmp/libkfbapi-buildroot//usr/lib64
~/tmp/libkfbapi-buildroot/usr/lib64 ~/RPM/BUILD/libkfbapi-1.0
+ for l in lib*.so
+ '[' -L libkfbapi.so ']'
++ readlink libkfbapi.so
+ f=libkfbapi.so.1
++ relative /usr/src/tmp/libkfbapi-buildroot//usr/lib64/libkfbapi.so.1 /usr/src/tmp/libkfbapi-buildroot//usr/lib64/kde4/devel/libkfbapi.so.1
+ ln -sf ../../libkfbapi.so.1 /usr/src/tmp/libkfbapi-buildroot//usr/lib64/kde4/devel/libkfbapi.so
+ rm -f libkfbapi.so
+ popd
~/RPM/BUILD/libkfbapi-1.0
+ '[' -d /usr/src/tmp/libkfbapi-buildroot//usr/lib64/kconf_update_bin ']'
+ '[' -d /usr/src/tmp/libkfbapi-buildroot//usr/share/kde4/share ']'
+ '[' -d /usr/src/tmp/libkfbapi-buildroot//usr/share/kde4/bin ']'
+ '[' -d /usr/src/tmp/libkfbapi-buildroot//etc/xdg/menus ']'
+ '[' -d /usr/src/tmp/libkfbapi-buildroot//usr/share/kde4/apps/cmake/modules/ ']'
+ /usr/lib/rpm/find-lang libkfbapi
+ /usr/lib/rpm/brp-alt
Cleaning files in /usr/src/tmp/libkfbapi-buildroot (auto)
mode of './usr/lib64/libkfbapi.so.1.0' changed from 0755 (rwxr-xr-x) to 0644 (rw-r--r--)
Verifying and fixing files in /usr/src/tmp/libkfbapi-buildroot (binconfig,pkgconfig,libtool,desktop)
/usr/lib64/pkgconfig/LibKFbAPI.pc: Libs: '-L${libdir} -lkfbapi' --> '-lkfbapi'
Checking contents of files in /usr/src/tmp/libkfbapi-buildroot/ (default)
Compressing files in /usr/src/tmp/libkfbapi-buildroot (auto)
Adjusting library links in /usr/src/tmp/libkfbapi-buildroot
./usr/lib64:
	libkfbapi.so.1 -> libkfbapi.so.1.0
Verifying ELF objects in /usr/src/tmp/libkfbapi-buildroot (arch=normal,fhs=normal,lfs=relaxed,lint=relaxed,rpath=normal,stack=normal,textrel=normal,unresolved=normal)
Hardlinking identical .pyc and .pyo files
Processing files: libkfbapi1-1.0-alt2
Finding Provides (using /usr/lib/rpm/find-provides)
Executing: /bin/sh -e /usr/src/tmp/rpm-tmp.dU3NLb
find-provides: running scripts (alternatives,debuginfo,gir,lib,pam,perl,pkgconfig,python,shell,typelib)
lib.prov: /usr/src/tmp/libkfbapi-buildroot/usr/lib64/libkfbapi.so.1: 646 symbols, 20 bpp
Finding Requires (using /usr/lib/rpm/find-requires)
Executing: /bin/sh -e /usr/src/tmp/rpm-tmp.eGmcjG
find-requires: running scripts (cpp,debuginfo,files,gir-js,gir-python,gir,lib,pam,perl,pkgconfig,pkgconfiglib,python,rpmlib,shebang,shell,static,symlinks,typelib)
Provides: libkfbapi.so.1()(64bit) = set:nd2koysNAqwmJuSgYObs0R1A5qmXxBiosO15pg9io5zE8c4ZxQLSWlDF4jQea69Lrmgkh6lNmyRA12KRG5q7lxwazmB96Z9OBgxCtUmwQHMQGsuwsMHVZmoFB0aaNqPnxOd1fU7EJyTULuVhR1Ua90ObZzea0Bi9bPTeq7OeGmxTPakpxElcjY3NgKZj8Ko4im2VZKpaakCwWYpma1p2gQ50upin535xM7xvieC3M14lzLooxu7mMFoLdTkZiesVQsIV3uy4VIualw9RCsqKpXq8PKZC6BCPQp9Gi2ZqNpk7PEQ57hvqINbXngkZcmkxFmZwLanWkza4JNP3gm9YMGaSJXu4pYyF6zv4K61ZnR08I5A2W0sS1loUdNZv1zpqD2fPZt5ztVD66Ixhq1yeTpxdVhvlWQZt8Tr4QKZd9UjxoRKh3t84JS6W0k9teMgVM89yafN9bGmxRrq8WML4AipXUBGqSLm2R0RQWXvh7PyZJ02k078oclyQbVUmDv9h6SVVXqc2bDL6s2ZIGnZg6khPf6l6kyIfyWwuQZCrzZ8gehAaLmGPd1i1LtSHNwowbfu2Y8htkNwvqZ5EMkgMmaB8qHuT75rzV806S41l8cTwhjINiobsep2QDhLVhggTrQJ1XFzxKlIprhFxZ8QT9oiRWYWVNYvAjHuGzU08GThy0DoL5PosdcaoIwdcnvIxYNdTT1Xf354VyfYMGPcQs3p07ecBMwzPS4tFkoSSOPnyC48yb1zWns2ZAZoKKIbI6eEZdQGxaRDRhYc8gw3sOZG5zWbqqg8L843vMpJN1LCbZaPOVoToZ9h66MeO91hsLeO9Pj2LGy0V8ZnEZJ4Tkafe5qaPy34Z5XuVILUrweGPXpODo8Y9h2MzsboeAa0Zl3xgXFgM8vEE0EzbJS3us2502sWYrzVDgRUhHZs2MvpdFUw48ZAlnxG0dSeDnYBARszNtqMTJpUGxGFcZl4AwNXEAAwBsqGJJ0aMezZFUZsoAbFZkbCnCosofl0IuvtUQjAYWqmu9jWjZ8Ob2yM1Ion2IaMjnPMp8FlZgQRS5ft6ekRiacmK5gQNBQmTiUO7yp0VlYqYh8tjtSYRA5HJdkj3mERR7UfZ2ikbZlMun3UT7OikZLfxHE2Zf7ZfjMk5gbq8VVOpruyEcX3Sh1zy1yf6tSNp2lXxuGNZcKJb0XNz7S6CfQmsf4z0PkyUaVc2cUUPjhaahCmwClANiSGOwwjZjOocG7Ivz5afaBUVrWqtH4RBgKTNi5yIkqKw8bJfL8QlOXCyMQotDOds3O326boxVaMhXECpCvC9GjLmC8Ju
Requires: libQtCore.so.4()(64bit) >= set:piFOUekvbE5M8GdZfVjEgu28YBDgB3Yk4Z2vZLQtlQBq7ePYrATFMOk2C2lbhmGPDSwRUNWkQZvIcb0fDaYcC5KTNGzp0MKZqUIn0IBLs5Y3chN7QbahrZecLBMijJnAYdCvvMlKYVvfeUwYSoeYvBsxCZ7myrYaegWhqv6b04ZmA0ZktGZgyCKZJRtJqE38nJnxG5ngcZ75yyQdmjmBe1UBOtpPTJSC0m93VR1lt2ybGM3w4HJaXOxfcQgZenV72BvMeRTZr0cu33z9, libQtGui.so.4()(64bit) >= set:rlR9KZ1ZHH8ILQ4Ng9Z4OOk6nGxFopwcAb1FTPHGFJlXQ6HrljXw19O9r3WUWB6SyZLslIcjNgZvttS0cJOwTj0ukzZ2FRMbZnOLBNk9vspL8srr5gaVZFqKavv5Au5ifC5JkNTuXk81Z0i9x94yjaG2eEqI9SZivIZnqBbTefWiylQf3rQFZ8g2lPZg6fvIboF9, libQtWebKit.so.4()(64bit) >= set:oksSdBLX2sfillSBwINWHXqSScj3, libc.so.6(GLIBC_2.14)(64bit), libc.so.6(GLIBC_2.2.5)(64bit), libc.so.6(GLIBC_2.4)(64bit), libgcc_s.so.1(GCC_3.0)(64bit), libkabc.so.4()(64bit) >= set:ojIyPh10FxC9umZyZbx3Wwq7ZB95rZ7qU1kZrtjhEpw8BcI47d0wG9Q29A, libkcalcore.so.4()(64bit) >= set:okjHpWWjZmWt8XUbJOcBtphJbUCaryBz18Y3Rnv0, libkdecore.so.5()(64bit) >= set:qkyBkk4cb7MhmfLTeRoffTtuYcYOSYrIxp7iHmnHBJ991wWw9ZDjp9O3NBgf5DiLwJjxQxCgNeCcej4SkxZIZjj7ynXNPWcT6wnYvxQyqHxlbOUIl8zhVI3RrsC2zeld9DjGMAEmMZ8tVJkca3, libkdeui.so.5()(64bit) >= set:ql8vAMwIZi4Cob18ZduhZcemUtIRGwZzY07a6NgwpDj6dFoCM1gyZ5pqA48H04, libkdewebkit.so.5()(64bit) >= set:lkZ5U1, libkio.so.5()(64bit) >= set:pmkZ9xGpGejwKqLZAUv6, libkmime.so.4()(64bit) >= set:ol419zNI2BimtxZ9hZ0vLFpb98, libkpimutils.so.4()(64bit) >= set:kjtl4, libqjson.so.0()(64bit) >= set:li9nAd7RBXQ2AU5pyEr, libstdc++.so.6(CXXABI_1.3)(64bit), libstdc++.so.6(CXXABI_1.3.9)(64bit), libstdc++.so.6(GLIBCXX_3.4)(64bit), rtld(GNU_HASH)
Requires(rpmlib): rpmlib(SetVersions)
Finding debuginfo files (using /usr/lib/rpm/find-debuginfo-files)
Executing: /bin/sh -e /usr/src/tmp/rpm-tmp.1msUHg
Creating libkfbapi1-debuginfo package
Processing files: libkfbapi-devel-1.0-alt2
Finding Provides (using /usr/lib/rpm/find-provides)
Executing: /bin/sh -e /usr/src/tmp/rpm-tmp.A8nIkU
find-provides: running scripts (alternatives,debuginfo,gir,lib,pam,perl,pkgconfig,python,shell,typelib)
Finding Requires (using /usr/lib/rpm/find-requires)
Executing: /bin/sh -e /usr/src/tmp/rpm-tmp.Dl4r7A
find-requires: running scripts (cpp,debuginfo,files,gir-js,gir-python,gir,lib,pam,perl,pkgconfig,pkgconfiglib,python,rpmlib,shebang,shell,static,symlinks,typelib)
/usr/src/tmp/libkfbapi-buildroot/usr/include/kde4/libkfbapi/appinfo.h:25:10: fatal error: QSharedPointer: No such file or directory
 #include <QSharedPointer>
          ^~~~~~~~~~~~~~~~
compilation terminated.
cpp.req: /usr/src/tmp/libkfbapi-buildroot/usr/include/kde4/libkfbapi/appinfo.h: cpp failed, trying c++ mode
In file included from /usr/src/tmp/libkfbapi-buildroot/usr/include/kde4/libkfbapi/libkfbapi_export.h:23,
                 from /usr/src/tmp/libkfbapi-buildroot/usr/include/kde4/libkfbapi/appinfo.h:23:
/usr/include/kde4/kdemacros.h:162:11: fatal error: QtCore/qglobal.h: No such file or directory
 # include <QtCore/qglobal.h>
           ^~~~~~~~~~~~~~~~~~
compilation terminated.
cpp.req: WARNING: /usr/src/tmp/libkfbapi-buildroot/usr/include/kde4/libkfbapi/appinfo.h: cpp failed
In file included from /usr/src/tmp/libkfbapi-buildroot/usr/include/kde4/libkfbapi/notejob.h:23:
/usr/src/tmp/libkfbapi-buildroot/usr/include/kde4/libkfbapi/facebookjobs.h:27:10: fatal error: KJob: No such file or directory
 #include <KJob>
          ^~~~~~
compilation terminated.
cpp.req: /usr/src/tmp/libkfbapi-buildroot/usr/include/kde4/libkfbapi/notejob.h: cpp failed, trying c++ mode
In file included from /usr/src/tmp/libkfbapi-buildroot/usr/include/kde4/libkfbapi/libkfbapi_export.h:23,
                 from /usr/src/tmp/libkfbapi-buildroot/usr/include/kde4/libkfbapi/facebookjobs.h:25,
                 from /usr/src/tmp/libkfbapi-buildroot/usr/include/kde4/libkfbapi/notejob.h:23:
/usr/include/kde4/kdemacros.h:162:11: fatal error: QtCore/qglobal.h: No such file or directory
 # include <QtCore/qglobal.h>
           ^~~~~~~~~~~~~~~~~~
compilation terminated.
cpp.req: WARNING: /usr/src/tmp/libkfbapi-buildroot/usr/include/kde4/libkfbapi/notejob.h: cpp failed
In file included from /usr/src/tmp/libkfbapi-buildroot/usr/include/kde4/libkfbapi/postjob.h:23:
/usr/src/tmp/libkfbapi-buildroot/usr/include/kde4/libkfbapi/facebookjobs.h:27:10: fatal error: KJob: No such file or directory
 #include <KJob>
          ^~~~~~
compilation terminated.
cpp.req: /usr/src/tmp/libkfbapi-buildroot/usr/include/kde4/libkfbapi/postjob.h: cpp failed, trying c++ mode
In file included from /usr/src/tmp/libkfbapi-buildroot/usr/include/kde4/libkfbapi/libkfbapi_export.h:23,
                 from /usr/src/tmp/libkfbapi-buildroot/usr/include/kde4/libkfbapi/facebookjobs.h:25,
                 from /usr/src/tmp/libkfbapi-buildroot/usr/include/kde4/libkfbapi/postjob.h:23:
/usr/include/kde4/kdemacros.h:162:11: fatal error: QtCore/qglobal.h: No such file or directory
 # include <QtCore/qglobal.h>
           ^~~~~~~~~~~~~~~~~~
compilation terminated.
cpp.req: WARNING: /usr/src/tmp/libkfbapi-buildroot/usr/include/kde4/libkfbapi/postjob.h: cpp failed
In file included from /usr/src/tmp/libkfbapi-buildroot/usr/include/kde4/libkfbapi/eventjob.h:23:
/usr/src/tmp/libkfbapi-buildroot/usr/include/kde4/libkfbapi/facebookjobs.h:27:10: fatal error: KJob: No such file or directory
 #include <KJob>
          ^~~~~~
compilation terminated.
cpp.req: /usr/src/tmp/libkfbapi-buildroot/usr/include/kde4/libkfbapi/eventjob.h: cpp failed, trying c++ mode
In file included from /usr/src/tmp/libkfbapi-buildroot/usr/include/kde4/libkfbapi/libkfbapi_export.h:23,
                 from /usr/src/tmp/libkfbapi-buildroot/usr/include/kde4/libkfbapi/facebookjobs.h:25,
                 from /usr/src/tmp/libkfbapi-buildroot/usr/include/kde4/libkfbapi/eventjob.h:23:
/usr/include/kde4/kdemacros.h:162:11: fatal error: QtCore/qglobal.h: No such file or directory
 # include <QtCore/qglobal.h>
           ^~~~~~~~~~~~~~~~~~
compilation terminated.
cpp.req: WARNING: /usr/src/tmp/libkfbapi-buildroot/usr/include/kde4/libkfbapi/eventjob.h: cpp failed
In file included from /usr/src/tmp/libkfbapi-buildroot/usr/include/kde4/libkfbapi/likeinfo.h:24:
/usr/src/tmp/libkfbapi-buildroot/usr/include/kde4/libkfbapi/userinfo.h:25:10: fatal error: KABC/Addressee: No such file or directory
 #include <KABC/Addressee>
          ^~~~~~~~~~~~~~~~
compilation terminated.
cpp.req: /usr/src/tmp/libkfbapi-buildroot/usr/include/kde4/libkfbapi/likeinfo.h: cpp failed, trying c++ mode
In file included from /usr/src/tmp/libkfbapi-buildroot/usr/include/kde4/libkfbapi/libkfbapi_export.h:23,
                 from /usr/src/tmp/libkfbapi-buildroot/usr/include/kde4/libkfbapi/likeinfo.h:23:
/usr/include/kde4/kdemacros.h:162:11: fatal error: QtCore/qglobal.h: No such file or directory
 # include <QtCore/qglobal.h>
           ^~~~~~~~~~~~~~~~~~
compilation terminated.
cpp.req: WARNING: /usr/src/tmp/libkfbapi-buildroot/usr/include/kde4/libkfbapi/likeinfo.h: cpp failed
/usr/src/tmp/libkfbapi-buildroot/usr/include/kde4/libkfbapi/noteinfo.h:25:10: fatal error: KMime/Message: No such file or directory
 #include <KMime/Message>
          ^~~~~~~~~~~~~~~
compilation terminated.
cpp.req: /usr/src/tmp/libkfbapi-buildroot/usr/include/kde4/libkfbapi/noteinfo.h: cpp failed, trying c++ mode
In file included from /usr/src/tmp/libkfbapi-buildroot/usr/include/kde4/libkfbapi/libkfbapi_export.h:23,
                 from /usr/src/tmp/libkfbapi-buildroot/usr/include/kde4/libkfbapi/noteinfo.h:23:
/usr/include/kde4/kdemacros.h:162:11: fatal error: QtCore/qglobal.h: No such file or directory
 # include <QtCore/qglobal.h>
           ^~~~~~~~~~~~~~~~~~
compilation terminated.
cpp.req: WARNING: /usr/src/tmp/libkfbapi-buildroot/usr/include/kde4/libkfbapi/noteinfo.h: cpp failed
In file included from /usr/src/tmp/libkfbapi-buildroot/usr/include/kde4/libkfbapi/photojob.h:24:
/usr/src/tmp/libkfbapi-buildroot/usr/include/kde4/libkfbapi/facebookjobs.h:27:10: fatal error: KJob: No such file or directory
 #include <KJob>
          ^~~~~~
compilation terminated.
cpp.req: /usr/src/tmp/libkfbapi-buildroot/usr/include/kde4/libkfbapi/photojob.h: cpp failed, trying c++ mode
In file included from /usr/src/tmp/libkfbapi-buildroot/usr/include/kde4/libkfbapi/libkfbapi_export.h:23,
                 from /usr/src/tmp/libkfbapi-buildroot/usr/include/kde4/libkfbapi/photojob.h:23:
/usr/include/kde4/kdemacros.h:162:11: fatal error: QtCore/qglobal.h: No such file or directory
 # include <QtCore/qglobal.h>
           ^~~~~~~~~~~~~~~~~~
compilation terminated.
cpp.req: WARNING: /usr/src/tmp/libkfbapi-buildroot/usr/include/kde4/libkfbapi/photojob.h: cpp failed
In file included from /usr/src/tmp/libkfbapi-buildroot/usr/include/kde4/libkfbapi/postinfo.h:24:
/usr/src/tmp/libkfbapi-buildroot/usr/include/kde4/libkfbapi/userinfo.h:25:10: fatal error: KABC/Addressee: No such file or directory
 #include <KABC/Addressee>
          ^~~~~~~~~~~~~~~~
compilation terminated.
cpp.req: /usr/src/tmp/libkfbapi-buildroot/usr/include/kde4/libkfbapi/postinfo.h: cpp failed, trying c++ mode
In file included from /usr/src/tmp/libkfbapi-buildroot/usr/include/kde4/libkfbapi/libkfbapi_export.h:23,
                 from /usr/src/tmp/libkfbapi-buildroot/usr/include/kde4/libkfbapi/postinfo.h:23:
/usr/include/kde4/kdemacros.h:162:11: fatal error: QtCore/qglobal.h: No such file or directory
 # include <QtCore/qglobal.h>
           ^~~~~~~~~~~~~~~~~~
compilation terminated.
cpp.req: WARNING: /usr/src/tmp/libkfbapi-buildroot/usr/include/kde4/libkfbapi/postinfo.h: cpp failed
/usr/src/tmp/libkfbapi-buildroot/usr/include/kde4/libkfbapi/userinfo.h:25:10: fatal error: KABC/Addressee: No such file or directory
 #include <KABC/Addressee>
          ^~~~~~~~~~~~~~~~
compilation terminated.
cpp.req: /usr/src/tmp/libkfbapi-buildroot/usr/include/kde4/libkfbapi/userinfo.h: cpp failed, trying c++ mode
In file included from /usr/src/tmp/libkfbapi-buildroot/usr/include/kde4/libkfbapi/libkfbapi_export.h:23,
                 from /usr/src/tmp/libkfbapi-buildroot/usr/include/kde4/libkfbapi/userinfo.h:23:
/usr/include/kde4/kdemacros.h:162:11: fatal error: QtCore/qglobal.h: No such file or directory
 # include <QtCore/qglobal.h>
           ^~~~~~~~~~~~~~~~~~
compilation terminated.
cpp.req: WARNING: /usr/src/tmp/libkfbapi-buildroot/usr/include/kde4/libkfbapi/userinfo.h: cpp failed
/usr/src/tmp/libkfbapi-buildroot/usr/include/kde4/libkfbapi/eventinfo.h:25:10: fatal error: KDateTime: No such file or directory
 #include <KDateTime>
          ^~~~~~~~~~~
compilation terminated.
cpp.req: /usr/src/tmp/libkfbapi-buildroot/usr/include/kde4/libkfbapi/eventinfo.h: cpp failed, trying c++ mode
In file included from /usr/src/tmp/libkfbapi-buildroot/usr/include/kde4/libkfbapi/libkfbapi_export.h:23,
                 from /usr/src/tmp/libkfbapi-buildroot/usr/include/kde4/libkfbapi/eventinfo.h:23:
/usr/include/kde4/kdemacros.h:162:11: fatal error: QtCore/qglobal.h: No such file or directory
 # include <QtCore/qglobal.h>
           ^~~~~~~~~~~~~~~~~~
compilation terminated.
cpp.req: WARNING: /usr/src/tmp/libkfbapi-buildroot/usr/include/kde4/libkfbapi/eventinfo.h: cpp failed
In file included from /usr/src/tmp/libkfbapi-buildroot/usr/include/kde4/libkfbapi/friendjob.h:23:
/usr/src/tmp/libkfbapi-buildroot/usr/include/kde4/libkfbapi/facebookjobs.h:27:10: fatal error: KJob: No such file or directory
 #include <KJob>
          ^~~~~~
compilation terminated.
cpp.req: /usr/src/tmp/libkfbapi-buildroot/usr/include/kde4/libkfbapi/friendjob.h: cpp failed, trying c++ mode
In file included from /usr/src/tmp/libkfbapi-buildroot/usr/include/kde4/libkfbapi/libkfbapi_export.h:23,
                 from /usr/src/tmp/libkfbapi-buildroot/usr/include/kde4/libkfbapi/facebookjobs.h:25,
                 from /usr/src/tmp/libkfbapi-buildroot/usr/include/kde4/libkfbapi/friendjob.h:23:
/usr/include/kde4/kdemacros.h:162:11: fatal error: QtCore/qglobal.h: No such file or directory
 # include <QtCore/qglobal.h>
           ^~~~~~~~~~~~~~~~~~
compilation terminated.
cpp.req: WARNING: /usr/src/tmp/libkfbapi-buildroot/usr/include/kde4/libkfbapi/friendjob.h: cpp failed
In file included from /usr/src/tmp/libkfbapi-buildroot/usr/include/kde4/libkfbapi/noteaddjob.h:23:
/usr/src/tmp/libkfbapi-buildroot/usr/include/kde4/libkfbapi/facebookjobs.h:27:10: fatal error: KJob: No such file or directory
 #include <KJob>
          ^~~~~~
compilation terminated.
cpp.req: /usr/src/tmp/libkfbapi-buildroot/usr/include/kde4/libkfbapi/noteaddjob.h: cpp failed, trying c++ mode
In file included from /usr/src/tmp/libkfbapi-buildroot/usr/include/kde4/libkfbapi/libkfbapi_export.h:23,
                 from /usr/src/tmp/libkfbapi-buildroot/usr/include/kde4/libkfbapi/facebookjobs.h:25,
                 from /usr/src/tmp/libkfbapi-buildroot/usr/include/kde4/libkfbapi/noteaddjob.h:23:
/usr/include/kde4/kdemacros.h:162:11: fatal error: QtCore/qglobal.h: No such file or directory
 # include <QtCore/qglobal.h>
           ^~~~~~~~~~~~~~~~~~
compilation terminated.
cpp.req: WARNING: /usr/src/tmp/libkfbapi-buildroot/usr/include/kde4/libkfbapi/noteaddjob.h: cpp failed
In file included from /usr/src/tmp/libkfbapi-buildroot/usr/include/kde4/libkfbapi/postaddjob.h:23:
/usr/src/tmp/libkfbapi-buildroot/usr/include/kde4/libkfbapi/facebookjobs.h:27:10: fatal error: KJob: No such file or directory
 #include <KJob>
          ^~~~~~
compilation terminated.
cpp.req: /usr/src/tmp/libkfbapi-buildroot/usr/include/kde4/libkfbapi/postaddjob.h: cpp failed, trying c++ mode
In file included from /usr/src/tmp/libkfbapi-buildroot/usr/include/kde4/libkfbapi/libkfbapi_export.h:23,
                 from /usr/src/tmp/libkfbapi-buildroot/usr/include/kde4/libkfbapi/facebookjobs.h:25,
                 from /usr/src/tmp/libkfbapi-buildroot/usr/include/kde4/libkfbapi/postaddjob.h:23:
/usr/include/kde4/kdemacros.h:162:11: fatal error: QtCore/qglobal.h: No such file or directory
 # include <QtCore/qglobal.h>
           ^~~~~~~~~~~~~~~~~~
compilation terminated.
cpp.req: WARNING: /usr/src/tmp/libkfbapi-buildroot/usr/include/kde4/libkfbapi/postaddjob.h: cpp failed
In file included from /usr/src/tmp/libkfbapi-buildroot/usr/include/kde4/libkfbapi/commentinfo.h:24:
/usr/src/tmp/libkfbapi-buildroot/usr/include/kde4/libkfbapi/userinfo.h:25:10: fatal error: KABC/Addressee: No such file or directory
 #include <KABC/Addressee>
          ^~~~~~~~~~~~~~~~
compilation terminated.
cpp.req: /usr/src/tmp/libkfbapi-buildroot/usr/include/kde4/libkfbapi/commentinfo.h: cpp failed, trying c++ mode
In file included from /usr/src/tmp/libkfbapi-buildroot/usr/include/kde4/libkfbapi/libkfbapi_export.h:23,
                 from /usr/src/tmp/libkfbapi-buildroot/usr/include/kde4/libkfbapi/commentinfo.h:23:
/usr/include/kde4/kdemacros.h:162:11: fatal error: QtCore/qglobal.h: No such file or directory
 # include <QtCore/qglobal.h>
           ^~~~~~~~~~~~~~~~~~
compilation terminated.
cpp.req: WARNING: /usr/src/tmp/libkfbapi-buildroot/usr/include/kde4/libkfbapi/commentinfo.h: cpp failed
In file included from /usr/src/tmp/libkfbapi-buildroot/usr/include/kde4/libkfbapi/getlikesjob.h:23:
/usr/src/tmp/libkfbapi-buildroot/usr/include/kde4/libkfbapi/facebookjobs.h:27:10: fatal error: KJob: No such file or directory
 #include <KJob>
          ^~~~~~
compilation terminated.
cpp.req: /usr/src/tmp/libkfbapi-buildroot/usr/include/kde4/libkfbapi/getlikesjob.h: cpp failed, trying c++ mode
In file included from /usr/src/tmp/libkfbapi-buildroot/usr/include/kde4/libkfbapi/libkfbapi_export.h:23,
                 from /usr/src/tmp/libkfbapi-buildroot/usr/include/kde4/libkfbapi/facebookjobs.h:25,
                 from /usr/src/tmp/libkfbapi-buildroot/usr/include/kde4/libkfbapi/getlikesjob.h:23:
/usr/include/kde4/kdemacros.h:162:11: fatal error: QtCore/qglobal.h: No such file or directory
 # include <QtCore/qglobal.h>
           ^~~~~~~~~~~~~~~~~~
compilation terminated.
cpp.req: WARNING: /usr/src/tmp/libkfbapi-buildroot/usr/include/kde4/libkfbapi/getlikesjob.h: cpp failed
In file included from /usr/src/tmp/libkfbapi-buildroot/usr/include/kde4/libkfbapi/listjobbase.h:25:
/usr/src/tmp/libkfbapi-buildroot/usr/include/kde4/libkfbapi/facebookjobs.h:27:10: fatal error: KJob: No such file or directory
 #include <KJob>
          ^~~~~~
compilation terminated.
cpp.req: /usr/src/tmp/libkfbapi-buildroot/usr/include/kde4/libkfbapi/listjobbase.h: cpp failed, trying c++ mode
In file included from /usr/src/tmp/libkfbapi-buildroot/usr/include/kde4/libkfbapi/libkfbapi_export.h:23,
                 from /usr/src/tmp/libkfbapi-buildroot/usr/include/kde4/libkfbapi/listjobbase.h:23:
/usr/include/kde4/kdemacros.h:162:11: fatal error: QtCore/qglobal.h: No such file or directory
 # include <QtCore/qglobal.h>
           ^~~~~~~~~~~~~~~~~~
compilation terminated.
cpp.req: WARNING: /usr/src/tmp/libkfbapi-buildroot/usr/include/kde4/libkfbapi/listjobbase.h: cpp failed
In file included from /usr/src/tmp/libkfbapi-buildroot/usr/include/kde4/libkfbapi/userinfojob.h:23:
/usr/src/tmp/libkfbapi-buildroot/usr/include/kde4/libkfbapi/userinfo.h:25:10: fatal error: KABC/Addressee: No such file or directory
 #include <KABC/Addressee>
          ^~~~~~~~~~~~~~~~
compilation terminated.
cpp.req: /usr/src/tmp/libkfbapi-buildroot/usr/include/kde4/libkfbapi/userinfojob.h: cpp failed, trying c++ mode
In file included from /usr/src/tmp/libkfbapi-buildroot/usr/include/kde4/libkfbapi/libkfbapi_export.h:23,
                 from /usr/src/tmp/libkfbapi-buildroot/usr/include/kde4/libkfbapi/userinfo.h:23,
                 from /usr/src/tmp/libkfbapi-buildroot/usr/include/kde4/libkfbapi/userinfojob.h:23:
/usr/include/kde4/kdemacros.h:162:11: fatal error: QtCore/qglobal.h: No such file or directory
 # include <QtCore/qglobal.h>
           ^~~~~~~~~~~~~~~~~~
compilation terminated.
cpp.req: WARNING: /usr/src/tmp/libkfbapi-buildroot/usr/include/kde4/libkfbapi/userinfojob.h: cpp failed
/usr/src/tmp/libkfbapi-buildroot/usr/include/kde4/libkfbapi/facebookjobs.h:27:10: fatal error: KJob: No such file or directory
 #include <KJob>
          ^~~~~~
compilation terminated.
cpp.req: /usr/src/tmp/libkfbapi-buildroot/usr/include/kde4/libkfbapi/facebookjobs.h: cpp failed, trying c++ mode
In file included from /usr/src/tmp/libkfbapi-buildroot/usr/include/kde4/libkfbapi/libkfbapi_export.h:23,
                 from /usr/src/tmp/libkfbapi-buildroot/usr/include/kde4/libkfbapi/facebookjobs.h:25:
/usr/include/kde4/kdemacros.h:162:11: fatal error: QtCore/qglobal.h: No such file or directory
 # include <QtCore/qglobal.h>
           ^~~~~~~~~~~~~~~~~~
compilation terminated.
cpp.req: WARNING: /usr/src/tmp/libkfbapi-buildroot/usr/include/kde4/libkfbapi/facebookjobs.h: cpp failed
In file included from /usr/src/tmp/libkfbapi-buildroot/usr/include/kde4/libkfbapi/listjobbase.h:25,
                 from /usr/src/tmp/libkfbapi-buildroot/usr/include/kde4/libkfbapi/noteslistjob.h:23:
/usr/src/tmp/libkfbapi-buildroot/usr/include/kde4/libkfbapi/facebookjobs.h:27:10: fatal error: KJob: No such file or directory
 #include <KJob>
          ^~~~~~
compilation terminated.
cpp.req: /usr/src/tmp/libkfbapi-buildroot/usr/include/kde4/libkfbapi/noteslistjob.h: cpp failed, trying c++ mode
In file included from /usr/src/tmp/libkfbapi-buildroot/usr/include/kde4/libkfbapi/libkfbapi_export.h:23,
                 from /usr/src/tmp/libkfbapi-buildroot/usr/include/kde4/libkfbapi/listjobbase.h:23,
                 from /usr/src/tmp/libkfbapi-buildroot/usr/include/kde4/libkfbapi/noteslistjob.h:23:
/usr/include/kde4/kdemacros.h:162:11: fatal error: QtCore/qglobal.h: No such file or directory
 # include <QtCore/qglobal.h>
           ^~~~~~~~~~~~~~~~~~
compilation terminated.
cpp.req: WARNING: /usr/src/tmp/libkfbapi-buildroot/usr/include/kde4/libkfbapi/noteslistjob.h: cpp failed
/usr/src/tmp/libkfbapi-buildroot/usr/include/kde4/libkfbapi/pagedlistjob.h:25:10: fatal error: KJob: No such file or directory
 #include <KJob>
          ^~~~~~
compilation terminated.
cpp.req: /usr/src/tmp/libkfbapi-buildroot/usr/include/kde4/libkfbapi/pagedlistjob.h: cpp failed, trying c++ mode
In file included from /usr/src/tmp/libkfbapi-buildroot/usr/include/kde4/libkfbapi/libkfbapi_export.h:23,
                 from /usr/src/tmp/libkfbapi-buildroot/usr/include/kde4/libkfbapi/pagedlistjob.h:23:
/usr/include/kde4/kdemacros.h:162:11: fatal error: QtCore/qglobal.h: No such file or directory
 # include <QtCore/qglobal.h>
           ^~~~~~~~~~~~~~~~~~
compilation terminated.
cpp.req: WARNING: /usr/src/tmp/libkfbapi-buildroot/usr/include/kde4/libkfbapi/pagedlistjob.h: cpp failed
In file included from /usr/src/tmp/libkfbapi-buildroot/usr/include/kde4/libkfbapi/listjobbase.h:25,
                 from /usr/src/tmp/libkfbapi-buildroot/usr/include/kde4/libkfbapi/postslistjob.h:23:
/usr/src/tmp/libkfbapi-buildroot/usr/include/kde4/libkfbapi/facebookjobs.h:27:10: fatal error: KJob: No such file or directory
 #include <KJob>
          ^~~~~~
compilation terminated.
cpp.req: /usr/src/tmp/libkfbapi-buildroot/usr/include/kde4/libkfbapi/postslistjob.h: cpp failed, trying c++ mode
In file included from /usr/src/tmp/libkfbapi-buildroot/usr/include/kde4/libkfbapi/libkfbapi_export.h:23,
                 from /usr/src/tmp/libkfbapi-buildroot/usr/include/kde4/libkfbapi/listjobbase.h:23,
                 from /usr/src/tmp/libkfbapi-buildroot/usr/include/kde4/libkfbapi/postslistjob.h:23:
/usr/include/kde4/kdemacros.h:162:11: fatal error: QtCore/qglobal.h: No such file or directory
 # include <QtCore/qglobal.h>
           ^~~~~~~~~~~~~~~~~~
compilation terminated.
cpp.req: WARNING: /usr/src/tmp/libkfbapi-buildroot/usr/include/kde4/libkfbapi/postslistjob.h: cpp failed
/usr/src/tmp/libkfbapi-buildroot/usr/include/kde4/libkfbapi/propertyinfo.h:25:10: fatal error: QSharedPointer: No such file or directory
 #include <QSharedPointer>
          ^~~~~~~~~~~~~~~~
compilation terminated.
cpp.req: /usr/src/tmp/libkfbapi-buildroot/usr/include/kde4/libkfbapi/propertyinfo.h: cpp failed, trying c++ mode
In file included from /usr/src/tmp/libkfbapi-buildroot/usr/include/kde4/libkfbapi/libkfbapi_export.h:23,
                 from /usr/src/tmp/libkfbapi-buildroot/usr/include/kde4/libkfbapi/propertyinfo.h:23:
/usr/include/kde4/kdemacros.h:162:11: fatal error: QtCore/qglobal.h: No such file or directory
 # include <QtCore/qglobal.h>
           ^~~~~~~~~~~~~~~~~~
compilation terminated.
cpp.req: WARNING: /usr/src/tmp/libkfbapi-buildroot/usr/include/kde4/libkfbapi/propertyinfo.h: cpp failed
In file included from /usr/src/tmp/libkfbapi-buildroot/usr/include/kde4/libkfbapi/listjobbase.h:25,
                 from /usr/src/tmp/libkfbapi-buildroot/usr/include/kde4/libkfbapi/eventslistjob.h:23:
/usr/src/tmp/libkfbapi-buildroot/usr/include/kde4/libkfbapi/facebookjobs.h:27:10: fatal error: KJob: No such file or directory
 #include <KJob>
          ^~~~~~
compilation terminated.
cpp.req: /usr/src/tmp/libkfbapi-buildroot/usr/include/kde4/libkfbapi/eventslistjob.h: cpp failed, trying c++ mode
In file included from /usr/src/tmp/libkfbapi-buildroot/usr/include/kde4/libkfbapi/libkfbapi_export.h:23,
                 from /usr/src/tmp/libkfbapi-buildroot/usr/include/kde4/libkfbapi/listjobbase.h:23,
                 from /usr/src/tmp/libkfbapi-buildroot/usr/include/kde4/libkfbapi/eventslistjob.h:23:
/usr/include/kde4/kdemacros.h:162:11: fatal error: QtCore/qglobal.h: No such file or directory
 # include <QtCore/qglobal.h>
           ^~~~~~~~~~~~~~~~~~
compilation terminated.
cpp.req: WARNING: /usr/src/tmp/libkfbapi-buildroot/usr/include/kde4/libkfbapi/eventslistjob.h: cpp failed
In file included from /usr/src/tmp/libkfbapi-buildroot/usr/include/kde4/libkfbapi/friendlistjob.h:23:
/usr/src/tmp/libkfbapi-buildroot/usr/include/kde4/libkfbapi/userinfo.h:25:10: fatal error: KABC/Addressee: No such file or directory
 #include <KABC/Addressee>
          ^~~~~~~~~~~~~~~~
compilation terminated.
cpp.req: /usr/src/tmp/libkfbapi-buildroot/usr/include/kde4/libkfbapi/friendlistjob.h: cpp failed, trying c++ mode
In file included from /usr/src/tmp/libkfbapi-buildroot/usr/include/kde4/libkfbapi/libkfbapi_export.h:23,
                 from /usr/src/tmp/libkfbapi-buildroot/usr/include/kde4/libkfbapi/userinfo.h:23,
                 from /usr/src/tmp/libkfbapi-buildroot/usr/include/kde4/libkfbapi/friendlistjob.h:23:
/usr/include/kde4/kdemacros.h:162:11: fatal error: QtCore/qglobal.h: No such file or directory
 # include <QtCore/qglobal.h>
           ^~~~~~~~~~~~~~~~~~
compilation terminated.
cpp.req: WARNING: /usr/src/tmp/libkfbapi-buildroot/usr/include/kde4/libkfbapi/friendlistjob.h: cpp failed
In file included from /usr/src/tmp/libkfbapi-buildroot/usr/include/kde4/libkfbapi/getcommentsjob.h:23:
/usr/src/tmp/libkfbapi-buildroot/usr/include/kde4/libkfbapi/facebookjobs.h:27:10: fatal error: KJob: No such file or directory
 #include <KJob>
          ^~~~~~
compilation terminated.
cpp.req: /usr/src/tmp/libkfbapi-buildroot/usr/include/kde4/libkfbapi/getcommentsjob.h: cpp failed, trying c++ mode
In file included from /usr/src/tmp/libkfbapi-buildroot/usr/include/kde4/libkfbapi/libkfbapi_export.h:23,
                 from /usr/src/tmp/libkfbapi-buildroot/usr/include/kde4/libkfbapi/facebookjobs.h:25,
                 from /usr/src/tmp/libkfbapi-buildroot/usr/include/kde4/libkfbapi/getcommentsjob.h:23:
/usr/include/kde4/kdemacros.h:162:11: fatal error: QtCore/qglobal.h: No such file or directory
 # include <QtCore/qglobal.h>
           ^~~~~~~~~~~~~~~~~~
compilation terminated.
cpp.req: WARNING: /usr/src/tmp/libkfbapi-buildroot/usr/include/kde4/libkfbapi/getcommentsjob.h: cpp failed
In file included from /usr/src/tmp/libkfbapi-buildroot/usr/include/kde4/libkfbapi/allnoteslistjob.h:23:
/usr/src/tmp/libkfbapi-buildroot/usr/include/kde4/libkfbapi/pagedlistjob.h:25:10: fatal error: KJob: No such file or directory
 #include <KJob>
          ^~~~~~
compilation terminated.
cpp.req: /usr/src/tmp/libkfbapi-buildroot/usr/include/kde4/libkfbapi/allnoteslistjob.h: cpp failed, trying c++ mode
In file included from /usr/src/tmp/libkfbapi-buildroot/usr/include/kde4/libkfbapi/libkfbapi_export.h:23,
                 from /usr/src/tmp/libkfbapi-buildroot/usr/include/kde4/libkfbapi/pagedlistjob.h:23,
                 from /usr/src/tmp/libkfbapi-buildroot/usr/include/kde4/libkfbapi/allnoteslistjob.h:23:
/usr/include/kde4/kdemacros.h:162:11: fatal error: QtCore/qglobal.h: No such file or directory
 # include <QtCore/qglobal.h>
           ^~~~~~~~~~~~~~~~~~
compilation terminated.
cpp.req: WARNING: /usr/src/tmp/libkfbapi-buildroot/usr/include/kde4/libkfbapi/allnoteslistjob.h: cpp failed
In file included from /usr/src/tmp/libkfbapi-buildroot/usr/include/kde4/libkfbapi/allpostslistjob.h:24:
/usr/src/tmp/libkfbapi-buildroot/usr/include/kde4/libkfbapi/pagedlistjob.h:25:10: fatal error: KJob: No such file or directory
 #include <KJob>
          ^~~~~~
compilation terminated.
cpp.req: /usr/src/tmp/libkfbapi-buildroot/usr/include/kde4/libkfbapi/allpostslistjob.h: cpp failed, trying c++ mode
In file included from /usr/src/tmp/libkfbapi-buildroot/usr/include/kde4/libkfbapi/libkfbapi_export.h:23,
                 from /usr/src/tmp/libkfbapi-buildroot/usr/include/kde4/libkfbapi/pagedlistjob.h:23,
                 from /usr/src/tmp/libkfbapi-buildroot/usr/include/kde4/libkfbapi/allpostslistjob.h:24:
/usr/include/kde4/kdemacros.h:162:11: fatal error: QtCore/qglobal.h: No such file or directory
 # include <QtCore/qglobal.h>
           ^~~~~~~~~~~~~~~~~~
compilation terminated.
cpp.req: WARNING: /usr/src/tmp/libkfbapi-buildroot/usr/include/kde4/libkfbapi/allpostslistjob.h: cpp failed
In file included from /usr/src/tmp/libkfbapi-buildroot/usr/include/kde4/libkfbapi/alleventslistjob.h:23:
/usr/src/tmp/libkfbapi-buildroot/usr/include/kde4/libkfbapi/pagedlistjob.h:25:10: fatal error: KJob: No such file or directory
 #include <KJob>
          ^~~~~~
compilation terminated.
cpp.req: /usr/src/tmp/libkfbapi-buildroot/usr/include/kde4/libkfbapi/alleventslistjob.h: cpp failed, trying c++ mode
In file included from /usr/src/tmp/libkfbapi-buildroot/usr/include/kde4/libkfbapi/libkfbapi_export.h:23,
                 from /usr/src/tmp/libkfbapi-buildroot/usr/include/kde4/libkfbapi/pagedlistjob.h:23,
                 from /usr/src/tmp/libkfbapi-buildroot/usr/include/kde4/libkfbapi/alleventslistjob.h:23:
/usr/include/kde4/kdemacros.h:162:11: fatal error: QtCore/qglobal.h: No such file or directory
 # include <QtCore/qglobal.h>
           ^~~~~~~~~~~~~~~~~~
compilation terminated.
cpp.req: WARNING: /usr/src/tmp/libkfbapi-buildroot/usr/include/kde4/libkfbapi/alleventslistjob.h: cpp failed
In file included from /usr/src/tmp/libkfbapi-buildroot/usr/include/kde4/libkfbapi/notificationinfo.h:24:
/usr/src/tmp/libkfbapi-buildroot/usr/include/kde4/libkfbapi/userinfo.h:25:10: fatal error: KABC/Addressee: No such file or directory
 #include <KABC/Addressee>
          ^~~~~~~~~~~~~~~~
compilation terminated.
cpp.req: /usr/src/tmp/libkfbapi-buildroot/usr/include/kde4/libkfbapi/notificationinfo.h: cpp failed, trying c++ mode
In file included from /usr/src/tmp/libkfbapi-buildroot/usr/include/kde4/libkfbapi/libkfbapi_export.h:23,
                 from /usr/src/tmp/libkfbapi-buildroot/usr/include/kde4/libkfbapi/notificationinfo.h:23:
/usr/include/kde4/kdemacros.h:162:11: fatal error: QtCore/qglobal.h: No such file or directory
 # include <QtCore/qglobal.h>
           ^~~~~~~~~~~~~~~~~~
compilation terminated.
cpp.req: WARNING: /usr/src/tmp/libkfbapi-buildroot/usr/include/kde4/libkfbapi/notificationinfo.h: cpp failed
/usr/src/tmp/libkfbapi-buildroot/usr/include/kde4/libkfbapi/authenticationdialog.h:25:10: fatal error: KDialog: No such file or directory
 #include <KDialog>
          ^~~~~~~~~
compilation terminated.
cpp.req: /usr/src/tmp/libkfbapi-buildroot/usr/include/kde4/libkfbapi/authenticationdialog.h: cpp failed, trying c++ mode
In file included from /usr/src/tmp/libkfbapi-buildroot/usr/include/kde4/libkfbapi/libkfbapi_export.h:23,
                 from /usr/src/tmp/libkfbapi-buildroot/usr/include/kde4/libkfbapi/authenticationdialog.h:23:
/usr/include/kde4/kdemacros.h:162:11: fatal error: QtCore/qglobal.h: No such file or directory
 # include <QtCore/qglobal.h>
           ^~~~~~~~~~~~~~~~~~
compilation terminated.
cpp.req: WARNING: /usr/src/tmp/libkfbapi-buildroot/usr/include/kde4/libkfbapi/authenticationdialog.h: cpp failed
In file included from /usr/src/tmp/libkfbapi-buildroot/usr/include/kde4/libkfbapi/listjobbase.h:25,
                 from /usr/src/tmp/libkfbapi-buildroot/usr/include/kde4/libkfbapi/notificationslistjob.h:23:
/usr/src/tmp/libkfbapi-buildroot/usr/include/kde4/libkfbapi/facebookjobs.h:27:10: fatal error: KJob: No such file or directory
 #include <KJob>
          ^~~~~~
compilation terminated.
cpp.req: /usr/src/tmp/libkfbapi-buildroot/usr/include/kde4/libkfbapi/notificationslistjob.h: cpp failed, trying c++ mode
In file included from /usr/src/tmp/libkfbapi-buildroot/usr/include/kde4/libkfbapi/libkfbapi_export.h:23,
                 from /usr/src/tmp/libkfbapi-buildroot/usr/include/kde4/libkfbapi/listjobbase.h:23,
                 from /usr/src/tmp/libkfbapi-buildroot/usr/include/kde4/libkfbapi/notificationslistjob.h:23:
/usr/include/kde4/kdemacros.h:162:11: fatal error: QtCore/qglobal.h: No such file or directory
 # include <QtCore/qglobal.h>
           ^~~~~~~~~~~~~~~~~~
compilation terminated.
cpp.req: WARNING: /usr/src/tmp/libkfbapi-buildroot/usr/include/kde4/libkfbapi/notificationslistjob.h: cpp failed
In file included from /usr/src/tmp/libkfbapi-buildroot/usr/include/kde4/libkfbapi/notificationsmarkreadjob.h:23:
/usr/src/tmp/libkfbapi-buildroot/usr/include/kde4/libkfbapi/facebookjobs.h:27:10: fatal error: KJob: No such file or directory
 #include <KJob>
          ^~~~~~
compilation terminated.
cpp.req: /usr/src/tmp/libkfbapi-buildroot/usr/include/kde4/libkfbapi/notificationsmarkreadjob.h: cpp failed, trying c++ mode
In file included from /usr/src/tmp/libkfbapi-buildroot/usr/include/kde4/libkfbapi/libkfbapi_export.h:23,
                 from /usr/src/tmp/libkfbapi-buildroot/usr/include/kde4/libkfbapi/facebookjobs.h:25,
                 from /usr/src/tmp/libkfbapi-buildroot/usr/include/kde4/libkfbapi/notificationsmarkreadjob.h:23:
/usr/include/kde4/kdemacros.h:162:11: fatal error: QtCore/qglobal.h: No such file or directory
 # include <QtCore/qglobal.h>
           ^~~~~~~~~~~~~~~~~~
compilation terminated.
cpp.req: WARNING: /usr/src/tmp/libkfbapi-buildroot/usr/include/kde4/libkfbapi/notificationsmarkreadjob.h: cpp failed
pkgconfiglib.req: WARNING: /usr/src/tmp/libkfbapi-buildroot/usr/lib64/pkgconfig/LibKFbAPI.pc: cannot find -lkfbapi library path (skip)
Provides: pkgconfig(LibKFbAPI) = 1.0
Requires: kde4pimlibs-devel, /usr/lib64/libkfbapi.so.1, /usr/lib64/pkgconfig, kde4libs-devel
Finding debuginfo files (using /usr/lib/rpm/find-debuginfo-files)
Executing: /bin/sh -e /usr/src/tmp/rpm-tmp.4iss4k
Processing files: libkfbapi1-debuginfo-1.0-alt2
Finding Provides (using /usr/lib/rpm/find-provides)
Executing: /bin/sh -e /usr/src/tmp/rpm-tmp.ne9me8
find-provides: running scripts (debuginfo)
Finding Requires (using /usr/lib/rpm/find-requires)
Executing: /bin/sh -e /usr/src/tmp/rpm-tmp.oAeTxY
find-requires: running scripts (debuginfo)
Provides: debug64(libkfbapi.so.1)
Requires: libkfbapi1 = 1.0-alt2, debug64(libQtCore.so.4), debug64(libQtGui.so.4), debug64(libQtWebKit.so.4), debug64(libc.so.6), debug64(libgcc_s.so.1), debug64(libkabc.so.4), debug64(libkcalcore.so.4), debug64(libkdecore.so.5), debug64(libkdeui.so.5), debug64(libkdewebkit.so.5), debug64(libkio.so.5), debug64(libkmime.so.4), debug64(libkpimutils.so.4), debug64(libqjson.so.0), debug64(libstdc++.so.6)
Adding to libkfbapi-devel a strict dependency on libkfbapi1
Removing 1 extra deps from libkfbapi-devel due to dependency on libkfbapi1
Wrote: /usr/src/RPM/RPMS/x86_64/libkfbapi1-1.0-alt2.x86_64.rpm
Wrote: /usr/src/RPM/RPMS/x86_64/libkfbapi-devel-1.0-alt2.x86_64.rpm
Wrote: /usr/src/RPM/RPMS/x86_64/libkfbapi1-debuginfo-1.0-alt2.x86_64.rpm
39.67user 7.16system 0:28.26elapsed 165%CPU (0avgtext+0avgdata 142692maxresident)k
0inputs+0outputs (0major+2352125minor)pagefaults 0swaps
60.97user 12.58system 1:07.99elapsed 108%CPU (0avgtext+0avgdata 142692maxresident)k
150592inputs+0outputs (0major+3379014minor)pagefaults 0swaps
--- libkfbapi1-1.0-alt2.x86_64.rpm.repo	2016-03-09 08:39:59.000000000 +0000
+++ libkfbapi1-1.0-alt2.x86_64.rpm.hasher	2019-07-19 04:42:40.745170098 +0000
@@ -46,3 +46,3 @@
 Requires: rpmlib(SetVersions)  
-Requires: libQtGui.so.4()(64bit) >= set:rlR9KZ1ZHH8ILQ4Ng9Z4OOk6nGxFopwc3ozsHPKTPHGFJlXQ6HrljXw19O9r3WUWB6SyZLslIcjNgZvttS0cJOwTj0ukzZ2FRMbZnOLBNk9vspL8srr5gaVZFqKavv5Au5ifC5JkNTuXk81Z0i9x94yjaG2eEqI9SZivIZnqBbTefWiylQf3rQFZ8g2lPZg6fvIboF9
+Requires: libQtGui.so.4()(64bit) >= set:rlR9KZ1ZHH8ILQ4Ng9Z4OOk6nGxFopwcAb1FTPHGFJlXQ6HrljXw19O9r3WUWB6SyZLslIcjNgZvttS0cJOwTj0ukzZ2FRMbZnOLBNk9vspL8srr5gaVZFqKavv5Au5ifC5JkNTuXk81Z0i9x94yjaG2eEqI9SZivIZnqBbTefWiylQf3rQFZ8g2lPZg6fvIboF9
 Requires: libQtWebKit.so.4()(64bit) >= set:oksSdBLX2sfillSBwINWHXqSScj3
@@ -50,2 +50,3 @@
 Requires: libc.so.6(GLIBC_2.2.5)(64bit)  
+Requires: libc.so.6(GLIBC_2.4)(64bit)  
 Requires: libgcc_s.so.1(GCC_3.0)(64bit)  
@@ -61,2 +62,3 @@
 Requires: libstdc++.so.6(CXXABI_1.3)(64bit)  
+Requires: libstdc++.so.6(CXXABI_1.3.9)(64bit)  
 Requires: libstdc++.so.6(GLIBCXX_3.4)(64bit)