<86>Feb 14 04:49:45 userdel[103477]: delete user 'rooter' <86>Feb 14 04:49:45 userdel[103477]: removed group 'rooter' owned by 'rooter' <86>Feb 14 04:49:45 userdel[103477]: removed shadow group 'rooter' owned by 'rooter' <86>Feb 14 04:49:45 groupadd[103518]: group added to /etc/group: name=rooter, GID=579 <86>Feb 14 04:49:45 groupadd[103518]: group added to /etc/gshadow: name=rooter <86>Feb 14 04:49:45 groupadd[103518]: new group: name=rooter, GID=579 <86>Feb 14 04:49:45 useradd[103610]: new user: name=rooter, UID=579, GID=579, home=/root, shell=/bin/bash <86>Feb 14 04:49:45 userdel[103746]: delete user 'builder' <86>Feb 14 04:49:45 userdel[103746]: removed group 'builder' owned by 'builder' <86>Feb 14 04:49:45 userdel[103746]: removed shadow group 'builder' owned by 'builder' <86>Feb 14 04:49:45 groupadd[103782]: group added to /etc/group: name=builder, GID=580 <86>Feb 14 04:49:45 groupadd[103782]: group added to /etc/gshadow: name=builder <86>Feb 14 04:49:45 groupadd[103782]: new group: name=builder, GID=580 <86>Feb 14 04:49:45 useradd[103869]: new user: name=builder, UID=580, GID=580, home=/usr/src, shell=/bin/bash <13>Feb 14 04:49:50 rpmi: xorg-proto-devel-2018.4-alt3 1527685079 installed <13>Feb 14 04:49:50 rpmi: libexpat-2.2.4-alt1 1503305341 installed <13>Feb 14 04:49:50 rpmi: libglvnd-7:1.1.0-alt3 sisyphus.215982.100 1541498630 installed <13>Feb 14 04:49:50 rpmi: libICE-1.0.9-alt1 1409902719 installed <13>Feb 14 04:49:50 rpmi: libpng16-1.6.36-alt1 sisyphus+219478.100.1.1 1547633315 installed <13>Feb 14 04:49:50 rpmi: libSM-1.2.3-alt1 sisyphus.215747.100 1540812760 installed <13>Feb 14 04:49:50 rpmi: zlib-devel-1.2.11-alt1 sisyphus.217171.100 1543710738 installed <13>Feb 14 04:49:50 rpmi: libpixman-3:0.38.0-alt1 sisyphus+221327.100.1.1 1549959656 installed <13>Feb 14 04:49:50 rpmi: libXdmcp-1.1.1-alt1 1334617699 installed <13>Feb 14 04:49:50 rpmi: libXau-1.0.8-alt1 1369565807 installed <13>Feb 14 04:49:50 rpmi: libxcb-1.13.1-alt1 sisyphus.214413.100 1539170828 installed <13>Feb 14 04:49:51 rpmi: libxcb-devel-1.13.1-alt1 sisyphus.214413.100 1539170828 installed <13>Feb 14 04:49:51 rpmi: libwayland-server-1.16.0-alt1 1535614868 installed <13>Feb 14 04:49:52 rpmi: libicu63-1:6.3.1-alt1 sisyphus.215328.100 1540049981 installed <13>Feb 14 04:49:52 rpmi: libgraphite2-1.3.13-alt1 sisyphus.218545.100 1545686499 installed <13>Feb 14 04:49:52 rpmi: libharfbuzz-2.2.0-alt1 sisyphus.218134.500 1545261457 installed <13>Feb 14 04:49:52 rpmi: libfreetype-2.9.1-alt1.S1 1530781049 installed <13>Feb 14 04:49:52 rpmi: fontconfig-2.13.1-alt1 sisyphus.215917.100 1540973883 installed Updating fonts cache: <29>Feb 14 04:49:53 fontconfig: Updating fonts cache: succeeded [ DONE ] <13>Feb 14 04:49:53 rpmi: libidn2-2.1.1-alt1 sisyphus+221274.100.1.2 1549951280 installed <13>Feb 14 04:49:53 rpmi: libharfbuzz-icu-2.2.0-alt1 sisyphus.218134.500 1545261457 installed <13>Feb 14 04:49:53 rpmi: libgraphite2-devel-1.3.13-alt1 sisyphus.218545.100 1545686499 installed <13>Feb 14 04:49:53 rpmi: icu-utils-1:6.3.1-alt1 sisyphus.215328.100 1540049981 installed <13>Feb 14 04:49:53 rpmi: libicu-devel-1:6.3.1-alt1 sisyphus.215328.100 1540049981 installed <13>Feb 14 04:49:53 rpmi: libXau-devel-1.0.8-alt1 1369565807 installed <13>Feb 14 04:49:53 rpmi: libpng-devel-1.6.36-alt1 sisyphus+219478.100.1.1 1547633315 installed <13>Feb 14 04:49:53 rpmi: libICE-devel-1.0.9-alt1 1409902719 installed <13>Feb 14 04:49:53 rpmi: libSM-devel-1.2.3-alt1 sisyphus.215747.100 1540812760 installed <13>Feb 14 04:49:53 rpmi: libOpenGL-7:1.1.0-alt3 sisyphus.215982.100 1541498630 installed <13>Feb 14 04:49:53 rpmi: libGLES-7:1.1.0-alt3 sisyphus.215982.100 1541498630 installed <13>Feb 14 04:49:53 rpmi: libjpeg-2:1.5.1-alt1 1498218302 installed <13>Feb 14 04:49:53 rpmi: libalsa-1:1.1.8-alt1 sisyphus+219888.100.4.1 1548752822 installed <13>Feb 14 04:49:53 rpmi: xorg-xf86miscproto-devel-0.9.3-alt1 1303464883 installed <13>Feb 14 04:49:54 rpmi: libxshmfence-1.2-alt2 1518613549 installed <13>Feb 14 04:49:54 rpmi: libX11-locales-3:1.6.7-alt1 sisyphus.214413.200 1539171080 installed <13>Feb 14 04:49:54 rpmi: libX11-3:1.6.7-alt1 sisyphus.214413.200 1539171080 installed <13>Feb 14 04:49:54 rpmi: libX11-devel-3:1.6.7-alt1 sisyphus.214413.200 1539171080 installed <13>Feb 14 04:49:54 rpmi: libXext-1.3.3-alt1 1409902932 installed <13>Feb 14 04:49:54 rpmi: libXrender-0.9.8-alt1 1371312110 installed <13>Feb 14 04:49:54 rpmi: libXrender-devel-0.9.8-alt1 1371312110 installed <13>Feb 14 04:49:54 rpmi: libXext-devel-1.3.3-alt1 1409902932 installed <13>Feb 14 04:49:54 rpmi: libXfixes-5.0.3-alt1 sisyphus.216396.300 1542022144 installed <13>Feb 14 04:49:54 rpmi: libXfixes-devel-5.0.3-alt1 sisyphus.216396.300 1542022144 installed <13>Feb 14 04:49:54 rpmi: libXxf86vm-1.1.4-alt2 1527672159 installed <13>Feb 14 04:49:54 rpmi: libXdamage-1.1.3-alt4 1297162596 installed <13>Feb 14 04:49:54 rpmi: libXt-1.1.4-alt1 1369984716 installed <13>Feb 14 04:49:54 rpmi: libXpm-3.5.11-alt1 1391072398 installed <13>Feb 14 04:49:54 rpmi: libXcursor-1.1.15-alt1.S1 1512373363 installed <13>Feb 14 04:49:54 rpmi: libXft-2.3.2-alt1 1409902650 installed <13>Feb 14 04:49:54 rpmi: libXrandr-1.5.0-alt1 1431936188 installed <13>Feb 14 04:49:54 rpmi: libXScrnSaver-1.2.2-alt1 1331212357 installed <13>Feb 14 04:49:54 rpmi: libXi-1.7.9-alt1.S1 1515755338 installed <13>Feb 14 04:49:54 rpmi: libXi-devel-1.7.9-alt1.S1 1515755338 installed <13>Feb 14 04:49:54 rpmi: libXinerama-1.1.3-alt2 1527671624 installed <13>Feb 14 04:49:54 rpmi: libXtst-1.2.2-alt1 1369984880 installed <13>Feb 14 04:49:54 rpmi: libXv-1.0.11-alt1 1527685497 installed <13>Feb 14 04:49:54 rpmi: libXxf86misc-1.0.3-alt1.qa1 1365952031 installed <13>Feb 14 04:49:54 rpmi: libXcomposite-0.4.3-alt3 1297306939 installed <13>Feb 14 04:49:54 rpmi: libwayland-client-1.16.0-alt1 1535614868 installed <13>Feb 14 04:49:54 rpmi: libpciaccess-1:0.14-alt1 1528969624 installed <13>Feb 14 04:49:54 rpmi: libdrm-1:2.4.97-alt1 sisyphus+220483.100.1.1 1549270237 installed <13>Feb 14 04:49:54 rpmi: libGLX-mesa-4:18.3.3-alt1 sisyphus+220483.200.1.1 1549272358 installed <13>Feb 14 04:49:54 rpmi: libGLX-7:1.1.0-alt3 sisyphus.215982.100 1541498630 installed <13>Feb 14 04:49:54 rpmi: libGL-7:1.1.0-alt3 sisyphus.215982.100 1541498630 installed <13>Feb 14 04:49:54 rpmi: libGLU-4:9.0.0-alt1 1347643776 installed <13>Feb 14 04:49:54 rpmi: libgbm-4:18.3.3-alt1 sisyphus+220483.200.1.1 1549272358 installed <13>Feb 14 04:49:54 rpmi: libEGL-mesa-4:18.3.3-alt1 sisyphus+220483.200.1.1 1549272358 installed <13>Feb 14 04:49:54 rpmi: libEGL-7:1.1.0-alt3 sisyphus.215982.100 1541498630 installed <13>Feb 14 04:49:54 rpmi: libglvnd-devel-7:1.1.0-alt3 sisyphus.215982.100 1541498630 installed <13>Feb 14 04:49:54 rpmi: libEGL-devel-4:18.3.3-alt1 sisyphus+220483.200.1.1 1549272358 installed <13>Feb 14 04:49:54 rpmi: libGL-devel-4:18.3.3-alt1 sisyphus+220483.200.1.1 1549272358 installed <13>Feb 14 04:49:54 rpmi: libcairo-1:1.16.0-alt1 sisyphus.215566.100 1540457760 installed <13>Feb 14 04:49:54 rpmi: gcc-c++-common-1.4.23-alt1 sisyphus.218115.200 1545282875 installed <13>Feb 14 04:49:54 rpmi: libstdc++8-devel-8.2.1-alt5 sisyphus+219286.200.2.1 1549853842 installed <13>Feb 14 04:49:55 rpmi: gcc8-c++-8.2.1-alt5 sisyphus+219286.200.2.1 1549853842 installed <13>Feb 14 04:49:55 rpmi: libgdbm-1.8.3-alt10 1454943313 installed <13>Feb 14 04:49:55 rpmi: xml-utils-1:2.9.4.0.12.e905-alt1.1 1525115736 installed <13>Feb 14 04:49:55 rpmi: rpm-build-gir-0.7.2-alt4 1534675014 installed <13>Feb 14 04:49:55 rpmi: rpm-macros-cmake-3.13.4-alt1 sisyphus+220827.100.1.2 1549497610 installed <13>Feb 14 04:49:55 rpmi: cmake-modules-3.13.4-alt1 sisyphus+220827.100.1.2 1549497610 installed <13>Feb 14 04:49:55 rpmi: libuv-1.23.2-alt1 sisyphus.217108.100 1543612227 installed <13>Feb 14 04:49:55 rpmi: librhash-1.3.5-alt2 1505156277 installed <13>Feb 14 04:49:55 rpmi: libjsoncpp19-1.8.4-alt2.S1 1518769512 installed <13>Feb 14 04:49:55 rpmi: publicsuffix-list-dafsa-20181106-alt1 sisyphus.216228.100 1541611754 installed <13>Feb 14 04:49:55 rpmi: libpsl-0.20.2-alt2 sisyphus.216228.200 1541611883 installed <13>Feb 14 04:49:55 rpmi: libnghttp2-1.34.0-alt1 sisyphus.214524.100 1539249616 installed <13>Feb 14 04:49:55 rpmi: libverto-0.3.0-alt1_5 1525957716 installed <13>Feb 14 04:49:55 rpmi: libkeyutils-1.6-alt2 sisyphus.217337.100 1544003165 installed <13>Feb 14 04:49:55 rpmi: libcom_err-1.44.5-alt1 sisyphus.218838.100 1546206092 installed <13>Feb 14 04:49:55 rpmi: libbrotlicommon-1.0.7-alt1 sisyphus.215491.100 1540428591 installed <13>Feb 14 04:49:55 rpmi: libbrotlidec-1.0.7-alt1 sisyphus.215491.100 1540428591 installed <13>Feb 14 04:49:55 rpmi: libnettle6-3.4.1-alt1 sisyphus.217427.100 1544107881 installed <13>Feb 14 04:49:55 rpmi: libarchive13-3.3.1-alt2 sisyphus.219343.100 1547461968 installed <13>Feb 14 04:49:55 rpmi: libtasn1-4.13-alt2 1521133848 installed <13>Feb 14 04:49:55 rpmi: libp11-kit-0.23.9-alt5 1525798241 installed <13>Feb 14 04:49:55 rpmi: rpm-macros-alternatives-0.5.0-alt1 sisyphus.219012.300 1546745004 installed <13>Feb 14 04:49:55 rpmi: alternatives-0.5.0-alt1 sisyphus.219012.300 1546745004 installed <13>Feb 14 04:49:55 rpmi: ca-certificates-2019.02.01-alt1 sisyphus+220384.200.1.1 1549032756 installed <13>Feb 14 04:49:55 rpmi: ca-trust-0.1.1-alt2 1515595785 installed <13>Feb 14 04:49:55 rpmi: p11-kit-trust-0.23.9-alt5 1525798241 installed <13>Feb 14 04:49:55 rpmi: libcrypto1.1-1.1.0j-alt1 sisyphus.216647.100 1542743840 installed <13>Feb 14 04:49:55 rpmi: libssl1.1-1.1.0j-alt1 sisyphus.216647.100 1542743840 installed <13>Feb 14 04:49:56 rpmi: libpython3-3.6.8-alt1 sisyphus+220164.200.3.1 1548842470 installed <13>Feb 14 04:49:56 rpmi: python3-3.6.8-alt1 sisyphus+220164.200.3.1 1548842470 installed <13>Feb 14 04:49:56 rpmi: python3-base-3.6.8-alt1 sisyphus+220164.200.3.1 1548842470 installed <86>Feb 14 04:49:56 groupadd[16157]: group added to /etc/group: name=_keytab, GID=499 <86>Feb 14 04:49:56 groupadd[16157]: group added to /etc/gshadow: name=_keytab <86>Feb 14 04:49:56 groupadd[16157]: new group: name=_keytab, GID=499 <13>Feb 14 04:49:56 rpmi: libkrb5-1.16.3-alt1 sisyphus.219042.100 1547045738 installed <86>Feb 14 04:49:56 groupadd[16479]: group added to /etc/group: name=sasl, GID=498 <86>Feb 14 04:49:56 groupadd[16479]: group added to /etc/gshadow: name=sasl <86>Feb 14 04:49:56 groupadd[16479]: new group: name=sasl, GID=498 <13>Feb 14 04:49:56 rpmi: libsasl2-3-2.1.27-alt1 sisyphus.218476.200 1545647744 installed <13>Feb 14 04:49:56 rpmi: libldap-2.4.46-alt1.1 sisyphus+219907.4400.1.1 1548349656 installed <13>Feb 14 04:49:56 rpmi: libcurl-7.64.0-alt1 sisyphus+220787.100.1.1 1549439378 installed <13>Feb 14 04:49:56 rpmi: glib2-devel-2.58.3-alt1 sisyphus+219722.100.1.1 1548088735 installed <13>Feb 14 04:49:56 rpmi: libharfbuzz-devel-2.2.0-alt1 sisyphus.218134.500 1545261457 installed <13>Feb 14 04:49:56 rpmi: libfreetype-devel-2.9.1-alt1.S1 1530781049 installed <13>Feb 14 04:49:56 rpmi: fontconfig-devel-2.13.1-alt1 sisyphus.215917.100 1540973883 installed <13>Feb 14 04:49:56 rpmi: libXft-devel-2.3.2-alt1 1409902650 installed <13>Feb 14 04:49:56 rpmi: libcairo-devel-1:1.16.0-alt1 sisyphus.215566.100 1540457760 installed <13>Feb 14 04:49:57 rpmi: cmake-3.13.4-alt1 sisyphus+220827.100.1.2 1549497610 installed <13>Feb 14 04:49:57 rpmi: gcc-c++-8-alt1 sisyphus.214000.40 1542664792 installed <13>Feb 14 04:49:57 rpmi: libGLU-devel-4:9.0.0-alt1 1347643776 installed <13>Feb 14 04:49:57 rpmi: libXcomposite-devel-0.4.3-alt3 1297306939 installed <13>Feb 14 04:49:57 rpmi: libXxf86misc-devel-1.0.3-alt1.qa1 1365952031 installed <13>Feb 14 04:49:57 rpmi: libXv-devel-1.0.11-alt1 1527685497 installed <13>Feb 14 04:49:57 rpmi: libXtst-devel-1.2.2-alt1 1369984880 installed <13>Feb 14 04:49:57 rpmi: libXinerama-devel-1.1.3-alt2 1527671624 installed <13>Feb 14 04:49:57 rpmi: libXScrnSaver-devel-1.2.2-alt1 1331212357 installed <13>Feb 14 04:49:57 rpmi: libXrandr-devel-1.5.0-alt1 1431936188 installed <13>Feb 14 04:49:57 rpmi: libXcursor-devel-1.1.15-alt1.S1 1512373363 installed <13>Feb 14 04:49:57 rpmi: libXpm-devel-3.5.11-alt1 1391072398 installed <13>Feb 14 04:49:57 rpmi: libXt-devel-1.1.4-alt1 1369984716 installed <13>Feb 14 04:49:57 rpmi: libXdamage-devel-1.1.3-alt4 1297162596 installed <13>Feb 14 04:49:57 rpmi: libXxf86vm-devel-1.1.4-alt2 1527672159 installed <13>Feb 14 04:49:57 rpmi: xprop-1.2.3-alt1 sisyphus.213300.100 1537401931 installed <13>Feb 14 04:49:57 rpmi: libalsa-devel-1:1.1.8-alt1 sisyphus+219888.100.4.1 1548752822 installed <13>Feb 14 04:49:57 rpmi: libjpeg-devel-2:1.5.1-alt1 1498218302 installed <13>Feb 14 04:49:57 rpmi: libXdmcp-devel-1.1.1-alt1 1334617699 installed <13>Feb 14 04:49:57 rpmi: libpixman-devel-3:0.38.0-alt1 sisyphus+221327.100.1.1 1549959656 installed <13>Feb 14 04:49:57 rpmi: libexpat-devel-2.2.4-alt1 1503305341 installed <13>Feb 14 04:49:57 rpmi: groff-base-1.22.3-alt2 1502488668 installed Building target platforms: x86_64 Building for target x86_64 Wrote: /usr/src/in/nosrpm/libfltk13-1.3.3-alt2.nosrc.rpm Installing libfltk13-1.3.3-alt2.src.rpm Building target platforms: x86_64 Building for target x86_64 Executing(%prep): /bin/sh -e /usr/src/tmp/rpm-tmp.91376 + umask 022 + /bin/mkdir -p /usr/src/RPM/BUILD + cd /usr/src/RPM/BUILD + cd /usr/src/RPM/BUILD + rm -rf libfltk13-1.3.3 + echo 'Source #0 (libfltk13-1.3.3.tar):' Source #0 (libfltk13-1.3.3.tar): + /bin/tar -xf /usr/src/RPM/SOURCES/libfltk13-1.3.3.tar + cd libfltk13-1.3.3 + /bin/chmod -c -Rf u+rwX,go-w . + tar xf /usr/src/RPM/SOURCES/fltk-1.3.3-docs-html.tar.gz + echo 'Patch #1 (fltk-1.3-L3156.patch):' Patch #1 (fltk-1.3-L3156.patch): + /usr/bin/patch -p0 patching file src/fl_font.cxx patching file src/gl_draw.cxx Hunk #1 succeeded at 84 (offset 3 lines). patching file FL/x.H + echo 'Patch #2 (fltk-1.3.2-fltk_config.patch):' Patch #2 (fltk-1.3.2-fltk_config.patch): + /usr/bin/patch -p1 patching file fltk-config.cmake.in patching file fltk-config.in + perl -pi -e 's/\bcat([1-3])\b/man$1/g' documentation/Makefile + sed -r -e 's/FL_API_VERSION=.*/FL_API_VERSION=2/' -i configure configure.in + sed -r -e 's/(libfltk[^\.]*\.so)\.1\.3/\1.2/g' -i src/Makefile + exit 0 Executing(%build): /bin/sh -e /usr/src/tmp/rpm-tmp.91376 + umask 022 + /bin/mkdir -p /usr/src/RPM/BUILD + cd /usr/src/RPM/BUILD + cd libfltk13-1.3.3 + CFLAGS='-pipe -frecord-gcc-switches -Wall -g -O2' + export CFLAGS + CXXFLAGS='-pipe -frecord-gcc-switches -Wall -g -O2' + export CXXFLAGS + FFLAGS='-pipe -frecord-gcc-switches -Wall -g -O2' + export FFLAGS + '[' -n '' ']' ++ printf %s '-pipe -frecord-gcc-switches -Wall -g -O2' ++ sed -r 's/(^|[[:space:]]+)-[^m][^[:space:]]*//g' + ASFLAGS= + export ASFLAGS + export lt_cv_deplibs_check_method=pass_all + lt_cv_deplibs_check_method=pass_all + readlink -e -- ./configure + xargs -ri dirname -- '{}' + xargs -ri find '{}' -type f '(' -name config.sub -or -name config.guess ')' -printf '%h/\n' + sort -u + xargs -rn1 install -pm755 -- /usr/share/gnu-config/config.sub /usr/share/gnu-config/config.guess + ./configure --build=x86_64-alt-linux --host=x86_64-alt-linux --prefix=/usr --exec-prefix=/usr --bindir=/usr/bin --sbindir=/usr/sbin --sysconfdir=/etc --datadir=/usr/share --includedir=/usr/include --libdir=/usr/lib64 --libexecdir=/usr/lib --localstatedir=/var/lib --sharedstatedir=/var/lib --mandir=/usr/share/man --infodir=/usr/share/info --disable-dependency-tracking --without-included-gettext --disable-static --enable-shared --enable-largefile --enable-xdbe --enable-xinerama --enable-xft --enable-threads configure: WARNING: unrecognized options: --disable-dependency-tracking, --without-included-gettext, --disable-static checking build system type... x86_64-alt-linux-gnu checking host system type... x86_64-alt-linux-gnu checking for x86_64-alt-linux-gcc... x86_64-alt-linux-gcc checking whether the C compiler works... yes checking for C compiler default output file name... a.out checking for suffix of executables... checking whether we are cross compiling... no checking for suffix of object files... o checking whether we are using the GNU C compiler... yes checking whether x86_64-alt-linux-gcc accepts -g... yes checking for x86_64-alt-linux-gcc option to accept ISO C89... none needed checking for x86_64-alt-linux-g++... x86_64-alt-linux-g++ checking whether we are using the GNU C++ compiler... yes checking whether x86_64-alt-linux-g++ accepts -g... yes checking if the compiler supports -fvisibility... yes checking if the compiler supports -fvisibility-inlines-hidden... yes checking for a BSD-compatible install... /bin/install -c checking for nroff... /usr/bin/nroff checking for doxygen... no checking for x86_64-alt-linux-ranlib... no checking for ranlib... ranlib checking for x86_64-alt-linux-ar... no checking for ar... /usr/bin/ar checking for x86_64-alt-linux-windres... no checking for windres... no checking how to run the C preprocessor... x86_64-alt-linux-gcc -E checking for grep that handles long lines and -e... /bin/grep checking for egrep... /bin/grep -E checking for ANSI C header files... yes checking for sys/types.h... yes checking for sys/stat.h... yes checking for stdlib.h... yes checking for string.h... yes checking for memory.h... yes checking for strings.h... yes checking for inttypes.h... yes checking for stdint.h... yes checking for unistd.h... yes checking size of short... 2 checking size of int... 4 checking size of long... 8 checking whether byte ordering is bigendian... no checking whether the compiler recognizes bool as a built-in type... yes checking for dirent.h that defines DIR... yes checking for library containing opendir... none required checking sys/select.h usability... yes checking sys/select.h presence... yes checking for sys/select.h... yes checking sys/stdtypes.h usability... no checking sys/stdtypes.h presence... no checking for sys/stdtypes.h... no checking whether we have the POSIX compatible scandir() prototype... no checking for scandir... yes checking for vsnprintf... yes checking for snprintf... yes checking for strings.h... (cached) yes checking for strcasecmp... yes checking for strlcat... yes checking for strlcpy... yes checking locale.h usability... yes checking locale.h presence... yes checking for locale.h... yes checking for localeconv... yes checking for library containing pow... -lm checking for special C compiler options needed for large files... no checking for _FILE_OFFSET_BITS value needed for large files... no checking for long long int... yes checking for library containing dlsym... -ldl checking dlfcn.h usability... yes checking dlfcn.h presence... yes checking for dlfcn.h... yes checking alsa/asoundlib.h usability... yes checking alsa/asoundlib.h presence... yes checking for alsa/asoundlib.h... yes checking for jpeg_CreateCompress in -ljpeg... yes checking jpeglib.h usability... yes checking jpeglib.h presence... yes checking for jpeglib.h... yes checking for gzgets in -lz... yes checking zlib.h usability... yes checking zlib.h presence... yes checking for zlib.h... yes checking for png_read_info in -lpng... yes checking png.h usability... yes checking png.h presence... yes checking for png.h... yes checking libpng/png.h usability... no checking libpng/png.h presence... no checking for libpng/png.h... no checking for png_get_valid in -lpng... yes checking for png_set_tRNS_to_alpha in -lpng... yes checking pthread.h usability... yes checking pthread.h presence... yes checking for pthread.h... yes checking for pthread_create using -lpthreads... no checking for pthread_create using -lpthread... yes checking for X... libraries , headers checking for gethostbyname... yes checking for connect... yes checking for remove... yes checking for shmat... yes checking for IceConnectionNumber in -lICE... yes configure: WARNING: Ignoring libraries " -lSM -lICE" requested by configure. checking for library containing dlopen... none required checking GL/gl.h usability... yes checking GL/gl.h presence... yes checking for GL/gl.h... yes checking for glXMakeCurrent in -lGL... yes checking for glXGetProcAddressARB in -lGL... yes checking GL/glu.h usability... yes checking GL/glu.h presence... yes checking for GL/glu.h... yes checking for XineramaIsActive in -lXinerama... yes checking for freetype-config... /usr/bin/freetype-config Package libpcre was not found in the pkg-config search path. Perhaps you should add the directory containing `libpcre.pc' to the PKG_CONFIG_PATH environment variable Package 'libpcre', required by 'glib-2.0', not found Package libpcre was not found in the pkg-config search path. Perhaps you should add the directory containing `libpcre.pc' to the PKG_CONFIG_PATH environment variable Package 'libpcre', required by 'glib-2.0', not found Package libpcre was not found in the pkg-config search path. Perhaps you should add the directory containing `libpcre.pc' to the PKG_CONFIG_PATH environment variable Package 'libpcre', required by 'glib-2.0', not found checking for FcPatternCreate in -lfontconfig... yes checking X11/Xft/Xft.h usability... yes checking X11/Xft/Xft.h presence... yes checking for X11/Xft/Xft.h... yes checking for XftDrawCreate in -lXft... yes checking for X11/extensions/Xdbe.h... yes checking for XdbeQueryExtension in -lXext... yes checking for X11/extensions/Xfixes.h... yes checking for XFixesQueryExtension in -lXfixes... yes checking for X11/Xcursor/Xcursor.h... yes checking for XcursorImageCreate in -lXcursor... yes checking for xprop... /usr/bin/xprop checking for X overlay visuals... no checking if GCC supports -fno-exceptions... yes checking if GCC supports -fno-strict-aliasing... yes checking if ld supports -Bsymbolic-functions... yes checking if toolchain supports sections... yes Configuration Summary ------------------------------------------------------------------------- Directories: prefix=/usr bindir=/usr/bin datadir=/usr/share datarootdir=${prefix}/share exec_prefix=/usr includedir=/usr/include libdir=/usr/lib64 mandir=/usr/share/man Graphics: X11+Xft+Xdbe+Xinerama Image Libraries: JPEG=System PNG=System ZLIB=System Large Files: YES OpenGL: YES Threads: YES configure: creating ./config.status config.status: creating makeinclude config.status: creating fltk.list config.status: creating fltk-config config.status: creating fltk.spec config.status: creating FL/Makefile config.status: creating config.h configure: WARNING: unrecognized options: --disable-dependency-tracking, --without-included-gettext, --disable-static + make -j8 === making src === make[1]: Entering directory '/usr/src/RPM/BUILD/libfltk13-1.3.3/src' make[1]: warning: -jN forced in submake: disabling jobserver mode. make[1]: Leaving directory '/usr/src/RPM/BUILD/libfltk13-1.3.3/src' make[1]: Entering directory '/usr/src/RPM/BUILD/libfltk13-1.3.3/src' Compiling Fl_Box.cxx... make[1]: Leaving directory '/usr/src/RPM/BUILD/libfltk13-1.3.3/src' make[1]: Entering directory '/usr/src/RPM/BUILD/libfltk13-1.3.3/src' Compiling Fl_Browser_load.cxx... make[1]: Leaving directory '/usr/src/RPM/BUILD/libfltk13-1.3.3/src' make[1]: Entering directory '/usr/src/RPM/BUILD/libfltk13-1.3.3/src' Compiling Fl_Button.cxx... make[1]: Leaving directory '/usr/src/RPM/BUILD/libfltk13-1.3.3/src' make[1]: Entering directory '/usr/src/RPM/BUILD/libfltk13-1.3.3/src' Compiling Fl_Check_Button.cxx... make[1]: Leaving directory '/usr/src/RPM/BUILD/libfltk13-1.3.3/src' make[1]: Entering directory '/usr/src/RPM/BUILD/libfltk13-1.3.3/src' Compiling Fl_Adjuster.cxx... make[1]: Leaving directory '/usr/src/RPM/BUILD/libfltk13-1.3.3/src' make[1]: Entering directory '/usr/src/RPM/BUILD/libfltk13-1.3.3/src' Compiling Fl_Bitmap.cxx... make[1]: Leaving directory '/usr/src/RPM/BUILD/libfltk13-1.3.3/src' make[1]: Entering directory '/usr/src/RPM/BUILD/libfltk13-1.3.3/src' Compiling Fl_Choice.cxx... make[1]: Leaving directory '/usr/src/RPM/BUILD/libfltk13-1.3.3/src' make[1]: Entering directory '/usr/src/RPM/BUILD/libfltk13-1.3.3/src' Compiling Fl_Check_Browser.cxx... make[1]: Leaving directory '/usr/src/RPM/BUILD/libfltk13-1.3.3/src' make[1]: Entering directory '/usr/src/RPM/BUILD/libfltk13-1.3.3/src' Compiling Fl.cxx... make[1]: Leaving directory '/usr/src/RPM/BUILD/libfltk13-1.3.3/src' make[1]: Entering directory '/usr/src/RPM/BUILD/libfltk13-1.3.3/src' Compiling Fl_Browser_.cxx... Fl_Browser_.cxx: In member function 'virtual int Fl_Browser_::handle(int)': Fl_Browser_.cxx:716:11: warning: this 'while' clause does not guard... [-Wmisleading-indentation] while ((l = item_next(l))) ^~~~~ Fl_Browser_.cxx:718:13: note: ...this statement, but the latter is misleadingly indented as if it were guarded by the 'while' return 1; ^~~~~~ make[1]: Leaving directory '/usr/src/RPM/BUILD/libfltk13-1.3.3/src' make[1]: Entering directory '/usr/src/RPM/BUILD/libfltk13-1.3.3/src' Compiling Fl_Chart.cxx... make[1]: Leaving directory '/usr/src/RPM/BUILD/libfltk13-1.3.3/src' make[1]: Entering directory '/usr/src/RPM/BUILD/libfltk13-1.3.3/src' Compiling Fl_Browser.cxx... make[1]: Leaving directory '/usr/src/RPM/BUILD/libfltk13-1.3.3/src' make[1]: Entering directory '/usr/src/RPM/BUILD/libfltk13-1.3.3/src' Compiling Fl_Clock.cxx... Fl_Clock.cxx: In function 'void drawhand(double, const float (*)[2], Fl_Color, Fl_Color)': Fl_Clock.cxx:44:3: warning: this 'for' clause does not guard... [-Wmisleading-indentation] for (i=0; i<4; i++) fl_vertex(v[i][0],v[i][1]); fl_end_loop(); ^~~ Fl_Clock.cxx:44:51: note: ...this statement, but the latter is misleadingly indented as if it were guarded by the 'for' for (i=0; i<4; i++) fl_vertex(v[i][0],v[i][1]); fl_end_loop(); ^~~~~~~~~~~ make[1]: Leaving directory '/usr/src/RPM/BUILD/libfltk13-1.3.3/src' make[1]: Entering directory '/usr/src/RPM/BUILD/libfltk13-1.3.3/src' Compiling Fl_Device.cxx... make[1]: Leaving directory '/usr/src/RPM/BUILD/libfltk13-1.3.3/src' make[1]: Entering directory '/usr/src/RPM/BUILD/libfltk13-1.3.3/src' Compiling Fl_Copy_Surface.cxx... make[1]: Leaving directory '/usr/src/RPM/BUILD/libfltk13-1.3.3/src' make[1]: Entering directory '/usr/src/RPM/BUILD/libfltk13-1.3.3/src' Compiling Fl_Counter.cxx... make[1]: Leaving directory '/usr/src/RPM/BUILD/libfltk13-1.3.3/src' make[1]: Entering directory '/usr/src/RPM/BUILD/libfltk13-1.3.3/src' Compiling Fl_Dial.cxx... make[1]: Leaving directory '/usr/src/RPM/BUILD/libfltk13-1.3.3/src' make[1]: Entering directory '/usr/src/RPM/BUILD/libfltk13-1.3.3/src' Compiling Fl_File_Browser.cxx... make[1]: Leaving directory '/usr/src/RPM/BUILD/libfltk13-1.3.3/src' make[1]: Entering directory '/usr/src/RPM/BUILD/libfltk13-1.3.3/src' Compiling Fl_Double_Window.cxx... make[1]: Leaving directory '/usr/src/RPM/BUILD/libfltk13-1.3.3/src' make[1]: Entering directory '/usr/src/RPM/BUILD/libfltk13-1.3.3/src' Compiling Fl_File_Icon.cxx... make[1]: Leaving directory '/usr/src/RPM/BUILD/libfltk13-1.3.3/src' make[1]: Entering directory '/usr/src/RPM/BUILD/libfltk13-1.3.3/src' Compiling Fl_File_Input.cxx... make[1]: Leaving directory '/usr/src/RPM/BUILD/libfltk13-1.3.3/src' make[1]: Entering directory '/usr/src/RPM/BUILD/libfltk13-1.3.3/src' Compiling Fl_Color_Chooser.cxx... make[1]: Leaving directory '/usr/src/RPM/BUILD/libfltk13-1.3.3/src' make[1]: Entering directory '/usr/src/RPM/BUILD/libfltk13-1.3.3/src' Compiling Fl_File_Chooser.cxx... make[1]: Leaving directory '/usr/src/RPM/BUILD/libfltk13-1.3.3/src' make[1]: Entering directory '/usr/src/RPM/BUILD/libfltk13-1.3.3/src' Compiling Fl_Image_Surface.cxx... make[1]: Leaving directory '/usr/src/RPM/BUILD/libfltk13-1.3.3/src' make[1]: Entering directory '/usr/src/RPM/BUILD/libfltk13-1.3.3/src' Compiling Fl_File_Chooser2.cxx... Fl_File_Chooser2.cxx: In member function 'const char* Fl_File_Chooser::value(int)': Fl_File_Chooser2.cxx:1500:41: warning: '__builtin___snprintf_chk' output may be truncated before the last format character [-Wformat-truncation=] snprintf(pathname, sizeof(pathname), "%s/%s", directory_, name); ^~~~~~~ In file included from /usr/include/stdio.h:862, from ../FL/fl_utf8.h:33, from ../FL/Fl.H:30, from ../FL/Fl_File_Chooser.H:30, from Fl_File_Chooser2.cxx:346: /usr/include/bits/stdio2.h:64:35: note: '__builtin___snprintf_chk' output 2 or more bytes (assuming 2049) into a destination of size 2048 return __builtin___snprintf_chk (__s, __n, __USE_FORTIFY_LEVEL - 1, ~~~~~~~~~~~~~~~~~~~~~~~~~^~~~~~~~~~~~~~~~~~~~~~~~~~~~~~~~~~~ __bos (__s), __fmt, __va_arg_pack ()); ~~~~~~~~~~~~~~~~~~~~~~~~~~~~~~~~~~~~~ Fl_File_Chooser2.cxx: In member function 'void Fl_File_Chooser::fileListCB()': Fl_File_Chooser2.cxx:713:42: warning: '__builtin___snprintf_chk' output may be truncated before the last format character [-Wformat-truncation=] snprintf(pathname, sizeof(pathname), "%s/%s", directory_, filename); ^~~~~~~ In file included from /usr/include/stdio.h:862, from ../FL/fl_utf8.h:33, from ../FL/Fl.H:30, from ../FL/Fl_File_Chooser.H:30, from Fl_File_Chooser2.cxx:346: /usr/include/bits/stdio2.h:64:35: note: '__builtin___snprintf_chk' output 2 or more bytes (assuming 2049) into a destination of size 2048 return __builtin___snprintf_chk (__s, __n, __USE_FORTIFY_LEVEL - 1, ~~~~~~~~~~~~~~~~~~~~~~~~~^~~~~~~~~~~~~~~~~~~~~~~~~~~~~~~~~~~ __bos (__s), __fmt, __va_arg_pack ()); ~~~~~~~~~~~~~~~~~~~~~~~~~~~~~~~~~~~~~ Fl_File_Chooser2.cxx: In member function 'void Fl_File_Chooser::newdir()': Fl_File_Chooser2.cxx:1072:42: warning: '__builtin___snprintf_chk' output may be truncated before the last format character [-Wformat-truncation=] snprintf(pathname, sizeof(pathname), "%s/%s", directory_, dir); ^~~~~~~ In file included from /usr/include/stdio.h:862, from ../FL/fl_utf8.h:33, from ../FL/Fl.H:30, from ../FL/Fl_File_Chooser.H:30, from Fl_File_Chooser2.cxx:346: /usr/include/bits/stdio2.h:64:35: note: '__builtin___snprintf_chk' output 2 or more bytes (assuming 2049) into a destination of size 2048 return __builtin___snprintf_chk (__s, __n, __USE_FORTIFY_LEVEL - 1, ~~~~~~~~~~~~~~~~~~~~~~~~~^~~~~~~~~~~~~~~~~~~~~~~~~~~~~~~~~~~ __bos (__s), __fmt, __va_arg_pack ()); ~~~~~~~~~~~~~~~~~~~~~~~~~~~~~~~~~~~~~ Fl_File_Chooser2.cxx: In member function 'void Fl_File_Chooser::fileNameCB()': Fl_File_Chooser2.cxx:902:39: warning: '__builtin___snprintf_chk' output may be truncated before the last format character [-Wformat-truncation=] snprintf(tempname, sizeof(tempname), "%s/%s", directory_, filename); ^~~~~~~ In file included from /usr/include/stdio.h:862, from ../FL/fl_utf8.h:33, from ../FL/Fl.H:30, from ../FL/Fl_File_Chooser.H:30, from Fl_File_Chooser2.cxx:346: /usr/include/bits/stdio2.h:64:35: note: '__builtin___snprintf_chk' output 2 or more bytes (assuming 2049) into a destination of size 2048 return __builtin___snprintf_chk (__s, __n, __USE_FORTIFY_LEVEL - 1, ~~~~~~~~~~~~~~~~~~~~~~~~~^~~~~~~~~~~~~~~~~~~~~~~~~~~~~~~~~~~ __bos (__s), __fmt, __va_arg_pack ()); ~~~~~~~~~~~~~~~~~~~~~~~~~~~~~~~~~~~~~ make[1]: Leaving directory '/usr/src/RPM/BUILD/libfltk13-1.3.3/src' make[1]: Entering directory '/usr/src/RPM/BUILD/libfltk13-1.3.3/src' Compiling Fl_Group.cxx... make[1]: Leaving directory '/usr/src/RPM/BUILD/libfltk13-1.3.3/src' make[1]: Entering directory '/usr/src/RPM/BUILD/libfltk13-1.3.3/src' Compiling Fl_Image.cxx... make[1]: Leaving directory '/usr/src/RPM/BUILD/libfltk13-1.3.3/src' make[1]: Entering directory '/usr/src/RPM/BUILD/libfltk13-1.3.3/src' Compiling Fl_Light_Button.cxx... make[1]: Leaving directory '/usr/src/RPM/BUILD/libfltk13-1.3.3/src' make[1]: Entering directory '/usr/src/RPM/BUILD/libfltk13-1.3.3/src' Compiling Fl_Input.cxx... make[1]: Leaving directory '/usr/src/RPM/BUILD/libfltk13-1.3.3/src' make[1]: Entering directory '/usr/src/RPM/BUILD/libfltk13-1.3.3/src' Compiling Fl_Menu_Button.cxx... make[1]: Leaving directory '/usr/src/RPM/BUILD/libfltk13-1.3.3/src' make[1]: Entering directory '/usr/src/RPM/BUILD/libfltk13-1.3.3/src' Compiling Fl_Menu_.cxx... make[1]: Leaving directory '/usr/src/RPM/BUILD/libfltk13-1.3.3/src' make[1]: Entering directory '/usr/src/RPM/BUILD/libfltk13-1.3.3/src' Compiling Fl_Menu_Bar.cxx... make[1]: Leaving directory '/usr/src/RPM/BUILD/libfltk13-1.3.3/src' make[1]: Entering directory '/usr/src/RPM/BUILD/libfltk13-1.3.3/src' Compiling Fl_Menu_Window.cxx... make[1]: Leaving directory '/usr/src/RPM/BUILD/libfltk13-1.3.3/src' make[1]: Entering directory '/usr/src/RPM/BUILD/libfltk13-1.3.3/src' Compiling Fl_Menu_add.cxx... make[1]: Leaving directory '/usr/src/RPM/BUILD/libfltk13-1.3.3/src' make[1]: Entering directory '/usr/src/RPM/BUILD/libfltk13-1.3.3/src' Compiling Fl_Menu_global.cxx... make[1]: Leaving directory '/usr/src/RPM/BUILD/libfltk13-1.3.3/src' make[1]: Entering directory '/usr/src/RPM/BUILD/libfltk13-1.3.3/src' Compiling Fl_Multi_Label.cxx... make[1]: Leaving directory '/usr/src/RPM/BUILD/libfltk13-1.3.3/src' make[1]: Entering directory '/usr/src/RPM/BUILD/libfltk13-1.3.3/src' Compiling Fl_Overlay_Window.cxx... make[1]: Leaving directory '/usr/src/RPM/BUILD/libfltk13-1.3.3/src' make[1]: Entering directory '/usr/src/RPM/BUILD/libfltk13-1.3.3/src' Compiling Fl_Menu.cxx... make[1]: Leaving directory '/usr/src/RPM/BUILD/libfltk13-1.3.3/src' make[1]: Entering directory '/usr/src/RPM/BUILD/libfltk13-1.3.3/src' Compiling Fl_Pack.cxx... make[1]: Leaving directory '/usr/src/RPM/BUILD/libfltk13-1.3.3/src' make[1]: Entering directory '/usr/src/RPM/BUILD/libfltk13-1.3.3/src' Compiling Fl_Input_.cxx... make[1]: Leaving directory '/usr/src/RPM/BUILD/libfltk13-1.3.3/src' make[1]: Entering directory '/usr/src/RPM/BUILD/libfltk13-1.3.3/src' Compiling Fl_Paged_Device.cxx... make[1]: Leaving directory '/usr/src/RPM/BUILD/libfltk13-1.3.3/src' make[1]: Entering directory '/usr/src/RPM/BUILD/libfltk13-1.3.3/src' Compiling Fl_Positioner.cxx... make[1]: Leaving directory '/usr/src/RPM/BUILD/libfltk13-1.3.3/src' make[1]: Entering directory '/usr/src/RPM/BUILD/libfltk13-1.3.3/src' Compiling Fl_Printer.cxx... make[1]: Leaving directory '/usr/src/RPM/BUILD/libfltk13-1.3.3/src' make[1]: Entering directory '/usr/src/RPM/BUILD/libfltk13-1.3.3/src' Compiling Fl_Progress.cxx... make[1]: Leaving directory '/usr/src/RPM/BUILD/libfltk13-1.3.3/src' make[1]: Entering directory '/usr/src/RPM/BUILD/libfltk13-1.3.3/src' Compiling Fl_Native_File_Chooser.cxx... make[1]: Leaving directory '/usr/src/RPM/BUILD/libfltk13-1.3.3/src' make[1]: Entering directory '/usr/src/RPM/BUILD/libfltk13-1.3.3/src' Compiling Fl_Pixmap.cxx... make[1]: Leaving directory '/usr/src/RPM/BUILD/libfltk13-1.3.3/src' make[1]: Entering directory '/usr/src/RPM/BUILD/libfltk13-1.3.3/src' Compiling Fl_Repeat_Button.cxx... make[1]: Leaving directory '/usr/src/RPM/BUILD/libfltk13-1.3.3/src' make[1]: Entering directory '/usr/src/RPM/BUILD/libfltk13-1.3.3/src' Compiling Fl_Round_Button.cxx... make[1]: Leaving directory '/usr/src/RPM/BUILD/libfltk13-1.3.3/src' make[1]: Entering directory '/usr/src/RPM/BUILD/libfltk13-1.3.3/src' Compiling Fl_Return_Button.cxx... make[1]: Leaving directory '/usr/src/RPM/BUILD/libfltk13-1.3.3/src' make[1]: Entering directory '/usr/src/RPM/BUILD/libfltk13-1.3.3/src' Compiling Fl_Single_Window.cxx... make[1]: Leaving directory '/usr/src/RPM/BUILD/libfltk13-1.3.3/src' make[1]: Entering directory '/usr/src/RPM/BUILD/libfltk13-1.3.3/src' Compiling Fl_Roller.cxx... make[1]: Leaving directory '/usr/src/RPM/BUILD/libfltk13-1.3.3/src' make[1]: Entering directory '/usr/src/RPM/BUILD/libfltk13-1.3.3/src' Compiling Fl_Shared_Image.cxx... make[1]: Leaving directory '/usr/src/RPM/BUILD/libfltk13-1.3.3/src' make[1]: Entering directory '/usr/src/RPM/BUILD/libfltk13-1.3.3/src' Compiling Fl_Scroll.cxx... make[1]: Leaving directory '/usr/src/RPM/BUILD/libfltk13-1.3.3/src' make[1]: Entering directory '/usr/src/RPM/BUILD/libfltk13-1.3.3/src' Compiling Fl_Scrollbar.cxx... make[1]: Leaving directory '/usr/src/RPM/BUILD/libfltk13-1.3.3/src' make[1]: Entering directory '/usr/src/RPM/BUILD/libfltk13-1.3.3/src' Compiling Fl_Preferences.cxx... make[1]: Leaving directory '/usr/src/RPM/BUILD/libfltk13-1.3.3/src' make[1]: Entering directory '/usr/src/RPM/BUILD/libfltk13-1.3.3/src' Compiling Fl_Help_View.cxx... Fl_Help_View.cxx: In member function 'Fl_Shared_Image* Fl_Help_View::get_image(const char*, int, int)': Fl_Help_View.cxx:2625:36: warning: '%s' directive output may be truncated writing up to 2047 bytes into a region of size 2043 [-Wformat-truncation=] snprintf(temp, sizeof(temp), "file:%s/%s", dir, name); ^~~~~~~~~~~~ ~~~ In file included from /usr/include/stdio.h:862, from ../FL/Fl_Help_View.H:30, from Fl_Help_View.cxx:49: /usr/include/bits/stdio2.h:64:35: note: '__builtin___snprintf_chk' output 7 or more bytes (assuming 2054) into a destination of size 2048 return __builtin___snprintf_chk (__s, __n, __USE_FORTIFY_LEVEL - 1, ~~~~~~~~~~~~~~~~~~~~~~~~~^~~~~~~~~~~~~~~~~~~~~~~~~~~~~~~~~~~ __bos (__s), __fmt, __va_arg_pack ()); ~~~~~~~~~~~~~~~~~~~~~~~~~~~~~~~~~~~~~ Fl_Help_View.cxx:2622:53: warning: '__builtin___snprintf_chk' output may be truncated before the last format character [-Wformat-truncation=] if (directory_[0]) snprintf(temp, sizeof(temp), "%s/%s", directory_, name); ^~~~~~~ In file included from /usr/include/stdio.h:862, from ../FL/Fl_Help_View.H:30, from Fl_Help_View.cxx:49: /usr/include/bits/stdio2.h:64:35: note: '__builtin___snprintf_chk' output 2 or more bytes (assuming 2049) into a destination of size 2048 return __builtin___snprintf_chk (__s, __n, __USE_FORTIFY_LEVEL - 1, ~~~~~~~~~~~~~~~~~~~~~~~~~^~~~~~~~~~~~~~~~~~~~~~~~~~~~~~~~~~~ __bos (__s), __fmt, __va_arg_pack ()); ~~~~~~~~~~~~~~~~~~~~~~~~~~~~~~~~~~~~~ Fl_Help_View.cxx:2616:36: warning: '__builtin___snprintf_chk' output may be truncated before the last format character [-Wformat-truncation=] snprintf(temp, sizeof(temp), "%s/%s", directory_, name); ^~~~~~~ In file included from /usr/include/stdio.h:862, from ../FL/Fl_Help_View.H:30, from Fl_Help_View.cxx:49: /usr/include/bits/stdio2.h:64:35: note: '__builtin___snprintf_chk' output 2 or more bytes (assuming 2049) into a destination of size 2048 return __builtin___snprintf_chk (__s, __n, __USE_FORTIFY_LEVEL - 1, ~~~~~~~~~~~~~~~~~~~~~~~~~^~~~~~~~~~~~~~~~~~~~~~~~~~~~~~~~~~~ __bos (__s), __fmt, __va_arg_pack ()); ~~~~~~~~~~~~~~~~~~~~~~~~~~~~~~~~~~~~~ Fl_Help_View.cxx: In member function 'int Fl_Help_View::load(const char*)': Fl_Help_View.cxx:3147:9: warning: '%s' directive output may be truncated writing up to 2047 bytes into a region of size 931 [-Wformat-truncation=] "Error" ^~~~~~~~~~~~~~~~~~~~~~~~~~~~~~~~~~~~~~~~~ "

Error

" ~~~~~~~~~~~~~~~~~~~~~~ "

Unable to follow the link \"%s\" - " ~~~~~~~~~~~~~~~~~~~~~~~~~~~~~~~~~~~~~~~~ "%s.

", ~~~~~~~~~~~~~~~~ f, urimsg); ~~~~~~ In file included from /usr/include/stdio.h:862, from ../FL/Fl_Help_View.H:30, from Fl_Help_View.cxx:49: /usr/include/bits/stdio2.h:64:35: note: '__builtin___snprintf_chk' output 106 or more bytes (assuming 2153) into a destination of size 1024 return __builtin___snprintf_chk (__s, __n, __USE_FORTIFY_LEVEL - 1, ~~~~~~~~~~~~~~~~~~~~~~~~~^~~~~~~~~~~~~~~~~~~~~~~~~~~~~~~~~~~ __bos (__s), __fmt, __va_arg_pack ()); ~~~~~~~~~~~~~~~~~~~~~~~~~~~~~~~~~~~~~ Fl_Help_View.cxx: In member function 'void Fl_Help_View::follow_link(Fl_Help_Link*)': Fl_Help_View.cxx:2723:31: warning: '%s' directive output may be truncated writing up to 2047 bytes into a region of size 2043 [-Wformat-truncation=] snprintf(temp, sizeof(temp), "file:%s/%s", dir, linkp->filename); ^~~~~~~~~~~~ ~~~ In file included from /usr/include/stdio.h:862, from ../FL/Fl_Help_View.H:30, from Fl_Help_View.cxx:49: /usr/include/bits/stdio2.h:64:35: note: '__builtin___snprintf_chk' output between 7 and 2245 bytes into a destination of size 2048 return __builtin___snprintf_chk (__s, __n, __USE_FORTIFY_LEVEL - 1, ~~~~~~~~~~~~~~~~~~~~~~~~~^~~~~~~~~~~~~~~~~~~~~~~~~~~~~~~~~~~ __bos (__s), __fmt, __va_arg_pack ()); ~~~~~~~~~~~~~~~~~~~~~~~~~~~~~~~~~~~~~ Fl_Help_View.cxx:2719:31: warning: '%s' directive output may be truncated writing up to 191 bytes into a region of size between 0 and 2047 [-Wformat-truncation=] snprintf(temp, sizeof(temp), "%s/%s", directory_, linkp->filename); ^~~~~~~ In file included from /usr/include/stdio.h:862, from ../FL/Fl_Help_View.H:30, from Fl_Help_View.cxx:49: /usr/include/bits/stdio2.h:64:35: note: '__builtin___snprintf_chk' output between 2 and 2240 bytes into a destination of size 2048 return __builtin___snprintf_chk (__s, __n, __USE_FORTIFY_LEVEL - 1, ~~~~~~~~~~~~~~~~~~~~~~~~~^~~~~~~~~~~~~~~~~~~~~~~~~~~~~~~~~~~ __bos (__s), __fmt, __va_arg_pack ()); ~~~~~~~~~~~~~~~~~~~~~~~~~~~~~~~~~~~~~ Fl_Help_View.cxx:2714:31: warning: '%s' directive output may be truncated writing up to 191 bytes into a region of size between 0 and 2047 [-Wformat-truncation=] snprintf(temp, sizeof(temp), "%s/%s", directory_, linkp->filename); ^~~~~~~ In file included from /usr/include/stdio.h:862, from ../FL/Fl_Help_View.H:30, from Fl_Help_View.cxx:49: /usr/include/bits/stdio2.h:64:35: note: '__builtin___snprintf_chk' output between 2 and 2240 bytes into a destination of size 2048 return __builtin___snprintf_chk (__s, __n, __USE_FORTIFY_LEVEL - 1, ~~~~~~~~~~~~~~~~~~~~~~~~~^~~~~~~~~~~~~~~~~~~~~~~~~~~~~~~~~~~ __bos (__s), __fmt, __va_arg_pack ()); ~~~~~~~~~~~~~~~~~~~~~~~~~~~~~~~~~~~~~ make[1]: Leaving directory '/usr/src/RPM/BUILD/libfltk13-1.3.3/src' make[1]: Entering directory '/usr/src/RPM/BUILD/libfltk13-1.3.3/src' Compiling Fl_Slider.cxx... make[1]: Leaving directory '/usr/src/RPM/BUILD/libfltk13-1.3.3/src' make[1]: Entering directory '/usr/src/RPM/BUILD/libfltk13-1.3.3/src' Compiling Fl_PostScript.cxx... make[1]: Leaving directory '/usr/src/RPM/BUILD/libfltk13-1.3.3/src' make[1]: Entering directory '/usr/src/RPM/BUILD/libfltk13-1.3.3/src' Compiling Fl_Table_Row.cxx... make[1]: Leaving directory '/usr/src/RPM/BUILD/libfltk13-1.3.3/src' make[1]: Entering directory '/usr/src/RPM/BUILD/libfltk13-1.3.3/src' Compiling Fl_Tabs.cxx... make[1]: Leaving directory '/usr/src/RPM/BUILD/libfltk13-1.3.3/src' make[1]: Entering directory '/usr/src/RPM/BUILD/libfltk13-1.3.3/src' Compiling Fl_Tile.cxx... make[1]: Leaving directory '/usr/src/RPM/BUILD/libfltk13-1.3.3/src' make[1]: Entering directory '/usr/src/RPM/BUILD/libfltk13-1.3.3/src' Compiling Fl_Table.cxx... Fl_Table.cxx: In member function 'void Fl_Table::recalc_dimensions()': Fl_Table.cxx:494:10: warning: suggest parentheses around operand of '!' or change '&' to '&&' or '!' to '~' [-Wparentheses] if ( !hideh & hidev ) { hidev = (( table_h - tih + scrollsize ) <= 0 ); } ^~~~~~ Fl_Table.cxx:495:10: warning: suggest parentheses around operand of '!' or change '&' to '&&' or '!' to '~' [-Wparentheses] if ( !hidev & hideh ) { hideh = (( table_w - tiw + scrollsize ) <= 0 ); } ^~~~~~ make[1]: Leaving directory '/usr/src/RPM/BUILD/libfltk13-1.3.3/src' make[1]: Entering directory '/usr/src/RPM/BUILD/libfltk13-1.3.3/src' Compiling Fl_Tiled_Image.cxx... make[1]: Leaving directory '/usr/src/RPM/BUILD/libfltk13-1.3.3/src' make[1]: Entering directory '/usr/src/RPM/BUILD/libfltk13-1.3.3/src' Compiling Fl_Text_Editor.cxx... make[1]: Leaving directory '/usr/src/RPM/BUILD/libfltk13-1.3.3/src' make[1]: Entering directory '/usr/src/RPM/BUILD/libfltk13-1.3.3/src' Compiling Fl_Tree_Prefs.cxx... make[1]: Leaving directory '/usr/src/RPM/BUILD/libfltk13-1.3.3/src' make[1]: Entering directory '/usr/src/RPM/BUILD/libfltk13-1.3.3/src' Compiling Fl_Tree_Item_Array.cxx... make[1]: Leaving directory '/usr/src/RPM/BUILD/libfltk13-1.3.3/src' make[1]: Entering directory '/usr/src/RPM/BUILD/libfltk13-1.3.3/src' Compiling Fl_Text_Buffer.cxx... make[1]: Leaving directory '/usr/src/RPM/BUILD/libfltk13-1.3.3/src' make[1]: Entering directory '/usr/src/RPM/BUILD/libfltk13-1.3.3/src' Compiling Fl_Valuator.cxx... make[1]: Leaving directory '/usr/src/RPM/BUILD/libfltk13-1.3.3/src' make[1]: Entering directory '/usr/src/RPM/BUILD/libfltk13-1.3.3/src' Compiling Fl_Value_Input.cxx... make[1]: Leaving directory '/usr/src/RPM/BUILD/libfltk13-1.3.3/src' make[1]: Entering directory '/usr/src/RPM/BUILD/libfltk13-1.3.3/src' Compiling Fl_Tooltip.cxx... make[1]: Leaving directory '/usr/src/RPM/BUILD/libfltk13-1.3.3/src' make[1]: Entering directory '/usr/src/RPM/BUILD/libfltk13-1.3.3/src' Compiling Fl_Value_Output.cxx... make[1]: Leaving directory '/usr/src/RPM/BUILD/libfltk13-1.3.3/src' make[1]: Entering directory '/usr/src/RPM/BUILD/libfltk13-1.3.3/src' Compiling Fl_Value_Slider.cxx... make[1]: Leaving directory '/usr/src/RPM/BUILD/libfltk13-1.3.3/src' make[1]: Entering directory '/usr/src/RPM/BUILD/libfltk13-1.3.3/src' Compiling Fl_Window_fullscreen.cxx... make[1]: Leaving directory '/usr/src/RPM/BUILD/libfltk13-1.3.3/src' make[1]: Entering directory '/usr/src/RPM/BUILD/libfltk13-1.3.3/src' Compiling Fl_Window.cxx... make[1]: Leaving directory '/usr/src/RPM/BUILD/libfltk13-1.3.3/src' make[1]: Entering directory '/usr/src/RPM/BUILD/libfltk13-1.3.3/src' Compiling Fl_Window_hotspot.cxx... make[1]: Leaving directory '/usr/src/RPM/BUILD/libfltk13-1.3.3/src' make[1]: Entering directory '/usr/src/RPM/BUILD/libfltk13-1.3.3/src' Compiling Fl_Widget.cxx... make[1]: Leaving directory '/usr/src/RPM/BUILD/libfltk13-1.3.3/src' make[1]: Entering directory '/usr/src/RPM/BUILD/libfltk13-1.3.3/src' Compiling Fl_Window_iconize.cxx... make[1]: Leaving directory '/usr/src/RPM/BUILD/libfltk13-1.3.3/src' make[1]: Entering directory '/usr/src/RPM/BUILD/libfltk13-1.3.3/src' Compiling Fl_Tree_Item.cxx... make[1]: Leaving directory '/usr/src/RPM/BUILD/libfltk13-1.3.3/src' make[1]: Entering directory '/usr/src/RPM/BUILD/libfltk13-1.3.3/src' Compiling Fl_abort.cxx... make[1]: Leaving directory '/usr/src/RPM/BUILD/libfltk13-1.3.3/src' make[1]: Entering directory '/usr/src/RPM/BUILD/libfltk13-1.3.3/src' Compiling Fl_Window_shape.cxx... make[1]: Leaving directory '/usr/src/RPM/BUILD/libfltk13-1.3.3/src' make[1]: Entering directory '/usr/src/RPM/BUILD/libfltk13-1.3.3/src' Compiling Fl_XBM_Image.cxx... make[1]: Leaving directory '/usr/src/RPM/BUILD/libfltk13-1.3.3/src' make[1]: Entering directory '/usr/src/RPM/BUILD/libfltk13-1.3.3/src' Compiling Fl_Wizard.cxx... make[1]: Leaving directory '/usr/src/RPM/BUILD/libfltk13-1.3.3/src' make[1]: Entering directory '/usr/src/RPM/BUILD/libfltk13-1.3.3/src' Compiling Fl_Tree.cxx... make[1]: Leaving directory '/usr/src/RPM/BUILD/libfltk13-1.3.3/src' make[1]: Entering directory '/usr/src/RPM/BUILD/libfltk13-1.3.3/src' Compiling Fl_XPM_Image.cxx... make[1]: Leaving directory '/usr/src/RPM/BUILD/libfltk13-1.3.3/src' make[1]: Entering directory '/usr/src/RPM/BUILD/libfltk13-1.3.3/src' Compiling Fl_add_idle.cxx... make[1]: Leaving directory '/usr/src/RPM/BUILD/libfltk13-1.3.3/src' make[1]: Entering directory '/usr/src/RPM/BUILD/libfltk13-1.3.3/src' Compiling Fl_get_key.cxx... make[1]: Leaving directory '/usr/src/RPM/BUILD/libfltk13-1.3.3/src' make[1]: Entering directory '/usr/src/RPM/BUILD/libfltk13-1.3.3/src' Compiling Fl_Text_Display.cxx... make[1]: Leaving directory '/usr/src/RPM/BUILD/libfltk13-1.3.3/src' make[1]: Entering directory '/usr/src/RPM/BUILD/libfltk13-1.3.3/src' Compiling Fl_display.cxx... make[1]: Leaving directory '/usr/src/RPM/BUILD/libfltk13-1.3.3/src' make[1]: Entering directory '/usr/src/RPM/BUILD/libfltk13-1.3.3/src' Compiling Fl_grab.cxx... make[1]: Leaving directory '/usr/src/RPM/BUILD/libfltk13-1.3.3/src' make[1]: Entering directory '/usr/src/RPM/BUILD/libfltk13-1.3.3/src' Compiling Fl_compose.cxx... make[1]: Leaving directory '/usr/src/RPM/BUILD/libfltk13-1.3.3/src' make[1]: Entering directory '/usr/src/RPM/BUILD/libfltk13-1.3.3/src' Compiling Fl_arg.cxx... make[1]: Leaving directory '/usr/src/RPM/BUILD/libfltk13-1.3.3/src' make[1]: Entering directory '/usr/src/RPM/BUILD/libfltk13-1.3.3/src' Compiling Fl_lock.cxx... make[1]: Leaving directory '/usr/src/RPM/BUILD/libfltk13-1.3.3/src' make[1]: Entering directory '/usr/src/RPM/BUILD/libfltk13-1.3.3/src' Compiling filename_ext.cxx... make[1]: Leaving directory '/usr/src/RPM/BUILD/libfltk13-1.3.3/src' make[1]: Entering directory '/usr/src/RPM/BUILD/libfltk13-1.3.3/src' Compiling Fl_own_colormap.cxx... make[1]: Leaving directory '/usr/src/RPM/BUILD/libfltk13-1.3.3/src' make[1]: Entering directory '/usr/src/RPM/BUILD/libfltk13-1.3.3/src' Compiling filename_expand.cxx... make[1]: Leaving directory '/usr/src/RPM/BUILD/libfltk13-1.3.3/src' make[1]: Entering directory '/usr/src/RPM/BUILD/libfltk13-1.3.3/src' Compiling Fl_get_system_colors.cxx... make[1]: Leaving directory '/usr/src/RPM/BUILD/libfltk13-1.3.3/src' make[1]: Entering directory '/usr/src/RPM/BUILD/libfltk13-1.3.3/src' Compiling Fl_visual.cxx... make[1]: Leaving directory '/usr/src/RPM/BUILD/libfltk13-1.3.3/src' make[1]: Entering directory '/usr/src/RPM/BUILD/libfltk13-1.3.3/src' Compiling filename_setext.cxx... make[1]: Leaving directory '/usr/src/RPM/BUILD/libfltk13-1.3.3/src' make[1]: Entering directory '/usr/src/RPM/BUILD/libfltk13-1.3.3/src' Compiling filename_isdir.cxx... make[1]: Leaving directory '/usr/src/RPM/BUILD/libfltk13-1.3.3/src' make[1]: Entering directory '/usr/src/RPM/BUILD/libfltk13-1.3.3/src' Compiling filename_match.cxx... make[1]: Leaving directory '/usr/src/RPM/BUILD/libfltk13-1.3.3/src' make[1]: Entering directory '/usr/src/RPM/BUILD/libfltk13-1.3.3/src' Compiling filename_absolute.cxx... make[1]: Leaving directory '/usr/src/RPM/BUILD/libfltk13-1.3.3/src' make[1]: Entering directory '/usr/src/RPM/BUILD/libfltk13-1.3.3/src' Compiling filename_list.cxx... filename_list.cxx: In function 'int fl_filename_list(const char*, dirent***, int (*)(dirent**, dirent**))': filename_list.cxx:121:36: error: invalid conversion from 'int (*)(const void*, const void*)' to 'int (*)(const dirent**, const dirent**)' [-fpermissive] int n = scandir(dirloc, list, 0, (int(*)(const void*,const void*))sort); ^~~~~~~~~~~~~~~~~~~~~~~~~~~~~~~~~~~~~ In file included from ../FL/filename.H:101, from filename_list.cxx:21: /usr/include/dirent.h:258:13: note: initializing argument 4 of 'int scandir(const char*, dirent***, int (*)(const dirent*), int (*)(const dirent**, const dirent**))' int (*__cmp) (const struct dirent **, ~~~~~~^~~~~~~~~~~~~~~~~~~~~~~~~~~~~~~ const struct dirent **)) ~~~~~~~~~~~~~~~~~~~~~~~ make[1]: *** [../makeinclude:149: filename_list.o] Error 1 make[1]: Leaving directory '/usr/src/RPM/BUILD/libfltk13-1.3.3/src' make[1]: *** Waiting for unfinished jobs.... make[1]: Entering directory '/usr/src/RPM/BUILD/libfltk13-1.3.3/src' Compiling fl_arci.cxx... make[1]: Leaving directory '/usr/src/RPM/BUILD/libfltk13-1.3.3/src' make[1]: Entering directory '/usr/src/RPM/BUILD/libfltk13-1.3.3/src' Compiling fl_arc.cxx... make[1]: Leaving directory '/usr/src/RPM/BUILD/libfltk13-1.3.3/src' make[1]: Entering directory '/usr/src/RPM/BUILD/libfltk13-1.3.3/src' Compiling fl_ask.cxx... make[1]: Leaving directory '/usr/src/RPM/BUILD/libfltk13-1.3.3/src' make[1]: Entering directory '/usr/src/RPM/BUILD/libfltk13-1.3.3/src' Compiling fl_boxtype.cxx... make[1]: Leaving directory '/usr/src/RPM/BUILD/libfltk13-1.3.3/src' make[1]: Entering directory '/usr/src/RPM/BUILD/libfltk13-1.3.3/src' Compiling fl_color.cxx... make[1]: Leaving directory '/usr/src/RPM/BUILD/libfltk13-1.3.3/src' make[1]: Entering directory '/usr/src/RPM/BUILD/libfltk13-1.3.3/src' Compiling Fl_x.cxx... Fl_x.cxx: In function 'KeySym fl_KeycodeToKeysym(Display*, KeyCode, unsigned int)': Fl_x.cxx:1313:34: warning: 'KeySym XKeycodeToKeysym(Display*, KeyCode, int)' is deprecated [-Wdeprecated-declarations] return XKeycodeToKeysym(d, k, i); ^ In file included from ../FL/fl_utf8.h:63, from ../FL/Fl.H:30, from Fl_x.cxx:30: /usr/include/X11/Xlib.h:1687:15: note: declared here extern KeySym XKeycodeToKeysym( ^~~~~~~~~~~~~~~~ Fl_x.cxx:1313:34: warning: 'KeySym XKeycodeToKeysym(Display*, KeyCode, int)' is deprecated [-Wdeprecated-declarations] return XKeycodeToKeysym(d, k, i); ^ In file included from ../FL/fl_utf8.h:63, from ../FL/Fl.H:30, from Fl_x.cxx:30: /usr/include/X11/Xlib.h:1687:15: note: declared here extern KeySym XKeycodeToKeysym( ^~~~~~~~~~~~~~~~ make[1]: Leaving directory '/usr/src/RPM/BUILD/libfltk13-1.3.3/src' make: *** [Makefile:24: all] Error 1 error: Bad exit status from /usr/src/tmp/rpm-tmp.91376 (%build) RPM build errors: Bad exit status from /usr/src/tmp/rpm-tmp.91376 (%build) Command exited with non-zero status 1 26.18user 3.23system 0:10.91elapsed 269%CPU (0avgtext+0avgdata 77124maxresident)k 0inputs+0outputs (0major+1437343minor)pagefaults 0swaps hsh-rebuild: rebuild of `libfltk13-1.3.3-alt2.src.rpm' failed. Command exited with non-zero status 1 41.89user 6.17system 0:32.64elapsed 147%CPU (0avgtext+0avgdata 121948maxresident)k 31152inputs+0outputs (0major+1889047minor)pagefaults 0swaps