<86>Feb  2 03:27:21 userdel[100090]: delete user 'rooter'
<86>Feb  2 03:27:21 userdel[100090]: removed group 'rooter' owned by 'rooter'
<86>Feb  2 03:27:21 userdel[100090]: removed shadow group 'rooter' owned by 'rooter'
<86>Feb  2 03:27:21 groupadd[100248]: group added to /etc/group: name=rooter, GID=645
<86>Feb  2 03:27:21 groupadd[100248]: group added to /etc/gshadow: name=rooter
<86>Feb  2 03:27:21 groupadd[100248]: new group: name=rooter, GID=645
<86>Feb  2 03:27:21 useradd[100406]: new user: name=rooter, UID=645, GID=645, home=/root, shell=/bin/bash
<86>Feb  2 03:27:21 userdel[100747]: delete user 'builder'
<86>Feb  2 03:27:21 userdel[100747]: removed group 'builder' owned by 'builder'
<86>Feb  2 03:27:21 userdel[100747]: removed shadow group 'builder' owned by 'builder'
<86>Feb  2 03:27:21 groupadd[100981]: group added to /etc/group: name=builder, GID=646
<86>Feb  2 03:27:21 groupadd[100981]: group added to /etc/gshadow: name=builder
<86>Feb  2 03:27:21 groupadd[100981]: new group: name=builder, GID=646
<86>Feb  2 03:27:21 useradd[101033]: new user: name=builder, UID=646, GID=646, home=/usr/src, shell=/bin/bash
<13>Feb  2 03:27:28 rpmi: xorg-proto-devel-2018.4-alt3 1527685079 installed
<13>Feb  2 03:27:28 rpmi: libjpeg-2:1.5.1-alt1 1498218302 installed
<13>Feb  2 03:27:28 rpmi: libpng16-1.6.36-alt1 sisyphus+219478.100.1.1 1547633315 installed
<13>Feb  2 03:27:28 rpmi: libexpat-2.2.4-alt1 1503305341 installed
<13>Feb  2 03:27:28 rpmi: libtiff5-4.0.3-alt1 1348347498 installed
<13>Feb  2 03:27:28 rpmi: libICE-1.0.9-alt1 1409902719 installed
<13>Feb  2 03:27:28 rpmi: libglvnd-7:1.1.0-alt3 sisyphus.215982.100 1541498630 installed
<13>Feb  2 03:27:28 rpmi: libSM-1.2.3-alt1 sisyphus.215747.100 1540812760 installed
<13>Feb  2 03:27:28 rpmi: libogg-1.3.3-alt1 sisyphus.217914.100 1545006089 installed
<13>Feb  2 03:27:28 rpmi: zlib-devel-1.2.11-alt1 sisyphus.217171.100 1543710738 installed
<13>Feb  2 03:27:28 rpmi: libwebp7-1.0.2-alt1 sisyphus+219651.100.1.2 1548057724 installed
<13>Feb  2 03:27:28 rpmi: libwayland-client-1.16.0-alt1 1535614868 installed
<13>Feb  2 03:27:28 rpmi: libpng-devel-1.6.36-alt1 sisyphus+219478.100.1.1 1547633315 installed
<13>Feb  2 03:27:28 rpmi: libICE-devel-1.0.9-alt1 1409902719 installed
<13>Feb  2 03:27:28 rpmi: libsqlite3-3.26.0-alt1 sisyphus.219274.100 1547430709 installed
<13>Feb  2 03:27:28 rpmi: qt4-common-4.8.7-alt13.S1 1535591089 installed
<13>Feb  2 03:27:28 rpmi: libqt4-core-4.8.7-alt13.S1 1535591089 installed
<13>Feb  2 03:27:28 rpmi: libqt4-sql-4.8.7-alt13.S1 1535591089 installed
<13>Feb  2 03:27:28 rpmi: libopenblas-0.2.20-alt1 1527006103 installed
<13>Feb  2 03:27:28 rpmi: libltdl7-2.4.2-alt7 sisyphus.216946.100 1543650626 installed
<13>Feb  2 03:27:28 rpmi: liblcms2-2.9-alt1 1516411888 installed
<13>Feb  2 03:27:28 rpmi: libgomp1-8.2.1-alt3 sisyphus.219333.200 1547468232 installed
<13>Feb  2 03:27:28 rpmi: libopenjpeg2.0-2.3.0-alt2 sisyphus.216213.100 1541598434 installed
<13>Feb  2 03:27:28 rpmi: libXau-1.0.8-alt1 1369565807 installed
<13>Feb  2 03:27:28 rpmi: libwayland-server-1.16.0-alt1 1535614868 installed
<13>Feb  2 03:27:28 rpmi: ilmbase12-common-2.2.0-alt1.1 1434451064 installed
<13>Feb  2 03:27:28 rpmi: libiex12-2.2.0-alt1.1 1434451064 installed
<13>Feb  2 03:27:29 rpmi: libicu63-1:6.3.1-alt1 sisyphus.215328.100 1540049981 installed
<13>Feb  2 03:27:29 rpmi: libgraphite2-1.3.13-alt1 sisyphus.218545.100 1545686499 installed
<13>Feb  2 03:27:29 rpmi: libharfbuzz-2.2.0-alt1 sisyphus.218134.500 1545261457 installed
<13>Feb  2 03:27:29 rpmi: libfreetype-2.9.1-alt1.S1 1530781049 installed
<13>Feb  2 03:27:29 rpmi: fontconfig-2.13.1-alt1 sisyphus.215917.100 1540973883 installed
Updating fonts cache: <29>Feb  2 03:27:30 fontconfig: Updating fonts cache: succeeded
[ DONE ]
<13>Feb  2 03:27:30 rpmi: libgdbm-1.8.3-alt10 1454943313 installed
<13>Feb  2 03:27:30 rpmi: libharfbuzz-icu-2.2.0-alt1 sisyphus.218134.500 1545261457 installed
<13>Feb  2 03:27:30 rpmi: libgraphite2-devel-1.3.13-alt1 sisyphus.218545.100 1545686499 installed
<13>Feb  2 03:27:30 rpmi: icu-utils-1:6.3.1-alt1 sisyphus.215328.100 1540049981 installed
<13>Feb  2 03:27:30 rpmi: libicu-devel-1:6.3.1-alt1 sisyphus.215328.100 1540049981 installed
<13>Feb  2 03:27:30 rpmi: libilmthread12-2.2.0-alt1.1 1434451064 installed
<13>Feb  2 03:27:30 rpmi: libhalf12-2.2.0-alt1.1 1434451064 installed
<13>Feb  2 03:27:30 rpmi: libXau-devel-1.0.8-alt1 1369565807 installed
<13>Feb  2 03:27:30 rpmi: libgomp8-devel-8.2.1-alt3 sisyphus.219333.200 1547468232 installed
<13>Feb  2 03:27:30 rpmi: libgomp-devel-8-alt1 sisyphus.214000.40 1542664792 installed
<13>Feb  2 03:27:30 rpmi: libmng-2.0.3-alt2 sisyphus.215736.100 1540804098 installed
<13>Feb  2 03:27:30 rpmi: libunixODBC2-2.3.4-alt2 1487857369 installed
<13>Feb  2 03:27:30 rpmi: libunixODBC-devel-compat-2.3.4-alt2 1487857369 installed
<13>Feb  2 03:27:31 rpmi: libunixODBC-devel-2.3.4-alt2 1487857369 installed
<13>Feb  2 03:27:31 rpmi: libqt4-sql-sqlite-4.8.7-alt13.S1 1535591089 installed
<13>Feb  2 03:27:31 rpmi: libqt4-xml-4.8.7-alt13.S1 1535591089 installed
<13>Feb  2 03:27:31 rpmi: libqt4-clucene-4.8.7-alt13.S1 1535591089 installed
<13>Feb  2 03:27:31 rpmi: libqt4-test-4.8.7-alt13.S1 1535591089 installed
<13>Feb  2 03:27:31 rpmi: rpm-macros-qt4-4.8.7-alt13.S1 1535591089 installed
<13>Feb  2 03:27:31 rpmi: libSM-devel-1.2.3-alt1 sisyphus.215747.100 1540812760 installed
<13>Feb  2 03:27:31 rpmi: libwayland-egl-4:18.1.0-alt1 1535614868 installed
<13>Feb  2 03:27:31 rpmi: libflac8-1.3.2-alt1 1507623526 installed
<13>Feb  2 03:27:31 rpmi: libvorbis-1.3.6-alt2 sisyphus+220072.200.2.2 1548744467 installed
<13>Feb  2 03:27:31 rpmi: libOpenGL-7:1.1.0-alt3 sisyphus.215982.100 1541498630 installed
<13>Feb  2 03:27:31 rpmi: libGLES-7:1.1.0-alt3 sisyphus.215982.100 1541498630 installed
<13>Feb  2 03:27:31 rpmi: libjasper-2.0.14-alt1 1530105213 installed
<13>Feb  2 03:27:31 rpmi: libv4l-1.16.2-alt2 sisyphus+220174.100.1.1 1548771987 installed
<13>Feb  2 03:27:31 rpmi: libalsa-1:1.1.8-alt1 sisyphus+219888.100.4.1 1548752822 installed
<13>Feb  2 03:27:31 rpmi: libnumpy-1:1.15.4-alt1 sisyphus.218638.200 1545948859 installed
<13>Feb  2 03:27:31 rpmi: libxblas-1.0.248-alt1.1 1496143642 installed
<13>Feb  2 03:27:31 rpmi: liborc-0.4.28-alt1 1511201491 installed
<13>Feb  2 03:27:31 rpmi: libgudev-1:232-alt3 1523738515 installed
<13>Feb  2 03:27:31 rpmi: libgsm-1.0.17-alt1 1523356157 installed
<13>Feb  2 03:27:31 rpmi: libsndfile-1.0.28-alt2 sisyphus.212728.100 1536333060 installed
<13>Feb  2 03:27:31 rpmi: libquadmath0-8.2.1-alt3 sisyphus.219333.200 1547468232 installed
<13>Feb  2 03:27:31 rpmi: libgfortran4-7.3.1-alt7 sisyphus.214000.100 1542666892 installed
<13>Feb  2 03:27:32 rpmi: liblapack-1:3.8.0-alt1 1527158327 installed
<13>Feb  2 03:27:32 rpmi: libasyncns-0.8-alt2.qa1 1365949819 installed
<13>Feb  2 03:27:32 rpmi: libwmflite-0.2.8.4-alt13 1506519334 installed
<13>Feb  2 03:27:32 rpmi: liblqr-0.4.2-alt1 1383038436 installed
<13>Feb  2 03:27:32 rpmi: libjbig-2.1-alt1 1401380921 installed
<13>Feb  2 03:27:32 rpmi: libgts-0.7.6-alt2.drc20130205 1360123643 installed
<13>Feb  2 03:27:32 rpmi: libpaper-1.1.24-alt4 1315383473 installed
<13>Feb  2 03:27:32 rpmi: libgtk+2-locales-2.24.32-alt2 1518699309 installed
<13>Feb  2 03:27:32 rpmi: liblz4-1:1.8.3-alt2 sisyphus.217095.200 1547082320 installed
<13>Feb  2 03:27:32 rpmi: libgpg-error-1.31-alt1.S1 1529015796 installed
<13>Feb  2 03:27:32 rpmi: libgcrypt20-1.8.3-alt4 sisyphus.218050.200 1545223148 installed
<13>Feb  2 03:27:32 rpmi: libsystemd-1:240-alt4 sisyphus.219244.100 1547241418 installed
<13>Feb  2 03:27:32 rpmi: libdbus-1.12.12-alt1 sisyphus.217336.100 1544000947 installed
<13>Feb  2 03:27:33 rpmi: libqt4-dbus-4.8.7-alt13.S1 1535591089 installed
<13>Feb  2 03:27:33 rpmi: libqt4-script-4.8.7-alt13.S1 1535591089 installed
<13>Feb  2 03:27:33 rpmi: libavahi-0.6.32-alt1 1500485694 installed
<13>Feb  2 03:27:33 rpmi: libdbus-devel-1.12.12-alt1 sisyphus.217336.100 1544000947 installed
<13>Feb  2 03:27:33 rpmi: libxslt-1.1.32-alt2 1517429962 installed
<13>Feb  2 03:27:33 rpmi: libatk-locales-2.30.0-alt1 sisyphus.212779.100 1536768328 installed
<13>Feb  2 03:27:33 rpmi: libatk-2.30.0-alt1 sisyphus.212779.100 1536768328 installed
<13>Feb  2 03:27:33 rpmi: libdatrie-0.2.9-alt1_6 1511686677 installed
<13>Feb  2 03:27:33 rpmi: libthai-0.1.28-alt1_1 sisyphus.214516.100 1539257851 installed
<13>Feb  2 03:27:33 rpmi: libfribidi-1.0.5-alt1 1532424343 installed
<13>Feb  2 03:27:33 rpmi: libpixman-3:0.36.0-alt1 sisyphus+219464.100.1.1 1547627432 installed
<13>Feb  2 03:27:33 rpmi: openexr22-common-2.2.0-alt1.1 1434451518 installed
<13>Feb  2 03:27:34 rpmi: libilmimf22-2.2.0-alt1.1 1434451518 installed
<13>Feb  2 03:27:34 rpmi: libxshmfence-1.2-alt2 1518613549 installed
<13>Feb  2 03:27:34 rpmi: libX11-locales-3:1.6.7-alt1 sisyphus.214413.200 1539171080 installed
<13>Feb  2 03:27:34 rpmi: libXdmcp-1.1.1-alt1 1334617699 installed
<13>Feb  2 03:27:34 rpmi: libxcb-1.13.1-alt1 sisyphus.214413.100 1539170828 installed
<13>Feb  2 03:27:34 rpmi: libX11-3:1.6.7-alt1 sisyphus.214413.200 1539171080 installed
<13>Feb  2 03:27:34 rpmi: libXext-1.3.3-alt1 1409902932 installed
<13>Feb  2 03:27:34 rpmi: libXrender-0.9.8-alt1 1371312110 installed
<13>Feb  2 03:27:34 rpmi: libXfixes-5.0.3-alt1 sisyphus.216396.300 1542022144 installed
<13>Feb  2 03:27:34 rpmi: libXcursor-1.1.15-alt1.S1 1512373363 installed
<13>Feb  2 03:27:34 rpmi: libXrandr-1.5.0-alt1 1431936188 installed
<13>Feb  2 03:27:34 rpmi: libXi-1.7.9-alt1.S1 1515755338 installed
<13>Feb  2 03:27:34 rpmi: libXinerama-1.1.3-alt2 1527671624 installed
<13>Feb  2 03:27:34 rpmi: libqt4-gui-4.8.7-alt13.S1 1535591089 installed
<13>Feb  2 03:27:34 rpmi: libqt4-designer-4.8.7-alt13.S1 1535591089 installed
<13>Feb  2 03:27:34 rpmi: libXft-2.3.2-alt1 1409902650 installed
<13>Feb  2 03:27:34 rpmi: libXdamage-1.1.3-alt4 1297162596 installed
<13>Feb  2 03:27:35 rpmi: libxcb-devel-1.13.1-alt1 sisyphus.214413.100 1539170828 installed
<13>Feb  2 03:27:36 rpmi: libX11-devel-3:1.6.7-alt1 sisyphus.214413.200 1539171080 installed
<13>Feb  2 03:27:36 rpmi: libXext-devel-1.3.3-alt1 1409902932 installed
<13>Feb  2 03:27:36 rpmi: libXrender-devel-0.9.8-alt1 1371312110 installed
<13>Feb  2 03:27:36 rpmi: libXfixes-devel-5.0.3-alt1 sisyphus.216396.300 1542022144 installed
<13>Feb  2 03:27:36 rpmi: libXi-devel-1.7.9-alt1.S1 1515755338 installed
<13>Feb  2 03:27:36 rpmi: libXrandr-devel-1.5.0-alt1 1431936188 installed
<13>Feb  2 03:27:36 rpmi: libXcursor-devel-1.1.15-alt1.S1 1512373363 installed
<13>Feb  2 03:27:36 rpmi: libXinerama-devel-1.1.3-alt2 1527671624 installed
<13>Feb  2 03:27:36 rpmi: libqt4-svg-4.8.7-alt13.S1 1535591089 installed
<13>Feb  2 03:27:36 rpmi: libqt4-uitools-4.8.7-alt13.S1 1535591089 installed
<13>Feb  2 03:27:36 rpmi: libqt4-multimedia-4.8.7-alt13.S1 1535591089 installed
<13>Feb  2 03:27:36 rpmi: libqt4-scripttools-4.8.7-alt13.S1 1535591089 installed
<13>Feb  2 03:27:36 rpmi: libXxf86vm-1.1.4-alt2 1527672159 installed
<13>Feb  2 03:27:36 rpmi: libXtst-1.2.2-alt1 1369984880 installed
<13>Feb  2 03:27:36 rpmi: libXtst-devel-1.2.2-alt1 1369984880 installed
<13>Feb  2 03:27:36 rpmi: libXv-1.0.11-alt1 1527685497 installed
<13>Feb  2 03:27:36 rpmi: libXv-devel-1.0.11-alt1 1527685497 installed
<13>Feb  2 03:27:36 rpmi: libXt-1.1.4-alt1 1369984716 installed
<13>Feb  2 03:27:36 rpmi: libXpm-3.5.11-alt1 1391072398 installed
<13>Feb  2 03:27:36 rpmi: libgd3-2.2.5-alt2.S1 1525496211 installed
<13>Feb  2 03:27:36 rpmi: libXcomposite-0.4.3-alt3 1297306939 installed
<13>Feb  2 03:27:36 rpmi: libpulseaudio-12.2-alt1 1535623578 installed
<13>Feb  2 03:27:36 rpmi: libphonon-4.8.3-alt1 1418134063 installed
<13>Feb  2 03:27:36 rpmi: libphononexperimental-4.8.3-alt1 1418134063 installed
<13>Feb  2 03:27:36 rpmi: libpciaccess-1:0.14-alt1 1528969624 installed
<13>Feb  2 03:27:36 rpmi: libdrm-1:2.4.96-alt1 sisyphus.215486.100 1540374008 installed
<13>Feb  2 03:27:36 rpmi: libGLX-mesa-4:18.3.2-alt1 sisyphus+219595.100.1.1 1547815077 installed
<13>Feb  2 03:27:36 rpmi: libgbm-4:18.3.2-alt1 sisyphus+219595.100.1.1 1547815077 installed
<13>Feb  2 03:27:36 rpmi: libEGL-mesa-4:18.3.2-alt1 sisyphus+219595.100.1.1 1547815077 installed
<13>Feb  2 03:27:36 rpmi: libEGL-7:1.1.0-alt3 sisyphus.215982.100 1541498630 installed
<13>Feb  2 03:27:36 rpmi: libGLX-7:1.1.0-alt3 sisyphus.215982.100 1541498630 installed
<13>Feb  2 03:27:36 rpmi: libGL-7:1.1.0-alt3 sisyphus.215982.100 1541498630 installed
<13>Feb  2 03:27:36 rpmi: libcairo-1:1.16.0-alt1 sisyphus.215566.100 1540457760 installed
<13>Feb  2 03:27:36 rpmi: libpango-1.42.4-alt1 1534787249 installed
<13>Feb  2 03:27:36 rpmi: libglvnd-devel-7:1.1.0-alt3 sisyphus.215982.100 1541498630 installed
<13>Feb  2 03:27:36 rpmi: libEGL-devel-4:18.3.2-alt1 sisyphus+219595.100.1.1 1547815077 installed
<13>Feb  2 03:27:36 rpmi: libGL-devel-4:18.3.2-alt1 sisyphus+219595.100.1.1 1547815077 installed
<13>Feb  2 03:27:36 rpmi: libqt4-opengl-4.8.7-alt13.S1 1535591089 installed
<13>Feb  2 03:27:36 rpmi: liblasi-1.1.2-alt1.qa1 1460141148 installed
<13>Feb  2 03:27:36 rpmi: libGLU-4:9.0.0-alt1 1347643776 installed
<13>Feb  2 03:27:36 rpmi: libGLU-devel-4:9.0.0-alt1 1347643776 installed
<13>Feb  2 03:27:36 rpmi: icon-theme-hicolor-0.17-alt1 1505715846 installed
<13>Feb  2 03:27:36 rpmi: libgdk-pixbuf-locales-2.38.0-alt4 sisyphus.219229.400 1547220196 installed
<13>Feb  2 03:27:36 rpmi: shared-mime-info-1.12-alt1 sisyphus+219597.100.2.2 1548056998 installed
<13>Feb  2 03:27:36 rpmi: gsettings-desktop-schemas-data-3.28.1-alt1 sisyphus.212587.100 1536082062 installed
<13>Feb  2 03:27:36 rpmi: libgio-2.58.3-alt1 sisyphus+219722.100.1.1 1548088735 installed
<13>Feb  2 03:27:36 rpmi: gsettings-desktop-schemas-3.28.1-alt1 sisyphus.212587.100 1536082062 installed
<13>Feb  2 03:27:36 rpmi: libgdk-pixbuf-2.38.0-alt4 sisyphus.219229.400 1547220196 installed
<13>Feb  2 03:27:36 rpmi: libgstreamer1.0-1.14.4-alt1 sisyphus.214120.2200 1538778549 installed
<13>Feb  2 03:27:36 rpmi: libgst-plugins1.0-1.14.4-alt3 sisyphus.216849.100 1543144417 installed
<13>Feb  2 03:27:36 rpmi: gtk-update-icon-cache-3.24.4-alt1 sisyphus+219722.200.2.2 1548107258 installed
<13>Feb  2 03:27:36 rpmi: librsvg-1:2.44.12-alt1 sisyphus+219722.400.2.2 1548107809 installed
<13>Feb  2 03:27:36 rpmi: libgdk-pixbuf-xlib-2.38.0-alt4 sisyphus.219229.400 1547220196 installed
<13>Feb  2 03:27:36 rpmi: gcc-c++-common-1.4.23-alt1 sisyphus.218115.200 1545282875 installed
<13>Feb  2 03:27:37 rpmi: libstdc++8-devel-8.2.1-alt3 sisyphus.219333.200 1547468232 installed
<13>Feb  2 03:27:37 rpmi: gcc8-c++-8.2.1-alt3 sisyphus.219333.200 1547468232 installed
<13>Feb  2 03:27:37 rpmi: xml-utils-1:2.9.4.0.12.e905-alt1.1 1525115736 installed
<13>Feb  2 03:27:37 rpmi: rpm-build-gir-0.7.2-alt4 1534675014 installed
<13>Feb  2 03:27:37 rpmi: djvu-common-3.5.25.3-alt1 1365826139 installed
<13>Feb  2 03:27:38 rpmi: libdjvu-3.5.25.3-alt1 1365826137 installed
<13>Feb  2 03:27:38 rpmi: libtinfo-devel-6.1.20180407-alt2 sisyphus.215627.200 1540831969 installed
<13>Feb  2 03:27:38 rpmi: libncurses-devel-6.1.20180407-alt2 sisyphus.215627.200 1540831969 installed
<13>Feb  2 03:27:38 rpmi: python-modules-curses-2.7.15-alt1 sisyphus.217364.100 1544022396 installed
<13>Feb  2 03:27:38 rpmi: libverto-0.3.0-alt1_5 1525957716 installed
<13>Feb  2 03:27:38 rpmi: libkeyutils-1.6-alt2 sisyphus.217337.100 1544003165 installed
<13>Feb  2 03:27:38 rpmi: libcom_err-1.44.5-alt1 sisyphus.218838.100 1546206092 installed
<13>Feb  2 03:27:38 rpmi: libtasn1-4.13-alt2 1521133848 installed
<13>Feb  2 03:27:38 rpmi: rpm-macros-alternatives-0.5.0-alt1 sisyphus.219012.300 1546745004 installed
<13>Feb  2 03:27:38 rpmi: alternatives-0.5.0-alt1 sisyphus.219012.300 1546745004 installed
<13>Feb  2 03:27:38 rpmi: libp11-kit-0.23.9-alt5 1525798241 installed
<13>Feb  2 03:27:38 rpmi: ca-certificates-2018.11.12-alt1 sisyphus.216395.300 1542114035 installed
<13>Feb  2 03:27:38 rpmi: ca-trust-0.1.1-alt2 1515595785 installed
<13>Feb  2 03:27:38 rpmi: p11-kit-trust-0.23.9-alt5 1525798241 installed
<13>Feb  2 03:27:38 rpmi: libcrypto1.1-1.1.0j-alt1 sisyphus.216647.100 1542743840 installed
<13>Feb  2 03:27:38 rpmi: libssl1.1-1.1.0j-alt1 sisyphus.216647.100 1542743840 installed
<13>Feb  2 03:27:38 rpmi: libqt4-network-4.8.7-alt13.S1 1535591089 installed
<13>Feb  2 03:27:38 rpmi: libpython3-3.6.8-alt1 sisyphus+220164.200.3.1 1548842470 installed
<13>Feb  2 03:27:38 rpmi: python3-3.6.8-alt1 sisyphus+220164.200.3.1 1548842470 installed
<13>Feb  2 03:27:38 rpmi: python3-base-3.6.8-alt1 sisyphus+220164.200.3.1 1548842470 installed
<13>Feb  2 03:27:38 rpmi: glib2-devel-2.58.3-alt1 sisyphus+219722.100.1.1 1548088735 installed
<13>Feb  2 03:27:38 rpmi: libgio-devel-2.58.3-alt1 sisyphus+219722.100.1.1 1548088735 installed
<86>Feb  2 03:27:38 groupadd[26256]: group added to /etc/group: name=_keytab, GID=499
<86>Feb  2 03:27:38 groupadd[26256]: group added to /etc/gshadow: name=_keytab
<86>Feb  2 03:27:38 groupadd[26256]: new group: name=_keytab, GID=499
<13>Feb  2 03:27:39 rpmi: libkrb5-1.16.3-alt1 sisyphus.219042.100 1547045738 installed
<13>Feb  2 03:27:39 rpmi: libcups-2.2.6-alt1 1510070331 installed
<13>Feb  2 03:27:39 rpmi: libgtk+2-2.24.32-alt2 1518699259 installed
<13>Feb  2 03:27:39 rpmi: libgs-9.26-alt2 sisyphus+220106.100.1.2 1548769306 installed
<13>Feb  2 03:27:39 rpmi: libgraphviz-2.40.1-alt4.1 sisyphus+219907.5300.2.1 1548535874 installed
<13>Feb  2 03:27:40 rpmi: libImageMagick6.6-6.9.10.24-alt1.1 sisyphus+219907.5400.2.1 1548536630 installed
<13>Feb  2 03:27:40 rpmi: libImageMagick++6.8-6.9.10.24-alt1.1 sisyphus+219907.5400.2.1 1548536630 installed
<13>Feb  2 03:27:40 rpmi: libtirpc-1.0.3-alt1 1532008015 installed
<13>Feb  2 03:27:40 rpmi: libnsl2-1.1.0-alt1_1 1511548748 installed
<13>Feb  2 03:27:40 rpmi: python-modules-compiler-2.7.15-alt1 sisyphus.217364.100 1544022396 installed
<13>Feb  2 03:27:40 rpmi: python-modules-email-2.7.15-alt1 sisyphus.217364.100 1544022396 installed
<13>Feb  2 03:27:40 rpmi: python-modules-unittest-2.7.15-alt1 sisyphus.217364.100 1544022396 installed
<13>Feb  2 03:27:40 rpmi: python-modules-nis-2.7.15-alt1 sisyphus.217364.100 1544022396 installed
<13>Feb  2 03:27:40 rpmi: python-modules-encodings-2.7.15-alt1 sisyphus.217364.100 1544022396 installed
<13>Feb  2 03:27:40 rpmi: python-modules-2.7.15-alt1 sisyphus.217364.100 1544022396 installed
<13>Feb  2 03:27:40 rpmi: python-modules-ctypes-2.7.15-alt1 sisyphus.217364.100 1544022396 installed
<13>Feb  2 03:27:40 rpmi: python-module-six-1.12.0-alt1 sisyphus+219665.100.2.1 1548148570 installed
<13>Feb  2 03:27:40 rpmi: python-modules-multiprocessing-2.7.15-alt1 sisyphus.217364.100 1544022396 installed
<13>Feb  2 03:27:40 rpmi: python-modules-xml-2.7.15-alt1 sisyphus.217364.100 1544022396 installed
<13>Feb  2 03:27:40 rpmi: gtk-builder-convert-2.24.32-alt2 1518699309 installed
<13>Feb  2 03:27:40 rpmi: python-modules-logging-2.7.15-alt1 sisyphus.217364.100 1544022396 installed
<13>Feb  2 03:27:40 rpmi: python-module-more-itertools-5.0.0-alt1 sisyphus.218699.100 1545980609 installed
<13>Feb  2 03:27:40 rpmi: python-modules-hotshot-2.7.15-alt1 sisyphus.217364.100 1544022396 installed
<13>Feb  2 03:27:40 rpmi: python-modules-bsddb-2.7.15-alt1 sisyphus.217364.100 1544022396 installed
<13>Feb  2 03:27:40 rpmi: python-2.7.15-alt1 sisyphus.217364.100 1544022396 installed
<13>Feb  2 03:27:40 rpmi: python-strict-2.7.15-alt1 sisyphus.217364.100 1544022396 installed
<13>Feb  2 03:27:40 rpmi: python-modules-distutils-2.7.15-alt1 sisyphus.217364.100 1544022396 installed
<13>Feb  2 03:27:40 rpmi: python-module-pygobject-2.28.7-alt1 1513944003 installed
<13>Feb  2 03:27:40 rpmi: python-module-attrs-18.2.0-alt1 sisyphus.214354.100 1539088435 installed
<13>Feb  2 03:27:40 rpmi: python-module-pycairo-1.18.0-alt1 sisyphus.216837.300 1543086135 installed
<13>Feb  2 03:27:40 rpmi: python-module-atomicwrites-1.2.1-alt1 sisyphus.214347.100 1539076636 installed
<13>Feb  2 03:27:40 rpmi: python-module-funcsigs-1.0.2-alt2 sisyphus+220258.100.1.1 1548882900 installed
<13>Feb  2 03:27:40 rpmi: python-module-py-1.7.0-alt1 sisyphus.214414.220 1539670883 installed
<13>Feb  2 03:27:40 rpmi: python-module-scandir-1.9.0-alt1 1535455368 installed
<13>Feb  2 03:27:40 rpmi: python-module-pathlib2-2.3.3-alt1 sisyphus.218098.100 1545218863 installed
<13>Feb  2 03:27:40 rpmi: python-modules-json-2.7.15-alt1 sisyphus.217364.100 1544022396 installed
<13>Feb  2 03:27:40 rpmi: python-module-pkg_resources-1:40.6.3-alt1 sisyphus+219164.200.2.1 1548188195 installed
<13>Feb  2 03:27:40 rpmi: python-module-pluggy-0.8.1-alt1 sisyphus.219350.100 1547468434 installed
<13>Feb  2 03:27:40 rpmi: python-module-pytest-3.10.1-alt3 sisyphus+219849.1200.10.1 1548275625 installed
<13>Feb  2 03:27:40 rpmi: python-module-numpy-1:1.15.4-alt1 sisyphus.218638.200 1545948859 installed
<13>Feb  2 03:27:40 rpmi: python-module-numpy-testing-1:1.15.4-alt1 sisyphus.218638.200 1545948859 installed
<13>Feb  2 03:27:41 rpmi: python-module-pygtk-2.24.0-alt6 1380567721 installed
<13>Feb  2 03:27:41 rpmi: libnsl2-devel-1.1.0-alt1_1 1511548748 installed
<13>Feb  2 03:27:41 rpmi: python-dev-2.7.15-alt1 sisyphus.217364.100 1544022396 installed
<13>Feb  2 03:27:41 rpmi: python-module-pygobject-devel-2.28.7-alt1 1513944003 installed
<13>Feb  2 03:27:41 rpmi: libgdk-pixbuf-devel-2.38.0-alt4 sisyphus.219229.400 1547220196 installed
<13>Feb  2 03:27:41 rpmi: libharfbuzz-devel-2.2.0-alt1 sisyphus.218134.500 1545261457 installed
<13>Feb  2 03:27:41 rpmi: libfreetype-devel-2.9.1-alt1.S1 1530781049 installed
<13>Feb  2 03:27:41 rpmi: fontconfig-devel-2.13.1-alt1 sisyphus.215917.100 1540973883 installed
<13>Feb  2 03:27:41 rpmi: libcairo-devel-1:1.16.0-alt1 sisyphus.215566.100 1540457760 installed
<13>Feb  2 03:27:41 rpmi: libXft-devel-2.3.2-alt1 1409902650 installed
<13>Feb  2 03:27:41 rpmi: libpango-devel-1.42.4-alt1 1534787249 installed
<13>Feb  2 03:27:41 rpmi: libatk-devel-2.30.0-alt1 sisyphus.212779.100 1536768328 installed
<13>Feb  2 03:27:41 rpmi: libgtk+2-devel-2.24.32-alt2 1518699259 installed
<13>Feb  2 03:27:41 rpmi: libqt4-qt3support-4.8.7-alt13.S1 1535591089 installed
<13>Feb  2 03:27:41 rpmi: libqt4-help-4.8.7-alt13.S1 1535591089 installed
<13>Feb  2 03:27:42 rpmi: libqt4-xmlpatterns-4.8.7-alt13.S1 1535591089 installed
<13>Feb  2 03:27:42 rpmi: libqt4-declarative-4.8.7-alt13.S1 1535591089 installed
<13>Feb  2 03:27:42 rpmi: libqt4-4.8.7-alt13.S1 1535591089 installed
<13>Feb  2 03:27:43 rpmi: libqt4-webkit-1:2.3.4-alt6 sisyphus.215264.100 1540024162 installed
<13>Feb  2 03:27:43 rpmi: libssl-devel-1.1.0j-alt1 sisyphus.216647.100 1542743840 installed
<13>Feb  2 03:27:43 rpmi: phonon-devel-4.8.3-alt1 1418134063 installed
<13>Feb  2 03:27:43 rpmi: libqt4-devel-4.8.7-alt13.S1 1535591089 installed
<13>Feb  2 03:27:43 rpmi: libqt4-webkit-devel-1:2.3.4-alt6 sisyphus.215264.100 1540024162 installed
<13>Feb  2 03:27:43 rpmi: python-module-pygtk-devel-2.24.0-alt6 1380567721 installed
<13>Feb  2 03:27:43 rpmi: libImageMagick-devel-6.9.10.24-alt1.1 sisyphus+219907.5400.2.1 1548536630 installed
<13>Feb  2 03:27:43 rpmi: gcc-c++-8-alt1 sisyphus.214000.40 1542664792 installed
<13>Feb  2 03:27:43 rpmi: libv4l-devel-1.16.2-alt2 sisyphus+220174.100.1.1 1548771987 installed
<13>Feb  2 03:27:43 rpmi: libpng15-1.5.28-alt2 1497966592 installed
Building target platforms: x86_64
Building for target x86_64
Wrote: /usr/src/in/nosrpm/zbar-0.10-alt9.nosrc.rpm
<13>Feb  2 03:27:50 rpmi: automake_1.11-1.11.6-alt8 1533753646 installed
Installing zbar-0.10-alt9.src.rpm
Building target platforms: x86_64
Building for target x86_64
Executing(%prep): /bin/sh -e /usr/src/tmp/rpm-tmp.90476
+ umask 022
+ /bin/mkdir -p /usr/src/RPM/BUILD
+ cd /usr/src/RPM/BUILD
+ cd /usr/src/RPM/BUILD
+ rm -rf zbar-0.10
+ echo 'Source #0 (zbar-0.10.tar):'
Source #0 (zbar-0.10.tar):
+ /bin/tar -xf /usr/src/RPM/SOURCES/zbar-0.10.tar
+ cd zbar-0.10
+ /bin/chmod -c -Rf u+rwX,go-w .
+ echo 'Patch #1 (0001-Description-Linux-2.6.38-and-later-do-not-support-th.patch):'
Patch #1 (0001-Description-Linux-2.6.38-and-later-do-not-support-th.patch):
+ /usr/bin/patch -p1
patching file configure.ac
patching file include/config.h.in
patching file zbar/Makefile.am.inc
patching file zbar/video/v4l1.c
patching file zbar/video/v4l2.c
patching file zbarcam/Makefile.am.inc
+ echo 'Patch #2 (python-zbar-import-fix-am.patch):'
Patch #2 (python-zbar-import-fix-am.patch):
+ /usr/bin/patch -p1
patching file python/imagescanner.c
++ grep -rl dprintf COPYING ChangeLog HACKING INSTALL LICENSE Makefile.am Makefile.in NEWS README README.windows TODO aclocal.m4 config configure configure.ac doc examples gtk include perl plugin pygtk python qt test zbar zbar-gtk.pc.in zbar-qt.pc.in zbar.ico zbar.nsi zbar.pc.in zbarcam zbarimg
+ for F in `grep -rl dprintf *`
+ sed -i.dprintf s/dprintf/debprintf/g zbar/scanner.c
+ for F in `grep -rl dprintf *`
+ sed -i.dprintf s/dprintf/debprintf/g zbar/decoder/qr_finder.c
+ for F in `grep -rl dprintf *`
+ sed -i.dprintf s/dprintf/debprintf/g zbar/decoder/pdf417.c
+ for F in `grep -rl dprintf *`
+ sed -i.dprintf s/dprintf/debprintf/g zbar/decoder/i25.c
+ for F in `grep -rl dprintf *`
+ sed -i.dprintf s/dprintf/debprintf/g zbar/decoder/ean.c
+ for F in `grep -rl dprintf *`
+ sed -i.dprintf s/dprintf/debprintf/g zbar/decoder/code39.c
+ for F in `grep -rl dprintf *`
+ sed -i.dprintf s/dprintf/debprintf/g zbar/decoder/code128.c
+ for F in `grep -rl dprintf *`
+ sed -i.dprintf s/dprintf/debprintf/g zbar/decoder.c
+ for F in `grep -rl dprintf *`
+ sed -i.dprintf s/dprintf/debprintf/g zbar/debug.h
+ exit 0
Executing(%build): /bin/sh -e /usr/src/tmp/rpm-tmp.49923
+ umask 022
+ /bin/mkdir -p /usr/src/RPM/BUILD
+ cd /usr/src/RPM/BUILD
+ cd zbar-0.10
+ autoreconf -fisv
autoreconf-default: Entering directory `.'
autoreconf-default: configure.ac: not using Gettext
autoreconf-default: running: aclocal --force -I config
configure.ac:10: warning: AC_LANG_CONFTEST: no AC_LANG_SOURCE call detected in body
../../lib/autoconf/lang.m4:194: AC_LANG_CONFTEST is expanded from...
../../lib/autoconf/general.m4:2663: _AC_LINK_IFELSE is expanded from...
../../lib/autoconf/general.m4:2680: AC_LINK_IFELSE is expanded from...
config/libtool.m4:1022: _LT_SYS_MODULE_PATH_AIX is expanded from...
config/libtool.m4:4171: _LT_LINKER_SHLIBS is expanded from...
config/libtool.m4:5246: _LT_LANG_C_CONFIG is expanded from...
config/libtool.m4:138: _LT_SETUP is expanded from...
config/libtool.m4:67: LT_INIT is expanded from...
configure.ac:10: the top level
configure.ac:10: warning: AC_LANG_CONFTEST: no AC_LANG_SOURCE call detected in body
../../lib/autoconf/lang.m4:194: AC_LANG_CONFTEST is expanded from...
../../lib/autoconf/general.m4:2663: _AC_LINK_IFELSE is expanded from...
../../lib/autoconf/general.m4:2680: AC_LINK_IFELSE is expanded from...
config/libtool.m4:4171: _LT_LINKER_SHLIBS is expanded from...
config/libtool.m4:5246: _LT_LANG_C_CONFIG is expanded from...
config/libtool.m4:138: _LT_SETUP is expanded from...
config/libtool.m4:67: LT_INIT is expanded from...
configure.ac:10: the top level
configure.ac:67: warning: AC_LANG_CONFTEST: no AC_LANG_SOURCE call detected in body
../../lib/autoconf/lang.m4:194: AC_LANG_CONFTEST is expanded from...
../../lib/autoconf/general.m4:2663: _AC_LINK_IFELSE is expanded from...
../../lib/autoconf/general.m4:2680: AC_LINK_IFELSE is expanded from...
config/libtool.m4:1022: _LT_SYS_MODULE_PATH_AIX is expanded from...
config/libtool.m4:5353: _LT_LANG_CXX_CONFIG is expanded from...
config/libtool.m4:785: _LT_LANG is expanded from...
config/libtool.m4:768: LT_LANG is expanded from...
configure.ac:67: the top level
autoreconf-default: configure.ac: tracing
configure.ac:10: warning: AC_LANG_CONFTEST: no AC_LANG_SOURCE call detected in body
../../lib/autoconf/lang.m4:194: AC_LANG_CONFTEST is expanded from...
../../lib/autoconf/general.m4:2663: _AC_LINK_IFELSE is expanded from...
../../lib/autoconf/general.m4:2680: AC_LINK_IFELSE is expanded from...
config/libtool.m4:1022: _LT_SYS_MODULE_PATH_AIX is expanded from...
config/libtool.m4:4171: _LT_LINKER_SHLIBS is expanded from...
config/libtool.m4:5246: _LT_LANG_C_CONFIG is expanded from...
config/libtool.m4:138: _LT_SETUP is expanded from...
config/libtool.m4:67: LT_INIT is expanded from...
configure.ac:10: the top level
configure.ac:10: warning: AC_LANG_CONFTEST: no AC_LANG_SOURCE call detected in body
../../lib/autoconf/lang.m4:194: AC_LANG_CONFTEST is expanded from...
../../lib/autoconf/general.m4:2663: _AC_LINK_IFELSE is expanded from...
../../lib/autoconf/general.m4:2680: AC_LINK_IFELSE is expanded from...
config/libtool.m4:4171: _LT_LINKER_SHLIBS is expanded from...
config/libtool.m4:5246: _LT_LANG_C_CONFIG is expanded from...
config/libtool.m4:138: _LT_SETUP is expanded from...
config/libtool.m4:67: LT_INIT is expanded from...
configure.ac:10: the top level
configure.ac:67: warning: AC_LANG_CONFTEST: no AC_LANG_SOURCE call detected in body
../../lib/autoconf/lang.m4:194: AC_LANG_CONFTEST is expanded from...
../../lib/autoconf/general.m4:2663: _AC_LINK_IFELSE is expanded from...
../../lib/autoconf/general.m4:2680: AC_LINK_IFELSE is expanded from...
config/libtool.m4:1022: _LT_SYS_MODULE_PATH_AIX is expanded from...
config/libtool.m4:5353: _LT_LANG_CXX_CONFIG is expanded from...
config/libtool.m4:785: _LT_LANG is expanded from...
config/libtool.m4:768: LT_LANG is expanded from...
configure.ac:67: the top level
autoreconf-default: running: libtoolize --force --install
libtoolize-default: putting auxiliary files in AC_CONFIG_AUX_DIR, `config'.
libtoolize-default: linking file `config/config.guess'
libtoolize-default: linking file `config/config.sub'
libtoolize-default: linking file `config/install-sh'
libtoolize-default: linking file `config/ltmain.sh'
libtoolize-default: putting macros in AC_CONFIG_MACRO_DIR, `config'.
libtoolize-default: linking file `config/libtool.m4'
libtoolize-default: linking file `config/ltoptions.m4'
libtoolize-default: linking file `config/ltsugar.m4'
libtoolize-default: linking file `config/ltversion.m4'
libtoolize-default: linking file `config/lt~obsolete.m4'
autoreconf-default: configure.ac: not using Intltool
autoreconf-default: configure.ac: not using gtk-doc
autoreconf-default: running: /usr/bin/autoconf-2.60 --force
autoreconf-default: running: /usr/bin/autoheader-2.60 --force
autoreconf-default: running: automake --add-missing --force-missing
autoreconf-default: Leaving directory `.'
+ CFLAGS='-pipe -frecord-gcc-switches -Wall -g -O2'
+ export CFLAGS
+ CXXFLAGS='-pipe -frecord-gcc-switches -Wall -g -O2'
+ export CXXFLAGS
+ FFLAGS='-pipe -frecord-gcc-switches -Wall -g -O2'
+ export FFLAGS
+ '[' -n '' ']'
++ printf %s '-pipe -frecord-gcc-switches -Wall -g -O2'
++ sed -r 's/(^|[[:space:]]+)-[^m][^[:space:]]*//g'
+ ASFLAGS=
+ export ASFLAGS
+ export lt_cv_deplibs_check_method=pass_all
+ lt_cv_deplibs_check_method=pass_all
+ readlink -e -- ./configure
+ xargs -ri dirname -- '{}'
+ xargs -ri find '{}' -type f '(' -name config.sub -or -name config.guess ')' -printf '%h/\n'
+ sort -u
+ xargs -rn1 install -pm755 -- /usr/share/gnu-config/config.sub /usr/share/gnu-config/config.guess
+ ./configure --build=x86_64-alt-linux --host=x86_64-alt-linux --prefix=/usr --exec-prefix=/usr --bindir=/usr/bin --sbindir=/usr/sbin --sysconfdir=/etc --datadir=/usr/share --includedir=/usr/include --libdir=/usr/lib64 --libexecdir=/usr/lib --localstatedir=/var/lib --sharedstatedir=/var/lib --mandir=/usr/share/man --infodir=/usr/share/info --disable-dependency-tracking --without-included-gettext
configure: WARNING: unrecognized options: --without-included-gettext
checking for a BSD-compatible install... /bin/install -c
checking whether build environment is sane... yes
checking for a thread-safe mkdir -p... /bin/mkdir -p
checking for gawk... gawk
checking whether make sets $(MAKE)... yes
checking build system type... x86_64-alt-linux-gnu
checking host system type... x86_64-alt-linux-gnu
checking how to print strings... printf
checking for style of include used by make... GNU
checking for x86_64-alt-linux-gcc... x86_64-alt-linux-gcc
checking whether the C compiler works... yes
checking for C compiler default output file name... a.out
checking for suffix of executables... 
checking whether we are cross compiling... no
checking for suffix of object files... o
checking whether we are using the GNU C compiler... yes
checking whether x86_64-alt-linux-gcc accepts -g... yes
checking for x86_64-alt-linux-gcc option to accept ISO C89... none needed
checking dependency style of x86_64-alt-linux-gcc... none
checking for a sed that does not truncate output... /bin/sed
checking for grep that handles long lines and -e... /bin/grep
checking for egrep... /bin/grep -E
checking for fgrep... /bin/grep -F
checking for ld used by x86_64-alt-linux-gcc... /usr/bin/ld
checking if the linker (/usr/bin/ld) is GNU ld... yes
checking for BSD- or MS-compatible name lister (nm)... /usr/bin/nm -B
checking the name lister (/usr/bin/nm -B) interface... BSD nm
checking whether ln -s works... yes
checking the maximum length of command line arguments... 1572864
checking whether the shell understands some XSI constructs... yes
checking whether the shell understands "+="... yes
checking how to convert x86_64-alt-linux-gnu file names to x86_64-alt-linux-gnu format... func_convert_file_noop
checking how to convert x86_64-alt-linux-gnu file names to toolchain format... func_convert_file_noop
checking for /usr/bin/ld option to reload object files... -r
checking for x86_64-alt-linux-objdump... no
checking for objdump... objdump
checking how to recognize dependent libraries... (cached) pass_all
checking for x86_64-alt-linux-dlltool... no
checking for dlltool... no
checking how to associate runtime and link libraries... printf %s\n
checking for x86_64-alt-linux-ar... no
checking for ar... ar
checking for archiver @FILE support... @
checking for x86_64-alt-linux-strip... no
checking for strip... strip
checking for x86_64-alt-linux-ranlib... no
checking for ranlib... ranlib
checking command to parse /usr/bin/nm -B output from x86_64-alt-linux-gcc object... ok
checking for sysroot... no
checking for x86_64-alt-linux-mt... no
checking for mt... no
checking if : is a manifest tool... no
checking how to run the C preprocessor... x86_64-alt-linux-gcc -E
checking for ANSI C header files... yes
checking for sys/types.h... yes
checking for sys/stat.h... yes
checking for stdlib.h... yes
checking for string.h... yes
checking for memory.h... yes
checking for strings.h... yes
checking for inttypes.h... yes
checking for stdint.h... yes
checking for unistd.h... yes
checking for dlfcn.h... yes
checking for objdir... .libs
checking if x86_64-alt-linux-gcc supports -fno-rtti -fno-exceptions... no
checking for x86_64-alt-linux-gcc option to produce PIC... -fPIC -DPIC
checking if x86_64-alt-linux-gcc PIC flag -fPIC -DPIC works... yes
checking if x86_64-alt-linux-gcc static flag -static works... no
checking if x86_64-alt-linux-gcc supports -c -o file.o... yes
checking if x86_64-alt-linux-gcc supports -c -o file.o... (cached) yes
checking whether the x86_64-alt-linux-gcc linker (/usr/bin/ld -m elf_x86_64) supports shared libraries... yes
checking whether -lc should be explicitly linked in... no
checking dynamic linker characteristics... GNU/Linux ld.so
checking how to hardcode library paths into programs... immediate
checking for shl_load... no
checking for shl_load in -ldld... no
checking for dlopen... no
checking for dlopen in -ldl... yes
checking whether a program can dlopen itself... yes
checking whether a statically linked program can dlopen itself... yes
checking whether stripping libraries is possible... yes
checking if libtool supports shared libraries... yes
checking whether to build shared libraries... yes
checking whether to build static libraries... yes
checking for x86_64-alt-linux-windres... no
checking for windres... no
checking for x86_64-alt-linux-gcc... (cached) x86_64-alt-linux-gcc
checking whether we are using the GNU C compiler... (cached) yes
checking whether x86_64-alt-linux-gcc accepts -g... (cached) yes
checking for x86_64-alt-linux-gcc option to accept ISO C89... (cached) none needed
checking dependency style of x86_64-alt-linux-gcc... (cached) none
checking whether x86_64-alt-linux-gcc and cc understand -c and -o together... yes
checking for x86_64-alt-linux-g++... x86_64-alt-linux-g++
checking whether we are using the GNU C++ compiler... yes
checking whether x86_64-alt-linux-g++ accepts -g... yes
checking dependency style of x86_64-alt-linux-g++... none
checking how to run the C++ preprocessor... x86_64-alt-linux-g++ -E
checking for ld used by x86_64-alt-linux-g++... /usr/bin/ld -m elf_x86_64
checking if the linker (/usr/bin/ld -m elf_x86_64) is GNU ld... yes
checking whether the x86_64-alt-linux-g++ linker (/usr/bin/ld -m elf_x86_64) supports shared libraries... yes
checking for x86_64-alt-linux-g++ option to produce PIC... -fPIC -DPIC
checking if x86_64-alt-linux-g++ PIC flag -fPIC -DPIC works... yes
checking if x86_64-alt-linux-g++ static flag -static works... no
checking if x86_64-alt-linux-g++ supports -c -o file.o... yes
checking if x86_64-alt-linux-g++ supports -c -o file.o... (cached) yes
checking whether the x86_64-alt-linux-g++ linker (/usr/bin/ld -m elf_x86_64) supports shared libraries... yes
checking dynamic linker characteristics... (cached) GNU/Linux ld.so
checking how to hardcode library paths into programs... immediate
checking for x86_64-alt-linux-pkg-config... no
checking for pkg-config... /usr/bin/pkg-config
checking pkg-config is at least version 0.9.0... yes
checking for xmlto... no
checking whether to build EAN symbologies... yes
checking whether to build Code 128 symbology... yes
checking whether to build Code 39 symbology... yes
checking whether to build PDF417 symbology... no
checking whether to build Interleaved 2 of 5 symbology... yes
checking whether to build QR Code... yes
checking for library containing clock_gettime... none required
checking for ld used by x86_64-alt-linux-gcc... /usr/bin/ld -m elf_x86_64
checking if the linker (/usr/bin/ld -m elf_x86_64) is GNU ld... yes
checking for shared library run path origin... done
checking for iconv... yes
checking for working iconv... yes
checking for iconv declaration... 
         extern size_t iconv (iconv_t cd, char * *inbuf, size_t *inbytesleft, char * *outbuf, size_t *outbytesleft);
checking poll.h usability... yes
checking poll.h presence... yes
checking for poll.h... yes
checking pthread.h usability... yes
checking pthread.h presence... yes
checking for pthread.h... yes
checking for pthread_create in -lpthread... yes
checking for v4l2_open in -lv4l2... yes
checking for X... libraries , headers 
checking for gethostbyname... yes
checking for connect... yes
checking for remove... yes
checking for shmat... yes
checking for IceConnectionNumber in -lICE... yes
checking for X11/extensions/XShm.h... yes
checking for XShmQueryVersion in -lXext... yes
checking for X11/extensions/Xvlib.h... yes
checking for XvQueryExtension in -lXv... yes
checking jpeglib.h usability... no
checking jpeglib.h presence... no
checking for jpeglib.h... no
checking jerror.h usability... no
checking jerror.h presence... no
checking for jerror.h... no
checking for jpeg_read_header in -ljpeg... no
checking for MagickWand >= 6.2.6... yes
configure: using ImageMagick version 6.9.10
checking wand/MagickWand.h usability... yes
checking wand/MagickWand.h presence... yes
checking for wand/MagickWand.h... yes
checking for gtk+-2.0 gthread-2.0... yes
configure: using GTK+ version 2.24.32
configure: using gthread-2.0 version 2.58.3
checking for a Python interpreter with version >= 2.3.5... python
checking for python... /usr/bin/python
checking for python version... 2.7
checking for python platform... linux2
checking for python script directory... ${prefix}/lib/python2.7/site-packages
checking for python extension module directory... ${exec_prefix}/lib64/python2.7/site-packages
checking for pygtk-2.0... yes
checking for pygtk-codegen-2.0... pygtk-codegen-2.0
checking for QtCore >= 4 QtGui >= 4... yes
configure: using moc from /usr/lib64/qt4/bin/moc
configure: using Qt version 4.8.7
checking whether to enable assertions... yes
checking fcntl.h usability... yes
checking fcntl.h presence... yes
checking for fcntl.h... yes
checking features.h usability... yes
checking features.h presence... yes
checking for features.h... yes
checking for inttypes.h... (cached) yes
checking for stdlib.h... (cached) yes
checking for string.h... (cached) yes
checking for unistd.h... (cached) yes
checking sys/ioctl.h usability... yes
checking sys/ioctl.h presence... yes
checking for sys/ioctl.h... yes
checking sys/time.h usability... yes
checking sys/time.h presence... yes
checking for sys/time.h... yes
checking sys/times.h usability... yes
checking sys/times.h presence... yes
checking for sys/times.h... yes
checking sys/ipc.h usability... yes
checking sys/ipc.h presence... yes
checking for sys/ipc.h... yes
checking sys/shm.h usability... yes
checking sys/shm.h presence... yes
checking for sys/shm.h... yes
checking sys/mman.h usability... yes
checking sys/mman.h presence... yes
checking for sys/mman.h... yes
checking for int32_t... yes
checking for uint32_t... yes
checking for uint8_t... yes
checking for uintptr_t... yes
checking for an ANSI C-conforming const... yes
checking for inline... inline
checking for stdlib.h... (cached) yes
checking for unistd.h... (cached) yes
checking for sys/param.h... yes
checking for getpagesize... yes
checking for working mmap... yes
checking for memset... yes
checking for atexit... yes
checking for setenv... yes
configure: creating ./config.status
config.status: creating Makefile
config.status: creating zbar.pc
config.status: creating zbar-gtk.pc
config.status: creating zbar-qt.pc
config.status: creating doc/doxygen.conf
config.status: creating include/config.h
config.status: executing depfiles commands
config.status: executing libtool commands
config.status: executing doc/version.xml commands
config.status: executing doc/reldate.xml commands
configure: WARNING: unrecognized options: --without-included-gettext

please verify that the detected configuration matches your expectations:
------------------------------------------------------------------------
X                 --with-x=yes
pthreads          --enable-pthread=yes
v4l2              --enable-video=yes
jpeg              --with-jpeg=no
        => JPEG image conversions will *NOT* be supported
Magick++          --with-imagemagick=yes
Python            --with-python=yes
GTK+              --with-gtk=yes
Qt4               --with-qt=yes

+ make -j8
make: Entering directory '/usr/src/RPM/BUILD/zbar-0.10'
/usr/lib64/qt4/bin/moc -Iqt -DQT_SHARED -I/usr/include/qt4 -I/usr/include/qt4/QtGui -I/usr/include/qt4 -I/usr/include/qt4/QtCore -I./include include/zbar/QZBar.h -o qt/moc_QZBar.cpp
make: Leaving directory '/usr/src/RPM/BUILD/zbar-0.10'
make: Entering directory '/usr/src/RPM/BUILD/zbar-0.10'
/usr/lib64/qt4/bin/moc -Iqt -DQT_SHARED -I/usr/include/qt4 -I/usr/include/qt4/QtGui -I/usr/include/qt4 -I/usr/include/qt4/QtCore -I./include qt/QZBarThread.h -o qt/moc_QZBarThread.cpp
make: Leaving directory '/usr/src/RPM/BUILD/zbar-0.10'
make: Entering directory '/usr/src/RPM/BUILD/zbar-0.10'
/usr/lib64/qt4/bin/moc -i -Itest -DQT_SHARED -I/usr/include/qt4 -I/usr/include/qt4/QtGui -I/usr/include/qt4 -I/usr/include/qt4/QtCore -I./include test/test_qt.cpp -o test/moc_test_qt.h
make: Leaving directory '/usr/src/RPM/BUILD/zbar-0.10'
make: Entering directory '/usr/src/RPM/BUILD/zbar-0.10'
/usr/bin/python /usr/share/pygobject/2.0/codegen/h2def.py include/zbar/zbargtk.h | \
/bin/sed -e 's/Z_TYPE_BAR_/ZBAR_TYPE_/' > pygtk/zbarpygtk.defs
make: Leaving directory '/usr/src/RPM/BUILD/zbar-0.10'
make: Entering directory '/usr/src/RPM/BUILD/zbar-0.10'
/usr/bin/glib-genmarshal --g-fatal-warnings --prefix=zbar_marshal \
    --header gtk/zbarmarshal.list > gtk/zbarmarshal.h
INFO: Reading gtk/zbarmarshal.list...
make: Leaving directory '/usr/src/RPM/BUILD/zbar-0.10'
make: Entering directory '/usr/src/RPM/BUILD/zbar-0.10'
pygtk-codegen-2.0 --prefix zbarpygtk \
            --register /usr/share/pygtk/2.0/defs/gdk-types.defs \
    --override ./pygtk/zbarpygtk.override pygtk/zbarpygtk.defs > pygtk/zbarpygtk.c
/usr/bin/pygtk-codegen-2.0: line 7: /dev/stderr: No such file or directory
/usr/bin/pygtk-codegen-2.0: line 8: /dev/stderr: No such file or directory
Warning: Constructor for ZBarGtk needs to be updated to new API
         See http://live.gnome.org/PyGTK_2fWhatsNew28#update-constructors
***INFO*** There are no declared global functions.
***INFO*** The coverage of methods is 100.00% (6/6)
***INFO*** There are no declared virtual proxies.
***INFO*** There are no declared virtual accessors.
***INFO*** There are no declared interface proxies.
make: Leaving directory '/usr/src/RPM/BUILD/zbar-0.10'
make: Entering directory '/usr/src/RPM/BUILD/zbar-0.10'
/usr/bin/glib-genmarshal --g-fatal-warnings --prefix=zbar_marshal \
    --body gtk/zbarmarshal.list > gtk/zbarmarshal.c
INFO: Reading gtk/zbarmarshal.list...
make: Leaving directory '/usr/src/RPM/BUILD/zbar-0.10'
make  all-am
make[1]: Entering directory '/usr/src/RPM/BUILD/zbar-0.10'
/bin/sh ./libtool  --tag=CC   --mode=compile x86_64-alt-linux-gcc -DHAVE_CONFIG_H -I. -I./include  -I./zbar -I./include    -Wall -Wno-parentheses -pipe -frecord-gcc-switches -Wall -g -O2 -c -o zbar/zbar_libzbar_la-refcnt.lo `test -f 'zbar/refcnt.c' || echo './'`zbar/refcnt.c
libtool: compile:  x86_64-alt-linux-gcc -DHAVE_CONFIG_H -I. -I./include -I./zbar -I./include -Wall -Wno-parentheses -pipe -frecord-gcc-switches -Wall -g -O2 -c zbar/refcnt.c  -fPIC -DPIC -o zbar/.libs/zbar_libzbar_la-refcnt.o
libtool: compile:  x86_64-alt-linux-gcc -DHAVE_CONFIG_H -I. -I./include -I./zbar -I./include -Wall -Wno-parentheses -pipe -frecord-gcc-switches -Wall -g -O2 -c zbar/refcnt.c -o zbar/zbar_libzbar_la-refcnt.o >/dev/null 2>&1
make[1]: Leaving directory '/usr/src/RPM/BUILD/zbar-0.10'
make[1]: Entering directory '/usr/src/RPM/BUILD/zbar-0.10'
/bin/sh ./libtool  --tag=CC   --mode=compile x86_64-alt-linux-gcc -DHAVE_CONFIG_H -I. -I./include  -I./zbar -I./include    -Wall -Wno-parentheses -pipe -frecord-gcc-switches -Wall -g -O2 -c -o zbar/zbar_libzbar_la-decoder.lo `test -f 'zbar/decoder.c' || echo './'`zbar/decoder.c
libtool: compile:  x86_64-alt-linux-gcc -DHAVE_CONFIG_H -I. -I./include -I./zbar -I./include -Wall -Wno-parentheses -pipe -frecord-gcc-switches -Wall -g -O2 -c zbar/decoder.c  -fPIC -DPIC -o zbar/.libs/zbar_libzbar_la-decoder.o
libtool: compile:  x86_64-alt-linux-gcc -DHAVE_CONFIG_H -I. -I./include -I./zbar -I./include -Wall -Wno-parentheses -pipe -frecord-gcc-switches -Wall -g -O2 -c zbar/decoder.c -o zbar/zbar_libzbar_la-decoder.o >/dev/null 2>&1
make[1]: Leaving directory '/usr/src/RPM/BUILD/zbar-0.10'
make[1]: Entering directory '/usr/src/RPM/BUILD/zbar-0.10'
/bin/sh ./libtool  --tag=CC   --mode=compile x86_64-alt-linux-gcc -DHAVE_CONFIG_H -I. -I./include  -I./zbar -I./include    -Wall -Wno-parentheses -pipe -frecord-gcc-switches -Wall -g -O2 -c -o zbar/zbar_libzbar_la-scanner.lo `test -f 'zbar/scanner.c' || echo './'`zbar/scanner.c
libtool: compile:  x86_64-alt-linux-gcc -DHAVE_CONFIG_H -I. -I./include -I./zbar -I./include -Wall -Wno-parentheses -pipe -frecord-gcc-switches -Wall -g -O2 -c zbar/scanner.c  -fPIC -DPIC -o zbar/.libs/zbar_libzbar_la-scanner.o
libtool: compile:  x86_64-alt-linux-gcc -DHAVE_CONFIG_H -I. -I./include -I./zbar -I./include -Wall -Wno-parentheses -pipe -frecord-gcc-switches -Wall -g -O2 -c zbar/scanner.c -o zbar/zbar_libzbar_la-scanner.o >/dev/null 2>&1
make[1]: Leaving directory '/usr/src/RPM/BUILD/zbar-0.10'
make[1]: Entering directory '/usr/src/RPM/BUILD/zbar-0.10'
/bin/sh ./libtool  --tag=CC   --mode=compile x86_64-alt-linux-gcc -DHAVE_CONFIG_H -I. -I./include  -I./zbar -I./include    -Wall -Wno-parentheses -pipe -frecord-gcc-switches -Wall -g -O2 -c -o zbar/zbar_libzbar_la-error.lo `test -f 'zbar/error.c' || echo './'`zbar/error.c
libtool: compile:  x86_64-alt-linux-gcc -DHAVE_CONFIG_H -I. -I./include -I./zbar -I./include -Wall -Wno-parentheses -pipe -frecord-gcc-switches -Wall -g -O2 -c zbar/error.c  -fPIC -DPIC -o zbar/.libs/zbar_libzbar_la-error.o
zbar/error.c:39:19: warning: duplicate 'const' declaration specifier [-Wduplicate-decl-specifier]
 static const char const * err_str[] = {
                   ^~~~~
libtool: compile:  x86_64-alt-linux-gcc -DHAVE_CONFIG_H -I. -I./include -I./zbar -I./include -Wall -Wno-parentheses -pipe -frecord-gcc-switches -Wall -g -O2 -c zbar/error.c -o zbar/zbar_libzbar_la-error.o >/dev/null 2>&1
make[1]: Leaving directory '/usr/src/RPM/BUILD/zbar-0.10'
make[1]: Entering directory '/usr/src/RPM/BUILD/zbar-0.10'
/bin/sh ./libtool  --tag=CC   --mode=compile x86_64-alt-linux-gcc -DHAVE_CONFIG_H -I. -I./include  -I./zbar -I./include    -Wall -Wno-parentheses -pipe -frecord-gcc-switches -Wall -g -O2 -c -o zbar/zbar_libzbar_la-video.lo `test -f 'zbar/video.c' || echo './'`zbar/video.c
libtool: compile:  x86_64-alt-linux-gcc -DHAVE_CONFIG_H -I. -I./include -I./zbar -I./include -Wall -Wno-parentheses -pipe -frecord-gcc-switches -Wall -g -O2 -c zbar/video.c  -fPIC -DPIC -o zbar/.libs/zbar_libzbar_la-video.o
libtool: compile:  x86_64-alt-linux-gcc -DHAVE_CONFIG_H -I. -I./include -I./zbar -I./include -Wall -Wno-parentheses -pipe -frecord-gcc-switches -Wall -g -O2 -c zbar/video.c -o zbar/zbar_libzbar_la-video.o >/dev/null 2>&1
make[1]: Leaving directory '/usr/src/RPM/BUILD/zbar-0.10'
make[1]: Entering directory '/usr/src/RPM/BUILD/zbar-0.10'
/bin/sh ./libtool  --tag=CC   --mode=compile x86_64-alt-linux-gcc -DHAVE_CONFIG_H -I. -I./include  -I./zbar -I./include    -Wall -Wno-parentheses -pipe -frecord-gcc-switches -Wall -g -O2 -c -o zbar/zbar_libzbar_la-config.lo `test -f 'zbar/config.c' || echo './'`zbar/config.c
libtool: compile:  x86_64-alt-linux-gcc -DHAVE_CONFIG_H -I. -I./include -I./zbar -I./include -Wall -Wno-parentheses -pipe -frecord-gcc-switches -Wall -g -O2 -c zbar/config.c  -fPIC -DPIC -o zbar/.libs/zbar_libzbar_la-config.o
libtool: compile:  x86_64-alt-linux-gcc -DHAVE_CONFIG_H -I. -I./include -I./zbar -I./include -Wall -Wno-parentheses -pipe -frecord-gcc-switches -Wall -g -O2 -c zbar/config.c -o zbar/zbar_libzbar_la-config.o >/dev/null 2>&1
make[1]: Leaving directory '/usr/src/RPM/BUILD/zbar-0.10'
make[1]: Entering directory '/usr/src/RPM/BUILD/zbar-0.10'
/bin/sh ./libtool  --tag=CC   --mode=compile x86_64-alt-linux-gcc -DHAVE_CONFIG_H -I. -I./include  -I./zbar -I./include    -Wall -Wno-parentheses -pipe -frecord-gcc-switches -Wall -g -O2 -c -o zbar/processor/zbar_libzbar_la-posix.lo `test -f 'zbar/processor/posix.c' || echo './'`zbar/processor/posix.c
libtool: compile:  x86_64-alt-linux-gcc -DHAVE_CONFIG_H -I. -I./include -I./zbar -I./include -Wall -Wno-parentheses -pipe -frecord-gcc-switches -Wall -g -O2 -c zbar/processor/posix.c  -fPIC -DPIC -o zbar/processor/.libs/zbar_libzbar_la-posix.o
libtool: compile:  x86_64-alt-linux-gcc -DHAVE_CONFIG_H -I. -I./include -I./zbar -I./include -Wall -Wno-parentheses -pipe -frecord-gcc-switches -Wall -g -O2 -c zbar/processor/posix.c -o zbar/processor/zbar_libzbar_la-posix.o >/dev/null 2>&1
make[1]: Leaving directory '/usr/src/RPM/BUILD/zbar-0.10'
make[1]: Entering directory '/usr/src/RPM/BUILD/zbar-0.10'
/bin/sh ./libtool  --tag=CC   --mode=compile x86_64-alt-linux-gcc -DHAVE_CONFIG_H -I. -I./include  -I./zbar -I./include    -Wall -Wno-parentheses -pipe -frecord-gcc-switches -Wall -g -O2 -c -o zbar/zbar_libzbar_la-image.lo `test -f 'zbar/image.c' || echo './'`zbar/image.c
libtool: compile:  x86_64-alt-linux-gcc -DHAVE_CONFIG_H -I. -I./include -I./zbar -I./include -Wall -Wno-parentheses -pipe -frecord-gcc-switches -Wall -g -O2 -c zbar/image.c  -fPIC -DPIC -o zbar/.libs/zbar_libzbar_la-image.o
libtool: compile:  x86_64-alt-linux-gcc -DHAVE_CONFIG_H -I. -I./include -I./zbar -I./include -Wall -Wno-parentheses -pipe -frecord-gcc-switches -Wall -g -O2 -c zbar/image.c -o zbar/zbar_libzbar_la-image.o >/dev/null 2>&1
make[1]: Leaving directory '/usr/src/RPM/BUILD/zbar-0.10'
make[1]: Entering directory '/usr/src/RPM/BUILD/zbar-0.10'
/bin/sh ./libtool  --tag=CC   --mode=compile x86_64-alt-linux-gcc -DHAVE_CONFIG_H -I. -I./include  -I./zbar -I./include    -Wall -Wno-parentheses -pipe -frecord-gcc-switches -Wall -g -O2 -c -o zbar/zbar_libzbar_la-window.lo `test -f 'zbar/window.c' || echo './'`zbar/window.c
libtool: compile:  x86_64-alt-linux-gcc -DHAVE_CONFIG_H -I. -I./include -I./zbar -I./include -Wall -Wno-parentheses -pipe -frecord-gcc-switches -Wall -g -O2 -c zbar/window.c  -fPIC -DPIC -o zbar/.libs/zbar_libzbar_la-window.o
libtool: compile:  x86_64-alt-linux-gcc -DHAVE_CONFIG_H -I. -I./include -I./zbar -I./include -Wall -Wno-parentheses -pipe -frecord-gcc-switches -Wall -g -O2 -c zbar/window.c -o zbar/zbar_libzbar_la-window.o >/dev/null 2>&1
make[1]: Leaving directory '/usr/src/RPM/BUILD/zbar-0.10'
make[1]: Entering directory '/usr/src/RPM/BUILD/zbar-0.10'
/bin/sh ./libtool  --tag=CC   --mode=compile x86_64-alt-linux-gcc -DHAVE_CONFIG_H -I. -I./include  -I./zbar -I./include    -Wall -Wno-parentheses -pipe -frecord-gcc-switches -Wall -g -O2 -c -o zbar/processor/zbar_libzbar_la-x.lo `test -f 'zbar/processor/x.c' || echo './'`zbar/processor/x.c
libtool: compile:  x86_64-alt-linux-gcc -DHAVE_CONFIG_H -I. -I./include -I./zbar -I./include -Wall -Wno-parentheses -pipe -frecord-gcc-switches -Wall -g -O2 -c zbar/processor/x.c  -fPIC -DPIC -o zbar/processor/.libs/zbar_libzbar_la-x.o
libtool: compile:  x86_64-alt-linux-gcc -DHAVE_CONFIG_H -I. -I./include -I./zbar -I./include -Wall -Wno-parentheses -pipe -frecord-gcc-switches -Wall -g -O2 -c zbar/processor/x.c -o zbar/processor/zbar_libzbar_la-x.o >/dev/null 2>&1
make[1]: Leaving directory '/usr/src/RPM/BUILD/zbar-0.10'
make[1]: Entering directory '/usr/src/RPM/BUILD/zbar-0.10'
/bin/sh ./libtool  --tag=CC   --mode=compile x86_64-alt-linux-gcc -DHAVE_CONFIG_H -I. -I./include  -I./zbar -I./include    -Wall -Wno-parentheses -pipe -frecord-gcc-switches -Wall -g -O2 -c -o zbar/zbar_libzbar_la-symbol.lo `test -f 'zbar/symbol.c' || echo './'`zbar/symbol.c
libtool: compile:  x86_64-alt-linux-gcc -DHAVE_CONFIG_H -I. -I./include -I./zbar -I./include -Wall -Wno-parentheses -pipe -frecord-gcc-switches -Wall -g -O2 -c zbar/symbol.c  -fPIC -DPIC -o zbar/.libs/zbar_libzbar_la-symbol.o
libtool: compile:  x86_64-alt-linux-gcc -DHAVE_CONFIG_H -I. -I./include -I./zbar -I./include -Wall -Wno-parentheses -pipe -frecord-gcc-switches -Wall -g -O2 -c zbar/symbol.c -o zbar/zbar_libzbar_la-symbol.o >/dev/null 2>&1
make[1]: Leaving directory '/usr/src/RPM/BUILD/zbar-0.10'
make[1]: Entering directory '/usr/src/RPM/BUILD/zbar-0.10'
/bin/sh ./libtool  --tag=CC   --mode=compile x86_64-alt-linux-gcc -DHAVE_CONFIG_H -I. -I./include  -I./zbar -I./include    -Wall -Wno-parentheses -pipe -frecord-gcc-switches -Wall -g -O2 -c -o zbar/processor/zbar_libzbar_la-lock.lo `test -f 'zbar/processor/lock.c' || echo './'`zbar/processor/lock.c
libtool: compile:  x86_64-alt-linux-gcc -DHAVE_CONFIG_H -I. -I./include -I./zbar -I./include -Wall -Wno-parentheses -pipe -frecord-gcc-switches -Wall -g -O2 -c zbar/processor/lock.c  -fPIC -DPIC -o zbar/processor/.libs/zbar_libzbar_la-lock.o
libtool: compile:  x86_64-alt-linux-gcc -DHAVE_CONFIG_H -I. -I./include -I./zbar -I./include -Wall -Wno-parentheses -pipe -frecord-gcc-switches -Wall -g -O2 -c zbar/processor/lock.c -o zbar/processor/zbar_libzbar_la-lock.o >/dev/null 2>&1
make[1]: Leaving directory '/usr/src/RPM/BUILD/zbar-0.10'
make[1]: Entering directory '/usr/src/RPM/BUILD/zbar-0.10'
/bin/sh ./libtool  --tag=CC   --mode=compile x86_64-alt-linux-gcc -DHAVE_CONFIG_H -I. -I./include  -I./zbar -I./include    -Wall -Wno-parentheses -pipe -frecord-gcc-switches -Wall -g -O2 -c -o zbar/zbar_libzbar_la-img_scanner.lo `test -f 'zbar/img_scanner.c' || echo './'`zbar/img_scanner.c
libtool: compile:  x86_64-alt-linux-gcc -DHAVE_CONFIG_H -I. -I./include -I./zbar -I./include -Wall -Wno-parentheses -pipe -frecord-gcc-switches -Wall -g -O2 -c zbar/img_scanner.c  -fPIC -DPIC -o zbar/.libs/zbar_libzbar_la-img_scanner.o
libtool: compile:  x86_64-alt-linux-gcc -DHAVE_CONFIG_H -I. -I./include -I./zbar -I./include -Wall -Wno-parentheses -pipe -frecord-gcc-switches -Wall -g -O2 -c zbar/img_scanner.c -o zbar/zbar_libzbar_la-img_scanner.o >/dev/null 2>&1
make[1]: Leaving directory '/usr/src/RPM/BUILD/zbar-0.10'
make[1]: Entering directory '/usr/src/RPM/BUILD/zbar-0.10'
/bin/sh ./libtool  --tag=CC   --mode=compile x86_64-alt-linux-gcc -DHAVE_CONFIG_H -I. -I./include  -I./zbar -I./include    -Wall -Wno-parentheses -pipe -frecord-gcc-switches -Wall -g -O2 -c -o zbar/zbar_libzbar_la-processor.lo `test -f 'zbar/processor.c' || echo './'`zbar/processor.c
libtool: compile:  x86_64-alt-linux-gcc -DHAVE_CONFIG_H -I. -I./include -I./zbar -I./include -Wall -Wno-parentheses -pipe -frecord-gcc-switches -Wall -g -O2 -c zbar/processor.c  -fPIC -DPIC -o zbar/.libs/zbar_libzbar_la-processor.o
libtool: compile:  x86_64-alt-linux-gcc -DHAVE_CONFIG_H -I. -I./include -I./zbar -I./include -Wall -Wno-parentheses -pipe -frecord-gcc-switches -Wall -g -O2 -c zbar/processor.c -o zbar/zbar_libzbar_la-processor.o >/dev/null 2>&1
make[1]: Leaving directory '/usr/src/RPM/BUILD/zbar-0.10'
make[1]: Entering directory '/usr/src/RPM/BUILD/zbar-0.10'
/bin/sh ./libtool  --tag=CC   --mode=compile x86_64-alt-linux-gcc -DHAVE_CONFIG_H -I. -I./include  -I./zbar -I./include    -Wall -Wno-parentheses -pipe -frecord-gcc-switches -Wall -g -O2 -c -o zbar/decoder/zbar_libzbar_la-i25.lo `test -f 'zbar/decoder/i25.c' || echo './'`zbar/decoder/i25.c
libtool: compile:  x86_64-alt-linux-gcc -DHAVE_CONFIG_H -I. -I./include -I./zbar -I./include -Wall -Wno-parentheses -pipe -frecord-gcc-switches -Wall -g -O2 -c zbar/decoder/i25.c  -fPIC -DPIC -o zbar/decoder/.libs/zbar_libzbar_la-i25.o
libtool: compile:  x86_64-alt-linux-gcc -DHAVE_CONFIG_H -I. -I./include -I./zbar -I./include -Wall -Wno-parentheses -pipe -frecord-gcc-switches -Wall -g -O2 -c zbar/decoder/i25.c -o zbar/decoder/zbar_libzbar_la-i25.o >/dev/null 2>&1
make[1]: Leaving directory '/usr/src/RPM/BUILD/zbar-0.10'
make[1]: Entering directory '/usr/src/RPM/BUILD/zbar-0.10'
/bin/sh ./libtool  --tag=CC   --mode=compile x86_64-alt-linux-gcc -DHAVE_CONFIG_H -I. -I./include  -I./zbar -I./include    -Wall -Wno-parentheses -pipe -frecord-gcc-switches -Wall -g -O2 -c -o zbar/decoder/zbar_libzbar_la-code39.lo `test -f 'zbar/decoder/code39.c' || echo './'`zbar/decoder/code39.c
libtool: compile:  x86_64-alt-linux-gcc -DHAVE_CONFIG_H -I. -I./include -I./zbar -I./include -Wall -Wno-parentheses -pipe -frecord-gcc-switches -Wall -g -O2 -c zbar/decoder/code39.c  -fPIC -DPIC -o zbar/decoder/.libs/zbar_libzbar_la-code39.o
libtool: compile:  x86_64-alt-linux-gcc -DHAVE_CONFIG_H -I. -I./include -I./zbar -I./include -Wall -Wno-parentheses -pipe -frecord-gcc-switches -Wall -g -O2 -c zbar/decoder/code39.c -o zbar/decoder/zbar_libzbar_la-code39.o >/dev/null 2>&1
make[1]: Leaving directory '/usr/src/RPM/BUILD/zbar-0.10'
make[1]: Entering directory '/usr/src/RPM/BUILD/zbar-0.10'
/bin/sh ./libtool  --tag=CC   --mode=compile x86_64-alt-linux-gcc -DHAVE_CONFIG_H -I. -I./include  -I./zbar -I./include    -Wall -Wno-parentheses -pipe -frecord-gcc-switches -Wall -g -O2 -c -o zbar/decoder/zbar_libzbar_la-code128.lo `test -f 'zbar/decoder/code128.c' || echo './'`zbar/decoder/code128.c
libtool: compile:  x86_64-alt-linux-gcc -DHAVE_CONFIG_H -I. -I./include -I./zbar -I./include -Wall -Wno-parentheses -pipe -frecord-gcc-switches -Wall -g -O2 -c zbar/decoder/code128.c  -fPIC -DPIC -o zbar/decoder/.libs/zbar_libzbar_la-code128.o
libtool: compile:  x86_64-alt-linux-gcc -DHAVE_CONFIG_H -I. -I./include -I./zbar -I./include -Wall -Wno-parentheses -pipe -frecord-gcc-switches -Wall -g -O2 -c zbar/decoder/code128.c -o zbar/decoder/zbar_libzbar_la-code128.o >/dev/null 2>&1
make[1]: Leaving directory '/usr/src/RPM/BUILD/zbar-0.10'
make[1]: Entering directory '/usr/src/RPM/BUILD/zbar-0.10'
/bin/sh ./libtool  --tag=CC   --mode=compile x86_64-alt-linux-gcc -DHAVE_CONFIG_H -I. -I./include  -I./zbar -I./include    -Wall -Wno-parentheses -pipe -frecord-gcc-switches -Wall -g -O2 -c -o zbar/decoder/zbar_libzbar_la-qr_finder.lo `test -f 'zbar/decoder/qr_finder.c' || echo './'`zbar/decoder/qr_finder.c
libtool: compile:  x86_64-alt-linux-gcc -DHAVE_CONFIG_H -I. -I./include -I./zbar -I./include -Wall -Wno-parentheses -pipe -frecord-gcc-switches -Wall -g -O2 -c zbar/decoder/qr_finder.c  -fPIC -DPIC -o zbar/decoder/.libs/zbar_libzbar_la-qr_finder.o
libtool: compile:  x86_64-alt-linux-gcc -DHAVE_CONFIG_H -I. -I./include -I./zbar -I./include -Wall -Wno-parentheses -pipe -frecord-gcc-switches -Wall -g -O2 -c zbar/decoder/qr_finder.c -o zbar/decoder/zbar_libzbar_la-qr_finder.o >/dev/null 2>&1
make[1]: Leaving directory '/usr/src/RPM/BUILD/zbar-0.10'
make[1]: Entering directory '/usr/src/RPM/BUILD/zbar-0.10'
/bin/sh ./libtool  --tag=CC   --mode=compile x86_64-alt-linux-gcc -DHAVE_CONFIG_H -I. -I./include  -I./zbar -I./include    -Wall -Wno-parentheses -pipe -frecord-gcc-switches -Wall -g -O2 -c -o zbar/qrcode/zbar_libzbar_la-binarize.lo `test -f 'zbar/qrcode/binarize.c' || echo './'`zbar/qrcode/binarize.c
libtool: compile:  x86_64-alt-linux-gcc -DHAVE_CONFIG_H -I. -I./include -I./zbar -I./include -Wall -Wno-parentheses -pipe -frecord-gcc-switches -Wall -g -O2 -c zbar/qrcode/binarize.c  -fPIC -DPIC -o zbar/qrcode/.libs/zbar_libzbar_la-binarize.o
libtool: compile:  x86_64-alt-linux-gcc -DHAVE_CONFIG_H -I. -I./include -I./zbar -I./include -Wall -Wno-parentheses -pipe -frecord-gcc-switches -Wall -g -O2 -c zbar/qrcode/binarize.c -o zbar/qrcode/zbar_libzbar_la-binarize.o >/dev/null 2>&1
make[1]: Leaving directory '/usr/src/RPM/BUILD/zbar-0.10'
make[1]: Entering directory '/usr/src/RPM/BUILD/zbar-0.10'
/bin/sh ./libtool  --tag=CC   --mode=compile x86_64-alt-linux-gcc -DHAVE_CONFIG_H -I. -I./include  -I./zbar -I./include    -Wall -Wno-parentheses -pipe -frecord-gcc-switches -Wall -g -O2 -c -o zbar/qrcode/zbar_libzbar_la-bch15_5.lo `test -f 'zbar/qrcode/bch15_5.c' || echo './'`zbar/qrcode/bch15_5.c
libtool: compile:  x86_64-alt-linux-gcc -DHAVE_CONFIG_H -I. -I./include -I./zbar -I./include -Wall -Wno-parentheses -pipe -frecord-gcc-switches -Wall -g -O2 -c zbar/qrcode/bch15_5.c  -fPIC -DPIC -o zbar/qrcode/.libs/zbar_libzbar_la-bch15_5.o
libtool: compile:  x86_64-alt-linux-gcc -DHAVE_CONFIG_H -I. -I./include -I./zbar -I./include -Wall -Wno-parentheses -pipe -frecord-gcc-switches -Wall -g -O2 -c zbar/qrcode/bch15_5.c -o zbar/qrcode/zbar_libzbar_la-bch15_5.o >/dev/null 2>&1
make[1]: Leaving directory '/usr/src/RPM/BUILD/zbar-0.10'
make[1]: Entering directory '/usr/src/RPM/BUILD/zbar-0.10'
/bin/sh ./libtool  --tag=CC   --mode=compile x86_64-alt-linux-gcc -DHAVE_CONFIG_H -I. -I./include  -I./zbar -I./include    -Wall -Wno-parentheses -pipe -frecord-gcc-switches -Wall -g -O2 -c -o zbar/qrcode/zbar_libzbar_la-util.lo `test -f 'zbar/qrcode/util.c' || echo './'`zbar/qrcode/util.c
libtool: compile:  x86_64-alt-linux-gcc -DHAVE_CONFIG_H -I. -I./include -I./zbar -I./include -Wall -Wno-parentheses -pipe -frecord-gcc-switches -Wall -g -O2 -c zbar/qrcode/util.c  -fPIC -DPIC -o zbar/qrcode/.libs/zbar_libzbar_la-util.o
libtool: compile:  x86_64-alt-linux-gcc -DHAVE_CONFIG_H -I. -I./include -I./zbar -I./include -Wall -Wno-parentheses -pipe -frecord-gcc-switches -Wall -g -O2 -c zbar/qrcode/util.c -o zbar/qrcode/zbar_libzbar_la-util.o >/dev/null 2>&1
make[1]: Leaving directory '/usr/src/RPM/BUILD/zbar-0.10'
make[1]: Entering directory '/usr/src/RPM/BUILD/zbar-0.10'
/bin/sh ./libtool  --tag=CC   --mode=compile x86_64-alt-linux-gcc -DHAVE_CONFIG_H -I. -I./include  -I./zbar -I./include    -Wall -Wno-parentheses -pipe -frecord-gcc-switches -Wall -g -O2 -c -o zbar/qrcode/zbar_libzbar_la-isaac.lo `test -f 'zbar/qrcode/isaac.c' || echo './'`zbar/qrcode/isaac.c
libtool: compile:  x86_64-alt-linux-gcc -DHAVE_CONFIG_H -I. -I./include -I./zbar -I./include -Wall -Wno-parentheses -pipe -frecord-gcc-switches -Wall -g -O2 -c zbar/qrcode/isaac.c  -fPIC -DPIC -o zbar/qrcode/.libs/zbar_libzbar_la-isaac.o
libtool: compile:  x86_64-alt-linux-gcc -DHAVE_CONFIG_H -I. -I./include -I./zbar -I./include -Wall -Wno-parentheses -pipe -frecord-gcc-switches -Wall -g -O2 -c zbar/qrcode/isaac.c -o zbar/qrcode/zbar_libzbar_la-isaac.o >/dev/null 2>&1
make[1]: Leaving directory '/usr/src/RPM/BUILD/zbar-0.10'
make[1]: Entering directory '/usr/src/RPM/BUILD/zbar-0.10'
/bin/sh ./libtool  --tag=CC   --mode=compile x86_64-alt-linux-gcc -DHAVE_CONFIG_H -I. -I./include  -I./zbar -I./include    -Wall -Wno-parentheses -pipe -frecord-gcc-switches -Wall -g -O2 -c -o zbar/qrcode/zbar_libzbar_la-qrdectxt.lo `test -f 'zbar/qrcode/qrdectxt.c' || echo './'`zbar/qrcode/qrdectxt.c
libtool: compile:  x86_64-alt-linux-gcc -DHAVE_CONFIG_H -I. -I./include -I./zbar -I./include -Wall -Wno-parentheses -pipe -frecord-gcc-switches -Wall -g -O2 -c zbar/qrcode/qrdectxt.c  -fPIC -DPIC -o zbar/qrcode/.libs/zbar_libzbar_la-qrdectxt.o
libtool: compile:  x86_64-alt-linux-gcc -DHAVE_CONFIG_H -I. -I./include -I./zbar -I./include -Wall -Wno-parentheses -pipe -frecord-gcc-switches -Wall -g -O2 -c zbar/qrcode/qrdectxt.c -o zbar/qrcode/zbar_libzbar_la-qrdectxt.o >/dev/null 2>&1
make[1]: Leaving directory '/usr/src/RPM/BUILD/zbar-0.10'
make[1]: Entering directory '/usr/src/RPM/BUILD/zbar-0.10'
/bin/sh ./libtool  --tag=CC   --mode=compile x86_64-alt-linux-gcc -DHAVE_CONFIG_H -I. -I./include  -I./zbar -I./include    -Wall -Wno-parentheses -pipe -frecord-gcc-switches -Wall -g -O2 -c -o zbar/zbar_libzbar_la-convert.lo `test -f 'zbar/convert.c' || echo './'`zbar/convert.c
libtool: compile:  x86_64-alt-linux-gcc -DHAVE_CONFIG_H -I. -I./include -I./zbar -I./include -Wall -Wno-parentheses -pipe -frecord-gcc-switches -Wall -g -O2 -c zbar/convert.c  -fPIC -DPIC -o zbar/.libs/zbar_libzbar_la-convert.o
libtool: compile:  x86_64-alt-linux-gcc -DHAVE_CONFIG_H -I. -I./include -I./zbar -I./include -Wall -Wno-parentheses -pipe -frecord-gcc-switches -Wall -g -O2 -c zbar/convert.c -o zbar/zbar_libzbar_la-convert.o >/dev/null 2>&1
make[1]: Leaving directory '/usr/src/RPM/BUILD/zbar-0.10'
make[1]: Entering directory '/usr/src/RPM/BUILD/zbar-0.10'
/bin/sh ./libtool  --tag=CC   --mode=compile x86_64-alt-linux-gcc -DHAVE_CONFIG_H -I. -I./include  -I./zbar -I./include    -Wall -Wno-parentheses -pipe -frecord-gcc-switches -Wall -g -O2 -c -o zbar/window/zbar_libzbar_la-ximage.lo `test -f 'zbar/window/ximage.c' || echo './'`zbar/window/ximage.c
libtool: compile:  x86_64-alt-linux-gcc -DHAVE_CONFIG_H -I. -I./include -I./zbar -I./include -Wall -Wno-parentheses -pipe -frecord-gcc-switches -Wall -g -O2 -c zbar/window/ximage.c  -fPIC -DPIC -o zbar/window/.libs/zbar_libzbar_la-ximage.o
libtool: compile:  x86_64-alt-linux-gcc -DHAVE_CONFIG_H -I. -I./include -I./zbar -I./include -Wall -Wno-parentheses -pipe -frecord-gcc-switches -Wall -g -O2 -c zbar/window/ximage.c -o zbar/window/zbar_libzbar_la-ximage.o >/dev/null 2>&1
make[1]: Leaving directory '/usr/src/RPM/BUILD/zbar-0.10'
make[1]: Entering directory '/usr/src/RPM/BUILD/zbar-0.10'
/bin/sh ./libtool  --tag=CC   --mode=compile x86_64-alt-linux-gcc -DHAVE_CONFIG_H -I. -I./include  -Igtk -pthread -I/usr/include/gtk-2.0 -I/usr/lib64/gtk-2.0/include -I/usr/include/pango-1.0 -I/usr/include/atk-1.0 -I/usr/include/cairo -I/usr/include/gdk-pixbuf-2.0 -I/usr/include/libpng16 -I/usr/include/pango-1.0 -I/usr/include/freetype2 -I/usr/include/libpng16 -I/usr/include/harfbuzz -I/usr/include/glib-2.0 -I/usr/lib64/glib-2.0/include -I./include  -Wall -Wno-parentheses -pipe -frecord-gcc-switches -Wall -g -O2 -c -o gtk/gtk_libzbargtk_la-zbarmarshal.lo `test -f 'gtk/zbarmarshal.c' || echo './'`gtk/zbarmarshal.c
libtool: compile:  x86_64-alt-linux-gcc -DHAVE_CONFIG_H -I. -I./include -Igtk -pthread -I/usr/include/gtk-2.0 -I/usr/lib64/gtk-2.0/include -I/usr/include/pango-1.0 -I/usr/include/atk-1.0 -I/usr/include/cairo -I/usr/include/gdk-pixbuf-2.0 -I/usr/include/libpng16 -I/usr/include/pango-1.0 -I/usr/include/freetype2 -I/usr/include/libpng16 -I/usr/include/harfbuzz -I/usr/include/glib-2.0 -I/usr/lib64/glib-2.0/include -I./include -Wall -Wno-parentheses -pipe -frecord-gcc-switches -Wall -g -O2 -c gtk/zbarmarshal.c  -fPIC -DPIC -o gtk/.libs/gtk_libzbargtk_la-zbarmarshal.o
libtool: compile:  x86_64-alt-linux-gcc -DHAVE_CONFIG_H -I. -I./include -Igtk -pthread -I/usr/include/gtk-2.0 -I/usr/lib64/gtk-2.0/include -I/usr/include/pango-1.0 -I/usr/include/atk-1.0 -I/usr/include/cairo -I/usr/include/gdk-pixbuf-2.0 -I/usr/include/libpng16 -I/usr/include/pango-1.0 -I/usr/include/freetype2 -I/usr/include/libpng16 -I/usr/include/harfbuzz -I/usr/include/glib-2.0 -I/usr/lib64/glib-2.0/include -I./include -Wall -Wno-parentheses -pipe -frecord-gcc-switches -Wall -g -O2 -c gtk/zbarmarshal.c -o gtk/gtk_libzbargtk_la-zbarmarshal.o >/dev/null 2>&1
make[1]: Leaving directory '/usr/src/RPM/BUILD/zbar-0.10'
make[1]: Entering directory '/usr/src/RPM/BUILD/zbar-0.10'
/bin/sh ./libtool  --tag=CC   --mode=compile x86_64-alt-linux-gcc -DHAVE_CONFIG_H -I. -I./include  -I./zbar -I./include    -Wall -Wno-parentheses -pipe -frecord-gcc-switches -Wall -g -O2 -c -o zbar/decoder/zbar_libzbar_la-ean.lo `test -f 'zbar/decoder/ean.c' || echo './'`zbar/decoder/ean.c
libtool: compile:  x86_64-alt-linux-gcc -DHAVE_CONFIG_H -I. -I./include -I./zbar -I./include -Wall -Wno-parentheses -pipe -frecord-gcc-switches -Wall -g -O2 -c zbar/decoder/ean.c  -fPIC -DPIC -o zbar/decoder/.libs/zbar_libzbar_la-ean.o
zbar/decoder/ean.c: In function 'ean_part_end4':
zbar/decoder/ean.c:245:13: warning: logical not is only applied to the left hand side of comparison [-Wlogical-not-parentheses]
     if(!par == fwd) {
             ^~
zbar/decoder/ean.c:245:8: note: add parentheses around left hand side expression to silence this warning
     if(!par == fwd) {
        ^~~~
        (   )
zbar/decoder/ean.c: In function 'ean_part_end7':
zbar/decoder/ean.c:294:13: warning: logical not is only applied to the left hand side of comparison [-Wlogical-not-parentheses]
     if(!par == fwd) {
             ^~
zbar/decoder/ean.c:294:8: note: add parentheses around left hand side expression to silence this warning
     if(!par == fwd) {
        ^~~~
        (   )
libtool: compile:  x86_64-alt-linux-gcc -DHAVE_CONFIG_H -I. -I./include -I./zbar -I./include -Wall -Wno-parentheses -pipe -frecord-gcc-switches -Wall -g -O2 -c zbar/decoder/ean.c -o zbar/decoder/zbar_libzbar_la-ean.o >/dev/null 2>&1
make[1]: Leaving directory '/usr/src/RPM/BUILD/zbar-0.10'
make[1]: Entering directory '/usr/src/RPM/BUILD/zbar-0.10'
/bin/sh ./libtool  --tag=CC   --mode=compile x86_64-alt-linux-gcc -DHAVE_CONFIG_H -I. -I./include  -I./zbar -I./include    -Wall -Wno-parentheses -pipe -frecord-gcc-switches -Wall -g -O2 -c -o zbar/qrcode/zbar_libzbar_la-rs.lo `test -f 'zbar/qrcode/rs.c' || echo './'`zbar/qrcode/rs.c
libtool: compile:  x86_64-alt-linux-gcc -DHAVE_CONFIG_H -I. -I./include -I./zbar -I./include -Wall -Wno-parentheses -pipe -frecord-gcc-switches -Wall -g -O2 -c zbar/qrcode/rs.c  -fPIC -DPIC -o zbar/qrcode/.libs/zbar_libzbar_la-rs.o
libtool: compile:  x86_64-alt-linux-gcc -DHAVE_CONFIG_H -I. -I./include -I./zbar -I./include -Wall -Wno-parentheses -pipe -frecord-gcc-switches -Wall -g -O2 -c zbar/qrcode/rs.c -o zbar/qrcode/zbar_libzbar_la-rs.o >/dev/null 2>&1
make[1]: Leaving directory '/usr/src/RPM/BUILD/zbar-0.10'
make[1]: Entering directory '/usr/src/RPM/BUILD/zbar-0.10'
/bin/sh ./libtool  --tag=CC   --mode=compile x86_64-alt-linux-gcc -DHAVE_CONFIG_H -I. -I./include  -I./zbar -I./include    -Wall -Wno-parentheses -pipe -frecord-gcc-switches -Wall -g -O2 -c -o zbar/window/zbar_libzbar_la-x.lo `test -f 'zbar/window/x.c' || echo './'`zbar/window/x.c
libtool: compile:  x86_64-alt-linux-gcc -DHAVE_CONFIG_H -I. -I./include -I./zbar -I./include -Wall -Wno-parentheses -pipe -frecord-gcc-switches -Wall -g -O2 -c zbar/window/x.c  -fPIC -DPIC -o zbar/window/.libs/zbar_libzbar_la-x.o
libtool: compile:  x86_64-alt-linux-gcc -DHAVE_CONFIG_H -I. -I./include -I./zbar -I./include -Wall -Wno-parentheses -pipe -frecord-gcc-switches -Wall -g -O2 -c zbar/window/x.c -o zbar/window/zbar_libzbar_la-x.o >/dev/null 2>&1
make[1]: Leaving directory '/usr/src/RPM/BUILD/zbar-0.10'
make[1]: Entering directory '/usr/src/RPM/BUILD/zbar-0.10'
/bin/sh ./libtool  --tag=CC   --mode=compile x86_64-alt-linux-gcc -DHAVE_CONFIG_H -I. -I./include  -I./zbar -I./include    -Wall -Wno-parentheses -pipe -frecord-gcc-switches -Wall -g -O2 -c -o zbar/window/zbar_libzbar_la-xv.lo `test -f 'zbar/window/xv.c' || echo './'`zbar/window/xv.c
libtool: compile:  x86_64-alt-linux-gcc -DHAVE_CONFIG_H -I. -I./include -I./zbar -I./include -Wall -Wno-parentheses -pipe -frecord-gcc-switches -Wall -g -O2 -c zbar/window/xv.c  -fPIC -DPIC -o zbar/window/.libs/zbar_libzbar_la-xv.o
libtool: compile:  x86_64-alt-linux-gcc -DHAVE_CONFIG_H -I. -I./include -I./zbar -I./include -Wall -Wno-parentheses -pipe -frecord-gcc-switches -Wall -g -O2 -c zbar/window/xv.c -o zbar/window/zbar_libzbar_la-xv.o >/dev/null 2>&1
make[1]: Leaving directory '/usr/src/RPM/BUILD/zbar-0.10'
make[1]: Entering directory '/usr/src/RPM/BUILD/zbar-0.10'
/bin/sh ./libtool  --tag=CC   --mode=compile x86_64-alt-linux-gcc -DHAVE_CONFIG_H -I. -I./include  -I./zbar -I./include    -Wall -Wno-parentheses -pipe -frecord-gcc-switches -Wall -g -O2 -c -o zbar/video/zbar_libzbar_la-v4l2.lo `test -f 'zbar/video/v4l2.c' || echo './'`zbar/video/v4l2.c
libtool: compile:  x86_64-alt-linux-gcc -DHAVE_CONFIG_H -I. -I./include -I./zbar -I./include -Wall -Wno-parentheses -pipe -frecord-gcc-switches -Wall -g -O2 -c zbar/video/v4l2.c  -fPIC -DPIC -o zbar/video/.libs/zbar_libzbar_la-v4l2.o
libtool: compile:  x86_64-alt-linux-gcc -DHAVE_CONFIG_H -I. -I./include -I./zbar -I./include -Wall -Wno-parentheses -pipe -frecord-gcc-switches -Wall -g -O2 -c zbar/video/v4l2.c -o zbar/video/zbar_libzbar_la-v4l2.o >/dev/null 2>&1
make[1]: Leaving directory '/usr/src/RPM/BUILD/zbar-0.10'
make[1]: Entering directory '/usr/src/RPM/BUILD/zbar-0.10'
/bin/sh ./libtool  --tag=CC   --mode=compile x86_64-alt-linux-gcc -DHAVE_CONFIG_H -I. -I./include  -Igtk -pthread -I/usr/include/gtk-2.0 -I/usr/lib64/gtk-2.0/include -I/usr/include/pango-1.0 -I/usr/include/atk-1.0 -I/usr/include/cairo -I/usr/include/gdk-pixbuf-2.0 -I/usr/include/libpng16 -I/usr/include/pango-1.0 -I/usr/include/freetype2 -I/usr/include/libpng16 -I/usr/include/harfbuzz -I/usr/include/glib-2.0 -I/usr/lib64/glib-2.0/include -I./include  -Wall -Wno-parentheses -pipe -frecord-gcc-switches -Wall -g -O2 -c -o gtk/gtk_libzbargtk_la-zbargtk.lo `test -f 'gtk/zbargtk.c' || echo './'`gtk/zbargtk.c
libtool: compile:  x86_64-alt-linux-gcc -DHAVE_CONFIG_H -I. -I./include -Igtk -pthread -I/usr/include/gtk-2.0 -I/usr/lib64/gtk-2.0/include -I/usr/include/pango-1.0 -I/usr/include/atk-1.0 -I/usr/include/cairo -I/usr/include/gdk-pixbuf-2.0 -I/usr/include/libpng16 -I/usr/include/pango-1.0 -I/usr/include/freetype2 -I/usr/include/libpng16 -I/usr/include/harfbuzz -I/usr/include/glib-2.0 -I/usr/lib64/glib-2.0/include -I./include -Wall -Wno-parentheses -pipe -frecord-gcc-switches -Wall -g -O2 -c gtk/zbargtk.c  -fPIC -DPIC -o gtk/.libs/gtk_libzbargtk_la-zbargtk.o
gtk/zbargtk.c: In function 'zbar_gtk_init':
gtk/zbargtk.c:621:5: warning: 'g_thread_create' is deprecated: Use 'g_thread_new' instead [-Wdeprecated-declarations]
     zbar->thread = g_thread_create(zbar_gtk_processing_thread, self,
     ^~~~
In file included from /usr/include/glib-2.0/glib.h:111,
                 from /usr/include/glib-2.0/gobject/gbinding.h:28,
                 from /usr/include/glib-2.0/glib-object.h:23,
                 from /usr/include/gtk-2.0/gtk/gtkenums.h:34,
                 from /usr/include/gtk-2.0/gtk/gtksignal.h:32,
                 from gtk/zbargtk.c:24:
/usr/include/glib-2.0/glib/deprecated/gthread.h:104:10: note: declared here
 GThread *g_thread_create       (GThreadFunc       func,
          ^~~~~~~~~~~~~~~
libtool: compile:  x86_64-alt-linux-gcc -DHAVE_CONFIG_H -I. -I./include -Igtk -pthread -I/usr/include/gtk-2.0 -I/usr/lib64/gtk-2.0/include -I/usr/include/pango-1.0 -I/usr/include/atk-1.0 -I/usr/include/cairo -I/usr/include/gdk-pixbuf-2.0 -I/usr/include/libpng16 -I/usr/include/pango-1.0 -I/usr/include/freetype2 -I/usr/include/libpng16 -I/usr/include/harfbuzz -I/usr/include/glib-2.0 -I/usr/lib64/glib-2.0/include -I./include -Wall -Wno-parentheses -pipe -frecord-gcc-switches -Wall -g -O2 -c gtk/zbargtk.c -o gtk/gtk_libzbargtk_la-zbargtk.o >/dev/null 2>&1
make[1]: Leaving directory '/usr/src/RPM/BUILD/zbar-0.10'
make[1]: Entering directory '/usr/src/RPM/BUILD/zbar-0.10'
/bin/sh ./libtool  --tag=CC   --mode=compile x86_64-alt-linux-gcc -DHAVE_CONFIG_H -I. -I./include  -I/usr/include/python2.7 -I./include  -Wall -Wno-parentheses -pipe -frecord-gcc-switches -Wall -g -O2 -c -o python/python_zbar_la-zbarmodule.lo `test -f 'python/zbarmodule.c' || echo './'`python/zbarmodule.c
libtool: compile:  x86_64-alt-linux-gcc -DHAVE_CONFIG_H -I. -I./include -I/usr/include/python2.7 -I./include -Wall -Wno-parentheses -pipe -frecord-gcc-switches -Wall -g -O2 -c python/zbarmodule.c  -fPIC -DPIC -o python/.libs/python_zbar_la-zbarmodule.o
libtool: compile:  x86_64-alt-linux-gcc -DHAVE_CONFIG_H -I. -I./include -I/usr/include/python2.7 -I./include -Wall -Wno-parentheses -pipe -frecord-gcc-switches -Wall -g -O2 -c python/zbarmodule.c -o python/python_zbar_la-zbarmodule.o >/dev/null 2>&1
make[1]: Leaving directory '/usr/src/RPM/BUILD/zbar-0.10'
make[1]: Entering directory '/usr/src/RPM/BUILD/zbar-0.10'
/bin/sh ./libtool  --tag=CC   --mode=compile x86_64-alt-linux-gcc -DHAVE_CONFIG_H -I. -I./include  -I/usr/include/python2.7 -I./include  -Wall -Wno-parentheses -pipe -frecord-gcc-switches -Wall -g -O2 -c -o python/python_zbar_la-exception.lo `test -f 'python/exception.c' || echo './'`python/exception.c
libtool: compile:  x86_64-alt-linux-gcc -DHAVE_CONFIG_H -I. -I./include -I/usr/include/python2.7 -I./include -Wall -Wno-parentheses -pipe -frecord-gcc-switches -Wall -g -O2 -c python/exception.c  -fPIC -DPIC -o python/.libs/python_zbar_la-exception.o
libtool: compile:  x86_64-alt-linux-gcc -DHAVE_CONFIG_H -I. -I./include -I/usr/include/python2.7 -I./include -Wall -Wno-parentheses -pipe -frecord-gcc-switches -Wall -g -O2 -c python/exception.c -o python/python_zbar_la-exception.o >/dev/null 2>&1
make[1]: Leaving directory '/usr/src/RPM/BUILD/zbar-0.10'
make[1]: Entering directory '/usr/src/RPM/BUILD/zbar-0.10'
/bin/sh ./libtool  --tag=CC   --mode=compile x86_64-alt-linux-gcc -DHAVE_CONFIG_H -I. -I./include  -I/usr/include/python2.7 -I./include  -Wall -Wno-parentheses -pipe -frecord-gcc-switches -Wall -g -O2 -c -o python/python_zbar_la-symbol.lo `test -f 'python/symbol.c' || echo './'`python/symbol.c
libtool: compile:  x86_64-alt-linux-gcc -DHAVE_CONFIG_H -I. -I./include -I/usr/include/python2.7 -I./include -Wall -Wno-parentheses -pipe -frecord-gcc-switches -Wall -g -O2 -c python/symbol.c  -fPIC -DPIC -o python/.libs/python_zbar_la-symbol.o
libtool: compile:  x86_64-alt-linux-gcc -DHAVE_CONFIG_H -I. -I./include -I/usr/include/python2.7 -I./include -Wall -Wno-parentheses -pipe -frecord-gcc-switches -Wall -g -O2 -c python/symbol.c -o python/python_zbar_la-symbol.o >/dev/null 2>&1
make[1]: Leaving directory '/usr/src/RPM/BUILD/zbar-0.10'
make[1]: Entering directory '/usr/src/RPM/BUILD/zbar-0.10'
/bin/sh ./libtool  --tag=CC   --mode=compile x86_64-alt-linux-gcc -DHAVE_CONFIG_H -I. -I./include  -I/usr/include/python2.7 -I./include  -Wall -Wno-parentheses -pipe -frecord-gcc-switches -Wall -g -O2 -c -o python/python_zbar_la-symboliter.lo `test -f 'python/symboliter.c' || echo './'`python/symboliter.c
libtool: compile:  x86_64-alt-linux-gcc -DHAVE_CONFIG_H -I. -I./include -I/usr/include/python2.7 -I./include -Wall -Wno-parentheses -pipe -frecord-gcc-switches -Wall -g -O2 -c python/symboliter.c  -fPIC -DPIC -o python/.libs/python_zbar_la-symboliter.o
libtool: compile:  x86_64-alt-linux-gcc -DHAVE_CONFIG_H -I. -I./include -I/usr/include/python2.7 -I./include -Wall -Wno-parentheses -pipe -frecord-gcc-switches -Wall -g -O2 -c python/symboliter.c -o python/python_zbar_la-symboliter.o >/dev/null 2>&1
make[1]: Leaving directory '/usr/src/RPM/BUILD/zbar-0.10'
make[1]: Entering directory '/usr/src/RPM/BUILD/zbar-0.10'
/bin/sh ./libtool  --tag=CC   --mode=compile x86_64-alt-linux-gcc -DHAVE_CONFIG_H -I. -I./include  -I/usr/include/python2.7 -I./include  -Wall -Wno-parentheses -pipe -frecord-gcc-switches -Wall -g -O2 -c -o python/python_zbar_la-enum.lo `test -f 'python/enum.c' || echo './'`python/enum.c
libtool: compile:  x86_64-alt-linux-gcc -DHAVE_CONFIG_H -I. -I./include -I/usr/include/python2.7 -I./include -Wall -Wno-parentheses -pipe -frecord-gcc-switches -Wall -g -O2 -c python/enum.c  -fPIC -DPIC -o python/.libs/python_zbar_la-enum.o
libtool: compile:  x86_64-alt-linux-gcc -DHAVE_CONFIG_H -I. -I./include -I/usr/include/python2.7 -I./include -Wall -Wno-parentheses -pipe -frecord-gcc-switches -Wall -g -O2 -c python/enum.c -o python/python_zbar_la-enum.o >/dev/null 2>&1
make[1]: Leaving directory '/usr/src/RPM/BUILD/zbar-0.10'
make[1]: Entering directory '/usr/src/RPM/BUILD/zbar-0.10'
/bin/sh ./libtool  --tag=CC   --mode=compile x86_64-alt-linux-gcc -DHAVE_CONFIG_H -I. -I./include  -I/usr/include/python2.7 -I./include  -Wall -Wno-parentheses -pipe -frecord-gcc-switches -Wall -g -O2 -c -o python/python_zbar_la-symbolset.lo `test -f 'python/symbolset.c' || echo './'`python/symbolset.c
libtool: compile:  x86_64-alt-linux-gcc -DHAVE_CONFIG_H -I. -I./include -I/usr/include/python2.7 -I./include -Wall -Wno-parentheses -pipe -frecord-gcc-switches -Wall -g -O2 -c python/symbolset.c  -fPIC -DPIC -o python/.libs/python_zbar_la-symbolset.o
libtool: compile:  x86_64-alt-linux-gcc -DHAVE_CONFIG_H -I. -I./include -I/usr/include/python2.7 -I./include -Wall -Wno-parentheses -pipe -frecord-gcc-switches -Wall -g -O2 -c python/symbolset.c -o python/python_zbar_la-symbolset.o >/dev/null 2>&1
make[1]: Leaving directory '/usr/src/RPM/BUILD/zbar-0.10'
make[1]: Entering directory '/usr/src/RPM/BUILD/zbar-0.10'
/bin/sh ./libtool  --tag=CC   --mode=compile x86_64-alt-linux-gcc -DHAVE_CONFIG_H -I. -I./include  -I/usr/include/python2.7 -I./include  -Wall -Wno-parentheses -pipe -frecord-gcc-switches -Wall -g -O2 -c -o python/python_zbar_la-imagescanner.lo `test -f 'python/imagescanner.c' || echo './'`python/imagescanner.c
libtool: compile:  x86_64-alt-linux-gcc -DHAVE_CONFIG_H -I. -I./include -I/usr/include/python2.7 -I./include -Wall -Wno-parentheses -pipe -frecord-gcc-switches -Wall -g -O2 -c python/imagescanner.c  -fPIC -DPIC -o python/.libs/python_zbar_la-imagescanner.o
libtool: compile:  x86_64-alt-linux-gcc -DHAVE_CONFIG_H -I. -I./include -I/usr/include/python2.7 -I./include -Wall -Wno-parentheses -pipe -frecord-gcc-switches -Wall -g -O2 -c python/imagescanner.c -o python/python_zbar_la-imagescanner.o >/dev/null 2>&1
make[1]: Leaving directory '/usr/src/RPM/BUILD/zbar-0.10'
make[1]: Entering directory '/usr/src/RPM/BUILD/zbar-0.10'
/bin/sh ./libtool  --tag=CC   --mode=compile x86_64-alt-linux-gcc -DHAVE_CONFIG_H -I. -I./include  -I/usr/include/python2.7 -I./include  -Wall -Wno-parentheses -pipe -frecord-gcc-switches -Wall -g -O2 -c -o python/python_zbar_la-decoder.lo `test -f 'python/decoder.c' || echo './'`python/decoder.c
libtool: compile:  x86_64-alt-linux-gcc -DHAVE_CONFIG_H -I. -I./include -I/usr/include/python2.7 -I./include -Wall -Wno-parentheses -pipe -frecord-gcc-switches -Wall -g -O2 -c python/decoder.c  -fPIC -DPIC -o python/.libs/python_zbar_la-decoder.o
libtool: compile:  x86_64-alt-linux-gcc -DHAVE_CONFIG_H -I. -I./include -I/usr/include/python2.7 -I./include -Wall -Wno-parentheses -pipe -frecord-gcc-switches -Wall -g -O2 -c python/decoder.c -o python/python_zbar_la-decoder.o >/dev/null 2>&1
make[1]: Leaving directory '/usr/src/RPM/BUILD/zbar-0.10'
make[1]: Entering directory '/usr/src/RPM/BUILD/zbar-0.10'
/bin/sh ./libtool  --tag=CC   --mode=compile x86_64-alt-linux-gcc -DHAVE_CONFIG_H -I. -I./include  -I/usr/include/python2.7 -I./include  -Wall -Wno-parentheses -pipe -frecord-gcc-switches -Wall -g -O2 -c -o python/python_zbar_la-processor.lo `test -f 'python/processor.c' || echo './'`python/processor.c
libtool: compile:  x86_64-alt-linux-gcc -DHAVE_CONFIG_H -I. -I./include -I/usr/include/python2.7 -I./include -Wall -Wno-parentheses -pipe -frecord-gcc-switches -Wall -g -O2 -c python/processor.c  -fPIC -DPIC -o python/.libs/python_zbar_la-processor.o
libtool: compile:  x86_64-alt-linux-gcc -DHAVE_CONFIG_H -I. -I./include -I/usr/include/python2.7 -I./include -Wall -Wno-parentheses -pipe -frecord-gcc-switches -Wall -g -O2 -c python/processor.c -o python/python_zbar_la-processor.o >/dev/null 2>&1
make[1]: Leaving directory '/usr/src/RPM/BUILD/zbar-0.10'
make[1]: Entering directory '/usr/src/RPM/BUILD/zbar-0.10'
/bin/sh ./libtool  --tag=CC   --mode=compile x86_64-alt-linux-gcc -DHAVE_CONFIG_H -I. -I./include  -I/usr/include/python2.7 -I./include  -Wall -Wno-parentheses -pipe -frecord-gcc-switches -Wall -g -O2 -c -o python/python_zbar_la-image.lo `test -f 'python/image.c' || echo './'`python/image.c
libtool: compile:  x86_64-alt-linux-gcc -DHAVE_CONFIG_H -I. -I./include -I/usr/include/python2.7 -I./include -Wall -Wno-parentheses -pipe -frecord-gcc-switches -Wall -g -O2 -c python/image.c  -fPIC -DPIC -o python/.libs/python_zbar_la-image.o
libtool: compile:  x86_64-alt-linux-gcc -DHAVE_CONFIG_H -I. -I./include -I/usr/include/python2.7 -I./include -Wall -Wno-parentheses -pipe -frecord-gcc-switches -Wall -g -O2 -c python/image.c -o python/python_zbar_la-image.o >/dev/null 2>&1
make[1]: Leaving directory '/usr/src/RPM/BUILD/zbar-0.10'
make[1]: Entering directory '/usr/src/RPM/BUILD/zbar-0.10'
/bin/sh ./libtool  --tag=CC   --mode=compile x86_64-alt-linux-gcc -DHAVE_CONFIG_H -I. -I./include  -I/usr/include/python2.7 -I./include  -Wall -Wno-parentheses -pipe -frecord-gcc-switches -Wall -g -O2 -c -o python/python_zbar_la-scanner.lo `test -f 'python/scanner.c' || echo './'`python/scanner.c
libtool: compile:  x86_64-alt-linux-gcc -DHAVE_CONFIG_H -I. -I./include -I/usr/include/python2.7 -I./include -Wall -Wno-parentheses -pipe -frecord-gcc-switches -Wall -g -O2 -c python/scanner.c  -fPIC -DPIC -o python/.libs/python_zbar_la-scanner.o
libtool: compile:  x86_64-alt-linux-gcc -DHAVE_CONFIG_H -I. -I./include -I/usr/include/python2.7 -I./include -Wall -Wno-parentheses -pipe -frecord-gcc-switches -Wall -g -O2 -c python/scanner.c -o python/python_zbar_la-scanner.o >/dev/null 2>&1
make[1]: Leaving directory '/usr/src/RPM/BUILD/zbar-0.10'
make[1]: Entering directory '/usr/src/RPM/BUILD/zbar-0.10'
/bin/sh ./libtool  --tag=CXX   --mode=compile x86_64-alt-linux-g++ -DHAVE_CONFIG_H -I. -I./include  -Iqt -DQT_SHARED -I/usr/include/qt4 -I/usr/include/qt4/QtGui -I/usr/include/qt4 -I/usr/include/qt4/QtCore -I./include  -Wall -Wno-parentheses -pipe -frecord-gcc-switches -Wall -g -O2 -c -o qt/qt_libzbarqt_la-moc_QZBar.lo `test -f 'qt/moc_QZBar.cpp' || echo './'`qt/moc_QZBar.cpp
libtool: compile:  x86_64-alt-linux-g++ -DHAVE_CONFIG_H -I. -I./include -Iqt -DQT_SHARED -I/usr/include/qt4 -I/usr/include/qt4/QtGui -I/usr/include/qt4 -I/usr/include/qt4/QtCore -I./include -Wall -Wno-parentheses -pipe -frecord-gcc-switches -Wall -g -O2 -c qt/moc_QZBar.cpp  -fPIC -DPIC -o qt/.libs/qt_libzbarqt_la-moc_QZBar.o
libtool: compile:  x86_64-alt-linux-g++ -DHAVE_CONFIG_H -I. -I./include -Iqt -DQT_SHARED -I/usr/include/qt4 -I/usr/include/qt4/QtGui -I/usr/include/qt4 -I/usr/include/qt4/QtCore -I./include -Wall -Wno-parentheses -pipe -frecord-gcc-switches -Wall -g -O2 -c qt/moc_QZBar.cpp -o qt/qt_libzbarqt_la-moc_QZBar.o >/dev/null 2>&1
make[1]: Leaving directory '/usr/src/RPM/BUILD/zbar-0.10'
make[1]: Entering directory '/usr/src/RPM/BUILD/zbar-0.10'
x86_64-alt-linux-gcc -DHAVE_CONFIG_H -I. -I./include  -I./include  -Wall -Wno-parentheses -pipe -frecord-gcc-switches -Wall -g -O2 -c -o zbarcam/zbarcam.o zbarcam/zbarcam.c
make[1]: Leaving directory '/usr/src/RPM/BUILD/zbar-0.10'
make[1]: Entering directory '/usr/src/RPM/BUILD/zbar-0.10'
/bin/sh ./libtool  --tag=CC   --mode=compile x86_64-alt-linux-gcc -DHAVE_CONFIG_H -I. -I./include  -pthread -I/usr/include/gtk-2.0 -I/usr/lib64/gtk-2.0/include -I/usr/include/pango-1.0 -I/usr/include/atk-1.0 -I/usr/include/cairo -I/usr/include/gdk-pixbuf-2.0 -I/usr/include/libpng16 -I/usr/include/pango-1.0 -I/usr/include/freetype2 -I/usr/include/libpng16 -I/usr/include/harfbuzz -I/usr/include/glib-2.0 -I/usr/lib64/glib-2.0/include -I/usr/include/python2.7 -pthread -I/usr/include/python2.7/pygtk -I/usr/include/gtk-2.0 -I/usr/lib64/gtk-2.0/include -I/usr/include/pango-1.0 -I/usr/include/atk-1.0 -I/usr/include/cairo -I/usr/include/gdk-pixbuf-2.0 -I/usr/include/libpng16 -I/usr/include/pango-1.0 -I/usr/include/freetype2 -I/usr/include/libpng16 -I/usr/include/harfbuzz -I/usr/include/glib-2.0 -I/usr/lib64/glib-2.0/include -I./include  -Wall -Wno-parentheses -pipe -frecord-gcc-switches -Wall -g -O2 -c -o pygtk/pygtk_zbarpygtk_la-zbarpygtkmodule.lo `test -f 'pygtk/zbarpygtkmodule.c' || echo './'`pygtk/zbarpygtkmodule.c
libtool: compile:  x86_64-alt-linux-gcc -DHAVE_CONFIG_H -I. -I./include -pthread -I/usr/include/gtk-2.0 -I/usr/lib64/gtk-2.0/include -I/usr/include/pango-1.0 -I/usr/include/atk-1.0 -I/usr/include/cairo -I/usr/include/gdk-pixbuf-2.0 -I/usr/include/libpng16 -I/usr/include/pango-1.0 -I/usr/include/freetype2 -I/usr/include/libpng16 -I/usr/include/harfbuzz -I/usr/include/glib-2.0 -I/usr/lib64/glib-2.0/include -I/usr/include/python2.7 -pthread -I/usr/include/python2.7/pygtk -I/usr/include/gtk-2.0 -I/usr/lib64/gtk-2.0/include -I/usr/include/pango-1.0 -I/usr/include/atk-1.0 -I/usr/include/cairo -I/usr/include/gdk-pixbuf-2.0 -I/usr/include/libpng16 -I/usr/include/pango-1.0 -I/usr/include/freetype2 -I/usr/include/libpng16 -I/usr/include/harfbuzz -I/usr/include/glib-2.0 -I/usr/lib64/glib-2.0/include -I./include -Wall -Wno-parentheses -pipe -frecord-gcc-switches -Wall -g -O2 -c pygtk/zbarpygtkmodule.c  -fPIC -DPIC -o pygtk/.libs/pygtk_zbarpygtk_la-zbarpygtkmodule.o
libtool: compile:  x86_64-alt-linux-gcc -DHAVE_CONFIG_H -I. -I./include -pthread -I/usr/include/gtk-2.0 -I/usr/lib64/gtk-2.0/include -I/usr/include/pango-1.0 -I/usr/include/atk-1.0 -I/usr/include/cairo -I/usr/include/gdk-pixbuf-2.0 -I/usr/include/libpng16 -I/usr/include/pango-1.0 -I/usr/include/freetype2 -I/usr/include/libpng16 -I/usr/include/harfbuzz -I/usr/include/glib-2.0 -I/usr/lib64/glib-2.0/include -I/usr/include/python2.7 -pthread -I/usr/include/python2.7/pygtk -I/usr/include/gtk-2.0 -I/usr/lib64/gtk-2.0/include -I/usr/include/pango-1.0 -I/usr/include/atk-1.0 -I/usr/include/cairo -I/usr/include/gdk-pixbuf-2.0 -I/usr/include/libpng16 -I/usr/include/pango-1.0 -I/usr/include/freetype2 -I/usr/include/libpng16 -I/usr/include/harfbuzz -I/usr/include/glib-2.0 -I/usr/lib64/glib-2.0/include -I./include -Wall -Wno-parentheses -pipe -frecord-gcc-switches -Wall -g -O2 -c pygtk/zbarpygtkmodule.c -o pygtk/pygtk_zbarpygtk_la-zbarpygtkmodule.o >/dev/null 2>&1
make[1]: Leaving directory '/usr/src/RPM/BUILD/zbar-0.10'
make[1]: Entering directory '/usr/src/RPM/BUILD/zbar-0.10'
x86_64-alt-linux-gcc -DHAVE_CONFIG_H -I. -I./include  -fopenmp -DMAGICKCORE_HDRI_ENABLE=0 -DMAGICKCORE_QUANTUM_DEPTH=16 -fopenmp -DMAGICKCORE_HDRI_ENABLE=0 -DMAGICKCORE_QUANTUM_DEPTH=16 -I/usr/include/ImageMagick-6 -I./include  -Wall -Wno-parentheses -pipe -frecord-gcc-switches -Wall -g -O2 -c -o zbarimg/zbarimg_zbarimg-zbarimg.o `test -f 'zbarimg/zbarimg.c' || echo './'`zbarimg/zbarimg.c
make[1]: Leaving directory '/usr/src/RPM/BUILD/zbar-0.10'
make[1]: Entering directory '/usr/src/RPM/BUILD/zbar-0.10'
/bin/sh ./libtool  --tag=CXX   --mode=compile x86_64-alt-linux-g++ -DHAVE_CONFIG_H -I. -I./include  -Iqt -DQT_SHARED -I/usr/include/qt4 -I/usr/include/qt4/QtGui -I/usr/include/qt4 -I/usr/include/qt4/QtCore -I./include  -Wall -Wno-parentheses -pipe -frecord-gcc-switches -Wall -g -O2 -c -o qt/qt_libzbarqt_la-QZBarThread.lo `test -f 'qt/QZBarThread.cpp' || echo './'`qt/QZBarThread.cpp
libtool: compile:  x86_64-alt-linux-g++ -DHAVE_CONFIG_H -I. -I./include -Iqt -DQT_SHARED -I/usr/include/qt4 -I/usr/include/qt4/QtGui -I/usr/include/qt4 -I/usr/include/qt4/QtCore -I./include -Wall -Wno-parentheses -pipe -frecord-gcc-switches -Wall -g -O2 -c qt/QZBarThread.cpp  -fPIC -DPIC -o qt/.libs/qt_libzbarqt_la-QZBarThread.o
qt/QZBarThread.cpp: In member function 'virtual bool zbar::QZBarThread::event(QEvent*)':
qt/QZBarThread.cpp:175:5: warning: case value '1001' not in enumerated type 'QEvent::Type' [-Wswitch]
     case VideoEnabled:
     ^~~~
qt/QZBarThread.cpp:178:5: warning: case value '1002' not in enumerated type 'QEvent::Type' [-Wswitch]
     case ScanImage:
     ^~~~
libtool: compile:  x86_64-alt-linux-g++ -DHAVE_CONFIG_H -I. -I./include -Iqt -DQT_SHARED -I/usr/include/qt4 -I/usr/include/qt4/QtGui -I/usr/include/qt4 -I/usr/include/qt4/QtCore -I./include -Wall -Wno-parentheses -pipe -frecord-gcc-switches -Wall -g -O2 -c qt/QZBarThread.cpp -o qt/qt_libzbarqt_la-QZBarThread.o >/dev/null 2>&1
make[1]: Leaving directory '/usr/src/RPM/BUILD/zbar-0.10'
make[1]: Entering directory '/usr/src/RPM/BUILD/zbar-0.10'
/bin/sh ./libtool  --tag=CXX   --mode=compile x86_64-alt-linux-g++ -DHAVE_CONFIG_H -I. -I./include  -Iqt -DQT_SHARED -I/usr/include/qt4 -I/usr/include/qt4/QtGui -I/usr/include/qt4 -I/usr/include/qt4/QtCore -I./include  -Wall -Wno-parentheses -pipe -frecord-gcc-switches -Wall -g -O2 -c -o qt/qt_libzbarqt_la-moc_QZBarThread.lo `test -f 'qt/moc_QZBarThread.cpp' || echo './'`qt/moc_QZBarThread.cpp
libtool: compile:  x86_64-alt-linux-g++ -DHAVE_CONFIG_H -I. -I./include -Iqt -DQT_SHARED -I/usr/include/qt4 -I/usr/include/qt4/QtGui -I/usr/include/qt4 -I/usr/include/qt4/QtCore -I./include -Wall -Wno-parentheses -pipe -frecord-gcc-switches -Wall -g -O2 -c qt/moc_QZBarThread.cpp  -fPIC -DPIC -o qt/.libs/qt_libzbarqt_la-moc_QZBarThread.o
libtool: compile:  x86_64-alt-linux-g++ -DHAVE_CONFIG_H -I. -I./include -Iqt -DQT_SHARED -I/usr/include/qt4 -I/usr/include/qt4/QtGui -I/usr/include/qt4 -I/usr/include/qt4/QtCore -I./include -Wall -Wno-parentheses -pipe -frecord-gcc-switches -Wall -g -O2 -c qt/moc_QZBarThread.cpp -o qt/qt_libzbarqt_la-moc_QZBarThread.o >/dev/null 2>&1
make[1]: Leaving directory '/usr/src/RPM/BUILD/zbar-0.10'
make[1]: Entering directory '/usr/src/RPM/BUILD/zbar-0.10'
/bin/sh ./libtool  --tag=CC   --mode=compile x86_64-alt-linux-gcc -DHAVE_CONFIG_H -I. -I./include  -I./zbar -I./include    -Wall -Wno-parentheses -pipe -frecord-gcc-switches -Wall -g -O2 -c -o zbar/qrcode/zbar_libzbar_la-qrdec.lo `test -f 'zbar/qrcode/qrdec.c' || echo './'`zbar/qrcode/qrdec.c
libtool: compile:  x86_64-alt-linux-gcc -DHAVE_CONFIG_H -I. -I./include -I./zbar -I./include -Wall -Wno-parentheses -pipe -frecord-gcc-switches -Wall -g -O2 -c zbar/qrcode/qrdec.c  -fPIC -DPIC -o zbar/qrcode/.libs/zbar_libzbar_la-qrdec.o
zbar/qrcode/qrdec.c: In function 'qr_finder_quick_crossing_check':
zbar/qrcode/qrdec.c:1215:27: warning: logical not is only applied to the left hand side of comparison [-Wlogical-not-parentheses]
   if(!_img[_y0*_width+_x0]!=_v||!_img[_y1*_width+_x1]!=_v)return 1;
                           ^~
zbar/qrcode/qrdec.c:1215:6: note: add parentheses around left hand side expression to silence this warning
   if(!_img[_y0*_width+_x0]!=_v||!_img[_y1*_width+_x1]!=_v)return 1;
      ^~~~~~~~~~~~~~~~~~~~~
      (                    )
zbar/qrcode/qrdec.c:1215:54: warning: logical not is only applied to the left hand side of comparison [-Wlogical-not-parentheses]
   if(!_img[_y0*_width+_x0]!=_v||!_img[_y1*_width+_x1]!=_v)return 1;
                                                      ^~
zbar/qrcode/qrdec.c:1215:33: note: add parentheses around left hand side expression to silence this warning
   if(!_img[_y0*_width+_x0]!=_v||!_img[_y1*_width+_x1]!=_v)return 1;
                                 ^~~~~~~~~~~~~~~~~~~~~
                                 (                    )
zbar/qrcode/qrdec.c:1216:45: warning: logical not is only applied to the left hand side of comparison [-Wlogical-not-parentheses]
   if(!_img[(_y0+_y1>>1)*_width+(_x0+_x1>>1)]==_v)return -1;
                                             ^~
zbar/qrcode/qrdec.c:1216:6: note: add parentheses around left hand side expression to silence this warning
   if(!_img[(_y0+_y1>>1)*_width+(_x0+_x1>>1)]==_v)return -1;
      ^~~~~~~~~~~~~~~~~~~~~~~~~~~~~~~~~~~~~~~
      (                                      )
zbar/qrcode/qrdec.c: In function 'qr_finder_locate_crossing':
zbar/qrcode/qrdec.c:1257:33: warning: logical not is only applied to the left hand side of comparison [-Wlogical-not-parentheses]
     if(!_img[x0[1]*_width+x0[0]]!=_v)break;
                                 ^~
zbar/qrcode/qrdec.c:1257:8: note: add parentheses around left hand side expression to silence this warning
     if(!_img[x0[1]*_width+x0[0]]!=_v)break;
        ^~~~~~~~~~~~~~~~~~~~~~~~~
        (                        )
zbar/qrcode/qrdec.c:1269:33: warning: logical not is only applied to the left hand side of comparison [-Wlogical-not-parentheses]
     if(!_img[x1[1]*_width+x1[0]]!=_v)break;
                                 ^~
zbar/qrcode/qrdec.c:1269:8: note: add parentheses around left hand side expression to silence this warning
     if(!_img[x1[1]*_width+x1[0]]!=_v)break;
        ^~~~~~~~~~~~~~~~~~~~~~~~~
        (                        )
libtool: compile:  x86_64-alt-linux-gcc -DHAVE_CONFIG_H -I. -I./include -I./zbar -I./include -Wall -Wno-parentheses -pipe -frecord-gcc-switches -Wall -g -O2 -c zbar/qrcode/qrdec.c -o zbar/qrcode/zbar_libzbar_la-qrdec.o >/dev/null 2>&1
make[1]: Leaving directory '/usr/src/RPM/BUILD/zbar-0.10'
make[1]: Entering directory '/usr/src/RPM/BUILD/zbar-0.10'
/bin/sh ./libtool  --tag=CC   --mode=compile x86_64-alt-linux-gcc -DHAVE_CONFIG_H -I. -I./include  -pthread -I/usr/include/gtk-2.0 -I/usr/lib64/gtk-2.0/include -I/usr/include/pango-1.0 -I/usr/include/atk-1.0 -I/usr/include/cairo -I/usr/include/gdk-pixbuf-2.0 -I/usr/include/libpng16 -I/usr/include/pango-1.0 -I/usr/include/freetype2 -I/usr/include/libpng16 -I/usr/include/harfbuzz -I/usr/include/glib-2.0 -I/usr/lib64/glib-2.0/include -I/usr/include/python2.7 -pthread -I/usr/include/python2.7/pygtk -I/usr/include/gtk-2.0 -I/usr/lib64/gtk-2.0/include -I/usr/include/pango-1.0 -I/usr/include/atk-1.0 -I/usr/include/cairo -I/usr/include/gdk-pixbuf-2.0 -I/usr/include/libpng16 -I/usr/include/pango-1.0 -I/usr/include/freetype2 -I/usr/include/libpng16 -I/usr/include/harfbuzz -I/usr/include/glib-2.0 -I/usr/lib64/glib-2.0/include -I./include  -Wall -Wno-parentheses -pipe -frecord-gcc-switches -Wall -g -O2 -c -o pygtk/pygtk_zbarpygtk_la-zbarpygtk.lo `test -f 'pygtk/zbarpygtk.c' || echo './'`pygtk/zbarpygtk.c
libtool: compile:  x86_64-alt-linux-gcc -DHAVE_CONFIG_H -I. -I./include -pthread -I/usr/include/gtk-2.0 -I/usr/lib64/gtk-2.0/include -I/usr/include/pango-1.0 -I/usr/include/atk-1.0 -I/usr/include/cairo -I/usr/include/gdk-pixbuf-2.0 -I/usr/include/libpng16 -I/usr/include/pango-1.0 -I/usr/include/freetype2 -I/usr/include/libpng16 -I/usr/include/harfbuzz -I/usr/include/glib-2.0 -I/usr/lib64/glib-2.0/include -I/usr/include/python2.7 -pthread -I/usr/include/python2.7/pygtk -I/usr/include/gtk-2.0 -I/usr/lib64/gtk-2.0/include -I/usr/include/pango-1.0 -I/usr/include/atk-1.0 -I/usr/include/cairo -I/usr/include/gdk-pixbuf-2.0 -I/usr/include/libpng16 -I/usr/include/pango-1.0 -I/usr/include/freetype2 -I/usr/include/libpng16 -I/usr/include/harfbuzz -I/usr/include/glib-2.0 -I/usr/lib64/glib-2.0/include -I./include -Wall -Wno-parentheses -pipe -frecord-gcc-switches -Wall -g -O2 -c pygtk/zbarpygtk.c  -fPIC -DPIC -o pygtk/.libs/pygtk_zbarpygtk_la-zbarpygtk.o
libtool: compile:  x86_64-alt-linux-gcc -DHAVE_CONFIG_H -I. -I./include -pthread -I/usr/include/gtk-2.0 -I/usr/lib64/gtk-2.0/include -I/usr/include/pango-1.0 -I/usr/include/atk-1.0 -I/usr/include/cairo -I/usr/include/gdk-pixbuf-2.0 -I/usr/include/libpng16 -I/usr/include/pango-1.0 -I/usr/include/freetype2 -I/usr/include/libpng16 -I/usr/include/harfbuzz -I/usr/include/glib-2.0 -I/usr/lib64/glib-2.0/include -I/usr/include/python2.7 -pthread -I/usr/include/python2.7/pygtk -I/usr/include/gtk-2.0 -I/usr/lib64/gtk-2.0/include -I/usr/include/pango-1.0 -I/usr/include/atk-1.0 -I/usr/include/cairo -I/usr/include/gdk-pixbuf-2.0 -I/usr/include/libpng16 -I/usr/include/pango-1.0 -I/usr/include/freetype2 -I/usr/include/libpng16 -I/usr/include/harfbuzz -I/usr/include/glib-2.0 -I/usr/lib64/glib-2.0/include -I./include -Wall -Wno-parentheses -pipe -frecord-gcc-switches -Wall -g -O2 -c pygtk/zbarpygtk.c -o pygtk/pygtk_zbarpygtk_la-zbarpygtk.o >/dev/null 2>&1
make[1]: Leaving directory '/usr/src/RPM/BUILD/zbar-0.10'
make[1]: Entering directory '/usr/src/RPM/BUILD/zbar-0.10'
/bin/sh ./libtool --tag=CC   --mode=link x86_64-alt-linux-gcc -Wall -Wno-parentheses -pipe -frecord-gcc-switches -Wall -g -O2 -no-undefined -version-info 2:0:2 -export-symbols-regex "^(zbar|_zbar.*_error)_.*"   -lv4l2    -o zbar/libzbar.la -rpath /usr/lib64 zbar/zbar_libzbar_la-config.lo zbar/zbar_libzbar_la-error.lo zbar/zbar_libzbar_la-symbol.lo zbar/zbar_libzbar_la-image.lo zbar/zbar_libzbar_la-convert.lo zbar/zbar_libzbar_la-processor.lo zbar/processor/zbar_libzbar_la-lock.lo zbar/zbar_libzbar_la-refcnt.lo zbar/zbar_libzbar_la-window.lo zbar/zbar_libzbar_la-video.lo zbar/zbar_libzbar_la-img_scanner.lo zbar/zbar_libzbar_la-scanner.lo zbar/zbar_libzbar_la-decoder.lo zbar/decoder/zbar_libzbar_la-ean.lo zbar/decoder/zbar_libzbar_la-code128.lo zbar/decoder/zbar_libzbar_la-code39.lo zbar/decoder/zbar_libzbar_la-i25.lo  zbar/decoder/zbar_libzbar_la-qr_finder.lo zbar/qrcode/zbar_libzbar_la-qrdec.lo zbar/qrcode/zbar_libzbar_la-qrdectxt.lo zbar/qrcode/zbar_libzbar_la-rs.lo zbar/qrcode/zbar_libzbar_la-isaac.lo zbar/qrcode/zbar_libzbar_la-bch15_5.lo zbar/qrcode/zbar_libzbar_la-binarize.lo zbar/qrcode/zbar_libzbar_la-util.lo  zbar/processor/zbar_libzbar_la-posix.lo  zbar/video/zbar_libzbar_la-v4l2.lo   zbar/processor/zbar_libzbar_la-x.lo zbar/window/zbar_libzbar_la-x.lo zbar/window/zbar_libzbar_la-ximage.lo zbar/window/zbar_libzbar_la-xv.lo      -lSM -lICE -lX11  -lXv   -lv4l2 -lpthread 
libtool: link: /usr/bin/nm -B  zbar/.libs/zbar_libzbar_la-config.o zbar/.libs/zbar_libzbar_la-error.o zbar/.libs/zbar_libzbar_la-symbol.o zbar/.libs/zbar_libzbar_la-image.o zbar/.libs/zbar_libzbar_la-convert.o zbar/.libs/zbar_libzbar_la-processor.o zbar/processor/.libs/zbar_libzbar_la-lock.o zbar/.libs/zbar_libzbar_la-refcnt.o zbar/.libs/zbar_libzbar_la-window.o zbar/.libs/zbar_libzbar_la-video.o zbar/.libs/zbar_libzbar_la-img_scanner.o zbar/.libs/zbar_libzbar_la-scanner.o zbar/.libs/zbar_libzbar_la-decoder.o zbar/decoder/.libs/zbar_libzbar_la-ean.o zbar/decoder/.libs/zbar_libzbar_la-code128.o zbar/decoder/.libs/zbar_libzbar_la-code39.o zbar/decoder/.libs/zbar_libzbar_la-i25.o zbar/decoder/.libs/zbar_libzbar_la-qr_finder.o zbar/qrcode/.libs/zbar_libzbar_la-qrdec.o zbar/qrcode/.libs/zbar_libzbar_la-qrdectxt.o zbar/qrcode/.libs/zbar_libzbar_la-rs.o zbar/qrcode/.libs/zbar_libzbar_la-isaac.o zbar/qrcode/.libs/zbar_libzbar_la-bch15_5.o zbar/qrcode/.libs/zbar_libzbar_la-binarize.o zbar/qrcode/.libs/zbar_libzbar_la-util.o zbar/processor/.libs/zbar_libzbar_la-posix.o zbar/video/.libs/zbar_libzbar_la-v4l2.o zbar/processor/.libs/zbar_libzbar_la-x.o zbar/window/.libs/zbar_libzbar_la-x.o zbar/window/.libs/zbar_libzbar_la-ximage.o zbar/window/.libs/zbar_libzbar_la-xv.o   | sed -n -e 's/^.*[	 ]\([ABCDGIRSTW][ABCDGIRSTW]*\)[	 ][	 ]*\([_A-Za-z][_A-Za-z0-9]*\)$/\1 \2 \2/p' | sed '/ __gnu_lto/d' | /bin/sed 's/.* //' | sort | uniq > zbar/.libs/libzbar.exp
libtool: link: /bin/grep -E -e "^(zbar|_zbar.*_error)_.*" "zbar/.libs/libzbar.exp" > "zbar/.libs/libzbar.expT"
libtool: link: mv -f "zbar/.libs/libzbar.expT" "zbar/.libs/libzbar.exp"
libtool: link: echo "{ global:" > zbar/.libs/libzbar.ver
libtool: link:  cat zbar/.libs/libzbar.exp | sed -e "s/\(.*\)/\1;/" >> zbar/.libs/libzbar.ver
libtool: link:  echo "local: *; };" >> zbar/.libs/libzbar.ver
libtool: link:  if test -r libzbar-altlinux.ver; then cp libzbar-altlinux.ver zbar/.libs/libzbar.ver; fi
libtool: link:  x86_64-alt-linux-gcc -shared  -fPIC -DPIC  zbar/.libs/zbar_libzbar_la-config.o zbar/.libs/zbar_libzbar_la-error.o zbar/.libs/zbar_libzbar_la-symbol.o zbar/.libs/zbar_libzbar_la-image.o zbar/.libs/zbar_libzbar_la-convert.o zbar/.libs/zbar_libzbar_la-processor.o zbar/processor/.libs/zbar_libzbar_la-lock.o zbar/.libs/zbar_libzbar_la-refcnt.o zbar/.libs/zbar_libzbar_la-window.o zbar/.libs/zbar_libzbar_la-video.o zbar/.libs/zbar_libzbar_la-img_scanner.o zbar/.libs/zbar_libzbar_la-scanner.o zbar/.libs/zbar_libzbar_la-decoder.o zbar/decoder/.libs/zbar_libzbar_la-ean.o zbar/decoder/.libs/zbar_libzbar_la-code128.o zbar/decoder/.libs/zbar_libzbar_la-code39.o zbar/decoder/.libs/zbar_libzbar_la-i25.o zbar/decoder/.libs/zbar_libzbar_la-qr_finder.o zbar/qrcode/.libs/zbar_libzbar_la-qrdec.o zbar/qrcode/.libs/zbar_libzbar_la-qrdectxt.o zbar/qrcode/.libs/zbar_libzbar_la-rs.o zbar/qrcode/.libs/zbar_libzbar_la-isaac.o zbar/qrcode/.libs/zbar_libzbar_la-bch15_5.o zbar/qrcode/.libs/zbar_libzbar_la-binarize.o zbar/qrcode/.libs/zbar_libzbar_la-util.o zbar/processor/.libs/zbar_libzbar_la-posix.o zbar/video/.libs/zbar_libzbar_la-v4l2.o zbar/processor/.libs/zbar_libzbar_la-x.o zbar/window/.libs/zbar_libzbar_la-x.o zbar/window/.libs/zbar_libzbar_la-ximage.o zbar/window/.libs/zbar_libzbar_la-xv.o   -lSM -lICE -lX11 -lXv -lv4l2 -lpthread  -O2   -Wl,-soname -Wl,libzbar.so.0 -Wl,-version-script -Wl,zbar/.libs/libzbar.ver -o zbar/.libs/libzbar.so.0.2.0
libtool: link: (cd "zbar/.libs" && rm -f "libzbar.so.0" && ln -s "libzbar.so.0.2.0" "libzbar.so.0")
libtool: link: (cd "zbar/.libs" && rm -f "libzbar.so" && ln -s "libzbar.so.0.2.0" "libzbar.so")
copying selected object files to avoid basename conflicts...
libtool: link: ln zbar/window/zbar_libzbar_la-x.o zbar/.libs/libzbar.lax/lt1-zbar_libzbar_la-x.o || cp zbar/window/zbar_libzbar_la-x.o zbar/.libs/libzbar.lax/lt1-zbar_libzbar_la-x.o
libtool: link: ar cru zbar/.libs/libzbar.a zbar/zbar_libzbar_la-config.o zbar/zbar_libzbar_la-error.o zbar/zbar_libzbar_la-symbol.o zbar/zbar_libzbar_la-image.o zbar/zbar_libzbar_la-convert.o zbar/zbar_libzbar_la-processor.o zbar/processor/zbar_libzbar_la-lock.o zbar/zbar_libzbar_la-refcnt.o zbar/zbar_libzbar_la-window.o zbar/zbar_libzbar_la-video.o zbar/zbar_libzbar_la-img_scanner.o zbar/zbar_libzbar_la-scanner.o zbar/zbar_libzbar_la-decoder.o zbar/decoder/zbar_libzbar_la-ean.o zbar/decoder/zbar_libzbar_la-code128.o zbar/decoder/zbar_libzbar_la-code39.o zbar/decoder/zbar_libzbar_la-i25.o zbar/decoder/zbar_libzbar_la-qr_finder.o zbar/qrcode/zbar_libzbar_la-qrdec.o zbar/qrcode/zbar_libzbar_la-qrdectxt.o zbar/qrcode/zbar_libzbar_la-rs.o zbar/qrcode/zbar_libzbar_la-isaac.o zbar/qrcode/zbar_libzbar_la-bch15_5.o zbar/qrcode/zbar_libzbar_la-binarize.o zbar/qrcode/zbar_libzbar_la-util.o zbar/processor/zbar_libzbar_la-posix.o zbar/video/zbar_libzbar_la-v4l2.o zbar/processor/zbar_libzbar_la-x.o zbar/.libs/libzbar.lax/lt1-zbar_libzbar_la-x.o zbar/window/zbar_libzbar_la-ximage.o zbar/window/zbar_libzbar_la-xv.o
libtool: link: ranlib zbar/.libs/libzbar.a
libtool: link: rm -fr zbar/.libs/libzbar.lax
libtool: link: ( cd "zbar/.libs" && rm -f "libzbar.la" && ln -s "../libzbar.la" "libzbar.la" )
make[1]: Leaving directory '/usr/src/RPM/BUILD/zbar-0.10'
make[1]: Entering directory '/usr/src/RPM/BUILD/zbar-0.10'
/bin/sh ./libtool --tag=CC   --mode=link x86_64-alt-linux-gcc -Wall -Wno-parentheses -pipe -frecord-gcc-switches -Wall -g -O2   -o zbarcam/zbarcam zbarcam/zbarcam.o  zbar/libzbar.la  -lv4l2 -lv4l2 -lpthread 
libtool: link: x86_64-alt-linux-gcc -Wall -Wno-parentheses -pipe -frecord-gcc-switches -Wall -g -O2 -o zbarcam/.libs/zbarcam zbarcam/zbarcam.o  zbar/.libs/libzbar.so -lv4l2 -lpthread
make[1]: Leaving directory '/usr/src/RPM/BUILD/zbar-0.10'
make[1]: Entering directory '/usr/src/RPM/BUILD/zbar-0.10'
/bin/sh ./libtool --tag=CC   --mode=link x86_64-alt-linux-gcc -Wall -Wno-parentheses -pipe -frecord-gcc-switches -Wall -g -O2   -o zbarimg/zbarimg zbarimg/zbarimg_zbarimg-zbarimg.o  -lMagickWand-6.Q16 -lMagickCore-6.Q16 zbar/libzbar.la  -lv4l2 -lpthread 
libtool: link: x86_64-alt-linux-gcc -Wall -Wno-parentheses -pipe -frecord-gcc-switches -Wall -g -O2 -o zbarimg/.libs/zbarimg zbarimg/zbarimg_zbarimg-zbarimg.o  -lMagickWand-6.Q16 -lMagickCore-6.Q16 zbar/.libs/libzbar.so -lv4l2 -lpthread
make[1]: Leaving directory '/usr/src/RPM/BUILD/zbar-0.10'
make[1]: Entering directory '/usr/src/RPM/BUILD/zbar-0.10'
/bin/sh ./libtool --tag=CC   --mode=link x86_64-alt-linux-gcc -Wall -Wno-parentheses -pipe -frecord-gcc-switches -Wall -g -O2 -shared -module -avoid-version -export-dynamic -export-symbols-regex initzbar  -o python/zbar.la -rpath /usr/lib64/python2.7/site-packages python/python_zbar_la-zbarmodule.lo python/python_zbar_la-enum.lo python/python_zbar_la-exception.lo python/python_zbar_la-symbol.lo python/python_zbar_la-symbolset.lo python/python_zbar_la-symboliter.lo python/python_zbar_la-image.lo python/python_zbar_la-processor.lo python/python_zbar_la-imagescanner.lo python/python_zbar_la-decoder.lo python/python_zbar_la-scanner.lo  zbar/libzbar.la  -lv4l2 -lpthread 
libtool: link: /usr/bin/nm -B  python/.libs/python_zbar_la-zbarmodule.o python/.libs/python_zbar_la-enum.o python/.libs/python_zbar_la-exception.o python/.libs/python_zbar_la-symbol.o python/.libs/python_zbar_la-symbolset.o python/.libs/python_zbar_la-symboliter.o python/.libs/python_zbar_la-image.o python/.libs/python_zbar_la-processor.o python/.libs/python_zbar_la-imagescanner.o python/.libs/python_zbar_la-decoder.o python/.libs/python_zbar_la-scanner.o   | sed -n -e 's/^.*[	 ]\([ABCDGIRSTW][ABCDGIRSTW]*\)[	 ][	 ]*\([_A-Za-z][_A-Za-z0-9]*\)$/\1 \2 \2/p' | sed '/ __gnu_lto/d' | /bin/sed 's/.* //' | sort | uniq > python/.libs/zbar.exp
libtool: link: /bin/grep -E -e "initzbar" "python/.libs/zbar.exp" > "python/.libs/zbar.expT"
libtool: link: mv -f "python/.libs/zbar.expT" "python/.libs/zbar.exp"
libtool: link: echo "{ global:" > python/.libs/zbar.ver
libtool: link:  cat python/.libs/zbar.exp | sed -e "s/\(.*\)/\1;/" >> python/.libs/zbar.ver
libtool: link:  echo "local: *; };" >> python/.libs/zbar.ver
libtool: link:  if test -r zbar-altlinux.ver; then cp zbar-altlinux.ver python/.libs/zbar.ver; fi
libtool: link:  x86_64-alt-linux-gcc -shared  -fPIC -DPIC  python/.libs/python_zbar_la-zbarmodule.o python/.libs/python_zbar_la-enum.o python/.libs/python_zbar_la-exception.o python/.libs/python_zbar_la-symbol.o python/.libs/python_zbar_la-symbolset.o python/.libs/python_zbar_la-symboliter.o python/.libs/python_zbar_la-image.o python/.libs/python_zbar_la-processor.o python/.libs/python_zbar_la-imagescanner.o python/.libs/python_zbar_la-decoder.o python/.libs/python_zbar_la-scanner.o   -Wl,-rpath -Wl,/usr/src/RPM/BUILD/zbar-0.10/zbar/.libs zbar/.libs/libzbar.so -lv4l2 -lpthread  -O2   -Wl,-soname -Wl,zbar.so -Wl,-version-script -Wl,python/.libs/zbar.ver -o python/.libs/zbar.so
libtool: link: ( cd "python/.libs" && rm -f "zbar.la" && ln -s "../zbar.la" "zbar.la" )
make[1]: Leaving directory '/usr/src/RPM/BUILD/zbar-0.10'
make[1]: Entering directory '/usr/src/RPM/BUILD/zbar-0.10'
/bin/sh ./libtool --tag=CC   --mode=link x86_64-alt-linux-gcc -Wall -Wno-parentheses -pipe -frecord-gcc-switches -Wall -g -O2 -version-info 0:2:0 -export-symbols-regex "^zbar_gtk_.*"   -o gtk/libzbargtk.la -rpath /usr/lib64 gtk/gtk_libzbargtk_la-zbargtk.lo gtk/gtk_libzbargtk_la-zbarmarshal.lo -lgtk-x11-2.0 -lgdk-x11-2.0 -lpangocairo-1.0 -latk-1.0 -lcairo -lgdk_pixbuf-2.0 -lgio-2.0 -lpangoft2-1.0 -lpango-1.0 -lgobject-2.0 -lfontconfig -lfreetype -lgthread-2.0 -pthread -lglib-2.0 zbar/libzbar.la  -lv4l2 -lpthread 
libtool: link: /usr/bin/nm -B  gtk/.libs/gtk_libzbargtk_la-zbargtk.o gtk/.libs/gtk_libzbargtk_la-zbarmarshal.o   | sed -n -e 's/^.*[	 ]\([ABCDGIRSTW][ABCDGIRSTW]*\)[	 ][	 ]*\([_A-Za-z][_A-Za-z0-9]*\)$/\1 \2 \2/p' | sed '/ __gnu_lto/d' | /bin/sed 's/.* //' | sort | uniq > gtk/.libs/libzbargtk.exp
libtool: link: /bin/grep -E -e "^zbar_gtk_.*" "gtk/.libs/libzbargtk.exp" > "gtk/.libs/libzbargtk.expT"
libtool: link: mv -f "gtk/.libs/libzbargtk.expT" "gtk/.libs/libzbargtk.exp"
libtool: link: echo "{ global:" > gtk/.libs/libzbargtk.ver
libtool: link:  cat gtk/.libs/libzbargtk.exp | sed -e "s/\(.*\)/\1;/" >> gtk/.libs/libzbargtk.ver
libtool: link:  echo "local: *; };" >> gtk/.libs/libzbargtk.ver
libtool: link:  if test -r libzbargtk-altlinux.ver; then cp libzbargtk-altlinux.ver gtk/.libs/libzbargtk.ver; fi
libtool: link:  x86_64-alt-linux-gcc -shared  -fPIC -DPIC  gtk/.libs/gtk_libzbargtk_la-zbargtk.o gtk/.libs/gtk_libzbargtk_la-zbarmarshal.o   -Wl,-rpath -Wl,/usr/src/RPM/BUILD/zbar-0.10/zbar/.libs -lgtk-x11-2.0 -lgdk-x11-2.0 -lpangocairo-1.0 -latk-1.0 -lcairo -lgdk_pixbuf-2.0 -lgio-2.0 -lpangoft2-1.0 -lpango-1.0 -lgobject-2.0 -lfontconfig -lfreetype -lgthread-2.0 -lglib-2.0 zbar/.libs/libzbar.so -lv4l2 -lpthread  -O2 -pthread   -pthread -Wl,-soname -Wl,libzbargtk.so.0 -Wl,-version-script -Wl,gtk/.libs/libzbargtk.ver -o gtk/.libs/libzbargtk.so.0.0.2
libtool: link: (cd "gtk/.libs" && rm -f "libzbargtk.so.0" && ln -s "libzbargtk.so.0.0.2" "libzbargtk.so.0")
libtool: link: (cd "gtk/.libs" && rm -f "libzbargtk.so" && ln -s "libzbargtk.so.0.0.2" "libzbargtk.so")
libtool: link: ar cru gtk/.libs/libzbargtk.a  gtk/gtk_libzbargtk_la-zbargtk.o gtk/gtk_libzbargtk_la-zbarmarshal.o
libtool: link: ranlib gtk/.libs/libzbargtk.a
libtool: link: ( cd "gtk/.libs" && rm -f "libzbargtk.la" && ln -s "../libzbargtk.la" "libzbargtk.la" )
make[1]: Leaving directory '/usr/src/RPM/BUILD/zbar-0.10'
make[1]: Entering directory '/usr/src/RPM/BUILD/zbar-0.10'
/bin/sh ./libtool  --tag=CXX   --mode=compile x86_64-alt-linux-g++ -DHAVE_CONFIG_H -I. -I./include  -Iqt -DQT_SHARED -I/usr/include/qt4 -I/usr/include/qt4/QtGui -I/usr/include/qt4 -I/usr/include/qt4/QtCore -I./include  -Wall -Wno-parentheses -pipe -frecord-gcc-switches -Wall -g -O2 -c -o qt/qt_libzbarqt_la-QZBar.lo `test -f 'qt/QZBar.cpp' || echo './'`qt/QZBar.cpp
libtool: compile:  x86_64-alt-linux-g++ -DHAVE_CONFIG_H -I. -I./include -Iqt -DQT_SHARED -I/usr/include/qt4 -I/usr/include/qt4/QtGui -I/usr/include/qt4 -I/usr/include/qt4/QtCore -I./include -Wall -Wno-parentheses -pipe -frecord-gcc-switches -Wall -g -O2 -c qt/QZBar.cpp  -fPIC -DPIC -o qt/.libs/qt_libzbarqt_la-QZBar.o
qt/QZBar.cpp: In member function 'virtual void zbar::QZBar::paintEvent(QPaintEvent*)':
qt/QZBar.cpp:186:11: warning: catching polymorphic type 'class zbar::Exception' by value [-Wcatch-value=]
     catch(Exception) {
           ^~~~~~~~~
qt/QZBar.cpp: In member function 'virtual void zbar::QZBar::resizeEvent(QResizeEvent*)':
qt/QZBar.cpp:199:11: warning: catching polymorphic type 'class zbar::Exception' by value [-Wcatch-value=]
     catch(Exception) { /* ignore */ }
           ^~~~~~~~~
qt/QZBar.cpp: In member function 'virtual void zbar::QZBar::changeEvent(QEvent*)':
qt/QZBar.cpp:209:11: warning: catching polymorphic type 'class zbar::Exception' by value [-Wcatch-value=]
     catch(Exception) { /* ignore (FIXME do something w/error) */ }
           ^~~~~~~~~
qt/QZBar.cpp: In member function 'void zbar::QZBar::attach()':
qt/QZBar.cpp:225:11: warning: catching polymorphic type 'class zbar::Exception' by value [-Wcatch-value=]
     catch(Exception) { /* ignore (FIXME do something w/error) */ }
           ^~~~~~~~~
libtool: compile:  x86_64-alt-linux-g++ -DHAVE_CONFIG_H -I. -I./include -Iqt -DQT_SHARED -I/usr/include/qt4 -I/usr/include/qt4/QtGui -I/usr/include/qt4 -I/usr/include/qt4/QtCore -I./include -Wall -Wno-parentheses -pipe -frecord-gcc-switches -Wall -g -O2 -c qt/QZBar.cpp -o qt/qt_libzbarqt_la-QZBar.o >/dev/null 2>&1
make[1]: Leaving directory '/usr/src/RPM/BUILD/zbar-0.10'
make[1]: Entering directory '/usr/src/RPM/BUILD/zbar-0.10'
/bin/sh ./libtool --tag=CC   --mode=link x86_64-alt-linux-gcc -Wall -Wno-parentheses -pipe -frecord-gcc-switches -Wall -g -O2 -shared -module -avoid-version -export-dynamic -export-symbols-regex initzbarpygtk  -o pygtk/zbarpygtk.la -rpath /usr/lib64/python2.7/site-packages pygtk/pygtk_zbarpygtk_la-zbarpygtkmodule.lo pygtk/pygtk_zbarpygtk_la-zbarpygtk.lo  -lgtk-x11-2.0 -lgdk-x11-2.0 -lpangocairo-1.0 -latk-1.0 -lcairo -lgdk_pixbuf-2.0 -lgio-2.0 -lpangoft2-1.0 -lpango-1.0 -lgobject-2.0 -lglib-2.0 -lfontconfig -lfreetype gtk/libzbargtk.la  -lv4l2 -lpthread 
libtool: link: /usr/bin/nm -B  pygtk/.libs/pygtk_zbarpygtk_la-zbarpygtkmodule.o pygtk/.libs/pygtk_zbarpygtk_la-zbarpygtk.o   | sed -n -e 's/^.*[	 ]\([ABCDGIRSTW][ABCDGIRSTW]*\)[	 ][	 ]*\([_A-Za-z][_A-Za-z0-9]*\)$/\1 \2 \2/p' | sed '/ __gnu_lto/d' | /bin/sed 's/.* //' | sort | uniq > pygtk/.libs/zbarpygtk.exp
libtool: link: /bin/grep -E -e "initzbarpygtk" "pygtk/.libs/zbarpygtk.exp" > "pygtk/.libs/zbarpygtk.expT"
libtool: link: mv -f "pygtk/.libs/zbarpygtk.expT" "pygtk/.libs/zbarpygtk.exp"
libtool: link: echo "{ global:" > pygtk/.libs/zbarpygtk.ver
libtool: link:  cat pygtk/.libs/zbarpygtk.exp | sed -e "s/\(.*\)/\1;/" >> pygtk/.libs/zbarpygtk.ver
libtool: link:  echo "local: *; };" >> pygtk/.libs/zbarpygtk.ver
libtool: link:  if test -r zbarpygtk-altlinux.ver; then cp zbarpygtk-altlinux.ver pygtk/.libs/zbarpygtk.ver; fi
libtool: link:  x86_64-alt-linux-gcc -shared  -fPIC -DPIC  pygtk/.libs/pygtk_zbarpygtk_la-zbarpygtkmodule.o pygtk/.libs/pygtk_zbarpygtk_la-zbarpygtk.o   -Wl,-rpath -Wl,/usr/src/RPM/BUILD/zbar-0.10/gtk/.libs -lgtk-x11-2.0 -lgdk-x11-2.0 -lpangocairo-1.0 -latk-1.0 -lcairo -lgdk_pixbuf-2.0 -lgio-2.0 -lpangoft2-1.0 -lpango-1.0 -lgobject-2.0 -lglib-2.0 -lfontconfig -lfreetype gtk/.libs/libzbargtk.so -lv4l2 -lpthread  -O2   -pthread -Wl,-soname -Wl,zbarpygtk.so -Wl,-version-script -Wl,pygtk/.libs/zbarpygtk.ver -o pygtk/.libs/zbarpygtk.so
libtool: link: ( cd "pygtk/.libs" && rm -f "zbarpygtk.la" && ln -s "../zbarpygtk.la" "zbarpygtk.la" )
make[1]: Leaving directory '/usr/src/RPM/BUILD/zbar-0.10'
make[1]: Entering directory '/usr/src/RPM/BUILD/zbar-0.10'
/bin/sh ./libtool --tag=CXX   --mode=link x86_64-alt-linux-g++ -Wall -Wno-parentheses -pipe -frecord-gcc-switches -Wall -g -O2 -version-info 0:2:0   -o qt/libzbarqt.la -rpath /usr/lib64 qt/qt_libzbarqt_la-QZBar.lo qt/qt_libzbarqt_la-QZBarThread.lo qt/qt_libzbarqt_la-moc_QZBar.lo qt/qt_libzbarqt_la-moc_QZBarThread.lo -L/usr/lib64/qt4/lib -lQtGui -lQtCore zbar/libzbar.la  -lv4l2 -lpthread 
libtool: link: x86_64-alt-linux-g++  -fPIC -DPIC -shared -nostdlib /usr/lib64/gcc/x86_64-alt-linux/8/../../../../lib64/crti.o /usr/lib64/gcc/x86_64-alt-linux/8/crtbeginS.o  qt/.libs/qt_libzbarqt_la-QZBar.o qt/.libs/qt_libzbarqt_la-QZBarThread.o qt/.libs/qt_libzbarqt_la-moc_QZBar.o qt/.libs/qt_libzbarqt_la-moc_QZBarThread.o   -Wl,-rpath -Wl,/usr/src/RPM/BUILD/zbar-0.10/zbar/.libs -L/usr/lib64/qt4/lib -lQtGui -lQtCore zbar/.libs/libzbar.so -lv4l2 -lpthread -L/usr/lib64/gcc/x86_64-alt-linux/8 -L/usr/lib64/gcc/x86_64-alt-linux/8/../../../../lib64 -L/lib/../lib64 -L/usr/lib/../lib64 -L/usr/lib64/gcc/x86_64-alt-linux/8/../../.. -lstdc++ -lm -lc -lgcc_s /usr/lib64/gcc/x86_64-alt-linux/8/crtendS.o /usr/lib64/gcc/x86_64-alt-linux/8/../../../../lib64/crtn.o  -O2   -Wl,-soname -Wl,libzbarqt.so.0 -o qt/.libs/libzbarqt.so.0.0.2
libtool: link: (cd "qt/.libs" && rm -f "libzbarqt.so.0" && ln -s "libzbarqt.so.0.0.2" "libzbarqt.so.0")
libtool: link: (cd "qt/.libs" && rm -f "libzbarqt.so" && ln -s "libzbarqt.so.0.0.2" "libzbarqt.so")
libtool: link: ar cru qt/.libs/libzbarqt.a  qt/qt_libzbarqt_la-QZBar.o qt/qt_libzbarqt_la-QZBarThread.o qt/qt_libzbarqt_la-moc_QZBar.o qt/qt_libzbarqt_la-moc_QZBarThread.o
libtool: link: ranlib qt/.libs/libzbarqt.a
libtool: link: ( cd "qt/.libs" && rm -f "libzbarqt.la" && ln -s "../libzbarqt.la" "libzbarqt.la" )
make[1]: Leaving directory '/usr/src/RPM/BUILD/zbar-0.10'
+ exit 0
Executing(%install): /bin/sh -e /usr/src/tmp/rpm-tmp.27100
+ umask 022
+ /bin/mkdir -p /usr/src/RPM/BUILD
+ cd /usr/src/RPM/BUILD
+ /bin/chmod -Rf u+rwX -- /usr/src/tmp/zbar-buildroot
+ :
+ /bin/rm -rf -- /usr/src/tmp/zbar-buildroot
+ cd zbar-0.10
+ make 'INSTALL=/bin/install -p' DESTDIR=/usr/src/tmp/zbar-buildroot install
make: Entering directory '/usr/src/RPM/BUILD/zbar-0.10'
make  install-am
make[1]: Entering directory '/usr/src/RPM/BUILD/zbar-0.10'
make[2]: Entering directory '/usr/src/RPM/BUILD/zbar-0.10'
 /bin/mkdir -p '/usr/src/tmp/zbar-buildroot/usr/lib64'
 /bin/sh ./libtool   --mode=install /bin/install -p   zbar/libzbar.la gtk/libzbargtk.la qt/libzbarqt.la '/usr/src/tmp/zbar-buildroot/usr/lib64'
libtool: install: /bin/install -p zbar/.libs/libzbar.so.0.2.0 /usr/src/tmp/zbar-buildroot/usr/lib64/libzbar.so.0.2.0
libtool: install: (cd /usr/src/tmp/zbar-buildroot/usr/lib64 && { ln -s -f libzbar.so.0.2.0 libzbar.so.0 || { rm -f libzbar.so.0 && ln -s libzbar.so.0.2.0 libzbar.so.0; }; })
libtool: install: (cd /usr/src/tmp/zbar-buildroot/usr/lib64 && { ln -s -f libzbar.so.0.2.0 libzbar.so || { rm -f libzbar.so && ln -s libzbar.so.0.2.0 libzbar.so; }; })
libtool: install: /bin/install -p zbar/.libs/libzbar.lai /usr/src/tmp/zbar-buildroot/usr/lib64/libzbar.la
libtool: install: warning: relinking `gtk/libzbargtk.la'
libtool: install: (cd /usr/src/RPM/BUILD/zbar-0.10; /bin/sh /usr/src/RPM/BUILD/zbar-0.10/libtool  --tag CC --mode=relink x86_64-alt-linux-gcc -Wall -Wno-parentheses -pipe -frecord-gcc-switches -Wall -g -O2 -version-info 0:2:0 -export-symbols-regex "^zbar_gtk_.*" -o gtk/libzbargtk.la -rpath /usr/lib64 gtk/gtk_libzbargtk_la-zbargtk.lo gtk/gtk_libzbargtk_la-zbarmarshal.lo -lgtk-x11-2.0 -lgdk-x11-2.0 -lpangocairo-1.0 -latk-1.0 -lcairo -lgdk_pixbuf-2.0 -lgio-2.0 -lpangoft2-1.0 -lpango-1.0 -lgobject-2.0 -lfontconfig -lfreetype -lgthread-2.0 -pthread -lglib-2.0 zbar/libzbar.la -lv4l2 -lpthread -inst-prefix-dir /usr/src/tmp/zbar-buildroot)
libtool: relink: /usr/bin/nm -B  gtk/.libs/gtk_libzbargtk_la-zbargtk.o gtk/.libs/gtk_libzbargtk_la-zbarmarshal.o   | sed -n -e 's/^.*[	 ]\([ABCDGIRSTW][ABCDGIRSTW]*\)[	 ][	 ]*\([_A-Za-z][_A-Za-z0-9]*\)$/\1 \2 \2/p' | sed '/ __gnu_lto/d' | /bin/sed 's/.* //' | sort | uniq > gtk/.libs/libzbargtk.exp
libtool: relink: /bin/grep -E -e "^zbar_gtk_.*" "gtk/.libs/libzbargtk.exp" > "gtk/.libs/libzbargtk.expT"
libtool: relink: mv -f "gtk/.libs/libzbargtk.expT" "gtk/.libs/libzbargtk.exp"
libtool: relink: echo "{ global:" > gtk/.libs/libzbargtk.ver
libtool: relink:  cat gtk/.libs/libzbargtk.exp | sed -e "s/\(.*\)/\1;/" >> gtk/.libs/libzbargtk.ver
libtool: relink:  echo "local: *; };" >> gtk/.libs/libzbargtk.ver
libtool: relink:  if test -r libzbargtk-altlinux.ver; then cp libzbargtk-altlinux.ver gtk/.libs/libzbargtk.ver; fi
libtool: relink:  x86_64-alt-linux-gcc -shared  -fPIC -DPIC  gtk/.libs/gtk_libzbargtk_la-zbargtk.o gtk/.libs/gtk_libzbargtk_la-zbarmarshal.o   -lgtk-x11-2.0 -lgdk-x11-2.0 -lpangocairo-1.0 -latk-1.0 -lcairo -lgdk_pixbuf-2.0 -lgio-2.0 -lpangoft2-1.0 -lpango-1.0 -lgobject-2.0 -lfontconfig -lfreetype -lgthread-2.0 -lglib-2.0 -L/usr/src/tmp/zbar-buildroot/usr/lib64 -L/usr/lib64 -lzbar -lv4l2 -lpthread  -O2 -pthread   -pthread -Wl,-soname -Wl,libzbargtk.so.0 -Wl,-version-script -Wl,gtk/.libs/libzbargtk.ver -o gtk/.libs/libzbargtk.so.0.0.2
libtool: install: /bin/install -p gtk/.libs/libzbargtk.so.0.0.2T /usr/src/tmp/zbar-buildroot/usr/lib64/libzbargtk.so.0.0.2
libtool: install: (cd /usr/src/tmp/zbar-buildroot/usr/lib64 && { ln -s -f libzbargtk.so.0.0.2 libzbargtk.so.0 || { rm -f libzbargtk.so.0 && ln -s libzbargtk.so.0.0.2 libzbargtk.so.0; }; })
libtool: install: (cd /usr/src/tmp/zbar-buildroot/usr/lib64 && { ln -s -f libzbargtk.so.0.0.2 libzbargtk.so || { rm -f libzbargtk.so && ln -s libzbargtk.so.0.0.2 libzbargtk.so; }; })
libtool: install: /bin/install -p gtk/.libs/libzbargtk.lai /usr/src/tmp/zbar-buildroot/usr/lib64/libzbargtk.la
libtool: install: warning: relinking `qt/libzbarqt.la'
libtool: install: (cd /usr/src/RPM/BUILD/zbar-0.10; /bin/sh /usr/src/RPM/BUILD/zbar-0.10/libtool  --tag CXX --mode=relink x86_64-alt-linux-g++ -Wall -Wno-parentheses -pipe -frecord-gcc-switches -Wall -g -O2 -version-info 0:2:0 -o qt/libzbarqt.la -rpath /usr/lib64 qt/qt_libzbarqt_la-QZBar.lo qt/qt_libzbarqt_la-QZBarThread.lo qt/qt_libzbarqt_la-moc_QZBar.lo qt/qt_libzbarqt_la-moc_QZBarThread.lo -L/usr/lib64/qt4/lib -lQtGui -lQtCore zbar/libzbar.la -lv4l2 -lpthread -inst-prefix-dir /usr/src/tmp/zbar-buildroot)
libtool: relink: x86_64-alt-linux-g++  -fPIC -DPIC -shared -nostdlib /usr/lib64/gcc/x86_64-alt-linux/8/../../../../lib64/crti.o /usr/lib64/gcc/x86_64-alt-linux/8/crtbeginS.o  qt/.libs/qt_libzbarqt_la-QZBar.o qt/.libs/qt_libzbarqt_la-QZBarThread.o qt/.libs/qt_libzbarqt_la-moc_QZBar.o qt/.libs/qt_libzbarqt_la-moc_QZBarThread.o   -L/usr/lib64/qt4/lib -lQtGui -lQtCore -L/usr/src/tmp/zbar-buildroot/usr/lib64 -L/usr/lib64 -lzbar -lv4l2 -lpthread -L/usr/lib64/gcc/x86_64-alt-linux/8 -L/usr/lib64/gcc/x86_64-alt-linux/8/../../../../lib64 -L/lib/../lib64 -L/usr/lib/../lib64 -L/usr/lib64/gcc/x86_64-alt-linux/8/../../.. -lstdc++ -lm -lc -lgcc_s /usr/lib64/gcc/x86_64-alt-linux/8/crtendS.o /usr/lib64/gcc/x86_64-alt-linux/8/../../../../lib64/crtn.o  -O2   -Wl,-soname -Wl,libzbarqt.so.0 -o qt/.libs/libzbarqt.so.0.0.2
libtool: install: /bin/install -p qt/.libs/libzbarqt.so.0.0.2T /usr/src/tmp/zbar-buildroot/usr/lib64/libzbarqt.so.0.0.2
libtool: install: (cd /usr/src/tmp/zbar-buildroot/usr/lib64 && { ln -s -f libzbarqt.so.0.0.2 libzbarqt.so.0 || { rm -f libzbarqt.so.0 && ln -s libzbarqt.so.0.0.2 libzbarqt.so.0; }; })
libtool: install: (cd /usr/src/tmp/zbar-buildroot/usr/lib64 && { ln -s -f libzbarqt.so.0.0.2 libzbarqt.so || { rm -f libzbarqt.so && ln -s libzbarqt.so.0.0.2 libzbarqt.so; }; })
libtool: install: /bin/install -p qt/.libs/libzbarqt.lai /usr/src/tmp/zbar-buildroot/usr/lib64/libzbarqt.la
libtool: install: /bin/install -p zbar/.libs/libzbar.a /usr/src/tmp/zbar-buildroot/usr/lib64/libzbar.a
libtool: install: chmod 644 /usr/src/tmp/zbar-buildroot/usr/lib64/libzbar.a
libtool: install: ranlib /usr/src/tmp/zbar-buildroot/usr/lib64/libzbar.a
libtool: install: /bin/install -p gtk/.libs/libzbargtk.a /usr/src/tmp/zbar-buildroot/usr/lib64/libzbargtk.a
libtool: install: chmod 644 /usr/src/tmp/zbar-buildroot/usr/lib64/libzbargtk.a
libtool: install: ranlib /usr/src/tmp/zbar-buildroot/usr/lib64/libzbargtk.a
libtool: install: /bin/install -p qt/.libs/libzbarqt.a /usr/src/tmp/zbar-buildroot/usr/lib64/libzbarqt.a
libtool: install: chmod 644 /usr/src/tmp/zbar-buildroot/usr/lib64/libzbarqt.a
libtool: install: ranlib /usr/src/tmp/zbar-buildroot/usr/lib64/libzbarqt.a
libtool: install: warning: remember to run `libtool --finish /usr/lib64'
 /bin/mkdir -p '/usr/src/tmp/zbar-buildroot/usr/bin'
  /bin/sh ./libtool   --mode=install /bin/install -p zbarimg/zbarimg zbarcam/zbarcam '/usr/src/tmp/zbar-buildroot/usr/bin'
libtool: install: warning: `zbar/libzbar.la' has not been installed in `/usr/lib64'
libtool: install: /bin/install -p zbarimg/.libs/zbarimg /usr/src/tmp/zbar-buildroot/usr/bin/zbarimg
libtool: install: warning: `zbar/libzbar.la' has not been installed in `/usr/lib64'
libtool: install: /bin/install -p zbarcam/.libs/zbarcam /usr/src/tmp/zbar-buildroot/usr/bin/zbarcam
 /bin/mkdir -p '/usr/src/tmp/zbar-buildroot/usr/lib64/python2.7/site-packages'
 /bin/sh ./libtool   --mode=install /bin/install -p   python/zbar.la pygtk/zbarpygtk.la '/usr/src/tmp/zbar-buildroot/usr/lib64/python2.7/site-packages'
libtool: install: warning: relinking `python/zbar.la'
libtool: install: (cd /usr/src/RPM/BUILD/zbar-0.10; /bin/sh /usr/src/RPM/BUILD/zbar-0.10/libtool  --tag CC --mode=relink x86_64-alt-linux-gcc -Wall -Wno-parentheses -pipe -frecord-gcc-switches -Wall -g -O2 -shared -module -avoid-version -export-dynamic -export-symbols-regex initzbar -o python/zbar.la -rpath /usr/lib64/python2.7/site-packages python/python_zbar_la-zbarmodule.lo python/python_zbar_la-enum.lo python/python_zbar_la-exception.lo python/python_zbar_la-symbol.lo python/python_zbar_la-symbolset.lo python/python_zbar_la-symboliter.lo python/python_zbar_la-image.lo python/python_zbar_la-processor.lo python/python_zbar_la-imagescanner.lo python/python_zbar_la-decoder.lo python/python_zbar_la-scanner.lo zbar/libzbar.la -lv4l2 -lpthread -inst-prefix-dir /usr/src/tmp/zbar-buildroot)
libtool: relink: /usr/bin/nm -B  python/.libs/python_zbar_la-zbarmodule.o python/.libs/python_zbar_la-enum.o python/.libs/python_zbar_la-exception.o python/.libs/python_zbar_la-symbol.o python/.libs/python_zbar_la-symbolset.o python/.libs/python_zbar_la-symboliter.o python/.libs/python_zbar_la-image.o python/.libs/python_zbar_la-processor.o python/.libs/python_zbar_la-imagescanner.o python/.libs/python_zbar_la-decoder.o python/.libs/python_zbar_la-scanner.o   | sed -n -e 's/^.*[	 ]\([ABCDGIRSTW][ABCDGIRSTW]*\)[	 ][	 ]*\([_A-Za-z][_A-Za-z0-9]*\)$/\1 \2 \2/p' | sed '/ __gnu_lto/d' | /bin/sed 's/.* //' | sort | uniq > python/.libs/zbar.exp
libtool: relink: /bin/grep -E -e "initzbar" "python/.libs/zbar.exp" > "python/.libs/zbar.expT"
libtool: relink: mv -f "python/.libs/zbar.expT" "python/.libs/zbar.exp"
libtool: relink: echo "{ global:" > python/.libs/zbar.ver
libtool: relink:  cat python/.libs/zbar.exp | sed -e "s/\(.*\)/\1;/" >> python/.libs/zbar.ver
libtool: relink:  echo "local: *; };" >> python/.libs/zbar.ver
libtool: relink:  if test -r zbar-altlinux.ver; then cp zbar-altlinux.ver python/.libs/zbar.ver; fi
libtool: relink:  x86_64-alt-linux-gcc -shared  -fPIC -DPIC  python/.libs/python_zbar_la-zbarmodule.o python/.libs/python_zbar_la-enum.o python/.libs/python_zbar_la-exception.o python/.libs/python_zbar_la-symbol.o python/.libs/python_zbar_la-symbolset.o python/.libs/python_zbar_la-symboliter.o python/.libs/python_zbar_la-image.o python/.libs/python_zbar_la-processor.o python/.libs/python_zbar_la-imagescanner.o python/.libs/python_zbar_la-decoder.o python/.libs/python_zbar_la-scanner.o   -L/usr/src/tmp/zbar-buildroot/usr/lib64 -L/usr/lib64 -lzbar -lv4l2 -lpthread  -O2   -Wl,-soname -Wl,zbar.so -Wl,-version-script -Wl,python/.libs/zbar.ver -o python/.libs/zbar.so
libtool: install: /bin/install -p python/.libs/zbar.soT /usr/src/tmp/zbar-buildroot/usr/lib64/python2.7/site-packages/zbar.so
libtool: install: /bin/install -p python/.libs/zbar.lai /usr/src/tmp/zbar-buildroot/usr/lib64/python2.7/site-packages/zbar.la
libtool: install: warning: relinking `pygtk/zbarpygtk.la'
libtool: install: (cd /usr/src/RPM/BUILD/zbar-0.10; /bin/sh /usr/src/RPM/BUILD/zbar-0.10/libtool  --tag CC --mode=relink x86_64-alt-linux-gcc -Wall -Wno-parentheses -pipe -frecord-gcc-switches -Wall -g -O2 -shared -module -avoid-version -export-dynamic -export-symbols-regex initzbarpygtk -o pygtk/zbarpygtk.la -rpath /usr/lib64/python2.7/site-packages pygtk/pygtk_zbarpygtk_la-zbarpygtkmodule.lo pygtk/pygtk_zbarpygtk_la-zbarpygtk.lo -lgtk-x11-2.0 -lgdk-x11-2.0 -lpangocairo-1.0 -latk-1.0 -lcairo -lgdk_pixbuf-2.0 -lgio-2.0 -lpangoft2-1.0 -lpango-1.0 -lgobject-2.0 -lglib-2.0 -lfontconfig -lfreetype gtk/libzbargtk.la -lv4l2 -lpthread -inst-prefix-dir /usr/src/tmp/zbar-buildroot)
libtool: relink: /usr/bin/nm -B  pygtk/.libs/pygtk_zbarpygtk_la-zbarpygtkmodule.o pygtk/.libs/pygtk_zbarpygtk_la-zbarpygtk.o   | sed -n -e 's/^.*[	 ]\([ABCDGIRSTW][ABCDGIRSTW]*\)[	 ][	 ]*\([_A-Za-z][_A-Za-z0-9]*\)$/\1 \2 \2/p' | sed '/ __gnu_lto/d' | /bin/sed 's/.* //' | sort | uniq > pygtk/.libs/zbarpygtk.exp
libtool: relink: /bin/grep -E -e "initzbarpygtk" "pygtk/.libs/zbarpygtk.exp" > "pygtk/.libs/zbarpygtk.expT"
libtool: relink: mv -f "pygtk/.libs/zbarpygtk.expT" "pygtk/.libs/zbarpygtk.exp"
libtool: relink: echo "{ global:" > pygtk/.libs/zbarpygtk.ver
libtool: relink:  cat pygtk/.libs/zbarpygtk.exp | sed -e "s/\(.*\)/\1;/" >> pygtk/.libs/zbarpygtk.ver
libtool: relink:  echo "local: *; };" >> pygtk/.libs/zbarpygtk.ver
libtool: relink:  if test -r zbarpygtk-altlinux.ver; then cp zbarpygtk-altlinux.ver pygtk/.libs/zbarpygtk.ver; fi
libtool: relink:  x86_64-alt-linux-gcc -shared  -fPIC -DPIC  pygtk/.libs/pygtk_zbarpygtk_la-zbarpygtkmodule.o pygtk/.libs/pygtk_zbarpygtk_la-zbarpygtk.o   -lgtk-x11-2.0 -lgdk-x11-2.0 -lpangocairo-1.0 -latk-1.0 -lcairo -lgdk_pixbuf-2.0 -lgio-2.0 -lpangoft2-1.0 -lpango-1.0 -lgobject-2.0 -lglib-2.0 -lfontconfig -lfreetype -L/usr/src/tmp/zbar-buildroot/usr/lib64 -L/usr/lib64 -lzbargtk -lv4l2 -lpthread  -O2   -pthread -Wl,-soname -Wl,zbarpygtk.so -Wl,-version-script -Wl,pygtk/.libs/zbarpygtk.ver -o pygtk/.libs/zbarpygtk.so
libtool: install: /bin/install -p pygtk/.libs/zbarpygtk.soT /usr/src/tmp/zbar-buildroot/usr/lib64/python2.7/site-packages/zbarpygtk.so
libtool: install: /bin/install -p pygtk/.libs/zbarpygtk.lai /usr/src/tmp/zbar-buildroot/usr/lib64/python2.7/site-packages/zbarpygtk.la
libtool: install: warning: remember to run `libtool --finish /usr/lib64/python2.7/site-packages'
 /bin/mkdir -p '/usr/src/tmp/zbar-buildroot/usr/share/doc/zbar'
 /bin/install -p -m 644 COPYING HACKING INSTALL LICENSE NEWS README TODO '/usr/src/tmp/zbar-buildroot/usr/share/doc/zbar'
 /bin/mkdir -p '/usr/src/tmp/zbar-buildroot/usr/include'
 /bin/install -p -m 644 include/zbar.h '/usr/src/tmp/zbar-buildroot/usr/include'
 /bin/mkdir -p '/usr/src/tmp/zbar-buildroot/usr/share/man/man1'
 /bin/install -p -m 644 doc/man/zbarimg.1 doc/man/zbarcam.1 '/usr/src/tmp/zbar-buildroot/usr/share/man/man1'
 /bin/mkdir -p '/usr/src/tmp/zbar-buildroot/usr/lib64/pkgconfig'
 /bin/install -p -m 644 zbar.pc zbar-gtk.pc zbar-qt.pc '/usr/src/tmp/zbar-buildroot/usr/lib64/pkgconfig'
 /bin/mkdir -p '/usr/src/tmp/zbar-buildroot/usr/include/zbar'
 /bin/install -p -m 644 include/zbar/Scanner.h include/zbar/Decoder.h include/zbar/Exception.h include/zbar/Symbol.h include/zbar/Image.h include/zbar/ImageScanner.h include/zbar/Video.h include/zbar/Window.h include/zbar/Processor.h include/zbar/zbargtk.h include/zbar/QZBar.h include/zbar/QZBarImage.h '/usr/src/tmp/zbar-buildroot/usr/include/zbar'
make[2]: Leaving directory '/usr/src/RPM/BUILD/zbar-0.10'
make[1]: Leaving directory '/usr/src/RPM/BUILD/zbar-0.10'
make: Leaving directory '/usr/src/RPM/BUILD/zbar-0.10'
+ /usr/lib/rpm/brp-alt
Cleaning files in /usr/src/tmp/zbar-buildroot (auto)
removed './usr/lib64/libzbarqt.la'
removed './usr/lib64/libzbargtk.la'
removed './usr/lib64/libzbar.la'
mode of './usr/lib64/python2.7/site-packages/zbarpygtk.so' changed from 0755 (rwxr-xr-x) to 0644 (rw-r--r--)
mode of './usr/lib64/python2.7/site-packages/zbar.so' changed from 0755 (rwxr-xr-x) to 0644 (rw-r--r--)
mode of './usr/lib64/libzbarqt.so.0.0.2' changed from 0755 (rwxr-xr-x) to 0644 (rw-r--r--)
mode of './usr/lib64/libzbargtk.so.0.0.2' changed from 0755 (rwxr-xr-x) to 0644 (rw-r--r--)
mode of './usr/lib64/libzbar.so.0.2.0' changed from 0755 (rwxr-xr-x) to 0644 (rw-r--r--)
Verifying and fixing files in /usr/src/tmp/zbar-buildroot (binconfig,pkgconfig,libtool,desktop)
/usr/lib64/pkgconfig/zbar-qt.pc: Cflags: '-I${includedir}' --> ''
/usr/lib64/pkgconfig/zbar-qt.pc: Libs: '-L${libdir} -lzbarqt' --> '-lzbarqt'
/usr/lib64/pkgconfig/zbar-gtk.pc: Cflags: '-I${includedir}' --> ''
/usr/lib64/pkgconfig/zbar-gtk.pc: Libs: '-L${libdir} -lzbargtk' --> '-lzbargtk'
/usr/lib64/pkgconfig/zbar.pc: Cflags: '-I${includedir}' --> ''
/usr/lib64/pkgconfig/zbar.pc: Libs: '-L${libdir} -lzbar' --> '-lzbar'
/usr/lib64/python2.7/site-packages/zbarpygtk.la: dependency_libs: ' /usr/lib64/libzbargtk.la -lgtk-x11-2.0 -lgdk-x11-2.0 -lpangocairo-1.0 -latk-1.0 -lcairo -lgdk_pixbuf-2.0 -lgio-2.0 -lpangoft2-1.0 -lpango-1.0 -lgobject-2.0 -lfontconfig -lfreetype -lgthread-2.0 -lglib-2.0 /usr/lib64/libzbar.la -lSM -lICE -lX11 -lXv -lv4l2 -lpthread' --> '/usr/lib64/libzbargtk.la -lgtk-x11-2.0 -lgdk-x11-2.0 -lpangocairo-1.0 -latk-1.0 -lcairo -lgdk_pixbuf-2.0 -lgio-2.0 -lpangoft2-1.0 -lpango-1.0 -lgobject-2.0 -lfontconfig -lfreetype -lgthread-2.0 -lglib-2.0 /usr/lib64/libzbar.la -lSM -lICE -lX11 -lXv -lv4l2 -lpthread'
/usr/lib64/python2.7/site-packages/zbar.la: dependency_libs: ' /usr/lib64/libzbar.la -lSM -lICE -lX11 -lXv -lv4l2 -lpthread' --> '/usr/lib64/libzbar.la -lSM -lICE -lX11 -lXv -lv4l2 -lpthread'
Checking contents of files in /usr/src/tmp/zbar-buildroot/ (default)
Compressing files in /usr/src/tmp/zbar-buildroot (auto)
Adjusting library links in /usr/src/tmp/zbar-buildroot
./usr/lib64:
	libzbar.so.0 -> libzbar.so.0.2.0
	libzbargtk.so.0 -> libzbargtk.so.0.0.2
	libzbarqt.so.0 -> libzbarqt.so.0.0.2
Verifying ELF objects in /usr/src/tmp/zbar-buildroot (arch=normal,fhs=normal,lfs=relaxed,lint=relaxed,rpath=normal,stack=normal,textrel=normal,unresolved=normal)
Hardlinking identical .pyc and .pyo files
Processing files: zbar-0.10-alt9
Finding Provides (using /usr/lib/rpm/find-provides)
Executing: /bin/sh -e /usr/src/tmp/rpm-tmp.m0aHOC
find-provides: running scripts (alternatives,debuginfo,gir,lib,pam,perl,pkgconfig,python,shell,typelib)
Finding Requires (using /usr/lib/rpm/find-requires)
Executing: /bin/sh -e /usr/src/tmp/rpm-tmp.BeTeGO
find-requires: running scripts (cpp,debuginfo,files,gir-js,gir-python,gir,lib,pam,perl,pkgconfig,pkgconfiglib,python,rpmlib,shebang,shell,static,symlinks,typelib)
Requires: /lib64/ld-linux-x86-64.so.2, libMagickWand-6.Q16.so.6()(64bit) >= set:njWZv0nPSozN8trX3cQLsnuWqXnZvJIQZm34Vz1, libc.so.6(GLIBC_2.2.5)(64bit), libc.so.6(GLIBC_2.3.4)(64bit), libzbar.so.0()(64bit) >= set:kePjQe2UUwagFdRSjvGOMmfZD2X765bCpdexAOdrSPvucHuG5bOmHoRgWIujtvaT1VSg8tXiAx2KJg, rtld(GNU_HASH)
Requires(rpmlib): rpmlib(SetVersions)
Finding debuginfo files (using /usr/lib/rpm/find-debuginfo-files)
Executing: /bin/sh -e /usr/src/tmp/rpm-tmp.gOZir8
Creating zbar-debuginfo package
Processing files: libzbar-0.10-alt9
Finding Provides (using /usr/lib/rpm/find-provides)
Executing: /bin/sh -e /usr/src/tmp/rpm-tmp.7Xhfjw
find-provides: running scripts (alternatives,debuginfo,gir,lib,pam,perl,pkgconfig,python,shell,typelib)
lib.prov: /usr/src/tmp/zbar-buildroot/usr/lib64/libzbar.so.0: 119 symbols, 17 bpp
Finding Requires (using /usr/lib/rpm/find-requires)
Executing: /bin/sh -e /usr/src/tmp/rpm-tmp.khNOBY
find-requires: running scripts (cpp,debuginfo,files,gir-js,gir-python,gir,lib,pam,perl,pkgconfig,pkgconfiglib,python,rpmlib,shebang,shell,static,symlinks,typelib)
Provides: libzbar.so.0()(64bit) = set:kdxEFBelf2BFoPuLzgC0z0ATOMOlm9aoiEExtMoccrDGdFOMQDGcuxfOhH8FSEPwnKPg4KZlxfltPi5kLYpOUs4Q7SZHdKKZ5K3G3rfAB5r6zi8acAHWIdQI5XDZ3fXGUDbDRL7YrCvsFb6I8I2SDbBRqyGyx7EvzWRheZsgOCmU8vvyZbqMQIz8sZyOcMtoKrdBJStT8gyP8erxZ1aZkM4BQlzDjXW2InEwvZqeWUtD1
Requires: libX11.so.6()(64bit) >= set:oipS1uTHp70LJjqwcig6I6hYiPo5pD4eKnFxHJtjeA4JBARkiGPRS08ldnPAIEYiI6j0kXOTcktBLUrJK5DYts5HcEaXZ4HnUkZenmEq8gHVu07cBAVzHbmegL0BznlhOYeCpg5Z8zaMunEbtgPsLeB, libXv.so.1()(64bit) >= set:ietH9rMJ82q6SuZB9li5G3aD1, libc.so.6(GLIBC_2.14)(64bit), libc.so.6(GLIBC_2.17)(64bit), libc.so.6(GLIBC_2.2.5)(64bit), libc.so.6(GLIBC_2.3)(64bit), libc.so.6(GLIBC_2.3.4)(64bit), libc.so.6(GLIBC_2.4)(64bit), libpthread.so.0(GLIBC_2.2.5)(64bit), libpthread.so.0(GLIBC_2.3.2)(64bit), libv4l2.so.0()(64bit) >= set:heR58QvshXAqb, rtld(GNU_HASH)
Requires(rpmlib): rpmlib(SetVersions)
Finding debuginfo files (using /usr/lib/rpm/find-debuginfo-files)
Executing: /bin/sh -e /usr/src/tmp/rpm-tmp.bjjxxy
Creating libzbar-debuginfo package
Processing files: libzbar-devel-0.10-alt9
Finding Provides (using /usr/lib/rpm/find-provides)
Executing: /bin/sh -e /usr/src/tmp/rpm-tmp.IcwwIc
find-provides: running scripts (alternatives,debuginfo,gir,lib,pam,perl,pkgconfig,python,shell,typelib)
Finding Requires (using /usr/lib/rpm/find-requires)
Executing: /bin/sh -e /usr/src/tmp/rpm-tmp.rWsmpV
find-requires: running scripts (cpp,debuginfo,files,gir-js,gir-python,gir,lib,pam,perl,pkgconfig,pkgconfiglib,python,rpmlib,shebang,shell,static,symlinks,typelib)
/usr/src/tmp/zbar-buildroot/usr/include/zbar/Image.h:30:3: error: #error "include zbar.h in your application, **not** zbar/Image.h"
 # error "include zbar.h in your application, **not** zbar/Image.h"
   ^~~~~
/usr/src/tmp/zbar-buildroot/usr/include/zbar/Image.h:34:10: fatal error: iterator: No such file or directory
 #include <iterator>
          ^~~~~~~~~~
compilation terminated.
cpp.req: /usr/src/tmp/zbar-buildroot/usr/include/zbar/Image.h: cpp failed, trying c++ mode
/usr/src/tmp/zbar-buildroot/usr/include/zbar/Image.h:30:3: error: #error "include zbar.h in your application, **not** zbar/Image.h"
 # error "include zbar.h in your application, **not** zbar/Image.h"
   ^~~~~
In file included from /usr/src/tmp/zbar-buildroot/usr/include/zbar/Image.h:35:
/usr/src/tmp/zbar-buildroot/usr/include/zbar/Symbol.h:30:3: error: #error "include zbar.h in your application, **not** zbar/Symbol.h"
 # error "include zbar.h in your application, **not** zbar/Symbol.h"
   ^~~~~
In file included from /usr/src/tmp/zbar-buildroot/usr/include/zbar/Image.h:36:
/usr/src/tmp/zbar-buildroot/usr/include/zbar/Exception.h:30:3: error: #error "include zbar.h in your application, **not** zbar/Exception.h"
 # error "include zbar.h in your application, **not** zbar/Exception.h"
   ^~~~~
cpp.req: WARNING: /usr/src/tmp/zbar-buildroot/usr/include/zbar/Image.h: cpp failed
/usr/src/tmp/zbar-buildroot/usr/include/zbar/Video.h:30:3: error: #error "include zbar.h in your application, **not** zbar/Video.h"
 # error "include zbar.h in your application, **not** zbar/Video.h"
   ^~~~~
In file included from /usr/src/tmp/zbar-buildroot/usr/include/zbar/Video.h:33:
/usr/src/tmp/zbar-buildroot/usr/include/zbar/Image.h:30:3: error: #error "include zbar.h in your application, **not** zbar/Image.h"
 # error "include zbar.h in your application, **not** zbar/Image.h"
   ^~~~~
In file included from /usr/src/tmp/zbar-buildroot/usr/include/zbar/Video.h:33:
/usr/src/tmp/zbar-buildroot/usr/include/zbar/Image.h:34:10: fatal error: iterator: No such file or directory
 #include <iterator>
          ^~~~~~~~~~
compilation terminated.
cpp.req: /usr/src/tmp/zbar-buildroot/usr/include/zbar/Video.h: cpp failed, trying c++ mode
/usr/src/tmp/zbar-buildroot/usr/include/zbar/Video.h:30:3: error: #error "include zbar.h in your application, **not** zbar/Video.h"
 # error "include zbar.h in your application, **not** zbar/Video.h"
   ^~~~~
In file included from /usr/src/tmp/zbar-buildroot/usr/include/zbar/Video.h:33:
/usr/src/tmp/zbar-buildroot/usr/include/zbar/Image.h:30:3: error: #error "include zbar.h in your application, **not** zbar/Image.h"
 # error "include zbar.h in your application, **not** zbar/Image.h"
   ^~~~~
In file included from /usr/src/tmp/zbar-buildroot/usr/include/zbar/Image.h:35,
                 from /usr/src/tmp/zbar-buildroot/usr/include/zbar/Video.h:33:
/usr/src/tmp/zbar-buildroot/usr/include/zbar/Symbol.h:30:3: error: #error "include zbar.h in your application, **not** zbar/Symbol.h"
 # error "include zbar.h in your application, **not** zbar/Symbol.h"
   ^~~~~
In file included from /usr/src/tmp/zbar-buildroot/usr/include/zbar/Image.h:36,
                 from /usr/src/tmp/zbar-buildroot/usr/include/zbar/Video.h:33:
/usr/src/tmp/zbar-buildroot/usr/include/zbar/Exception.h:30:3: error: #error "include zbar.h in your application, **not** zbar/Exception.h"
 # error "include zbar.h in your application, **not** zbar/Exception.h"
   ^~~~~
cpp.req: WARNING: /usr/src/tmp/zbar-buildroot/usr/include/zbar/Video.h: cpp failed
/usr/src/tmp/zbar-buildroot/usr/include/zbar/Symbol.h:30:3: error: #error "include zbar.h in your application, **not** zbar/Symbol.h"
 # error "include zbar.h in your application, **not** zbar/Symbol.h"
   ^~~~~
/usr/src/tmp/zbar-buildroot/usr/include/zbar/Symbol.h:34:10: fatal error: string: No such file or directory
 #include <string>
          ^~~~~~~~
compilation terminated.
cpp.req: /usr/src/tmp/zbar-buildroot/usr/include/zbar/Symbol.h: cpp failed, trying c++ mode
/usr/src/tmp/zbar-buildroot/usr/include/zbar/Symbol.h:30:3: error: #error "include zbar.h in your application, **not** zbar/Symbol.h"
 # error "include zbar.h in your application, **not** zbar/Symbol.h"
   ^~~~~
cpp.req: WARNING: /usr/src/tmp/zbar-buildroot/usr/include/zbar/Symbol.h: cpp failed
/usr/src/tmp/zbar-buildroot/usr/include/zbar/Window.h:30:3: error: #error "include zbar.h in your application, **not** zbar/Window.h"
 # error "include zbar.h in your application, **not** zbar/Window.h"
   ^~~~~
In file included from /usr/src/tmp/zbar-buildroot/usr/include/zbar/Window.h:33:
/usr/src/tmp/zbar-buildroot/usr/include/zbar/Image.h:30:3: error: #error "include zbar.h in your application, **not** zbar/Image.h"
 # error "include zbar.h in your application, **not** zbar/Image.h"
   ^~~~~
In file included from /usr/src/tmp/zbar-buildroot/usr/include/zbar/Window.h:33:
/usr/src/tmp/zbar-buildroot/usr/include/zbar/Image.h:34:10: fatal error: iterator: No such file or directory
 #include <iterator>
          ^~~~~~~~~~
compilation terminated.
cpp.req: /usr/src/tmp/zbar-buildroot/usr/include/zbar/Window.h: cpp failed, trying c++ mode
/usr/src/tmp/zbar-buildroot/usr/include/zbar/Window.h:30:3: error: #error "include zbar.h in your application, **not** zbar/Window.h"
 # error "include zbar.h in your application, **not** zbar/Window.h"
   ^~~~~
In file included from /usr/src/tmp/zbar-buildroot/usr/include/zbar/Window.h:33:
/usr/src/tmp/zbar-buildroot/usr/include/zbar/Image.h:30:3: error: #error "include zbar.h in your application, **not** zbar/Image.h"
 # error "include zbar.h in your application, **not** zbar/Image.h"
   ^~~~~
In file included from /usr/src/tmp/zbar-buildroot/usr/include/zbar/Image.h:35,
                 from /usr/src/tmp/zbar-buildroot/usr/include/zbar/Window.h:33:
/usr/src/tmp/zbar-buildroot/usr/include/zbar/Symbol.h:30:3: error: #error "include zbar.h in your application, **not** zbar/Symbol.h"
 # error "include zbar.h in your application, **not** zbar/Symbol.h"
   ^~~~~
In file included from /usr/src/tmp/zbar-buildroot/usr/include/zbar/Image.h:36,
                 from /usr/src/tmp/zbar-buildroot/usr/include/zbar/Window.h:33:
/usr/src/tmp/zbar-buildroot/usr/include/zbar/Exception.h:30:3: error: #error "include zbar.h in your application, **not** zbar/Exception.h"
 # error "include zbar.h in your application, **not** zbar/Exception.h"
   ^~~~~
cpp.req: WARNING: /usr/src/tmp/zbar-buildroot/usr/include/zbar/Window.h: cpp failed
/usr/src/tmp/zbar-buildroot/usr/include/zbar/Decoder.h:30:3: error: #error "include zbar.h in your application, **not** zbar/Decoder.h"
 # error "include zbar.h in your application, **not** zbar/Decoder.h"
   ^~~~~
/usr/src/tmp/zbar-buildroot/usr/include/zbar/Decoder.h:33:10: fatal error: string: No such file or directory
 #include <string>
          ^~~~~~~~
compilation terminated.
cpp.req: /usr/src/tmp/zbar-buildroot/usr/include/zbar/Decoder.h: cpp failed, trying c++ mode
/usr/src/tmp/zbar-buildroot/usr/include/zbar/Decoder.h:30:3: error: #error "include zbar.h in your application, **not** zbar/Decoder.h"
 # error "include zbar.h in your application, **not** zbar/Decoder.h"
   ^~~~~
cpp.req: WARNING: /usr/src/tmp/zbar-buildroot/usr/include/zbar/Decoder.h: cpp failed
/usr/src/tmp/zbar-buildroot/usr/include/zbar/Scanner.h:30:3: error: #error "include zbar.h in your application, **not** zbar/Scanner.h"
 # error "include zbar.h in your application, **not** zbar/Scanner.h"
   ^~~~~
cpp.req: /usr/src/tmp/zbar-buildroot/usr/include/zbar/Scanner.h: cpp failed, trying c++ mode
/usr/src/tmp/zbar-buildroot/usr/include/zbar/Scanner.h:30:3: error: #error "include zbar.h in your application, **not** zbar/Scanner.h"
 # error "include zbar.h in your application, **not** zbar/Scanner.h"
   ^~~~~
cpp.req: WARNING: /usr/src/tmp/zbar-buildroot/usr/include/zbar/Scanner.h: cpp failed
/usr/src/tmp/zbar-buildroot/usr/include/zbar/Exception.h:30:3: error: #error "include zbar.h in your application, **not** zbar/Exception.h"
 # error "include zbar.h in your application, **not** zbar/Exception.h"
   ^~~~~
/usr/src/tmp/zbar-buildroot/usr/include/zbar/Exception.h:33:10: fatal error: exception: No such file or directory
 #include <exception>
          ^~~~~~~~~~~
compilation terminated.
cpp.req: /usr/src/tmp/zbar-buildroot/usr/include/zbar/Exception.h: cpp failed, trying c++ mode
/usr/src/tmp/zbar-buildroot/usr/include/zbar/Exception.h:30:3: error: #error "include zbar.h in your application, **not** zbar/Exception.h"
 # error "include zbar.h in your application, **not** zbar/Exception.h"
   ^~~~~
cpp.req: WARNING: /usr/src/tmp/zbar-buildroot/usr/include/zbar/Exception.h: cpp failed
/usr/src/tmp/zbar-buildroot/usr/include/zbar/Processor.h:30:3: error: #error "include zbar.h in your application, **not** zbar/Processor.h"
 # error "include zbar.h in your application, **not** zbar/Processor.h"
   ^~~~~
In file included from /usr/src/tmp/zbar-buildroot/usr/include/zbar/Processor.h:33:
/usr/src/tmp/zbar-buildroot/usr/include/zbar/Exception.h:30:3: error: #error "include zbar.h in your application, **not** zbar/Exception.h"
 # error "include zbar.h in your application, **not** zbar/Exception.h"
   ^~~~~
/usr/src/tmp/zbar-buildroot/usr/include/zbar/Exception.h:33:10: fatal error: exception: No such file or directory
 #include <exception>
          ^~~~~~~~~~~
compilation terminated.
cpp.req: /usr/src/tmp/zbar-buildroot/usr/include/zbar/Processor.h: cpp failed, trying c++ mode
/usr/src/tmp/zbar-buildroot/usr/include/zbar/Processor.h:30:3: error: #error "include zbar.h in your application, **not** zbar/Processor.h"
 # error "include zbar.h in your application, **not** zbar/Processor.h"
   ^~~~~
In file included from /usr/src/tmp/zbar-buildroot/usr/include/zbar/Processor.h:33:
/usr/src/tmp/zbar-buildroot/usr/include/zbar/Exception.h:30:3: error: #error "include zbar.h in your application, **not** zbar/Exception.h"
 # error "include zbar.h in your application, **not** zbar/Exception.h"
   ^~~~~
In file included from /usr/src/tmp/zbar-buildroot/usr/include/zbar/Processor.h:34:
/usr/src/tmp/zbar-buildroot/usr/include/zbar/Image.h:30:3: error: #error "include zbar.h in your application, **not** zbar/Image.h"
 # error "include zbar.h in your application, **not** zbar/Image.h"
   ^~~~~
In file included from /usr/src/tmp/zbar-buildroot/usr/include/zbar/Image.h:35,
                 from /usr/src/tmp/zbar-buildroot/usr/include/zbar/Processor.h:34:
/usr/src/tmp/zbar-buildroot/usr/include/zbar/Symbol.h:30:3: error: #error "include zbar.h in your application, **not** zbar/Symbol.h"
 # error "include zbar.h in your application, **not** zbar/Symbol.h"
   ^~~~~
cpp.req: WARNING: /usr/src/tmp/zbar-buildroot/usr/include/zbar/Processor.h: cpp failed
/usr/src/tmp/zbar-buildroot/usr/include/zbar/ImageScanner.h:30:3: error: #error "include zbar.h in your application, **not** zbar/ImageScanner.h"
 # error "include zbar.h in your application, **not** zbar/ImageScanner.h"
   ^~~~~
In file included from /usr/src/tmp/zbar-buildroot/usr/include/zbar/ImageScanner.h:33:
/usr/src/tmp/zbar-buildroot/usr/include/zbar/Image.h:30:3: error: #error "include zbar.h in your application, **not** zbar/Image.h"
 # error "include zbar.h in your application, **not** zbar/Image.h"
   ^~~~~
In file included from /usr/src/tmp/zbar-buildroot/usr/include/zbar/ImageScanner.h:33:
/usr/src/tmp/zbar-buildroot/usr/include/zbar/Image.h:34:10: fatal error: iterator: No such file or directory
 #include <iterator>
          ^~~~~~~~~~
compilation terminated.
cpp.req: /usr/src/tmp/zbar-buildroot/usr/include/zbar/ImageScanner.h: cpp failed, trying c++ mode
/usr/src/tmp/zbar-buildroot/usr/include/zbar/ImageScanner.h:30:3: error: #error "include zbar.h in your application, **not** zbar/ImageScanner.h"
 # error "include zbar.h in your application, **not** zbar/ImageScanner.h"
   ^~~~~
In file included from /usr/src/tmp/zbar-buildroot/usr/include/zbar/ImageScanner.h:33:
/usr/src/tmp/zbar-buildroot/usr/include/zbar/Image.h:30:3: error: #error "include zbar.h in your application, **not** zbar/Image.h"
 # error "include zbar.h in your application, **not** zbar/Image.h"
   ^~~~~
In file included from /usr/src/tmp/zbar-buildroot/usr/include/zbar/Image.h:35,
                 from /usr/src/tmp/zbar-buildroot/usr/include/zbar/ImageScanner.h:33:
/usr/src/tmp/zbar-buildroot/usr/include/zbar/Symbol.h:30:3: error: #error "include zbar.h in your application, **not** zbar/Symbol.h"
 # error "include zbar.h in your application, **not** zbar/Symbol.h"
   ^~~~~
In file included from /usr/src/tmp/zbar-buildroot/usr/include/zbar/Image.h:36,
                 from /usr/src/tmp/zbar-buildroot/usr/include/zbar/ImageScanner.h:33:
/usr/src/tmp/zbar-buildroot/usr/include/zbar/Exception.h:30:3: error: #error "include zbar.h in your application, **not** zbar/Exception.h"
 # error "include zbar.h in your application, **not** zbar/Exception.h"
   ^~~~~
cpp.req: WARNING: /usr/src/tmp/zbar-buildroot/usr/include/zbar/ImageScanner.h: cpp failed
Provides: pkgconfig(zbar) = 0.10
Requires: libzbar = 0.10, /usr/lib64/libzbar.so.0.2.0, /usr/lib64/pkgconfig
Finding debuginfo files (using /usr/lib/rpm/find-debuginfo-files)
Executing: /bin/sh -e /usr/src/tmp/rpm-tmp.UFXq4N
Processing files: libzbar-devel-static-0.10-alt9
Finding Provides (using /usr/lib/rpm/find-provides)
Executing: /bin/sh -e /usr/src/tmp/rpm-tmp.bhDNqL
find-provides: running scripts (alternatives,debuginfo,gir,lib,pam,perl,pkgconfig,python,shell,typelib)
Finding Requires (using /usr/lib/rpm/find-requires)
Executing: /bin/sh -e /usr/src/tmp/rpm-tmp.sMxX3M
find-requires: running scripts (cpp,debuginfo,files,gir-js,gir-python,gir,lib,pam,perl,pkgconfig,pkgconfiglib,python,rpmlib,shebang,shell,static,symlinks,typelib)
Requires: libzbar = 0.10, glibc-devel-static
Finding debuginfo files (using /usr/lib/rpm/find-debuginfo-files)
Executing: /bin/sh -e /usr/src/tmp/rpm-tmp.lrpeRS
Processing files: libzbar-gtk-0.10-alt9
Finding Provides (using /usr/lib/rpm/find-provides)
Executing: /bin/sh -e /usr/src/tmp/rpm-tmp.YVBR82
find-provides: running scripts (alternatives,debuginfo,gir,lib,pam,perl,pkgconfig,python,shell,typelib)
lib.prov: /usr/src/tmp/zbar-buildroot/usr/lib64/libzbargtk.so.0: 10 symbols, 14 bpp
Finding Requires (using /usr/lib/rpm/find-requires)
Executing: /bin/sh -e /usr/src/tmp/rpm-tmp.rxYmBh
find-requires: running scripts (cpp,debuginfo,files,gir-js,gir-python,gir,lib,pam,perl,pkgconfig,pkgconfiglib,python,rpmlib,shebang,shell,static,symlinks,typelib)
Provides: libzbargtk.so.0()(64bit) = set:hdLly5O9nczAt8f4NXtQp7
Requires: libzbar = 0.10, libgdk-x11-2.0.so.0()(64bit) >= set:njSckyWAGqJ6KatZ01tSrx9cZ6Y0, libgdk_pixbuf-2.0.so.0()(64bit) >= set:linLyF7lTFUi8cqP5yBtG4, libglib-2.0.so.0()(64bit) >= set:okqV6vBGq1n558FngPLfglUOnrZhrh6MGMfXpD9oieGth5, libgobject-2.0.so.0()(64bit) >= set:mhaxmHLZpnYcSryTnWEp5abc7xBGZc3dpqHlyv5dVFjudEhqKT61WXZawGwX1nNZDAmDRWHF0SZIXcqvf4Fp, libgtk-x11-2.0.so.0()(64bit) >= set:pl7gcH7vIOFo2IsZ92MKauZsbn1ks, libzbar.so.0()(64bit) >= set:kePjtGIsNR90TrEwe65SnaYwSRoJZigPQqJuo62npXTSWjAvtXIgeXCerEeIA8sTsa9ABWPyvkuATeMInEw3, rtld(GNU_HASH)
Requires(rpmlib): rpmlib(SetVersions)
Finding debuginfo files (using /usr/lib/rpm/find-debuginfo-files)
Executing: /bin/sh -e /usr/src/tmp/rpm-tmp.UQ1FzF
Creating libzbar-gtk-debuginfo package
Processing files: libzbar-gtk-devel-0.10-alt9
Finding Provides (using /usr/lib/rpm/find-provides)
Executing: /bin/sh -e /usr/src/tmp/rpm-tmp.5knva8
find-provides: running scripts (alternatives,debuginfo,gir,lib,pam,perl,pkgconfig,python,shell,typelib)
Finding Requires (using /usr/lib/rpm/find-requires)
Executing: /bin/sh -e /usr/src/tmp/rpm-tmp.OGjzOE
find-requires: running scripts (cpp,debuginfo,files,gir-js,gir-python,gir,lib,pam,perl,pkgconfig,pkgconfiglib,python,rpmlib,shebang,shell,static,symlinks,typelib)
Provides: pkgconfig(zbar-gtk) = 0.10
Requires: libzbar-gtk = 0.10, libzbar-devel = 0.10, /usr/include/zbar.h, /usr/lib64/libzbargtk.so.0.0.2, /usr/lib64/pkgconfig, glib2-devel, libgtk+2-devel, pkgconfig(gthread-2.0), pkgconfig(gtk+-2.0), pkgconfig(zbar)
Finding debuginfo files (using /usr/lib/rpm/find-debuginfo-files)
Executing: /bin/sh -e /usr/src/tmp/rpm-tmp.Jk8hDi
Processing files: libzbar-gtk-devel-static-0.10-alt9
Finding Provides (using /usr/lib/rpm/find-provides)
Executing: /bin/sh -e /usr/src/tmp/rpm-tmp.gaRJ00
find-provides: running scripts (alternatives,debuginfo,gir,lib,pam,perl,pkgconfig,python,shell,typelib)
Finding Requires (using /usr/lib/rpm/find-requires)
Executing: /bin/sh -e /usr/src/tmp/rpm-tmp.bgaSXN
find-requires: running scripts (cpp,debuginfo,files,gir-js,gir-python,gir,lib,pam,perl,pkgconfig,pkgconfiglib,python,rpmlib,shebang,shell,static,symlinks,typelib)
Requires: libzbar-gtk = 0.10, libzbar-devel = 0.10, glibc-devel-static
Finding debuginfo files (using /usr/lib/rpm/find-debuginfo-files)
Executing: /bin/sh -e /usr/src/tmp/rpm-tmp.a8y8HF
Processing files: python-module-zbar-0.10-alt9
Finding Provides (using /usr/lib/rpm/find-provides)
Executing: /bin/sh -e /usr/src/tmp/rpm-tmp.VGfw0B
find-provides: running scripts (alternatives,debuginfo,gir,lib,pam,perl,pkgconfig,python,shell,typelib)
Finding Requires (using /usr/lib/rpm/find-requires)
Executing: /bin/sh -e /usr/src/tmp/rpm-tmp.SvHuQC
find-requires: running scripts (cpp,debuginfo,files,gir-js,gir-python,gir,lib,pam,perl,pkgconfig,pkgconfiglib,python,rpmlib,shebang,shell,static,symlinks,typelib)
Provides: python2.7(zbar), python2.7(zbarpygtk)
Requires: /usr/lib64/python2.7/site-packages, libc.so.6(GLIBC_2.2.5)(64bit), libgdk_pixbuf-2.0.so.0()(64bit) >= set:lkWZa3, libgobject-2.0.so.0()(64bit) >= set:mlfqQ0, libzbar.so.0()(64bit) >= set:kdPjgXMBwc1618LBxBHU5axy6S1zaI10eNU5iMmrQpMbTp82nZIodlgZ2vCce668yIZ0A06zQEgoBFVZpDtlYPNJpPYzHub2BQqty2zsCB7VpEdJMhZma73CCt419iZ3raym61is6NpbIfkY9oyiWGNPFt5pEwvZqeWUtD1, libzbargtk.so.0()(64bit) >= set:heLly5O9LooHu7VI3, rtld(GNU_HASH)
Requires(rpmlib): rpmlib(SetVersions)
Finding debuginfo files (using /usr/lib/rpm/find-debuginfo-files)
Executing: /bin/sh -e /usr/src/tmp/rpm-tmp.p7E9fL
Creating python-module-zbar-debuginfo package
Processing files: libzbar-qt-0.10-alt9
Finding Provides (using /usr/lib/rpm/find-provides)
Executing: /bin/sh -e /usr/src/tmp/rpm-tmp.kbB9lY
find-provides: running scripts (alternatives,debuginfo,gir,lib,pam,perl,pkgconfig,python,shell,typelib)
lib.prov: /usr/src/tmp/zbar-buildroot/usr/lib64/libzbarqt.so.0: 160 symbols, 18 bpp
Finding Requires (using /usr/lib/rpm/find-requires)
Executing: /bin/sh -e /usr/src/tmp/rpm-tmp.PPwd7f
find-requires: running scripts (cpp,debuginfo,files,gir-js,gir-python,gir,lib,pam,perl,pkgconfig,pkgconfiglib,python,rpmlib,shebang,shell,static,symlinks,typelib)
Provides: libzbarqt.so.0()(64bit) = set:ld9tjEHxOj79YNyaqVC5TT13IwumawoOo441TSZfaXmcYtKJfPPExPU0RGCpe6HqnRlPLSeQqBehSfjV38u0cgbmqjOFMEovif7VbffwvhENyztM1Z23MgiZgBAIwgDJP4gE1wIxc4OFxdunqTUvmVqXp2aq7T9n54WtoqhQjPTZsr69d8Mte7d40Fju9u0zf0SUyJtaQimFafJeP1LvMv0vb0y9mnE87a2RwZh34XfuoPNkNHXsjNqDoK30xezHmwutI0W7R5ZvFMGnyZJGHh7Z5obCxSefhRh48kZrDkZH3TLi9RKvx9uRW8t5CK90UPVh5UQmAd0
Requires: libQtCore.so.4()(64bit) >= set:pjFOEGivEngJFZDZkespiYfHjKR9Mjh8tHBb5JWULj1cW0o0f3X4AtkUDx0e11NZvfCD0T21DZecSoUPK5askFuPe0JLFRZefHIaah9bqFkhlhKkZkMDzRZf4xRfgwmCZyP6LTpmaw5ypRDqAH7Wb8x7C7XNxHBtF4, libQtGui.so.4()(64bit) >= set:rlcpUJyMZgbOIselK5xO0ph6XGauw8jiOZzv4gH1ybRQeo0bpwKCAJ1LlaGFaJ7T8dI5ZLVaQMh9h96AfS0cJOwTj0u9B4GM78HVlwXtgalBMJJl0F6ZzdftPgN0k81Z0ua7JZ3zYe3ZwWqzUiuJmVRvuYqL9SZivIzQ2iYt7LaHISwikokIyWKfOjyac8cds4V8c5, libc.so.6(GLIBC_2.14)(64bit), libc.so.6(GLIBC_2.2.5)(64bit), libc.so.6(GLIBC_2.4)(64bit), libgcc_s.so.1(GCC_3.0)(64bit), libstdc++.so.6(CXXABI_1.3)(64bit), libstdc++.so.6(CXXABI_1.3.1)(64bit), libstdc++.so.6(CXXABI_1.3.9)(64bit), libstdc++.so.6(GLIBCXX_3.4)(64bit), libstdc++.so.6(GLIBCXX_3.4.21)(64bit), libstdc++.so.6(GLIBCXX_3.4.9)(64bit), libzbar.so.0()(64bit) >= set:kefZsO5nDMt04Ex2Wok6buVJCkU1JHNqZ5wC9edp8sBJvrHTdoD5OpTQPZtgGXD8392TdDiTtmtEZsyvkuATeMInEwj8Qt6, rtld(GNU_HASH)
Requires(rpmlib): rpmlib(SetVersions)
Finding debuginfo files (using /usr/lib/rpm/find-debuginfo-files)
Executing: /bin/sh -e /usr/src/tmp/rpm-tmp.u5u0GH
Creating libzbar-qt-debuginfo package
Processing files: libzbar-qt-devel-0.10-alt9
Finding Provides (using /usr/lib/rpm/find-provides)
Executing: /bin/sh -e /usr/src/tmp/rpm-tmp.dLLVxd
find-provides: running scripts (alternatives,debuginfo,gir,lib,pam,perl,pkgconfig,python,shell,typelib)
Finding Requires (using /usr/lib/rpm/find-requires)
Executing: /bin/sh -e /usr/src/tmp/rpm-tmp.OOM87N
find-requires: running scripts (cpp,debuginfo,files,gir-js,gir-python,gir,lib,pam,perl,pkgconfig,pkgconfiglib,python,rpmlib,shebang,shell,static,symlinks,typelib)
In file included from /usr/include/qt4/QtCore/qobject.h:48,
                 from /usr/include/qt4/QtGui/qwidget.h:47,
                 from /usr/src/tmp/zbar-buildroot/usr/include/zbar/QZBar.h:29:
/usr/include/qt4/QtCore/qstring.h:54:12: fatal error: string: No such file or directory
 #  include <string>
            ^~~~~~~~
compilation terminated.
cpp.req: /usr/src/tmp/zbar-buildroot/usr/include/zbar/QZBar.h: cpp failed, trying c++ mode
Provides: pkgconfig(zbar-qt) = 0.10
Requires: libzbar-qt = 0.10, libzbar-devel = 0.10, /usr/include/zbar.h, /usr/lib64/libzbarqt.so.0.0.2, /usr/lib64/pkgconfig, libqt4-devel, pkgconfig(QtCore) >= 4, pkgconfig(QtGui) >= 4, pkgconfig(zbar)
Finding debuginfo files (using /usr/lib/rpm/find-debuginfo-files)
Executing: /bin/sh -e /usr/src/tmp/rpm-tmp.nNRKyv
Processing files: libzbar-qt-devel-static-0.10-alt9
Finding Provides (using /usr/lib/rpm/find-provides)
Executing: /bin/sh -e /usr/src/tmp/rpm-tmp.qPwirh
find-provides: running scripts (alternatives,debuginfo,gir,lib,pam,perl,pkgconfig,python,shell,typelib)
Finding Requires (using /usr/lib/rpm/find-requires)
Executing: /bin/sh -e /usr/src/tmp/rpm-tmp.vSf4O7
find-requires: running scripts (cpp,debuginfo,files,gir-js,gir-python,gir,lib,pam,perl,pkgconfig,pkgconfiglib,python,rpmlib,shebang,shell,static,symlinks,typelib)
Requires: libzbar-qt = 0.10, libzbar-devel = 0.10, glibc-devel-static
Finding debuginfo files (using /usr/lib/rpm/find-debuginfo-files)
Executing: /bin/sh -e /usr/src/tmp/rpm-tmp.wNRZL2
Processing files: zbar-debuginfo-0.10-alt9
Finding Provides (using /usr/lib/rpm/find-provides)
Executing: /bin/sh -e /usr/src/tmp/rpm-tmp.T7SFC2
find-provides: running scripts (debuginfo)
Finding Requires (using /usr/lib/rpm/find-requires)
Executing: /bin/sh -e /usr/src/tmp/rpm-tmp.8p7ek7
find-requires: running scripts (debuginfo)
Requires: zbar = 0.10-alt9, /usr/lib/debug/lib64/ld-linux-x86-64.so.2.debug, debug64(libMagickWand-6.Q16.so.6), debug64(libc.so.6), debug64(libzbar.so.0)
Processing files: libzbar-debuginfo-0.10-alt9
Finding Provides (using /usr/lib/rpm/find-provides)
Executing: /bin/sh -e /usr/src/tmp/rpm-tmp.dHzBjg
find-provides: running scripts (debuginfo)
Finding Requires (using /usr/lib/rpm/find-requires)
Executing: /bin/sh -e /usr/src/tmp/rpm-tmp.UpwIwt
find-requires: running scripts (debuginfo)
Provides: debug64(libzbar.so.0)
Requires: libzbar = 0.10-alt9, debug64(libX11.so.6), debug64(libXv.so.1), debug64(libc.so.6), debug64(libpthread.so.0), debug64(libv4l2.so.0)
Processing files: libzbar-gtk-debuginfo-0.10-alt9
Finding Provides (using /usr/lib/rpm/find-provides)
Executing: /bin/sh -e /usr/src/tmp/rpm-tmp.TLq7jL
find-provides: running scripts (debuginfo)
Finding Requires (using /usr/lib/rpm/find-requires)
Executing: /bin/sh -e /usr/src/tmp/rpm-tmp.MyGz46
find-requires: running scripts (debuginfo)
Provides: debug64(libzbargtk.so.0)
Requires: libzbar-gtk = 0.10-alt9, debug64(libgdk-x11-2.0.so.0), debug64(libgdk_pixbuf-2.0.so.0), debug64(libglib-2.0.so.0), debug64(libgobject-2.0.so.0), debug64(libgtk-x11-2.0.so.0), debug64(libzbar.so.0)
Processing files: python-module-zbar-debuginfo-0.10-alt9
Finding Provides (using /usr/lib/rpm/find-provides)
Executing: /bin/sh -e /usr/src/tmp/rpm-tmp.hjN3Ax
find-provides: running scripts (debuginfo)
Finding Requires (using /usr/lib/rpm/find-requires)
Executing: /bin/sh -e /usr/src/tmp/rpm-tmp.iKFdY2
find-requires: running scripts (debuginfo)
Requires: python-module-zbar = 0.10-alt9, debug64(libc.so.6), debug64(libgdk_pixbuf-2.0.so.0), debug64(libgobject-2.0.so.0), debug64(libzbar.so.0), debug64(libzbargtk.so.0)
Processing files: libzbar-qt-debuginfo-0.10-alt9
Finding Provides (using /usr/lib/rpm/find-provides)
Executing: /bin/sh -e /usr/src/tmp/rpm-tmp.l2keOC
find-provides: running scripts (debuginfo)
Finding Requires (using /usr/lib/rpm/find-requires)
Executing: /bin/sh -e /usr/src/tmp/rpm-tmp.WNmRXg
find-requires: running scripts (debuginfo)
Provides: debug64(libzbarqt.so.0)
Requires: libzbar-qt = 0.10-alt9, debug64(libQtCore.so.4), debug64(libQtGui.so.4), debug64(libc.so.6), debug64(libgcc_s.so.1), debug64(libstdc++.so.6), debug64(libzbar.so.0)
Adding to zbar a strict dependency on libzbar
Adding to libzbar-devel a strict dependency on libzbar
Adding to libzbar-devel-static a strict dependency on libzbar
Adding to libzbar-gtk a strict dependency on libzbar
Adding to libzbar-gtk-devel a strict dependency on libzbar-devel
Adding to libzbar-gtk-devel a strict dependency on libzbar-gtk
Adding to libzbar-gtk-devel-static a strict dependency on libzbar-devel
Adding to libzbar-gtk-devel-static a strict dependency on libzbar-gtk
Adding to python-module-zbar a strict dependency on libzbar
Adding to python-module-zbar a strict dependency on libzbar-gtk
Adding to libzbar-qt a strict dependency on libzbar
Adding to libzbar-qt-devel a strict dependency on libzbar-devel
Adding to libzbar-qt-devel a strict dependency on libzbar-qt
Adding to libzbar-qt-devel-static a strict dependency on libzbar-devel
Adding to libzbar-qt-devel-static a strict dependency on libzbar-qt
Adding to zbar-debuginfo a strict dependency on libzbar-debuginfo
Adding to libzbar-gtk-debuginfo a strict dependency on libzbar-debuginfo
Adding to python-module-zbar-debuginfo a strict dependency on libzbar-debuginfo
Adding to python-module-zbar-debuginfo a strict dependency on libzbar-gtk-debuginfo
Adding to libzbar-qt-debuginfo a strict dependency on libzbar-debuginfo
Removing from zbar-debuginfo 1 sources provided by libzbar-debuginfo
also prunning dir /usr/src/debug/zbar-0.10/include
Removing from libzbar-gtk-debuginfo 1 sources provided by libzbar-debuginfo
Removing from python-module-zbar-debuginfo 1 sources provided by libzbar-debuginfo
Removing from libzbar-qt-debuginfo 1 sources provided by libzbar-debuginfo
Removing from python-module-zbar-debuginfo 1 sources provided by libzbar-gtk-debuginfo
also prunning dir /usr/src/debug/zbar-0.10/include/zbar
also prunning dir /usr/src/debug/zbar-0.10/include
Removing 1 extra deps from zbar due to dependency on libzbar
Removing 1 extra deps from libzbar-devel due to dependency on libzbar
Removing 1 extra deps from libzbar-gtk due to dependency on libzbar
Removing 1 extra deps from python-module-zbar due to dependency on libzbar
Removing 1 extra deps from libzbar-qt due to dependency on libzbar
Removing 2 extra deps from libzbar-gtk-devel due to dependency on libzbar-devel
Removing 2 extra deps from libzbar-qt-devel due to dependency on libzbar-devel
Removing 1 extra deps from libzbar-gtk-devel due to dependency on libzbar-gtk
Removing 1 extra deps from python-module-zbar due to dependency on libzbar-gtk
Removing 1 extra deps from libzbar-qt-devel due to dependency on libzbar-qt
Removing 1 extra deps from zbar-debuginfo due to dependency on libzbar-debuginfo
Removing 1 extra deps from libzbar-gtk-debuginfo due to dependency on libzbar-debuginfo
Removing 1 extra deps from python-module-zbar-debuginfo due to dependency on libzbar-debuginfo
Removing 1 extra deps from libzbar-qt-debuginfo due to dependency on libzbar-debuginfo
Removing 1 extra deps from python-module-zbar-debuginfo due to dependency on libzbar-gtk-debuginfo
Removing 4 extra deps from zbar due to repentancy on libzbar
Removing 2 extra deps from libzbar-gtk due to repentancy on libzbar
Removing 3 extra deps from python-module-zbar due to repentancy on libzbar
Removing 5 extra deps from libzbar-qt due to repentancy on libzbar
Removing 1 extra deps from libzbar-gtk-devel due to repentancy on libzbar-devel
Removing 1 extra deps from libzbar-qt-devel due to repentancy on libzbar-devel
Removing 1 extra deps from python-module-zbar due to repentancy on libzbar-gtk
Removing 1 extra deps from zbar-debuginfo due to repentancy on libzbar-debuginfo
Removing 1 extra deps from python-module-zbar-debuginfo due to repentancy on libzbar-debuginfo
Removing 1 extra deps from libzbar-qt-debuginfo due to repentancy on libzbar-debuginfo
Removing 3 extra deps from python-module-zbar-debuginfo due to repentancy on libzbar-gtk-debuginfo
Wrote: /usr/src/RPM/RPMS/x86_64/zbar-0.10-alt9.x86_64.rpm
Wrote: /usr/src/RPM/RPMS/x86_64/libzbar-0.10-alt9.x86_64.rpm
Wrote: /usr/src/RPM/RPMS/x86_64/libzbar-devel-0.10-alt9.x86_64.rpm
Wrote: /usr/src/RPM/RPMS/x86_64/libzbar-devel-static-0.10-alt9.x86_64.rpm
Wrote: /usr/src/RPM/RPMS/x86_64/libzbar-gtk-0.10-alt9.x86_64.rpm
Wrote: /usr/src/RPM/RPMS/x86_64/libzbar-gtk-devel-0.10-alt9.x86_64.rpm
Wrote: /usr/src/RPM/RPMS/x86_64/libzbar-gtk-devel-static-0.10-alt9.x86_64.rpm
Wrote: /usr/src/RPM/RPMS/x86_64/python-module-zbar-0.10-alt9.x86_64.rpm
Wrote: /usr/src/RPM/RPMS/x86_64/libzbar-qt-0.10-alt9.x86_64.rpm
Wrote: /usr/src/RPM/RPMS/x86_64/libzbar-qt-devel-0.10-alt9.x86_64.rpm
Wrote: /usr/src/RPM/RPMS/x86_64/libzbar-qt-devel-static-0.10-alt9.x86_64.rpm
Wrote: /usr/src/RPM/RPMS/x86_64/zbar-debuginfo-0.10-alt9.x86_64.rpm
Wrote: /usr/src/RPM/RPMS/x86_64/libzbar-debuginfo-0.10-alt9.x86_64.rpm
Wrote: /usr/src/RPM/RPMS/x86_64/libzbar-gtk-debuginfo-0.10-alt9.x86_64.rpm
Wrote: /usr/src/RPM/RPMS/x86_64/python-module-zbar-debuginfo-0.10-alt9.x86_64.rpm
Wrote: /usr/src/RPM/RPMS/x86_64/libzbar-qt-debuginfo-0.10-alt9.x86_64.rpm
59.91user 7.83system 2:24.95elapsed 46%CPU (0avgtext+0avgdata 137672maxresident)k
0inputs+0outputs (0major+3844918minor)pagefaults 0swaps
83.04user 12.90system 3:11.35elapsed 50%CPU (0avgtext+0avgdata 137672maxresident)k
0inputs+0outputs (0major+4839707minor)pagefaults 0swaps
--- libzbar-qt-0.10-alt9.x86_64.rpm.repo	2018-05-30 20:04:34.000000000 +0000
+++ libzbar-qt-0.10-alt9.x86_64.rpm.hasher	2019-02-02 03:30:24.411746042 +0000
@@ -13,3 +13,3 @@
 Requires: rpmlib(PayloadIsLzma)  
-Provides: libzbarqt.so.0()(64bit) = set:ld9tjEHxOj79YNyaqVC5TXp1Zci14j6zw8USKZBpTyxLPJZ9VpQMpswqlPc7zlJHWGVnr7qJiD8XDFY14f06E5bJ9VkokIfFDzYBD7ML8QoNNeUwup06iO7a9p1xerD9wg30p3p8Aj3rYKQKNZIanrfjghXUeVGwgL3jbyuqZmvuP8F11KPVEx08tObN3oY1M6nIJjxmOalVFRpeUZ3UfwL50N4HbkA35xqgZE1yZ7YMCzFynTVCyReNs702t6nJ0Zaz5gZEW2ZLkoRbNZCRREzZiI5PgrDDEW824aZJjGZJxXnFAqTLM4LqtAK2jT40YVYE2sqbO6
+Provides: libzbarqt.so.0()(64bit) = set:ld9tjEHxOj79YNyaqVC5TT13IwumawoOo441TSZfaXmcYtKJfPPExPU0RGCpe6HqnRlPLSeQqBehSfjV38u0cgbmqjOFMEovif7VbffwvhENyztM1Z23MgiZgBAIwgDJP4gE1wIxc4OFxdunqTUvmVqXp2aq7T9n54WtoqhQjPTZsr69d8Mte7d40Fju9u0zf0SUyJtaQimFafJeP1LvMv0vb0y9mnE87a2RwZh34XfuoPNkNHXsjNqDoK30xezHmwutI0W7R5ZvFMGnyZJGHh7Z5obCxSefhRh48kZrDkZH3TLi9RKvx9uRW8t5CK90UPVh5UQmAd0
 Provides: libzbar-qt = 0.10-alt9