<86>Jan  1 03:10:38 userdel[18708]: delete user 'rooter'
<86>Jan  1 03:10:38 groupadd[18890]: group added to /etc/group: name=rooter, GID=705
<86>Jan  1 03:10:38 groupadd[18890]: group added to /etc/gshadow: name=rooter
<86>Jan  1 03:10:38 groupadd[18890]: new group: name=rooter, GID=705
<86>Jan  1 03:10:38 useradd[18944]: new user: name=rooter, UID=705, GID=705, home=/root, shell=/bin/bash
<86>Jan  1 03:10:38 userdel[19193]: delete user 'builder'
<86>Jan  1 03:10:38 userdel[19193]: removed group 'builder' owned by 'builder'
<86>Jan  1 03:10:38 userdel[19193]: removed shadow group 'builder' owned by 'builder'
<86>Jan  1 03:10:38 groupadd[19311]: group added to /etc/group: name=builder, GID=706
<86>Jan  1 03:10:38 groupadd[19311]: group added to /etc/gshadow: name=builder
<86>Jan  1 03:10:38 groupadd[19311]: new group: name=builder, GID=706
<86>Jan  1 03:10:38 useradd[19345]: new user: name=builder, UID=706, GID=706, home=/usr/src, shell=/bin/bash
<13>Jan  1 03:10:43 rpmi: perl-HTTP-Date-6.02-alt1 1348645274 installed
<13>Jan  1 03:10:43 rpmi: sgml-common-0.6.3-alt15 1423664786 installed
<13>Jan  1 03:10:43 rpmi: libexpat-2.2.4-alt1 1503305341 installed
<13>Jan  1 03:10:43 rpmi: xml-utils-1:2.9.4.0.12.e905-alt1.1 1525115736 installed
<13>Jan  1 03:10:43 rpmi: docbook-dtds-4.5-alt1 1223476557 installed
<13>Jan  1 03:10:43 rpmi: rpm-build-gir-0.7.2-alt4 1534675014 installed
<13>Jan  1 03:10:43 rpmi: perl-LWP-MediaTypes-6.02-alt1 1329754558 installed
<13>Jan  1 03:10:43 rpmi: perl-Compress-Raw-Zlib-2.083-alt1 sisyphus.218843.100 1546249305 installed
<13>Jan  1 03:10:43 rpmi: perl-libnet-1:3.11-alt1 1511423541 installed
<13>Jan  1 03:10:43 rpmi: libsqlite3-3.25.2-alt2 sisyphus.215082.100 1539700192 installed
<13>Jan  1 03:10:43 rpmi: libnspr-1:4.20-alt1 sisyphus.216395.100 1542113038 installed
<13>Jan  1 03:10:43 rpmi: libgdbm-1.8.3-alt10 1454943313 installed
<13>Jan  1 03:10:43 rpmi: docbook-style-xsl-1.79.1-alt2 sisyphus.213665.100 1537949315 installed
<13>Jan  1 03:10:43 rpmi: perl-File-Listing-6.04-alt1 1329758996 installed
<13>Jan  1 03:10:44 rpmi: libmozjs60-60.1.0-alt1 1533143983 installed
<13>Jan  1 03:10:44 rpmi: liblz4-1:1.8.3-alt1 sisyphus.213737.100 1538009646 installed
<13>Jan  1 03:10:44 rpmi: perl-Try-Tiny-0.30-alt1 1514318058 installed
<13>Jan  1 03:10:44 rpmi: perl-IO-Socket-IP-0.39-alt1 1494508514 installed
<13>Jan  1 03:10:44 rpmi: perl-Compress-Raw-Bzip2-2.083-alt1 sisyphus.218842.100 1546248693 installed
<13>Jan  1 03:10:44 rpmi: perl-HTML-Tagset-3.20-alt2 1317725093 installed
<13>Jan  1 03:10:44 rpmi: perl-Filter-1.59-alt1 1533737240 installed
<13>Jan  1 03:10:44 rpmi: perl-Encode-2.98-alt1 1525447808 installed
<13>Jan  1 03:10:44 rpmi: perl-URI-1.74-alt1 1525446424 installed
<13>Jan  1 03:10:44 rpmi: perl-IO-Compress-2.083-alt1 sisyphus.218844.100 1546249771 installed
<13>Jan  1 03:10:44 rpmi: perl-Net-HTTP-6.18-alt1 1526560501 installed
<13>Jan  1 03:10:44 rpmi: perl-HTML-Parser-3.72-alt1.1.1 1513340652 installed
<13>Jan  1 03:10:44 rpmi: perl-WWW-RobotRules-6.02-alt1 1329756211 installed
<13>Jan  1 03:10:44 rpmi: perl-Encode-Locale-1.05-alt1 1444608613 installed
<13>Jan  1 03:10:44 rpmi: perl-IO-HTML-1.001-alt1 1404821752 installed
<13>Jan  1 03:10:44 rpmi: perl-HTTP-Message-6.18-alt1 1528288416 installed
<13>Jan  1 03:10:44 rpmi: perl-HTTP-Cookies-6.04-alt1 1504116575 installed
<13>Jan  1 03:10:44 rpmi: perl-HTTP-Negotiate-6.01-alt1 1329760563 installed
<13>Jan  1 03:10:44 rpmi: perl-Term-ANSIColor-4.06-alt1 1479407083 installed
<13>Jan  1 03:10:44 rpmi: perl-Data-Dump-1.23-alt1 1444601978 installed
<13>Jan  1 03:10:44 rpmi: perl-libwww-6.36-alt1 sisyphus.215515.100 1540400896 installed
<13>Jan  1 03:10:44 rpmi: perl-XML-Parser-2.44-alt2.1.1 1513346066 installed
<13>Jan  1 03:10:44 rpmi: libOpenSP-1.5.2-alt3.qa1 1365943428 installed
<13>Jan  1 03:10:44 rpmi: openjade-1.3.2-alt14 1507625360 installed
<13>Jan  1 03:10:44 rpmi: docbook-style-dsssl-1.79-alt3 1324062818 installed
<13>Jan  1 03:10:44 rpmi: highlight-3.38-alt1 1499785547 installed
<13>Jan  1 03:10:44 rpmi: python-modules-curses-2.7.15-alt1 sisyphus.217364.100 1544022396 installed
<13>Jan  1 03:10:44 rpmi: libverto-0.3.0-alt1_5 1525957716 installed
<13>Jan  1 03:10:44 rpmi: libkeyutils-1.6-alt2 sisyphus.217337.100 1544003165 installed
<13>Jan  1 03:10:44 rpmi: libcom_err-1.44.5-alt1 sisyphus.218838.100 1546206092 installed
<13>Jan  1 03:10:44 rpmi: libxapian-1.4.5-alt3 sisyphus.215025.100 1539610702 installed
<13>Jan  1 03:10:44 rpmi: python-sphinx-objects.inv-1:2.3.8.20181220-alt1 sisyphus.218261.100 1545348338 installed
<13>Jan  1 03:10:44 rpmi: libgpg-error-1.31-alt1.S1 1529015796 installed
<13>Jan  1 03:10:44 rpmi: libgcrypt20-1.8.3-alt4 sisyphus.218050.200 1545223148 installed
<13>Jan  1 03:10:44 rpmi: libxslt-1.1.32-alt2 1517429962 installed
<13>Jan  1 03:10:44 rpmi: xsltproc-1.1.32-alt2 1517429962 installed
<13>Jan  1 03:10:44 rpmi: libsystemd-1:239-alt3 sisyphus.215710.300 1540765573 installed
<13>Jan  1 03:10:44 rpmi: libffi-devel-1:3.2.1-alt2 1528881748 installed
<13>Jan  1 03:10:45 rpmi: shared-mime-info-1.10-alt1.1 1530525597 installed
<13>Jan  1 03:10:45 rpmi: gsettings-desktop-schemas-data-3.28.1-alt1 sisyphus.212587.100 1536082062 installed
<13>Jan  1 03:10:45 rpmi: libgio-2.58.2-alt1 sisyphus.218134.100 1545260899 installed
<13>Jan  1 03:10:45 rpmi: gsettings-desktop-schemas-3.28.1-alt1 sisyphus.212587.100 1536082062 installed
<13>Jan  1 03:10:45 rpmi: gobject-introspection-1.58.3-alt1 sisyphus.218857.100 1546259903 installed
<13>Jan  1 03:10:45 rpmi: gobject-introspection-x11-1.58.3-alt1 sisyphus.218857.100 1546259903 installed
<13>Jan  1 03:10:45 rpmi: gcc-c++-common-1.4.23-alt1 sisyphus.218115.200 1545282875 installed
<13>Jan  1 03:10:45 rpmi: libstdc++8-devel-8.2.1-alt2 sisyphus.218691.100 1545948574 installed
<13>Jan  1 03:10:46 rpmi: gcc8-c++-8.2.1-alt2 sisyphus.218691.100 1545948574 installed
<13>Jan  1 03:10:46 rpmi: libtasn1-4.13-alt2 1521133848 installed
<13>Jan  1 03:10:46 rpmi: libp11-kit-0.23.9-alt5 1525798241 installed
<13>Jan  1 03:10:46 rpmi: ed-1:0.2-alt10 1449768441 installed
<13>Jan  1 03:10:46 rpmi: rpm-macros-alternatives-0.4.5-alt1.1 1404382149 installed
<13>Jan  1 03:10:46 rpmi: alternatives-0.4.5-alt1.1 1404382149 installed
<13>Jan  1 03:10:46 rpmi: ca-certificates-2018.11.12-alt1 sisyphus.216395.300 1542114035 installed
<13>Jan  1 03:10:46 rpmi: ca-trust-0.1.1-alt2 1515595785 installed
<13>Jan  1 03:10:46 rpmi: p11-kit-trust-0.23.9-alt5 1525798241 installed
<13>Jan  1 03:10:46 rpmi: libcrypto1.1-1.1.0j-alt1 sisyphus.216647.100 1542743840 installed
<13>Jan  1 03:10:46 rpmi: libssl1.1-1.1.0j-alt1 sisyphus.216647.100 1542743840 installed
<13>Jan  1 03:10:46 rpmi: libpython3-3.6.5-alt1.1 1535734400 installed
<13>Jan  1 03:10:46 rpmi: rpm-build-python3-0.1.13.1-alt2 1535450458 installed
<13>Jan  1 03:10:46 rpmi: tests-for-installed-python3-pkgs-0.1.13.1-alt2 1535450458 installed
<13>Jan  1 03:10:46 rpmi: python3-3.6.5-alt1.1 1535734400 installed
<13>Jan  1 03:10:46 rpmi: python3-base-3.6.5-alt1.1 1535734400 installed
<13>Jan  1 03:10:46 rpmi: python3-module-pkg_resources-1:40.5.0-alt1 sisyphus.216029.100 1541106477 installed
<13>Jan  1 03:10:46 rpmi: python3-module-six-1.11.0-alt2 1535611135 installed
<13>Jan  1 03:10:46 rpmi: glib2-devel-2.58.2-alt1 sisyphus.218134.100 1545260899 installed
<13>Jan  1 03:10:46 rpmi: python3-module-idna-2.7-alt1 1530720902 installed
<13>Jan  1 03:10:47 rpmi: libgio-devel-2.58.2-alt1 sisyphus.218134.100 1545260899 installed
<13>Jan  1 03:10:47 rpmi: python3-module-more-itertools-5.0.0-alt1 sisyphus.218699.100 1545980609 installed
<13>Jan  1 03:10:47 rpmi: python3-module-anytree-2.4.3-alt1 1521929586 installed
<13>Jan  1 03:10:47 rpmi: python3-module-ntlm-1.1.0-alt1.1.1.1 1460405346 installed
<13>Jan  1 03:10:47 rpmi: python3-module-pycparser-2.19-alt1 sisyphus.216095.100 1541345023 installed
<13>Jan  1 03:10:47 rpmi: python3-module-cffi-1.10.0-alt1.1 1525117590 installed
<13>Jan  1 03:10:47 rpmi: python3-module-asn1crypto-0.24.0-alt1 1521037480 installed
<13>Jan  1 03:10:47 rpmi: python3-module-cryptography-2.4.2-alt1 sisyphus.216799.200 1543487238 installed
<13>Jan  1 03:10:47 rpmi: python3-module-OpenSSL-18.0.0-alt1 1532996168 installed
<13>Jan  1 03:10:47 rpmi: python3-module-pytz-1:2016.10-alt1 1484291011 installed
<13>Jan  1 03:10:47 rpmi: python3-module-babel-1:2.4.0-alt1.1 1517644530 installed
<13>Jan  1 03:10:47 rpmi: python3-module-zope.interface-4.5.0-alt1.qa1 sisyphus.214938.100 1539939466 installed
<13>Jan  1 03:10:47 rpmi: python3-module-chameleon.core-3.1-alt1.2 1527237057 installed
<13>Jan  1 03:10:47 rpmi: python3-module-polib-1.0.5-alt1.1.2 1526977584 installed
<13>Jan  1 03:10:47 rpmi: python3-module-lingua-4.13-alt1.1 1517783822 installed
<13>Jan  1 03:10:47 rpmi: python3-module-genshi-0.7-alt1.1.1.1 1460400303 installed
<13>Jan  1 03:10:47 rpmi: python3-module-webencodings-0.5.1-alt1.1 1517943573 installed
<13>Jan  1 03:10:47 rpmi: python3-module-cssselect-0.9.1-alt1.2 1526980827 installed
<13>Jan  1 03:10:47 rpmi: python3-module-html5lib-1:0.999999999-alt4.qa1 sisyphus.214868.100 1539741045 installed
<13>Jan  1 03:10:47 rpmi: python3-module-lxml-4.2.5-alt1 sisyphus.218580.100 1545824862 installed
<13>Jan  1 03:10:47 rpmi: python3-module-docutils-0.14-alt2 1535729778 installed
<13>Jan  1 03:10:47 rpmi: python3-module-chardet-3.0.4-alt1 1506613818 installed
<13>Jan  1 03:10:47 rpmi: python3-module-ndg-0.4.2-alt1.qa1 1531457730 installed
<13>Jan  1 03:10:47 rpmi: python3-module-ndg-httpsclient-0.4.2-alt1.qa1 1531457730 installed
<13>Jan  1 03:10:47 rpmi: python3-module-urllib3-2:1.24.1-alt2 sisyphus.218529.100 1545673498 installed
<13>Jan  1 03:10:47 rpmi: python3-module-requests-2.21.0-alt1 sisyphus.218511.200 1545669878 installed
<13>Jan  1 03:10:47 rpmi: python3-module-imagesize-0.7.1-alt1 1461387704 installed
<13>Jan  1 03:10:47 rpmi: python3-module-markupsafe-0.23-alt1.2.1.1 1525118564 installed
<13>Jan  1 03:10:47 rpmi: python3-module-jinja2-2.10-alt1 1521724576 installed
<13>Jan  1 03:10:47 rpmi: python3-module-atomicwrites-1.2.1-alt1 sisyphus.214347.100 1539076636 installed
<13>Jan  1 03:10:47 rpmi: python3-module-attrs-18.2.0-alt1 sisyphus.214354.100 1539088435 installed
<13>Jan  1 03:10:47 rpmi: python3-module-pluggy-0.8.0-alt1 sisyphus.215346.100 1540073015 installed
<13>Jan  1 03:10:48 rpmi: python3-module-py-1.7.0-alt1 sisyphus.214414.220 1539670883 installed
<13>Jan  1 03:10:48 rpmi: python3-module-pytest-3.10.1-alt1 sisyphus.218100.300 1545832616 installed
<13>Jan  1 03:10:48 rpmi: python3-module-snowballstemmer-1.2.0-alt2.1 1457859319 installed
<13>Jan  1 03:10:48 rpmi: python3-module-whoosh-2.7.4-alt1 1527698183 installed
<13>Jan  1 03:10:48 rpmi: python3-module-xapian-1.4.5-alt2.qa1 1531484055 installed
<13>Jan  1 03:10:48 rpmi: python3-module-markdown-2.6.7-alt1.1 1517789319 installed
<13>Jan  1 03:10:48 rpmi: python3-modules-sqlite3-3.6.5-alt1.1 1535734400 installed
<13>Jan  1 03:10:48 rpmi: python3-module-SQLAlchemy-1.0.12-alt1.1 1525119185 installed
<13>Jan  1 03:10:48 rpmi: python3-module-sphinxcontrib-websupport-1.0.1-alt3.qa1 sisyphus.214922.100 1539851266 installed
<13>Jan  1 03:10:48 rpmi: python3-module-alabaster-0.7.6-alt3 1526385201 installed
<13>Jan  1 03:10:48 rpmi: python3-module-Pygments-2.2.0-alt2 1526455576 installed
<13>Jan  1 03:10:48 rpmi: python3-module-sphinx-1:1.6.5-alt3 sisyphus.213215.100 1537280252 installed
<86>Jan  1 03:10:48 groupadd[54000]: group added to /etc/group: name=_keytab, GID=499
<86>Jan  1 03:10:48 groupadd[54000]: group added to /etc/gshadow: name=_keytab
<86>Jan  1 03:10:48 groupadd[54000]: new group: name=_keytab, GID=499
<13>Jan  1 03:10:48 rpmi: libkrb5-1.16.2-alt2 sisyphus.216877.200 1543483170 installed
<13>Jan  1 03:10:48 rpmi: libtirpc-1.0.3-alt1 1532008015 installed
<13>Jan  1 03:10:48 rpmi: libnsl2-1.1.0-alt1_1 1511548748 installed
<13>Jan  1 03:10:48 rpmi: python-modules-compiler-2.7.15-alt1 sisyphus.217364.100 1544022396 installed
<13>Jan  1 03:10:48 rpmi: python-modules-email-2.7.15-alt1 sisyphus.217364.100 1544022396 installed
<13>Jan  1 03:10:48 rpmi: python-modules-unittest-2.7.15-alt1 sisyphus.217364.100 1544022396 installed
<13>Jan  1 03:10:48 rpmi: python-modules-nis-2.7.15-alt1 sisyphus.217364.100 1544022396 installed
<13>Jan  1 03:10:48 rpmi: python-modules-encodings-2.7.15-alt1 sisyphus.217364.100 1544022396 installed
<13>Jan  1 03:10:49 rpmi: python-modules-2.7.15-alt1 sisyphus.217364.100 1544022396 installed
<13>Jan  1 03:10:49 rpmi: python-modules-xml-2.7.15-alt1 sisyphus.217364.100 1544022396 installed
<13>Jan  1 03:10:49 rpmi: python-modules-hotshot-2.7.15-alt1 sisyphus.217364.100 1544022396 installed
<13>Jan  1 03:10:49 rpmi: python-modules-bsddb-2.7.15-alt1 sisyphus.217364.100 1544022396 installed
<13>Jan  1 03:10:49 rpmi: python-modules-ctypes-2.7.15-alt1 sisyphus.217364.100 1544022396 installed
<13>Jan  1 03:10:49 rpmi: python-modules-multiprocessing-2.7.15-alt1 sisyphus.217364.100 1544022396 installed
<13>Jan  1 03:10:49 rpmi: python-modules-logging-2.7.15-alt1 sisyphus.217364.100 1544022396 installed
<13>Jan  1 03:10:49 rpmi: python-2.7.15-alt1 sisyphus.217364.100 1544022396 installed
<13>Jan  1 03:10:49 rpmi: libnss-3.40.1-alt1 sisyphus.218259.100 1545764880 installed
<13>Jan  1 03:10:49 rpmi: python3-module-nss-1.0.1-alt2.S1.1 1525119332 installed
<13>Jan  1 03:10:49 rpmi: python3-module-beaker-1.9.0-alt1 1521467136 installed
<13>Jan  1 03:10:49 rpmi: python3-module-mako-1.0.1-alt1.1.1.1 1460400692 installed
<13>Jan  1 03:10:49 rpmi: rpm-macros-pam0-1.3.1.0.5.955b-alt2 1530819916 installed
<13>Jan  1 03:10:49 rpmi: libpam0-devel-1.3.1.0.5.955b-alt2 1530819916 installed
<13>Jan  1 03:10:49 rpmi: gobject-introspection-devel-1.58.3-alt1 sisyphus.218857.100 1546259903 installed
<13>Jan  1 03:10:49 rpmi: gtk-doc-1.29-alt2 sisyphus.217088.100 1543518451 installed
<13>Jan  1 03:10:49 rpmi: gcc-c++-8-alt1 sisyphus.214000.40 1542664792 installed
<13>Jan  1 03:10:49 rpmi: libsystemd-devel-1:239-alt3 sisyphus.215710.300 1540765573 installed
<13>Jan  1 03:10:49 rpmi: intltool-0.51.0-alt2 1513698802 installed
<13>Jan  1 03:10:49 rpmi: libmozjs60-devel-60.1.0-alt1 1533143983 installed
<13>Jan  1 03:10:49 rpmi: libexpat-devel-2.2.4-alt1 1503305341 installed
Building target platforms: x86_64
Building for target x86_64
Wrote: /usr/src/in/nosrpm/polkit-0.115-alt4.nosrc.rpm
Installing polkit-0.115-alt4.src.rpm
Building target platforms: x86_64
Building for target x86_64
Executing(%prep): /bin/sh -e /usr/src/tmp/rpm-tmp.80219
+ umask 022
+ /bin/mkdir -p /usr/src/RPM/BUILD
+ cd /usr/src/RPM/BUILD
+ cd /usr/src/RPM/BUILD
+ rm -rf polkit-0.115
+ echo 'Source #0 (polkit-0.115.tar):'
Source #0 (polkit-0.115.tar):
+ /bin/tar -xf /usr/src/RPM/SOURCES/polkit-0.115.tar
+ cd polkit-0.115
+ /bin/chmod -c -Rf u+rwX,go-w .
+ echo 'Patch #0 (polkit-0.115-alt4.patch):'
Patch #0 (polkit-0.115-alt4.patch):
+ /usr/bin/patch -p1
patching file .gear/rules
patching file .gear/tags/2e60ba6f6e82d07b2528db467c37e08b2904bdf2
patching file .gear/tags/list
patching file HACKING
patching file NEWS
patching file configure.ac
patching file data/Makefile.am
patching file po/LINGUAS
patching file po/cs.po
patching file po/it.po
patching file po/pl.po
patching file po/pt_BR.po
patching file polkit-0.109-alt-helper_path.patch
patching file polkit.spec
patching file src/polkit/polkitpermission.c
patching file src/polkit/polkitunixgroup.c
patching file src/polkit/polkitunixprocess.c
patching file src/polkit/polkitunixuser.c
patching file src/polkitagent/Makefile.am
patching file src/polkitagent/polkitagentlistener.c
patching file src/polkitbackend/Makefile.am
patching file src/polkitbackend/polkitbackendactionpool.c
patching file src/polkitbackend/polkitbackendinteractiveauthority.c
patching file src/polkitbackend/polkitbackendjsauthority.cpp
patching file src/programs/pkttyagent.c
patching file test/data/etc/group
patching file test/data/etc/passwd
patching file test/data/etc/polkit-1/rules.d/10-testing.rules
patching file test/polkitbackend/test-polkitbackendjsauthority.c
+ echo 'Patch #1 (polkit-0.109-alt-helper_path.patch):'
Patch #1 (polkit-0.109-alt-helper_path.patch):
+ /usr/bin/patch -p1
patching file src/polkitagent/polkitagentsession.c
Hunk #1 succeeded at 596 with fuzz 2 (offset -24 lines).
+ touch ChangeLog
+ exit 0
Executing(%build): /bin/sh -e /usr/src/tmp/rpm-tmp.99563
+ umask 022
+ /bin/mkdir -p /usr/src/RPM/BUILD
+ cd /usr/src/RPM/BUILD
+ cd polkit-0.115
+ autoreconf -fisv
autoreconf-default: Entering directory `.'
autoreconf-default: configure.ac: not using Gettext
autoreconf-default: running: aclocal --force 
autoreconf-default: configure.ac: tracing
autoreconf-default: configure.ac: adding subdirectory test/mocklibc to autoreconf
autoreconf-default: Entering directory `test/mocklibc'
autoreconf-default: running: libtoolize --force --install
libtoolize-default: putting auxiliary files in `.'.
libtoolize-default: linking file `./config.guess'
libtoolize-default: linking file `./config.sub'
libtoolize-default: linking file `./install-sh'
libtoolize-default: linking file `./ltmain.sh'
libtoolize-default: Consider adding `AC_CONFIG_MACRO_DIR([m4])' to configure.ac and
libtoolize-default: rerunning libtoolize-default, to keep the correct libtool macros in-tree.
libtoolize-default: Consider adding `-I m4' to ACLOCAL_AMFLAGS in Makefile.am.
autoreconf-default: configure.ac: not using Intltool
autoreconf-default: configure.ac: not using gtk-doc
autoreconf-default: running: /usr/bin/autoconf-2.60 --force
autoreconf-default: running: /usr/bin/autoheader-2.60 --force
autoreconf-default: running: automake --add-missing --force-missing
configure.ac:11: installing './compile'
configure.ac:8: installing './missing'
parallel-tests: installing './test-driver'
src/Makefile.am: installing './depcomp'
autoreconf-default: Leaving directory `test/mocklibc'
libtoolize-default: putting auxiliary files in `.'.
libtoolize-default: linking file `./config.guess'
libtoolize-default: linking file `./config.sub'
libtoolize-default: linking file `./install-sh'
libtoolize-default: linking file `./ltmain.sh'
libtoolize-default: putting macros in AC_CONFIG_MACRO_DIR, `buildutil'.
libtoolize-default: linking file `buildutil/libtool.m4'
libtoolize-default: linking file `buildutil/ltoptions.m4'
libtoolize-default: linking file `buildutil/ltsugar.m4'
libtoolize-default: linking file `buildutil/ltversion.m4'
libtoolize-default: linking file `buildutil/lt~obsolete.m4'
libtoolize-default: Consider adding `-I buildutil' to ACLOCAL_AMFLAGS in Makefile.am.
autoreconf-default: running: intltoolize --force
autoreconf-default: running: gtkdocize
configure.ac:26: installing './compile'
configure.ac:5: installing './missing'
Makefile.am: installing './INSTALL'
src/examples/Makefile.am: installing './depcomp'
parallel-tests: installing './test-driver'
autoreconf-default: Leaving directory `.'
+ CFLAGS='-pipe -frecord-gcc-switches -Wall -g -O2'
+ export CFLAGS
+ CXXFLAGS='-pipe -frecord-gcc-switches -Wall -g -O2'
+ export CXXFLAGS
+ FFLAGS='-pipe -frecord-gcc-switches -Wall -g -O2'
+ export FFLAGS
+ '[' -n '' ']'
++ printf %s '-pipe -frecord-gcc-switches -Wall -g -O2'
++ sed -r 's/(^|[[:space:]]+)-[^m][^[:space:]]*//g'
+ ASFLAGS=
+ export ASFLAGS
+ export lt_cv_deplibs_check_method=pass_all
+ lt_cv_deplibs_check_method=pass_all
+ readlink -e -- ./configure
+ xargs -ri dirname -- '{}'
+ xargs -ri find '{}' -type f '(' -name config.sub -or -name config.guess ')' -printf '%h/\n'
+ sort -u
+ xargs -rn1 install -pm755 -- /usr/share/gnu-config/config.sub /usr/share/gnu-config/config.guess
+ ./configure --build=x86_64-alt-linux --host=x86_64-alt-linux --prefix=/usr --exec-prefix=/usr --bindir=/usr/bin --sbindir=/usr/sbin --sysconfdir=/etc --datadir=/usr/share --includedir=/usr/include --libdir=/usr/lib64 --libexecdir=/usr/lib --localstatedir=/var/lib --sharedstatedir=/var/lib --mandir=/usr/share/man --infodir=/usr/share/info --disable-dependency-tracking --without-included-gettext --libexecdir=/usr/libexec --localstatedir=/var --enable-gtk-doc --disable-static --enable-libsystemd-login=yes
checking for a BSD-compatible install... /bin/install -c
checking whether build environment is sane... yes
checking for a thread-safe mkdir -p... /bin/mkdir -p
checking for gawk... gawk
checking whether make sets $(MAKE)... yes
checking whether make supports nested variables... yes
checking whether to enable maintainer-specific portions of Makefiles... no
checking whether make supports nested variables... (cached) yes
checking for style of include used by make... GNU
checking for x86_64-alt-linux-gcc... x86_64-alt-linux-gcc
checking whether the C compiler works... yes
checking for C compiler default output file name... a.out
checking for suffix of executables... 
checking whether we are cross compiling... no
checking for suffix of object files... o
checking whether we are using the GNU C compiler... yes
checking whether x86_64-alt-linux-gcc accepts -g... yes
checking for x86_64-alt-linux-gcc option to accept ISO C89... none needed
checking whether x86_64-alt-linux-gcc understands -c and -o together... yes
checking dependency style of x86_64-alt-linux-gcc... none
checking how to run the C preprocessor... x86_64-alt-linux-gcc -E
checking for grep that handles long lines and -e... /bin/grep
checking for egrep... /bin/grep -E
checking for ANSI C header files... yes
checking for sys/types.h... yes
checking for sys/stat.h... yes
checking for stdlib.h... yes
checking for string.h... yes
checking for memory.h... yes
checking for strings.h... yes
checking for inttypes.h... yes
checking for stdint.h... yes
checking for unistd.h... yes
checking minix/config.h usability... no
checking minix/config.h presence... no
checking for minix/config.h... no
checking whether it is safe to define __EXTENSIONS__... yes
checking for library containing strerror... none required
checking for x86_64-alt-linux-gcc... (cached) x86_64-alt-linux-gcc
checking whether we are using the GNU C compiler... (cached) yes
checking whether x86_64-alt-linux-gcc accepts -g... (cached) yes
checking for x86_64-alt-linux-gcc option to accept ISO C89... (cached) none needed
checking whether x86_64-alt-linux-gcc understands -c and -o together... (cached) yes
checking dependency style of x86_64-alt-linux-gcc... (cached) none
checking for ANSI C header files... (cached) yes
checking build system type... x86_64-alt-linux-gnu
checking host system type... x86_64-alt-linux-gnu
checking how to print strings... printf
checking for a sed that does not truncate output... /bin/sed
checking for fgrep... /bin/grep -F
checking for ld used by x86_64-alt-linux-gcc... /usr/bin/ld
checking if the linker (/usr/bin/ld) is GNU ld... yes
checking for BSD- or MS-compatible name lister (nm)... /usr/bin/nm -B
checking the name lister (/usr/bin/nm -B) interface... BSD nm
checking whether ln -s works... yes
checking the maximum length of command line arguments... 1572864
checking whether the shell understands some XSI constructs... yes
checking whether the shell understands "+="... yes
checking how to convert x86_64-alt-linux-gnu file names to x86_64-alt-linux-gnu format... func_convert_file_noop
checking how to convert x86_64-alt-linux-gnu file names to toolchain format... func_convert_file_noop
checking for /usr/bin/ld option to reload object files... -r
checking for x86_64-alt-linux-objdump... no
checking for objdump... objdump
checking how to recognize dependent libraries... (cached) pass_all
checking for x86_64-alt-linux-dlltool... no
checking for dlltool... no
checking how to associate runtime and link libraries... printf %s\n
checking for x86_64-alt-linux-ar... no
checking for ar... ar
checking for archiver @FILE support... @
checking for x86_64-alt-linux-strip... no
checking for strip... strip
checking for x86_64-alt-linux-ranlib... no
checking for ranlib... ranlib
checking command to parse /usr/bin/nm -B output from x86_64-alt-linux-gcc object... ok
checking for sysroot... no
checking for x86_64-alt-linux-mt... no
checking for mt... no
checking if : is a manifest tool... no
checking for dlfcn.h... yes
checking for objdir... .libs
checking if x86_64-alt-linux-gcc supports -fno-rtti -fno-exceptions... no
checking for x86_64-alt-linux-gcc option to produce PIC... -fPIC -DPIC
checking if x86_64-alt-linux-gcc PIC flag -fPIC -DPIC works... yes
checking if x86_64-alt-linux-gcc static flag -static works... no
checking if x86_64-alt-linux-gcc supports -c -o file.o... yes
checking if x86_64-alt-linux-gcc supports -c -o file.o... (cached) yes
checking whether the x86_64-alt-linux-gcc linker (/usr/bin/ld -m elf_x86_64) supports shared libraries... yes
checking whether -lc should be explicitly linked in... no
checking dynamic linker characteristics... GNU/Linux ld.so
checking how to hardcode library paths into programs... immediate
checking whether stripping libraries is possible... yes
checking if libtool supports shared libraries... yes
checking whether to build shared libraries... yes
checking whether to build static libraries... no
checking whether make sets $(MAKE)... (cached) yes
checking whether ln -s works... yes
checking for special C compiler options needed for large files... no
checking for _FILE_OFFSET_BITS value needed for large files... no
checking for x86_64-alt-linux-g++... x86_64-alt-linux-g++
checking whether we are using the GNU C++ compiler... yes
checking whether x86_64-alt-linux-g++ accepts -g... yes
checking dependency style of x86_64-alt-linux-g++... none
checking how to run the C++ preprocessor... x86_64-alt-linux-g++ -E
checking for ld used by x86_64-alt-linux-g++... /usr/bin/ld -m elf_x86_64
checking if the linker (/usr/bin/ld -m elf_x86_64) is GNU ld... yes
checking whether the x86_64-alt-linux-g++ linker (/usr/bin/ld -m elf_x86_64) supports shared libraries... yes
checking for x86_64-alt-linux-g++ option to produce PIC... -fPIC -DPIC
checking if x86_64-alt-linux-g++ PIC flag -fPIC -DPIC works... yes
checking if x86_64-alt-linux-g++ static flag -static works... no
checking if x86_64-alt-linux-g++ supports -c -o file.o... yes
checking if x86_64-alt-linux-g++ supports -c -o file.o... (cached) yes
checking whether the x86_64-alt-linux-g++ linker (/usr/bin/ld -m elf_x86_64) supports shared libraries... yes
checking dynamic linker characteristics... (cached) GNU/Linux ld.so
checking how to hardcode library paths into programs... immediate
checking for xsltproc... /usr/bin/xsltproc
checking for x86_64-alt-linux-pkg-config... no
checking for pkg-config... /usr/bin/pkg-config
checking pkg-config is at least version 0.9.0... yes
checking for gtk-doc... yes
checking for gtkdoc-check... gtkdoc-check.test
checking for gtkdoc-check... /usr/bin/gtkdoc-check
checking for gtkdoc-rebase... /usr/bin/gtkdoc-rebase
checking for gtkdoc-mkpdf... no
checking whether to build gtk-doc documentation... yes
checking for glib-2.0 >= 2.10.0 gobject-2.0  >= 2.10.0... yes
checking if x86_64-alt-linux-gcc supports flag -pipe in envvar CFLAGS... yes
checking if x86_64-alt-linux-gcc supports flag -Wall in envvar CFLAGS... yes
checking if x86_64-alt-linux-gcc supports flag -Werror=empty-body in envvar CFLAGS... yes
checking if x86_64-alt-linux-gcc supports flag -Werror=strict-prototypes in envvar CFLAGS... yes
checking if x86_64-alt-linux-gcc supports flag -Werror=missing-prototypes in envvar CFLAGS... yes
checking if x86_64-alt-linux-gcc supports flag -Werror=implicit-function-declaration in envvar CFLAGS... yes
checking if x86_64-alt-linux-gcc supports flag -Werror=format=2 -Werror=format-security -Werror=format-nonliteral in envvar CFLAGS... yes
checking if x86_64-alt-linux-gcc supports flag -Werror=pointer-arith in envvar CFLAGS... yes
checking if x86_64-alt-linux-gcc supports flag -Werror=init-self in envvar CFLAGS... yes
checking if x86_64-alt-linux-gcc supports flag -Werror=missing-declarations in envvar CFLAGS... yes
checking if x86_64-alt-linux-gcc supports flag -Werror=return-type in envvar CFLAGS... yes
checking if x86_64-alt-linux-gcc supports flag -Werror=overflow in envvar CFLAGS... yes
checking if x86_64-alt-linux-gcc supports flag -Werror=int-conversion in envvar CFLAGS... yes
checking if x86_64-alt-linux-gcc supports flag -Werror=parenthesis in envvar CFLAGS... no
checking if x86_64-alt-linux-gcc supports flag -Werror=incompatible-pointer-types in envvar CFLAGS... yes
checking if x86_64-alt-linux-gcc supports flag -Werror=misleading-indentation in envvar CFLAGS... yes
checking if x86_64-alt-linux-gcc supports flag -Werror=missing-include-dirs in envvar CFLAGS... yes
checking if x86_64-alt-linux-gcc supports flag -Werror=aggregate-return in envvar CFLAGS... yes
checking if x86_64-alt-linux-gcc supports flag -Werror=declaration-after-statement in envvar CFLAGS... yes
checking for gmodule-2.0 gio-unix-2.0 >= 2.38.0... yes
checking for mozjs-60... yes
checking expat.h usability... yes
checking expat.h presence... yes
checking for expat.h... yes
checking for XML_ParserCreate in -lexpat... yes
checking for clearenv... yes
checking for fdatasync... yes
checking netgroup.h usability... no
checking netgroup.h presence... no
checking for netgroup.h... no
checking for libsystemd... yes
checking for sd_uid_get_display... yes
configure: WARNING: libsystemd requested but system does not appear to be using systemd
checking for pam_start in -lpam... yes
checking for sigtimedwait in -lc... yes
checking how to call pam_strerror... two arguments
checking security/pam_modutil.h usability... yes
checking security/pam_modutil.h presence... yes
checking for security/pam_modutil.h... yes
checking security/pam_ext.h usability... yes
checking security/pam_ext.h presence... yes
checking for security/pam_ext.h... yes
checking for pam_vsyslog in -lpam... yes
checking for /etc/redhat-release... yes
checking for /etc/SuSE-release... no
checking for /etc/gentoo-release... no
checking for /etc/pardus-release... no
checking for gobject-introspection... yes
checking whether NLS is requested... yes
checking for intltool >= 0.40.0... 0.51.0 found
checking for intltool-update... /usr/bin/intltool-update
checking for intltool-merge... /usr/bin/intltool-merge
checking for intltool-extract... /usr/bin/intltool-extract
checking for xgettext... /usr/bin/xgettext
checking for msgmerge... /usr/bin/msgmerge
checking for msgfmt... /usr/bin/msgfmt
checking for gmsgfmt... /usr/bin/msgfmt
checking for perl... /usr/bin/perl
checking for perl >= 5.8.1... 5.26.2
checking for XML::Parser... ok
checking locale.h usability... yes
checking locale.h presence... yes
checking for locale.h... yes
checking for LC_MESSAGES... yes
checking for CFPreferencesCopyAppValue... no
checking for CFLocaleCopyCurrent... no
checking libintl.h usability... yes
checking libintl.h presence... yes
checking for libintl.h... yes
checking for ngettext in libc... yes
checking for dgettext in libc... yes
checking for bind_textdomain_codeset... yes
checking for msgfmt... (cached) /usr/bin/msgfmt
checking for dcgettext... yes
checking if msgfmt accepts -c... yes
checking for gmsgfmt... (cached) /usr/bin/msgfmt
checking for xgettext... (cached) /usr/bin/xgettext
checking that generated files are newer than configure... done
configure: creating ./config.status
config.status: creating Makefile
config.status: creating actions/Makefile
config.status: creating data/Makefile
config.status: creating data/polkit-1
config.status: creating data/polkit-gobject-1.pc
config.status: creating data/polkit-agent-1.pc
config.status: creating src/Makefile
config.status: creating src/polkit/Makefile
config.status: creating src/polkitbackend/Makefile
config.status: creating src/polkitagent/Makefile
config.status: creating src/programs/Makefile
config.status: creating src/examples/Makefile
config.status: creating docs/version.xml
config.status: creating docs/extensiondir.xml
config.status: creating docs/Makefile
config.status: creating docs/polkit/Makefile
config.status: creating docs/man/Makefile
config.status: creating po/Makefile.in
config.status: creating test/Makefile
config.status: creating test/polkit/Makefile
config.status: creating test/polkitbackend/Makefile
config.status: creating config.h
config.status: executing depfiles commands
config.status: executing libtool commands
config.status: executing default-1 commands
config.status: executing po/stamp-it commands
=== configuring in test/mocklibc (/usr/src/RPM/BUILD/polkit-0.115/test/mocklibc)
configure: running /bin/sh ./configure --disable-option-checking '--prefix=/usr'  '--build=x86_64-alt-linux' '--host=x86_64-alt-linux' '--exec-prefix=/usr' '--bindir=/usr/bin' '--sbindir=/usr/sbin' '--sysconfdir=/etc' '--datadir=/usr/share' '--includedir=/usr/include' '--libdir=/usr/lib64' '--libexecdir=/usr/lib' '--localstatedir=/var/lib' '--sharedstatedir=/var/lib' '--mandir=/usr/share/man' '--infodir=/usr/share/info' '--disable-dependency-tracking' '--without-included-gettext' '--libexecdir=/usr/libexec' '--localstatedir=/var' '--enable-gtk-doc' '--disable-static' '--enable-libsystemd-login=yes' 'build_alias=x86_64-alt-linux' 'host_alias=x86_64-alt-linux' 'CFLAGS=-pipe -frecord-gcc-switches -Wall -g -O2' 'CXXFLAGS=-pipe -frecord-gcc-switches -Wall -g -O2' --cache-file=/dev/null --srcdir=.
checking for a BSD-compatible install... /bin/install -c
checking whether build environment is sane... yes
checking for a thread-safe mkdir -p... /bin/mkdir -p
checking for gawk... gawk
checking whether make sets $(MAKE)... yes
checking whether make supports nested variables... yes
checking for x86_64-alt-linux-gcc... x86_64-alt-linux-gcc
checking whether the C compiler works... yes
checking for C compiler default output file name... a.out
checking for suffix of executables... 
checking whether we are cross compiling... no
checking for suffix of object files... o
checking whether we are using the GNU C compiler... yes
checking whether x86_64-alt-linux-gcc accepts -g... yes
checking for x86_64-alt-linux-gcc option to accept ISO C89... none needed
checking whether x86_64-alt-linux-gcc understands -c and -o together... yes
checking for style of include used by make... GNU
checking dependency style of x86_64-alt-linux-gcc... none
checking build system type... x86_64-alt-linux-gnu
checking host system type... x86_64-alt-linux-gnu
checking how to print strings... printf
checking for a sed that does not truncate output... /bin/sed
checking for grep that handles long lines and -e... /bin/grep
checking for egrep... /bin/grep -E
checking for fgrep... /bin/grep -F
checking for ld used by x86_64-alt-linux-gcc... /usr/bin/ld
checking if the linker (/usr/bin/ld) is GNU ld... yes
checking for BSD- or MS-compatible name lister (nm)... /usr/bin/nm -B
checking the name lister (/usr/bin/nm -B) interface... BSD nm
checking whether ln -s works... yes
checking the maximum length of command line arguments... 1572864
checking whether the shell understands some XSI constructs... yes
checking whether the shell understands "+="... yes
checking how to convert x86_64-alt-linux-gnu file names to x86_64-alt-linux-gnu format... func_convert_file_noop
checking how to convert x86_64-alt-linux-gnu file names to toolchain format... func_convert_file_noop
checking for /usr/bin/ld option to reload object files... -r
checking for x86_64-alt-linux-objdump... no
checking for objdump... objdump
checking how to recognize dependent libraries... (cached) pass_all
checking for x86_64-alt-linux-dlltool... no
checking for dlltool... no
checking how to associate runtime and link libraries... printf %s\n
checking for x86_64-alt-linux-ar... no
checking for ar... ar
checking for archiver @FILE support... @
checking for x86_64-alt-linux-strip... no
checking for strip... strip
checking for x86_64-alt-linux-ranlib... no
checking for ranlib... ranlib
checking command to parse /usr/bin/nm -B output from x86_64-alt-linux-gcc object... ok
checking for sysroot... no
checking for x86_64-alt-linux-mt... no
checking for mt... no
checking if : is a manifest tool... no
checking how to run the C preprocessor... x86_64-alt-linux-gcc -E
checking for ANSI C header files... yes
checking for sys/types.h... yes
checking for sys/stat.h... yes
checking for stdlib.h... yes
checking for string.h... yes
checking for memory.h... yes
checking for strings.h... yes
checking for inttypes.h... yes
checking for stdint.h... yes
checking for unistd.h... yes
checking for dlfcn.h... yes
checking for objdir... .libs
checking if x86_64-alt-linux-gcc supports -fno-rtti -fno-exceptions... no
checking for x86_64-alt-linux-gcc option to produce PIC... -fPIC -DPIC
checking if x86_64-alt-linux-gcc PIC flag -fPIC -DPIC works... yes
checking if x86_64-alt-linux-gcc static flag -static works... no
checking if x86_64-alt-linux-gcc supports -c -o file.o... yes
checking if x86_64-alt-linux-gcc supports -c -o file.o... (cached) yes
checking whether the x86_64-alt-linux-gcc linker (/usr/bin/ld -m elf_x86_64) supports shared libraries... yes
checking whether -lc should be explicitly linked in... no
checking dynamic linker characteristics... GNU/Linux ld.so
checking how to hardcode library paths into programs... immediate
checking whether stripping libraries is possible... yes
checking if libtool supports shared libraries... yes
checking whether to build shared libraries... yes
checking whether to build static libraries... no
checking netdb.h usability... yes
checking netdb.h presence... yes
checking for netdb.h... yes
checking for stdlib.h... (cached) yes
checking for string.h... (cached) yes
checking for uid_t in sys/types.h... yes
checking for size_t... yes
checking for ssize_t... yes
checking for stdlib.h... (cached) yes
checking for GNU libc compatible malloc... yes
checking for endgrent... yes
checking for endpwent... yes
checking for memset... yes
checking for regcomp... yes
checking for strdup... yes
checking that generated files are newer than configure... done
configure: creating ./config.status
config.status: creating Makefile
config.status: creating src/Makefile
config.status: creating bin/Makefile
config.status: creating config.h
config.status: executing depfiles commands
config.status: executing libtool commands

                  polkit 0.116
                =================

        prefix:                     /usr
        libdir:                     /usr/lib64
        libexecdir:                 /usr/libexec
        bindir:                     /usr/bin
        sbindir:                    /usr/sbin
        datadir:                    /usr/share
        sysconfdir:                 /etc
        localstatedir:              /var
        docdir:                     ${datarootdir}/doc/${PACKAGE_TARNAME}

        compiler:                   x86_64-alt-linux-gcc
        cflags:                     -pipe -frecord-gcc-switches -Wall -g -O2
        cppflags:                   
        xsltproc:                   /usr/bin/xsltproc
	introspection:		    yes

        Distribution/OS:            redhat
        Authentication framework:   pam
        Session tracking:           libsystemd-login
        PAM support:                yes
        systemdsystemunitdir:       /lib/systemd/system
        polkitd user:               polkitd

        PAM file auth:              system-auth
        PAM file account:           system-auth
        PAM file password:          system-auth
        PAM file session:           system-auth

        Maintainer mode:            no
        Building api docs:          yes
        Building man pages:         yes
        Building examples:          yes


NOTE: The file /usr/lib/polkit-1/polkit-agent-helper-1 must be owned
      by root and have mode 4755 (setuid root binary)

NOTE: The file /usr/bin/pkexec must be owned by root and
      have mode 4755 (setuid root binary)

NOTE: The directory /etc/polkit-1/rules.d must be owned
      by user 'polkitd' and have mode 700

NOTE: The directory /usr/share/polkit-1/rules.d must be owned
      by user 'polkitd' and have mode 700

+ make
make: Entering directory '/usr/src/RPM/BUILD/polkit-0.115'
make  all-recursive
make[1]: Entering directory '/usr/src/RPM/BUILD/polkit-0.115'
Making all in actions
make[2]: Entering directory '/usr/src/RPM/BUILD/polkit-0.115/actions'
  ITMRG  org.freedesktop.policykit.policy
git.mk: Generating .gitignore
make[2]: Leaving directory '/usr/src/RPM/BUILD/polkit-0.115/actions'
Making all in data
make[2]: Entering directory '/usr/src/RPM/BUILD/polkit-0.115/data'
git.mk: Generating .gitignore
make[2]: Leaving directory '/usr/src/RPM/BUILD/polkit-0.115/data'
Making all in src
make[2]: Entering directory '/usr/src/RPM/BUILD/polkit-0.115/src'
Making all in polkit
make[3]: Entering directory '/usr/src/RPM/BUILD/polkit-0.115/src/polkit'
( top_builddir=`cd ../.. && pwd`; \
 cd . && glib-mkenums --template polkitenumtypes.c.template polkitcheckauthorizationflags.h polkiterror.h polkitimplicitauthorization.h polkitauthorityfeatures.h) > \
   polkitenumtypes.c.tmp && mv polkitenumtypes.c.tmp polkitenumtypes.c
( top_builddir=`cd ../.. && pwd`; \
 cd . && glib-mkenums --template polkitenumtypes.h.template polkitcheckauthorizationflags.h polkiterror.h polkitimplicitauthorization.h polkitauthorityfeatures.h) > \
   polkitenumtypes.h.tmp && mv polkitenumtypes.h.tmp polkitenumtypes.h
git.mk: Generating .gitignore
make  all-am
make[4]: Entering directory '/usr/src/RPM/BUILD/polkit-0.115/src/polkit'
  CC       libpolkit_gobject_1_la-polkitenumtypes.lo
  CC       libpolkit_gobject_1_la-polkitactiondescription.lo
  CC       libpolkit_gobject_1_la-polkitauthorityfeatures.lo
  CC       libpolkit_gobject_1_la-polkitdetails.lo
  CC       libpolkit_gobject_1_la-polkitauthority.lo
polkitauthority.c: In function 'authority_get_async_cb':
polkitauthority.c:437:7: warning: 'g_simple_async_result_set_from_error' is deprecated [-Wdeprecated-declarations]
       g_simple_async_result_set_from_error (simple, error);
       ^~~~~~~~~~~~~~~~~~~~~~~~~~~~~~~~~~~~
In file included from /usr/include/glib-2.0/gio/gio.h:117,
                 from polkitauthority.h:30,
                 from polkitauthority.c:28:
/usr/include/glib-2.0/gio/gsimpleasyncresult.h:113:21: note: declared here
 void                g_simple_async_result_set_from_error   (GSimpleAsyncResult      *simple,
                     ^~~~~~~~~~~~~~~~~~~~~~~~~~~~~~~~~~~~
polkitauthority.c:443:7: warning: 'g_simple_async_result_set_op_res_gpointer' is deprecated [-Wdeprecated-declarations]
       g_simple_async_result_set_op_res_gpointer (simple,
       ^~~~~~~~~~~~~~~~~~~~~~~~~~~~~~~~~~~~~~~~~
In file included from /usr/include/glib-2.0/gio/gio.h:117,
                 from polkitauthority.h:30,
                 from polkitauthority.c:28:
/usr/include/glib-2.0/gio/gsimpleasyncresult.h:75:21: note: declared here
 void                g_simple_async_result_set_op_res_gpointer (GSimpleAsyncResult      *simple,
                     ^~~~~~~~~~~~~~~~~~~~~~~~~~~~~~~~~~~~~~~~~
polkitauthority.c:447:3: warning: 'g_simple_async_result_complete_in_idle' is deprecated [-Wdeprecated-declarations]
   g_simple_async_result_complete_in_idle (simple);
   ^~~~~~~~~~~~~~~~~~~~~~~~~~~~~~~~~~~~~~
In file included from /usr/include/glib-2.0/gio/gio.h:117,
                 from polkitauthority.h:30,
                 from polkitauthority.c:28:
/usr/include/glib-2.0/gio/gsimpleasyncresult.h:106:21: note: declared here
 void                g_simple_async_result_complete_in_idle (GSimpleAsyncResult      *simple);
                     ^~~~~~~~~~~~~~~~~~~~~~~~~~~~~~~~~~~~~~
polkitauthority.c: In function 'polkit_authority_get_async':
polkitauthority.c:477:3: warning: 'g_simple_async_result_new' is deprecated: Use 'g_task_new' instead [-Wdeprecated-declarations]
   simple = g_simple_async_result_new (NULL,
   ^~~~~~
In file included from /usr/include/glib-2.0/gio/gio.h:117,
                 from polkitauthority.h:30,
                 from polkitauthority.c:28:
/usr/include/glib-2.0/gio/gsimpleasyncresult.h:51:21: note: declared here
 GSimpleAsyncResult *g_simple_async_result_new              (GObject                 *source_object,
                     ^~~~~~~~~~~~~~~~~~~~~~~~~
polkitauthority.c:487:7: warning: 'g_simple_async_result_set_from_error' is deprecated [-Wdeprecated-declarations]
       g_simple_async_result_set_from_error (simple, error);
       ^~~~~~~~~~~~~~~~~~~~~~~~~~~~~~~~~~~~
In file included from /usr/include/glib-2.0/gio/gio.h:117,
                 from polkitauthority.h:30,
                 from polkitauthority.c:28:
/usr/include/glib-2.0/gio/gsimpleasyncresult.h:113:21: note: declared here
 void                g_simple_async_result_set_from_error   (GSimpleAsyncResult      *simple,
                     ^~~~~~~~~~~~~~~~~~~~~~~~~~~~~~~~~~~~
polkitauthority.c:489:7: warning: 'g_simple_async_result_complete_in_idle' is deprecated [-Wdeprecated-declarations]
       g_simple_async_result_complete_in_idle (simple);
       ^~~~~~~~~~~~~~~~~~~~~~~~~~~~~~~~~~~~~~
In file included from /usr/include/glib-2.0/gio/gio.h:117,
                 from polkitauthority.h:30,
                 from polkitauthority.c:28:
/usr/include/glib-2.0/gio/gsimpleasyncresult.h:106:21: note: declared here
 void                g_simple_async_result_complete_in_idle (GSimpleAsyncResult      *simple);
                     ^~~~~~~~~~~~~~~~~~~~~~~~~~~~~~~~~~~~~~
polkitauthority.c: In function 'polkit_authority_get_finish':
polkitauthority.c:525:3: warning: 'g_simple_async_result_get_source_tag' is deprecated [-Wdeprecated-declarations]
   g_warn_if_fail (g_simple_async_result_get_source_tag (simple) == polkit_authority_get_async);
   ^~~~~~~~~~~~~~
In file included from /usr/include/glib-2.0/gio/gio.h:117,
                 from polkitauthority.h:30,
                 from polkitauthority.c:28:
/usr/include/glib-2.0/gio/gsimpleasyncresult.h:99:21: note: declared here
 gpointer            g_simple_async_result_get_source_tag   (GSimpleAsyncResult      *simple);
                     ^~~~~~~~~~~~~~~~~~~~~~~~~~~~~~~~~~~~
polkitauthority.c:529:3: warning: 'g_simple_async_result_propagate_error' is deprecated [-Wdeprecated-declarations]
   if (g_simple_async_result_propagate_error (simple, error))
   ^~
In file included from /usr/include/glib-2.0/gio/gio.h:117,
                 from polkitauthority.h:30,
                 from polkitauthority.c:28:
/usr/include/glib-2.0/gio/gsimpleasyncresult.h:119:21: note: declared here
 gboolean            g_simple_async_result_propagate_error  (GSimpleAsyncResult      *simple,
                     ^~~~~~~~~~~~~~~~~~~~~~~~~~~~~~~~~~~~~
polkitauthority.c:532:3: warning: 'g_simple_async_result_get_op_res_gpointer' is deprecated [-Wdeprecated-declarations]
   object = g_simple_async_result_get_op_res_gpointer (simple);
   ^~~~~~
In file included from /usr/include/glib-2.0/gio/gio.h:117,
                 from polkitauthority.h:30,
                 from polkitauthority.c:28:
/usr/include/glib-2.0/gio/gsimpleasyncresult.h:79:21: note: declared here
 gpointer            g_simple_async_result_get_op_res_gpointer (GSimpleAsyncResult      *simple);
                     ^~~~~~~~~~~~~~~~~~~~~~~~~~~~~~~~~~~~~~~~~
polkitauthority.c: In function 'generic_async_cb':
polkitauthority.c:631:3: warning: 'g_simple_async_result_set_op_res_gpointer' is deprecated [-Wdeprecated-declarations]
   g_simple_async_result_set_op_res_gpointer (simple, g_object_ref (res), g_object_unref);
   ^~~~~~~~~~~~~~~~~~~~~~~~~~~~~~~~~~~~~~~~~
In file included from /usr/include/glib-2.0/gio/gio.h:117,
                 from polkitauthority.h:30,
                 from polkitauthority.c:28:
/usr/include/glib-2.0/gio/gsimpleasyncresult.h:75:21: note: declared here
 void                g_simple_async_result_set_op_res_gpointer (GSimpleAsyncResult      *simple,
                     ^~~~~~~~~~~~~~~~~~~~~~~~~~~~~~~~~~~~~~~~~
polkitauthority.c:632:3: warning: 'g_simple_async_result_complete' is deprecated [-Wdeprecated-declarations]
   g_simple_async_result_complete (simple);
   ^~~~~~~~~~~~~~~~~~~~~~~~~~~~~~
In file included from /usr/include/glib-2.0/gio/gio.h:117,
                 from polkitauthority.h:30,
                 from polkitauthority.c:28:
/usr/include/glib-2.0/gio/gsimpleasyncresult.h:104:21: note: declared here
 void                g_simple_async_result_complete         (GSimpleAsyncResult      *simple);
                     ^~~~~~~~~~~~~~~~~~~~~~~~~~~~~~
polkitauthority.c: In function 'polkit_authority_enumerate_actions':
polkitauthority.c:669:22: warning: 'g_simple_async_result_new' is deprecated: Use 'g_task_new' instead [-Wdeprecated-declarations]
                      g_simple_async_result_new (G_OBJECT (authority),
                      ^~~~~~~~~~~~~~~~~~~~~~~~~
In file included from /usr/include/glib-2.0/gio/gio.h:117,
                 from polkitauthority.h:30,
                 from polkitauthority.c:28:
/usr/include/glib-2.0/gio/gsimpleasyncresult.h:51:21: note: declared here
 GSimpleAsyncResult *g_simple_async_result_new              (GObject                 *source_object,
                     ^~~~~~~~~~~~~~~~~~~~~~~~~
polkitauthority.c: In function 'polkit_authority_enumerate_actions_finish':
polkitauthority.c:706:3: warning: 'g_simple_async_result_get_source_tag' is deprecated [-Wdeprecated-declarations]
   g_warn_if_fail (g_simple_async_result_get_source_tag (G_SIMPLE_ASYNC_RESULT (res)) == polkit_authority_enumerate_actions);
   ^~~~~~~~~~~~~~
In file included from /usr/include/glib-2.0/gio/gio.h:117,
                 from polkitauthority.h:30,
                 from polkitauthority.c:28:
/usr/include/glib-2.0/gio/gsimpleasyncresult.h:99:21: note: declared here
 gpointer            g_simple_async_result_get_source_tag   (GSimpleAsyncResult      *simple);
                     ^~~~~~~~~~~~~~~~~~~~~~~~~~~~~~~~~~~~
polkitauthority.c:707:3: warning: 'g_simple_async_result_get_op_res_gpointer' is deprecated [-Wdeprecated-declarations]
   _res = G_ASYNC_RESULT (g_simple_async_result_get_op_res_gpointer (G_SIMPLE_ASYNC_RESULT (res)));
   ^~~~
In file included from /usr/include/glib-2.0/gio/gio.h:117,
                 from polkitauthority.h:30,
                 from polkitauthority.c:28:
/usr/include/glib-2.0/gio/gsimpleasyncresult.h:79:21: note: declared here
 gpointer            g_simple_async_result_get_op_res_gpointer (GSimpleAsyncResult      *simple);
                     ^~~~~~~~~~~~~~~~~~~~~~~~~~~~~~~~~~~~~~~~~
polkitauthority.c: In function 'check_authorization_cb':
polkitauthority.c:821:7: warning: 'g_simple_async_result_set_from_error' is deprecated [-Wdeprecated-declarations]
       g_simple_async_result_set_from_error (data->simple, error);
       ^~~~~~~~~~~~~~~~~~~~~~~~~~~~~~~~~~~~
In file included from /usr/include/glib-2.0/gio/gio.h:117,
                 from polkitauthority.h:30,
                 from polkitauthority.c:28:
/usr/include/glib-2.0/gio/gsimpleasyncresult.h:113:21: note: declared here
 void                g_simple_async_result_set_from_error   (GSimpleAsyncResult      *simple,
                     ^~~~~~~~~~~~~~~~~~~~~~~~~~~~~~~~~~~~
polkitauthority.c:832:7: warning: 'g_simple_async_result_set_op_res_gpointer' is deprecated [-Wdeprecated-declarations]
       g_simple_async_result_set_op_res_gpointer (data->simple, result, g_object_unref);
       ^~~~~~~~~~~~~~~~~~~~~~~~~~~~~~~~~~~~~~~~~
In file included from /usr/include/glib-2.0/gio/gio.h:117,
                 from polkitauthority.h:30,
                 from polkitauthority.c:28:
/usr/include/glib-2.0/gio/gsimpleasyncresult.h:75:21: note: declared here
 void                g_simple_async_result_set_op_res_gpointer (GSimpleAsyncResult      *simple,
                     ^~~~~~~~~~~~~~~~~~~~~~~~~~~~~~~~~~~~~~~~~
polkitauthority.c:835:3: warning: 'g_simple_async_result_complete' is deprecated [-Wdeprecated-declarations]
   g_simple_async_result_complete (data->simple);
   ^~~~~~~~~~~~~~~~~~~~~~~~~~~~~~
In file included from /usr/include/glib-2.0/gio/gio.h:117,
                 from polkitauthority.h:30,
                 from polkitauthority.c:28:
/usr/include/glib-2.0/gio/gsimpleasyncresult.h:104:21: note: declared here
 void                g_simple_async_result_complete         (GSimpleAsyncResult      *simple);
                     ^~~~~~~~~~~~~~~~~~~~~~~~~~~~~~
polkitauthority.c: In function 'polkit_authority_check_authorization':
polkitauthority.c:899:3: warning: 'g_simple_async_result_new' is deprecated: Use 'g_task_new' instead [-Wdeprecated-declarations]
   data->simple = g_simple_async_result_new (G_OBJECT (authority),
   ^~~~
In file included from /usr/include/glib-2.0/gio/gio.h:117,
                 from polkitauthority.h:30,
                 from polkitauthority.c:28:
/usr/include/glib-2.0/gio/gsimpleasyncresult.h:51:21: note: declared here
 GSimpleAsyncResult *g_simple_async_result_new              (GObject                 *source_object,
                     ^~~~~~~~~~~~~~~~~~~~~~~~~
polkitauthority.c: In function 'polkit_authority_check_authorization_finish':
polkitauthority.c:947:3: warning: 'g_simple_async_result_propagate_error' is deprecated [-Wdeprecated-declarations]
   if (g_simple_async_result_propagate_error (G_SIMPLE_ASYNC_RESULT (res), error))
   ^~
In file included from /usr/include/glib-2.0/gio/gio.h:117,
                 from polkitauthority.h:30,
                 from polkitauthority.c:28:
/usr/include/glib-2.0/gio/gsimpleasyncresult.h:119:21: note: declared here
 gboolean            g_simple_async_result_propagate_error  (GSimpleAsyncResult      *simple,
                     ^~~~~~~~~~~~~~~~~~~~~~~~~~~~~~~~~~~~~
polkitauthority.c:950:3: warning: 'g_simple_async_result_get_op_res_gpointer' is deprecated [-Wdeprecated-declarations]
   ret = g_object_ref (g_simple_async_result_get_op_res_gpointer (G_SIMPLE_ASYNC_RESULT (res)));
   ^~~
In file included from /usr/include/glib-2.0/gio/gio.h:117,
                 from polkitauthority.h:30,
                 from polkitauthority.c:28:
/usr/include/glib-2.0/gio/gsimpleasyncresult.h:79:21: note: declared here
 gpointer            g_simple_async_result_get_op_res_gpointer (GSimpleAsyncResult      *simple);
                     ^~~~~~~~~~~~~~~~~~~~~~~~~~~~~~~~~~~~~~~~~
polkitauthority.c:950:3: warning: 'g_simple_async_result_get_op_res_gpointer' is deprecated [-Wdeprecated-declarations]
   ret = g_object_ref (g_simple_async_result_get_op_res_gpointer (G_SIMPLE_ASYNC_RESULT (res)));
   ^~~
In file included from /usr/include/glib-2.0/gio/gio.h:117,
                 from polkitauthority.h:30,
                 from polkitauthority.c:28:
/usr/include/glib-2.0/gio/gsimpleasyncresult.h:79:21: note: declared here
 gpointer            g_simple_async_result_get_op_res_gpointer (GSimpleAsyncResult      *simple);
                     ^~~~~~~~~~~~~~~~~~~~~~~~~~~~~~~~~~~~~~~~~
polkitauthority.c: In function 'polkit_authority_register_authentication_agent':
polkitauthority.c:1068:22: warning: 'g_simple_async_result_new' is deprecated: Use 'g_task_new' instead [-Wdeprecated-declarations]
                      g_simple_async_result_new (G_OBJECT (authority),
                      ^~~~~~~~~~~~~~~~~~~~~~~~~
In file included from /usr/include/glib-2.0/gio/gio.h:117,
                 from polkitauthority.h:30,
                 from polkitauthority.c:28:
/usr/include/glib-2.0/gio/gsimpleasyncresult.h:51:21: note: declared here
 GSimpleAsyncResult *g_simple_async_result_new              (GObject                 *source_object,
                     ^~~~~~~~~~~~~~~~~~~~~~~~~
polkitauthority.c: In function 'polkit_authority_register_authentication_agent_finish':
polkitauthority.c:1099:3: warning: 'g_simple_async_result_get_source_tag' is deprecated [-Wdeprecated-declarations]
   g_warn_if_fail (g_simple_async_result_get_source_tag (G_SIMPLE_ASYNC_RESULT (res)) == polkit_authority_register_authentication_agent);
   ^~~~~~~~~~~~~~
In file included from /usr/include/glib-2.0/gio/gio.h:117,
                 from polkitauthority.h:30,
                 from polkitauthority.c:28:
/usr/include/glib-2.0/gio/gsimpleasyncresult.h:99:21: note: declared here
 gpointer            g_simple_async_result_get_source_tag   (GSimpleAsyncResult      *simple);
                     ^~~~~~~~~~~~~~~~~~~~~~~~~~~~~~~~~~~~
polkitauthority.c:1100:3: warning: 'g_simple_async_result_get_op_res_gpointer' is deprecated [-Wdeprecated-declarations]
   _res = G_ASYNC_RESULT (g_simple_async_result_get_op_res_gpointer (G_SIMPLE_ASYNC_RESULT (res)));
   ^~~~
In file included from /usr/include/glib-2.0/gio/gio.h:117,
                 from polkitauthority.h:30,
                 from polkitauthority.c:28:
/usr/include/glib-2.0/gio/gsimpleasyncresult.h:79:21: note: declared here
 gpointer            g_simple_async_result_get_op_res_gpointer (GSimpleAsyncResult      *simple);
                     ^~~~~~~~~~~~~~~~~~~~~~~~~~~~~~~~~~~~~~~~~
polkitauthority.c: In function 'polkit_authority_register_authentication_agent_with_options':
polkitauthority.c:1221:26: warning: 'g_simple_async_result_new' is deprecated: Use 'g_task_new' instead [-Wdeprecated-declarations]
                          g_simple_async_result_new (G_OBJECT (authority),
                          ^~~~~~~~~~~~~~~~~~~~~~~~~
In file included from /usr/include/glib-2.0/gio/gio.h:117,
                 from polkitauthority.h:30,
                 from polkitauthority.c:28:
/usr/include/glib-2.0/gio/gsimpleasyncresult.h:51:21: note: declared here
 GSimpleAsyncResult *g_simple_async_result_new              (GObject                 *source_object,
                     ^~~~~~~~~~~~~~~~~~~~~~~~~
polkitauthority.c:1238:26: warning: 'g_simple_async_result_new' is deprecated: Use 'g_task_new' instead [-Wdeprecated-declarations]
                          g_simple_async_result_new (G_OBJECT (authority),
                          ^~~~~~~~~~~~~~~~~~~~~~~~~
In file included from /usr/include/glib-2.0/gio/gio.h:117,
                 from polkitauthority.h:30,
                 from polkitauthority.c:28:
/usr/include/glib-2.0/gio/gsimpleasyncresult.h:51:21: note: declared here
 GSimpleAsyncResult *g_simple_async_result_new              (GObject                 *source_object,
                     ^~~~~~~~~~~~~~~~~~~~~~~~~
polkitauthority.c: In function 'polkit_authority_register_authentication_agent_with_options_finish':
polkitauthority.c:1271:3: warning: 'g_simple_async_result_get_source_tag' is deprecated [-Wdeprecated-declarations]
   g_warn_if_fail (g_simple_async_result_get_source_tag (G_SIMPLE_ASYNC_RESULT (res)) == polkit_authority_register_authentication_agent_with_options);
   ^~~~~~~~~~~~~~
In file included from /usr/include/glib-2.0/gio/gio.h:117,
                 from polkitauthority.h:30,
                 from polkitauthority.c:28:
/usr/include/glib-2.0/gio/gsimpleasyncresult.h:99:21: note: declared here
 gpointer            g_simple_async_result_get_source_tag   (GSimpleAsyncResult      *simple);
                     ^~~~~~~~~~~~~~~~~~~~~~~~~~~~~~~~~~~~
polkitauthority.c:1272:3: warning: 'g_simple_async_result_get_op_res_gpointer' is deprecated [-Wdeprecated-declarations]
   _res = G_ASYNC_RESULT (g_simple_async_result_get_op_res_gpointer (G_SIMPLE_ASYNC_RESULT (res)));
   ^~~~
In file included from /usr/include/glib-2.0/gio/gio.h:117,
                 from polkitauthority.h:30,
                 from polkitauthority.c:28:
/usr/include/glib-2.0/gio/gsimpleasyncresult.h:79:21: note: declared here
 gpointer            g_simple_async_result_get_op_res_gpointer (GSimpleAsyncResult      *simple);
                     ^~~~~~~~~~~~~~~~~~~~~~~~~~~~~~~~~~~~~~~~~
polkitauthority.c: In function 'polkit_authority_unregister_authentication_agent':
polkitauthority.c:1378:22: warning: 'g_simple_async_result_new' is deprecated: Use 'g_task_new' instead [-Wdeprecated-declarations]
                      g_simple_async_result_new (G_OBJECT (authority),
                      ^~~~~~~~~~~~~~~~~~~~~~~~~
In file included from /usr/include/glib-2.0/gio/gio.h:117,
                 from polkitauthority.h:30,
                 from polkitauthority.c:28:
/usr/include/glib-2.0/gio/gsimpleasyncresult.h:51:21: note: declared here
 GSimpleAsyncResult *g_simple_async_result_new              (GObject                 *source_object,
                     ^~~~~~~~~~~~~~~~~~~~~~~~~
polkitauthority.c: In function 'polkit_authority_unregister_authentication_agent_finish':
polkitauthority.c:1409:3: warning: 'g_simple_async_result_get_source_tag' is deprecated [-Wdeprecated-declarations]
   g_warn_if_fail (g_simple_async_result_get_source_tag (G_SIMPLE_ASYNC_RESULT (res)) == polkit_authority_unregister_authentication_agent);
   ^~~~~~~~~~~~~~
In file included from /usr/include/glib-2.0/gio/gio.h:117,
                 from polkitauthority.h:30,
                 from polkitauthority.c:28:
/usr/include/glib-2.0/gio/gsimpleasyncresult.h:99:21: note: declared here
 gpointer            g_simple_async_result_get_source_tag   (GSimpleAsyncResult      *simple);
                     ^~~~~~~~~~~~~~~~~~~~~~~~~~~~~~~~~~~~
polkitauthority.c:1410:3: warning: 'g_simple_async_result_get_op_res_gpointer' is deprecated [-Wdeprecated-declarations]
   _res = G_ASYNC_RESULT (g_simple_async_result_get_op_res_gpointer (G_SIMPLE_ASYNC_RESULT (res)));
   ^~~~
In file included from /usr/include/glib-2.0/gio/gio.h:117,
                 from polkitauthority.h:30,
                 from polkitauthority.c:28:
/usr/include/glib-2.0/gio/gsimpleasyncresult.h:79:21: note: declared here
 gpointer            g_simple_async_result_get_op_res_gpointer (GSimpleAsyncResult      *simple);
                     ^~~~~~~~~~~~~~~~~~~~~~~~~~~~~~~~~~~~~~~~~
polkitauthority.c: In function 'polkit_authority_authentication_agent_response':
polkitauthority.c:1519:22: warning: 'g_simple_async_result_new' is deprecated: Use 'g_task_new' instead [-Wdeprecated-declarations]
                      g_simple_async_result_new (G_OBJECT (authority),
                      ^~~~~~~~~~~~~~~~~~~~~~~~~
In file included from /usr/include/glib-2.0/gio/gio.h:117,
                 from polkitauthority.h:30,
                 from polkitauthority.c:28:
/usr/include/glib-2.0/gio/gsimpleasyncresult.h:51:21: note: declared here
 GSimpleAsyncResult *g_simple_async_result_new              (GObject                 *source_object,
                     ^~~~~~~~~~~~~~~~~~~~~~~~~
polkitauthority.c: In function 'polkit_authority_authentication_agent_response_finish':
polkitauthority.c:1550:3: warning: 'g_simple_async_result_get_source_tag' is deprecated [-Wdeprecated-declarations]
   g_warn_if_fail (g_simple_async_result_get_source_tag (G_SIMPLE_ASYNC_RESULT (res)) == polkit_authority_authentication_agent_response);
   ^~~~~~~~~~~~~~
In file included from /usr/include/glib-2.0/gio/gio.h:117,
                 from polkitauthority.h:30,
                 from polkitauthority.c:28:
/usr/include/glib-2.0/gio/gsimpleasyncresult.h:99:21: note: declared here
 gpointer            g_simple_async_result_get_source_tag   (GSimpleAsyncResult      *simple);
                     ^~~~~~~~~~~~~~~~~~~~~~~~~~~~~~~~~~~~
polkitauthority.c:1551:3: warning: 'g_simple_async_result_get_op_res_gpointer' is deprecated [-Wdeprecated-declarations]
   _res = G_ASYNC_RESULT (g_simple_async_result_get_op_res_gpointer (G_SIMPLE_ASYNC_RESULT (res)));
   ^~~~
In file included from /usr/include/glib-2.0/gio/gio.h:117,
                 from polkitauthority.h:30,
                 from polkitauthority.c:28:
/usr/include/glib-2.0/gio/gsimpleasyncresult.h:79:21: note: declared here
 gpointer            g_simple_async_result_get_op_res_gpointer (GSimpleAsyncResult      *simple);
                     ^~~~~~~~~~~~~~~~~~~~~~~~~~~~~~~~~~~~~~~~~
polkitauthority.c: In function 'polkit_authority_enumerate_temporary_authorizations':
polkitauthority.c:1645:22: warning: 'g_simple_async_result_new' is deprecated: Use 'g_task_new' instead [-Wdeprecated-declarations]
                      g_simple_async_result_new (G_OBJECT (authority),
                      ^~~~~~~~~~~~~~~~~~~~~~~~~
In file included from /usr/include/glib-2.0/gio/gio.h:117,
                 from polkitauthority.h:30,
                 from polkitauthority.c:28:
/usr/include/glib-2.0/gio/gsimpleasyncresult.h:51:21: note: declared here
 GSimpleAsyncResult *g_simple_async_result_new              (GObject                 *source_object,
                     ^~~~~~~~~~~~~~~~~~~~~~~~~
polkitauthority.c: In function 'polkit_authority_enumerate_temporary_authorizations_finish':
polkitauthority.c:1682:3: warning: 'g_simple_async_result_get_source_tag' is deprecated [-Wdeprecated-declarations]
   g_warn_if_fail (g_simple_async_result_get_source_tag (G_SIMPLE_ASYNC_RESULT (res)) == polkit_authority_enumerate_temporary_authorizations);
   ^~~~~~~~~~~~~~
In file included from /usr/include/glib-2.0/gio/gio.h:117,
                 from polkitauthority.h:30,
                 from polkitauthority.c:28:
/usr/include/glib-2.0/gio/gsimpleasyncresult.h:99:21: note: declared here
 gpointer            g_simple_async_result_get_source_tag   (GSimpleAsyncResult      *simple);
                     ^~~~~~~~~~~~~~~~~~~~~~~~~~~~~~~~~~~~
polkitauthority.c:1683:3: warning: 'g_simple_async_result_get_op_res_gpointer' is deprecated [-Wdeprecated-declarations]
   _res = G_ASYNC_RESULT (g_simple_async_result_get_op_res_gpointer (G_SIMPLE_ASYNC_RESULT (res)));
   ^~~~
In file included from /usr/include/glib-2.0/gio/gio.h:117,
                 from polkitauthority.h:30,
                 from polkitauthority.c:28:
/usr/include/glib-2.0/gio/gsimpleasyncresult.h:79:21: note: declared here
 gpointer            g_simple_async_result_get_op_res_gpointer (GSimpleAsyncResult      *simple);
                     ^~~~~~~~~~~~~~~~~~~~~~~~~~~~~~~~~~~~~~~~~
polkitauthority.c: In function 'polkit_authority_revoke_temporary_authorizations':
polkitauthority.c:1794:22: warning: 'g_simple_async_result_new' is deprecated: Use 'g_task_new' instead [-Wdeprecated-declarations]
                      g_simple_async_result_new (G_OBJECT (authority),
                      ^~~~~~~~~~~~~~~~~~~~~~~~~
In file included from /usr/include/glib-2.0/gio/gio.h:117,
                 from polkitauthority.h:30,
                 from polkitauthority.c:28:
/usr/include/glib-2.0/gio/gsimpleasyncresult.h:51:21: note: declared here
 GSimpleAsyncResult *g_simple_async_result_new              (GObject                 *source_object,
                     ^~~~~~~~~~~~~~~~~~~~~~~~~
polkitauthority.c: In function 'polkit_authority_revoke_temporary_authorizations_finish':
polkitauthority.c:1825:3: warning: 'g_simple_async_result_get_source_tag' is deprecated [-Wdeprecated-declarations]
   g_warn_if_fail (g_simple_async_result_get_source_tag (G_SIMPLE_ASYNC_RESULT (res)) == polkit_authority_revoke_temporary_authorizations);
   ^~~~~~~~~~~~~~
In file included from /usr/include/glib-2.0/gio/gio.h:117,
                 from polkitauthority.h:30,
                 from polkitauthority.c:28:
/usr/include/glib-2.0/gio/gsimpleasyncresult.h:99:21: note: declared here
 gpointer            g_simple_async_result_get_source_tag   (GSimpleAsyncResult      *simple);
                     ^~~~~~~~~~~~~~~~~~~~~~~~~~~~~~~~~~~~
polkitauthority.c:1826:3: warning: 'g_simple_async_result_get_op_res_gpointer' is deprecated [-Wdeprecated-declarations]
   _res = G_ASYNC_RESULT (g_simple_async_result_get_op_res_gpointer (G_SIMPLE_ASYNC_RESULT (res)));
   ^~~~
In file included from /usr/include/glib-2.0/gio/gio.h:117,
                 from polkitauthority.h:30,
                 from polkitauthority.c:28:
/usr/include/glib-2.0/gio/gsimpleasyncresult.h:79:21: note: declared here
 gpointer            g_simple_async_result_get_op_res_gpointer (GSimpleAsyncResult      *simple);
                     ^~~~~~~~~~~~~~~~~~~~~~~~~~~~~~~~~~~~~~~~~
polkitauthority.c: In function 'polkit_authority_revoke_temporary_authorization_by_id':
polkitauthority.c:1914:22: warning: 'g_simple_async_result_new' is deprecated: Use 'g_task_new' instead [-Wdeprecated-declarations]
                      g_simple_async_result_new (G_OBJECT (authority),
                      ^~~~~~~~~~~~~~~~~~~~~~~~~
In file included from /usr/include/glib-2.0/gio/gio.h:117,
                 from polkitauthority.h:30,
                 from polkitauthority.c:28:
/usr/include/glib-2.0/gio/gsimpleasyncresult.h:51:21: note: declared here
 GSimpleAsyncResult *g_simple_async_result_new              (GObject                 *source_object,
                     ^~~~~~~~~~~~~~~~~~~~~~~~~
polkitauthority.c: In function 'polkit_authority_revoke_temporary_authorization_by_id_finish':
polkitauthority.c:1945:3: warning: 'g_simple_async_result_get_source_tag' is deprecated [-Wdeprecated-declarations]
   g_warn_if_fail (g_simple_async_result_get_source_tag (G_SIMPLE_ASYNC_RESULT (res)) == polkit_authority_revoke_temporary_authorization_by_id);
   ^~~~~~~~~~~~~~
In file included from /usr/include/glib-2.0/gio/gio.h:117,
                 from polkitauthority.h:30,
                 from polkitauthority.c:28:
/usr/include/glib-2.0/gio/gsimpleasyncresult.h:99:21: note: declared here
 gpointer            g_simple_async_result_get_source_tag   (GSimpleAsyncResult      *simple);
                     ^~~~~~~~~~~~~~~~~~~~~~~~~~~~~~~~~~~~
polkitauthority.c:1946:3: warning: 'g_simple_async_result_get_op_res_gpointer' is deprecated [-Wdeprecated-declarations]
   _res = G_ASYNC_RESULT (g_simple_async_result_get_op_res_gpointer (G_SIMPLE_ASYNC_RESULT (res)));
   ^~~~
In file included from /usr/include/glib-2.0/gio/gio.h:117,
                 from polkitauthority.h:30,
                 from polkitauthority.c:28:
/usr/include/glib-2.0/gio/gsimpleasyncresult.h:79:21: note: declared here
 gpointer            g_simple_async_result_get_op_res_gpointer (GSimpleAsyncResult      *simple);
                     ^~~~~~~~~~~~~~~~~~~~~~~~~~~~~~~~~~~~~~~~~
  CC       libpolkit_gobject_1_la-polkiterror.lo
  CC       libpolkit_gobject_1_la-polkitsubject.lo
  CC       libpolkit_gobject_1_la-polkitunixprocess.lo
polkitunixprocess.c: In function 'polkit_unix_process_exists':
polkitunixprocess.c:508:3: warning: 'g_simple_async_result_new' is deprecated: Use 'g_task_new' instead [-Wdeprecated-declarations]
   simple = g_simple_async_result_new (G_OBJECT (subject),
   ^~~~~~
In file included from /usr/include/glib-2.0/gio/gio.h:117,
                 from polkitunixprocess.h:32,
                 from polkitunixprocess.c:44:
/usr/include/glib-2.0/gio/gsimpleasyncresult.h:51:21: note: declared here
 GSimpleAsyncResult *g_simple_async_result_new              (GObject                 *source_object,
                     ^~~~~~~~~~~~~~~~~~~~~~~~~
polkitunixprocess.c:512:3: warning: 'g_simple_async_result_complete' is deprecated [-Wdeprecated-declarations]
   g_simple_async_result_complete (simple);
   ^~~~~~~~~~~~~~~~~~~~~~~~~~~~~~
In file included from /usr/include/glib-2.0/gio/gio.h:117,
                 from polkitunixprocess.h:32,
                 from polkitunixprocess.c:44:
/usr/include/glib-2.0/gio/gsimpleasyncresult.h:104:21: note: declared here
 void                g_simple_async_result_complete         (GSimpleAsyncResult      *simple);
                     ^~~~~~~~~~~~~~~~~~~~~~~~~~~~~~
polkitunixprocess.c: In function 'polkit_unix_process_exists_finish':
polkitunixprocess.c:523:3: warning: 'g_simple_async_result_get_source_tag' is deprecated [-Wdeprecated-declarations]
   g_warn_if_fail (g_simple_async_result_get_source_tag (simple) == polkit_unix_process_exists);
   ^~~~~~~~~~~~~~
In file included from /usr/include/glib-2.0/gio/gio.h:117,
                 from polkitunixprocess.h:32,
                 from polkitunixprocess.c:44:
/usr/include/glib-2.0/gio/gsimpleasyncresult.h:99:21: note: declared here
 gpointer            g_simple_async_result_get_source_tag   (GSimpleAsyncResult      *simple);
                     ^~~~~~~~~~~~~~~~~~~~~~~~~~~~~~~~~~~~
  CC       libpolkit_gobject_1_la-polkitsystembusname.lo
polkitsystembusname.c: In function 'exists_in_thread_func':
polkitsystembusname.c:284:7: warning: 'g_simple_async_result_set_from_error' is deprecated [-Wdeprecated-declarations]
       g_simple_async_result_set_from_error (res, error);
       ^~~~~~~~~~~~~~~~~~~~~~~~~~~~~~~~~~~~
In file included from /usr/include/glib-2.0/gio/gio.h:117,
                 from polkitsystembusname.h:32,
                 from polkitsystembusname.c:27:
/usr/include/glib-2.0/gio/gsimpleasyncresult.h:113:21: note: declared here
 void                g_simple_async_result_set_from_error   (GSimpleAsyncResult      *simple,
                     ^~~~~~~~~~~~~~~~~~~~~~~~~~~~~~~~~~~~
polkitsystembusname.c: In function 'polkit_system_bus_name_exists':
polkitsystembusname.c:299:3: warning: 'g_simple_async_result_new' is deprecated: Use 'g_task_new' instead [-Wdeprecated-declarations]
   simple = g_simple_async_result_new (G_OBJECT (subject),
   ^~~~~~
In file included from /usr/include/glib-2.0/gio/gio.h:117,
                 from polkitsystembusname.h:32,
                 from polkitsystembusname.c:27:
/usr/include/glib-2.0/gio/gsimpleasyncresult.h:51:21: note: declared here
 GSimpleAsyncResult *g_simple_async_result_new              (GObject                 *source_object,
                     ^~~~~~~~~~~~~~~~~~~~~~~~~
polkitsystembusname.c:303:3: warning: 'g_simple_async_result_run_in_thread' is deprecated [-Wdeprecated-declarations]
   g_simple_async_result_run_in_thread (simple,
   ^~~~~~~~~~~~~~~~~~~~~~~~~~~~~~~~~~~
In file included from /usr/include/glib-2.0/gio/gio.h:117,
                 from polkitsystembusname.h:32,
                 from polkitsystembusname.c:27:
/usr/include/glib-2.0/gio/gsimpleasyncresult.h:108:21: note: declared here
 void                g_simple_async_result_run_in_thread    (GSimpleAsyncResult      *simple,
                     ^~~~~~~~~~~~~~~~~~~~~~~~~~~~~~~~~~~
polkitsystembusname.c: In function 'polkit_system_bus_name_exists_finish':
polkitsystembusname.c:318:3: warning: 'g_simple_async_result_get_source_tag' is deprecated [-Wdeprecated-declarations]
   g_warn_if_fail (g_simple_async_result_get_source_tag (simple) == polkit_system_bus_name_exists);
   ^~~~~~~~~~~~~~
In file included from /usr/include/glib-2.0/gio/gio.h:117,
                 from polkitsystembusname.h:32,
                 from polkitsystembusname.c:27:
/usr/include/glib-2.0/gio/gsimpleasyncresult.h:99:21: note: declared here
 gpointer            g_simple_async_result_get_source_tag   (GSimpleAsyncResult      *simple);
                     ^~~~~~~~~~~~~~~~~~~~~~~~~~~~~~~~~~~~
polkitsystembusname.c:322:3: warning: 'g_simple_async_result_propagate_error' is deprecated [-Wdeprecated-declarations]
   if (g_simple_async_result_propagate_error (simple, error))
   ^~
In file included from /usr/include/glib-2.0/gio/gio.h:117,
                 from polkitsystembusname.h:32,
                 from polkitsystembusname.c:27:
/usr/include/glib-2.0/gio/gsimpleasyncresult.h:119:21: note: declared here
 gboolean            g_simple_async_result_propagate_error  (GSimpleAsyncResult      *simple,
                     ^~~~~~~~~~~~~~~~~~~~~~~~~~~~~~~~~~~~~
polkitsystembusname.c:325:3: warning: 'g_simple_async_result_get_op_res_gboolean' is deprecated [-Wdeprecated-declarations]
   ret = g_simple_async_result_get_op_res_gboolean (simple);
   ^~~
In file included from /usr/include/glib-2.0/gio/gio.h:117,
                 from polkitsystembusname.h:32,
                 from polkitsystembusname.c:27:
/usr/include/glib-2.0/gio/gsimpleasyncresult.h:91:21: note: declared here
 gboolean            g_simple_async_result_get_op_res_gboolean (GSimpleAsyncResult      *simple);
                     ^~~~~~~~~~~~~~~~~~~~~~~~~~~~~~~~~~~~~~~~~
  CC       libpolkit_gobject_1_la-polkitidentity.lo
  CC       libpolkit_gobject_1_la-polkitunixuser.lo
  CC       libpolkit_gobject_1_la-polkitunixgroup.lo
  CC       libpolkit_gobject_1_la-polkitunixnetgroup.lo
  CC       libpolkit_gobject_1_la-polkitauthorizationresult.lo
  CC       libpolkit_gobject_1_la-polkitcheckauthorizationflags.lo
  CC       libpolkit_gobject_1_la-polkitimplicitauthorization.lo
  CC       libpolkit_gobject_1_la-polkittemporaryauthorization.lo
  CC       libpolkit_gobject_1_la-polkitpermission.lo
polkitpermission.c: In function 'acquire_cb':
polkitpermission.c:558:15: warning: 'g_simple_async_result_set_error' is deprecated [-Wdeprecated-declarations]
               g_simple_async_result_set_error (data->simple,
               ^~~~~~~~~~~~~~~~~~~~~~~~~~~~~~~
In file included from /usr/include/glib-2.0/gio/gio.h:117,
                 from polkitpermission.c:30:
/usr/include/glib-2.0/gio/gsimpleasyncresult.h:122:21: note: declared here
 void                g_simple_async_result_set_error        (GSimpleAsyncResult      *simple,
                     ^~~~~~~~~~~~~~~~~~~~~~~~~~~~~~~
polkitpermission.c:566:15: warning: 'g_simple_async_result_set_error' is deprecated [-Wdeprecated-declarations]
               g_simple_async_result_set_error (data->simple,
               ^~~~~~~~~~~~~~~~~~~~~~~~~~~~~~~
In file included from /usr/include/glib-2.0/gio/gio.h:117,
                 from polkitpermission.c:30:
/usr/include/glib-2.0/gio/gsimpleasyncresult.h:122:21: note: declared here
 void                g_simple_async_result_set_error        (GSimpleAsyncResult      *simple,
                     ^~~~~~~~~~~~~~~~~~~~~~~~~~~~~~~
polkitpermission.c:577:7: warning: 'g_simple_async_result_set_from_error' is deprecated [-Wdeprecated-declarations]
       g_simple_async_result_set_from_error (data->simple, error);
       ^~~~~~~~~~~~~~~~~~~~~~~~~~~~~~~~~~~~
In file included from /usr/include/glib-2.0/gio/gio.h:117,
                 from polkitpermission.c:30:
/usr/include/glib-2.0/gio/gsimpleasyncresult.h:113:21: note: declared here
 void                g_simple_async_result_set_from_error   (GSimpleAsyncResult      *simple,
                     ^~~~~~~~~~~~~~~~~~~~~~~~~~~~~~~~~~~~
polkitpermission.c:583:3: warning: 'g_simple_async_result_complete' is deprecated [-Wdeprecated-declarations]
   g_simple_async_result_complete (data->simple);
   ^~~~~~~~~~~~~~~~~~~~~~~~~~~~~~
In file included from /usr/include/glib-2.0/gio/gio.h:117,
                 from polkitpermission.c:30:
/usr/include/glib-2.0/gio/gsimpleasyncresult.h:104:21: note: declared here
 void                g_simple_async_result_complete         (GSimpleAsyncResult      *simple);
                     ^~~~~~~~~~~~~~~~~~~~~~~~~~~~~~
polkitpermission.c: In function 'acquire_async':
polkitpermission.c:598:3: warning: 'g_simple_async_result_new' is deprecated: Use 'g_task_new' instead [-Wdeprecated-declarations]
   data->simple = g_simple_async_result_new (G_OBJECT (permission),
   ^~~~
In file included from /usr/include/glib-2.0/gio/gio.h:117,
                 from polkitpermission.c:30:
/usr/include/glib-2.0/gio/gsimpleasyncresult.h:51:21: note: declared here
 GSimpleAsyncResult *g_simple_async_result_new              (GObject                 *source_object,
                     ^~~~~~~~~~~~~~~~~~~~~~~~~
polkitpermission.c: In function 'acquire_finish':
polkitpermission.c:621:3: warning: 'g_simple_async_result_get_source_tag' is deprecated [-Wdeprecated-declarations]
   g_warn_if_fail (g_simple_async_result_get_source_tag (simple) == acquire_async);
   ^~~~~~~~~~~~~~
In file included from /usr/include/glib-2.0/gio/gio.h:117,
                 from polkitpermission.c:30:
/usr/include/glib-2.0/gio/gsimpleasyncresult.h:99:21: note: declared here
 gpointer            g_simple_async_result_get_source_tag   (GSimpleAsyncResult      *simple);
                     ^~~~~~~~~~~~~~~~~~~~~~~~~~~~~~~~~~~~
polkitpermission.c:623:3: warning: 'g_simple_async_result_propagate_error' is deprecated [-Wdeprecated-declarations]
   if (g_simple_async_result_propagate_error (simple, error))
   ^~
In file included from /usr/include/glib-2.0/gio/gio.h:117,
                 from polkitpermission.c:30:
/usr/include/glib-2.0/gio/gsimpleasyncresult.h:119:21: note: declared here
 gboolean            g_simple_async_result_propagate_error  (GSimpleAsyncResult      *simple,
                     ^~~~~~~~~~~~~~~~~~~~~~~~~~~~~~~~~~~~~
polkitpermission.c: In function 'release_check_cb':
polkitpermission.c:710:7: warning: 'g_simple_async_result_set_from_error' is deprecated [-Wdeprecated-declarations]
       g_simple_async_result_set_from_error (data->simple, error);
       ^~~~~~~~~~~~~~~~~~~~~~~~~~~~~~~~~~~~
In file included from /usr/include/glib-2.0/gio/gio.h:117,
                 from polkitpermission.c:30:
/usr/include/glib-2.0/gio/gsimpleasyncresult.h:113:21: note: declared here
 void                g_simple_async_result_set_from_error   (GSimpleAsyncResult      *simple,
                     ^~~~~~~~~~~~~~~~~~~~~~~~~~~~~~~~~~~~
polkitpermission.c:721:3: warning: 'g_simple_async_result_complete' is deprecated [-Wdeprecated-declarations]
   g_simple_async_result_complete (data->simple);
   ^~~~~~~~~~~~~~~~~~~~~~~~~~~~~~
In file included from /usr/include/glib-2.0/gio/gio.h:117,
                 from polkitpermission.c:30:
/usr/include/glib-2.0/gio/gsimpleasyncresult.h:104:21: note: declared here
 void                g_simple_async_result_complete         (GSimpleAsyncResult      *simple);
                     ^~~~~~~~~~~~~~~~~~~~~~~~~~~~~~
polkitpermission.c: In function 'release_cb':
polkitpermission.c:742:7: warning: 'g_simple_async_result_set_from_error' is deprecated [-Wdeprecated-declarations]
       g_simple_async_result_set_from_error (data->simple, error);
       ^~~~~~~~~~~~~~~~~~~~~~~~~~~~~~~~~~~~
In file included from /usr/include/glib-2.0/gio/gio.h:117,
                 from polkitpermission.c:30:
/usr/include/glib-2.0/gio/gsimpleasyncresult.h:113:21: note: declared here
 void                g_simple_async_result_set_from_error   (GSimpleAsyncResult      *simple,
                     ^~~~~~~~~~~~~~~~~~~~~~~~~~~~~~~~~~~~
polkitpermission.c:747:7: warning: 'g_simple_async_result_complete' is deprecated [-Wdeprecated-declarations]
       g_simple_async_result_complete (data->simple);
       ^~~~~~~~~~~~~~~~~~~~~~~~~~~~~~
In file included from /usr/include/glib-2.0/gio/gio.h:117,
                 from polkitpermission.c:30:
/usr/include/glib-2.0/gio/gsimpleasyncresult.h:104:21: note: declared here
 void                g_simple_async_result_complete         (GSimpleAsyncResult      *simple);
                     ^~~~~~~~~~~~~~~~~~~~~~~~~~~~~~
polkitpermission.c: In function 'release_async':
polkitpermission.c:778:3: warning: 'g_simple_async_result_new' is deprecated: Use 'g_task_new' instead [-Wdeprecated-declarations]
   data->simple = g_simple_async_result_new (G_OBJECT (permission),
   ^~~~
In file included from /usr/include/glib-2.0/gio/gio.h:117,
                 from polkitpermission.c:30:
/usr/include/glib-2.0/gio/gsimpleasyncresult.h:51:21: note: declared here
 GSimpleAsyncResult *g_simple_async_result_new              (GObject                 *source_object,
                     ^~~~~~~~~~~~~~~~~~~~~~~~~
polkitpermission.c:785:7: warning: 'g_simple_async_result_set_error' is deprecated [-Wdeprecated-declarations]
       g_simple_async_result_set_error (data->simple,
       ^~~~~~~~~~~~~~~~~~~~~~~~~~~~~~~
In file included from /usr/include/glib-2.0/gio/gio.h:117,
                 from polkitpermission.c:30:
/usr/include/glib-2.0/gio/gsimpleasyncresult.h:122:21: note: declared here
 void                g_simple_async_result_set_error        (GSimpleAsyncResult      *simple,
                     ^~~~~~~~~~~~~~~~~~~~~~~~~~~~~~~
polkitpermission.c:790:7: warning: 'g_simple_async_result_complete_in_idle' is deprecated [-Wdeprecated-declarations]
       g_simple_async_result_complete_in_idle (data->simple);
       ^~~~~~~~~~~~~~~~~~~~~~~~~~~~~~~~~~~~~~
In file included from /usr/include/glib-2.0/gio/gio.h:117,
                 from polkitpermission.c:30:
/usr/include/glib-2.0/gio/gsimpleasyncresult.h:106:21: note: declared here
 void                g_simple_async_result_complete_in_idle (GSimpleAsyncResult      *simple);
                     ^~~~~~~~~~~~~~~~~~~~~~~~~~~~~~~~~~~~~~
polkitpermission.c: In function 'release_finish':
polkitpermission.c:812:3: warning: 'g_simple_async_result_get_source_tag' is deprecated [-Wdeprecated-declarations]
   g_warn_if_fail (g_simple_async_result_get_source_tag (simple) == release_async);
   ^~~~~~~~~~~~~~
In file included from /usr/include/glib-2.0/gio/gio.h:117,
                 from polkitpermission.c:30:
/usr/include/glib-2.0/gio/gsimpleasyncresult.h:99:21: note: declared here
 gpointer            g_simple_async_result_get_source_tag   (GSimpleAsyncResult      *simple);
                     ^~~~~~~~~~~~~~~~~~~~~~~~~~~~~~~~~~~~
polkitpermission.c:814:3: warning: 'g_simple_async_result_propagate_error' is deprecated [-Wdeprecated-declarations]
   if (g_simple_async_result_propagate_error (simple, error))
   ^~
In file included from /usr/include/glib-2.0/gio/gio.h:117,
                 from polkitpermission.c:30:
/usr/include/glib-2.0/gio/gsimpleasyncresult.h:119:21: note: declared here
 gboolean            g_simple_async_result_propagate_error  (GSimpleAsyncResult      *simple,
                     ^~~~~~~~~~~~~~~~~~~~~~~~~~~~~~~~~~~~~
  CC       libpolkit_gobject_1_la-polkitunixsession-systemd.lo
polkitunixsession-systemd.c: In function 'exists_in_thread_func':
polkitunixsession-systemd.c:388:7: warning: 'g_simple_async_result_set_from_error' is deprecated [-Wdeprecated-declarations]
       g_simple_async_result_set_from_error (res, error);
       ^~~~~~~~~~~~~~~~~~~~~~~~~~~~~~~~~~~~
In file included from /usr/include/glib-2.0/gio/gio.h:117,
                 from polkitunixsession.h:30,
                 from polkitunixsession-systemd.c:28:
/usr/include/glib-2.0/gio/gsimpleasyncresult.h:113:21: note: declared here
 void                g_simple_async_result_set_from_error   (GSimpleAsyncResult      *simple,
                     ^~~~~~~~~~~~~~~~~~~~~~~~~~~~~~~~~~~~
polkitunixsession-systemd.c: In function 'polkit_unix_session_exists':
polkitunixsession-systemd.c:403:3: warning: 'g_simple_async_result_new' is deprecated: Use 'g_task_new' instead [-Wdeprecated-declarations]
   simple = g_simple_async_result_new (G_OBJECT (subject),
   ^~~~~~
In file included from /usr/include/glib-2.0/gio/gio.h:117,
                 from polkitunixsession.h:30,
                 from polkitunixsession-systemd.c:28:
/usr/include/glib-2.0/gio/gsimpleasyncresult.h:51:21: note: declared here
 GSimpleAsyncResult *g_simple_async_result_new              (GObject                 *source_object,
                     ^~~~~~~~~~~~~~~~~~~~~~~~~
polkitunixsession-systemd.c:407:3: warning: 'g_simple_async_result_run_in_thread' is deprecated [-Wdeprecated-declarations]
   g_simple_async_result_run_in_thread (simple,
   ^~~~~~~~~~~~~~~~~~~~~~~~~~~~~~~~~~~
In file included from /usr/include/glib-2.0/gio/gio.h:117,
                 from polkitunixsession.h:30,
                 from polkitunixsession-systemd.c:28:
/usr/include/glib-2.0/gio/gsimpleasyncresult.h:108:21: note: declared here
 void                g_simple_async_result_run_in_thread    (GSimpleAsyncResult      *simple,
                     ^~~~~~~~~~~~~~~~~~~~~~~~~~~~~~~~~~~
polkitunixsession-systemd.c: In function 'polkit_unix_session_exists_finish':
polkitunixsession-systemd.c:422:3: warning: 'g_simple_async_result_get_source_tag' is deprecated [-Wdeprecated-declarations]
   g_warn_if_fail (g_simple_async_result_get_source_tag (simple) == polkit_unix_session_exists);
   ^~~~~~~~~~~~~~
In file included from /usr/include/glib-2.0/gio/gio.h:117,
                 from polkitunixsession.h:30,
                 from polkitunixsession-systemd.c:28:
/usr/include/glib-2.0/gio/gsimpleasyncresult.h:99:21: note: declared here
 gpointer            g_simple_async_result_get_source_tag   (GSimpleAsyncResult      *simple);
                     ^~~~~~~~~~~~~~~~~~~~~~~~~~~~~~~~~~~~
polkitunixsession-systemd.c:426:3: warning: 'g_simple_async_result_propagate_error' is deprecated [-Wdeprecated-declarations]
   if (g_simple_async_result_propagate_error (simple, error))
   ^~
In file included from /usr/include/glib-2.0/gio/gio.h:117,
                 from polkitunixsession.h:30,
                 from polkitunixsession-systemd.c:28:
/usr/include/glib-2.0/gio/gsimpleasyncresult.h:119:21: note: declared here
 gboolean            g_simple_async_result_propagate_error  (GSimpleAsyncResult      *simple,
                     ^~~~~~~~~~~~~~~~~~~~~~~~~~~~~~~~~~~~~
polkitunixsession-systemd.c:429:3: warning: 'g_simple_async_result_get_op_res_gboolean' is deprecated [-Wdeprecated-declarations]
   ret = g_simple_async_result_get_op_res_gboolean (simple);
   ^~~
In file included from /usr/include/glib-2.0/gio/gio.h:117,
                 from polkitunixsession.h:30,
                 from polkitunixsession-systemd.c:28:
/usr/include/glib-2.0/gio/gsimpleasyncresult.h:91:21: note: declared here
 gboolean            g_simple_async_result_get_op_res_gboolean (GSimpleAsyncResult      *simple);
                     ^~~~~~~~~~~~~~~~~~~~~~~~~~~~~~~~~~~~~~~~~
  CCLD     libpolkit-gobject-1.la
  GISCAN   Polkit-1.0.gir
  GICOMP   Polkit-1.0.gir
make[4]: Leaving directory '/usr/src/RPM/BUILD/polkit-0.115/src/polkit'
make[3]: Leaving directory '/usr/src/RPM/BUILD/polkit-0.115/src/polkit'
Making all in polkitbackend
make[3]: Entering directory '/usr/src/RPM/BUILD/polkit-0.115/src/polkitbackend'
./toarray.pl ./init.js init_js > initjs.h
git.mk: Generating .gitignore
make  all-am
make[4]: Entering directory '/usr/src/RPM/BUILD/polkit-0.115/src/polkitbackend'
  CC       libpolkit_backend_1_la-polkitbackendauthority.lo
polkitbackendauthority.c: In function 'polkit_backend_authority_check_authorization':
polkitbackendauthority.c:216:7: warning: 'g_simple_async_result_new_error' is deprecated: Use 'g_task_new' instead [-Wdeprecated-declarations]
       simple = g_simple_async_result_new_error (G_OBJECT (authority),
       ^~~~~~
In file included from /usr/include/glib-2.0/gio/gio.h:117,
                 from ../../src/polkit/polkitactiondescription.h:30,
                 from ../../src/polkit/polkit.h:30,
                 from polkitbackendauthority.c:29:
/usr/include/glib-2.0/gio/gsimpleasyncresult.h:56:21: note: declared here
 GSimpleAsyncResult *g_simple_async_result_new_error        (GObject                 *source_object,
                     ^~~~~~~~~~~~~~~~~~~~~~~~~~~~~~~
polkitbackendauthority.c:222:7: warning: 'g_simple_async_result_complete' is deprecated [-Wdeprecated-declarations]
       g_simple_async_result_complete (simple);
       ^~~~~~~~~~~~~~~~~~~~~~~~~~~~~~
In file included from /usr/include/glib-2.0/gio/gio.h:117,
                 from ../../src/polkit/polkitactiondescription.h:30,
                 from ../../src/polkit/polkit.h:30,
                 from polkitbackendauthority.c:29:
/usr/include/glib-2.0/gio/gsimpleasyncresult.h:104:21: note: declared here
 void                g_simple_async_result_complete         (GSimpleAsyncResult      *simple);
                     ^~~~~~~~~~~~~~~~~~~~~~~~~~~~~~
polkitbackendauthority.c: In function 'polkit_backend_authority_check_authorization_finish':
polkitbackendauthority.c:253:7: warning: 'g_simple_async_result_propagate_error' is deprecated [-Wdeprecated-declarations]
       g_simple_async_result_propagate_error (G_SIMPLE_ASYNC_RESULT (res), error);
       ^~~~~~~~~~~~~~~~~~~~~~~~~~~~~~~~~~~~~
In file included from /usr/include/glib-2.0/gio/gio.h:117,
                 from ../../src/polkit/polkitactiondescription.h:30,
                 from ../../src/polkit/polkit.h:30,
                 from polkitbackendauthority.c:29:
/usr/include/glib-2.0/gio/gsimpleasyncresult.h:119:21: note: declared here
 gboolean            g_simple_async_result_propagate_error  (GSimpleAsyncResult      *simple,
                     ^~~~~~~~~~~~~~~~~~~~~~~~~~~~~~~~~~~~~
  CC       libpolkit_backend_1_la-polkitbackendinteractiveauthority.lo
polkitbackendinteractiveauthority.c: In function 'check_authorization_challenge_cb':
polkitbackendinteractiveauthority.c:737:3: warning: 'g_simple_async_result_set_op_res_gpointer' is deprecated [-Wdeprecated-declarations]
   g_simple_async_result_set_op_res_gpointer (simple,
   ^~~~~~~~~~~~~~~~~~~~~~~~~~~~~~~~~~~~~~~~~
In file included from /usr/include/glib-2.0/gio/gio.h:117,
                 from ../../src/polkit/polkitactiondescription.h:30,
                 from ../../src/polkit/polkit.h:30,
                 from polkitbackendinteractiveauthority.c:35:
/usr/include/glib-2.0/gio/gsimpleasyncresult.h:75:21: note: declared here
 void                g_simple_async_result_set_op_res_gpointer (GSimpleAsyncResult      *simple,
                     ^~~~~~~~~~~~~~~~~~~~~~~~~~~~~~~~~~~~~~~~~
polkitbackendinteractiveauthority.c:740:3: warning: 'g_simple_async_result_complete' is deprecated [-Wdeprecated-declarations]
   g_simple_async_result_complete (simple);
   ^~~~~~~~~~~~~~~~~~~~~~~~~~~~~~
In file included from /usr/include/glib-2.0/gio/gio.h:117,
                 from ../../src/polkit/polkitactiondescription.h:30,
                 from ../../src/polkit/polkit.h:30,
                 from polkitbackendinteractiveauthority.c:35:
/usr/include/glib-2.0/gio/gsimpleasyncresult.h:104:21: note: declared here
 void                g_simple_async_result_complete         (GSimpleAsyncResult      *simple);
                     ^~~~~~~~~~~~~~~~~~~~~~~~~~~~~~
polkitbackendinteractiveauthority.c: In function 'polkit_backend_interactive_authority_check_authorization_finish':
polkitbackendinteractiveauthority.c:760:3: warning: 'g_simple_async_result_get_source_tag' is deprecated [-Wdeprecated-declarations]
   g_warn_if_fail (g_simple_async_result_get_source_tag (simple) == polkit_backend_interactive_authority_check_authorization);
   ^~~~~~~~~~~~~~
In file included from /usr/include/glib-2.0/gio/gio.h:117,
                 from ../../src/polkit/polkitactiondescription.h:30,
                 from ../../src/polkit/polkit.h:30,
                 from polkitbackendinteractiveauthority.c:35:
/usr/include/glib-2.0/gio/gsimpleasyncresult.h:99:21: note: declared here
 gpointer            g_simple_async_result_get_source_tag   (GSimpleAsyncResult      *simple);
                     ^~~~~~~~~~~~~~~~~~~~~~~~~~~~~~~~~~~~
polkitbackendinteractiveauthority.c:764:3: warning: 'g_simple_async_result_propagate_error' is deprecated [-Wdeprecated-declarations]
   if (g_simple_async_result_propagate_error (simple, error))
   ^~
In file included from /usr/include/glib-2.0/gio/gio.h:117,
                 from ../../src/polkit/polkitactiondescription.h:30,
                 from ../../src/polkit/polkit.h:30,
                 from polkitbackendinteractiveauthority.c:35:
/usr/include/glib-2.0/gio/gsimpleasyncresult.h:119:21: note: declared here
 gboolean            g_simple_async_result_propagate_error  (GSimpleAsyncResult      *simple,
                     ^~~~~~~~~~~~~~~~~~~~~~~~~~~~~~~~~~~~~
polkitbackendinteractiveauthority.c:767:3: warning: 'g_simple_async_result_get_op_res_gpointer' is deprecated [-Wdeprecated-declarations]
   result = g_object_ref (g_simple_async_result_get_op_res_gpointer (simple));
   ^~~~~~
In file included from /usr/include/glib-2.0/gio/gio.h:117,
                 from ../../src/polkit/polkitactiondescription.h:30,
                 from ../../src/polkit/polkit.h:30,
                 from polkitbackendinteractiveauthority.c:35:
/usr/include/glib-2.0/gio/gsimpleasyncresult.h:79:21: note: declared here
 gpointer            g_simple_async_result_get_op_res_gpointer (GSimpleAsyncResult      *simple);
                     ^~~~~~~~~~~~~~~~~~~~~~~~~~~~~~~~~~~~~~~~~
polkitbackendinteractiveauthority.c:767:3: warning: 'g_simple_async_result_get_op_res_gpointer' is deprecated [-Wdeprecated-declarations]
   result = g_object_ref (g_simple_async_result_get_op_res_gpointer (simple));
   ^~~~~~
In file included from /usr/include/glib-2.0/gio/gio.h:117,
                 from ../../src/polkit/polkitactiondescription.h:30,
                 from ../../src/polkit/polkit.h:30,
                 from polkitbackendinteractiveauthority.c:35:
/usr/include/glib-2.0/gio/gsimpleasyncresult.h:79:21: note: declared here
 gpointer            g_simple_async_result_get_op_res_gpointer (GSimpleAsyncResult      *simple);
                     ^~~~~~~~~~~~~~~~~~~~~~~~~~~~~~~~~~~~~~~~~
polkitbackendinteractiveauthority.c: In function 'polkit_backend_interactive_authority_check_authorization':
polkitbackendinteractiveauthority.c:868:3: warning: 'g_simple_async_result_new' is deprecated: Use 'g_task_new' instead [-Wdeprecated-declarations]
   simple = g_simple_async_result_new (G_OBJECT (authority),
   ^~~~~~
In file included from /usr/include/glib-2.0/gio/gio.h:117,
                 from ../../src/polkit/polkitactiondescription.h:30,
                 from ../../src/polkit/polkit.h:30,
                 from polkitbackendinteractiveauthority.c:35:
/usr/include/glib-2.0/gio/gsimpleasyncresult.h:51:21: note: declared here
 GSimpleAsyncResult *g_simple_async_result_new              (GObject                 *source_object,
                     ^~~~~~~~~~~~~~~~~~~~~~~~~
polkitbackendinteractiveauthority.c:896:7: warning: 'g_simple_async_result_set_from_error' is deprecated [-Wdeprecated-declarations]
       g_simple_async_result_set_from_error (simple, error);
       ^~~~~~~~~~~~~~~~~~~~~~~~~~~~~~~~~~~~
In file included from /usr/include/glib-2.0/gio/gio.h:117,
                 from ../../src/polkit/polkitactiondescription.h:30,
                 from ../../src/polkit/polkit.h:30,
                 from polkitbackendinteractiveauthority.c:35:
/usr/include/glib-2.0/gio/gsimpleasyncresult.h:113:21: note: declared here
 void                g_simple_async_result_set_from_error   (GSimpleAsyncResult      *simple,
                     ^~~~~~~~~~~~~~~~~~~~~~~~~~~~~~~~~~~~
polkitbackendinteractiveauthority.c:897:7: warning: 'g_simple_async_result_complete' is deprecated [-Wdeprecated-declarations]
       g_simple_async_result_complete (simple);
       ^~~~~~~~~~~~~~~~~~~~~~~~~~~~~~
In file included from /usr/include/glib-2.0/gio/gio.h:117,
                 from ../../src/polkit/polkitactiondescription.h:30,
                 from ../../src/polkit/polkit.h:30,
                 from polkitbackendinteractiveauthority.c:35:
/usr/include/glib-2.0/gio/gsimpleasyncresult.h:104:21: note: declared here
 void                g_simple_async_result_complete         (GSimpleAsyncResult      *simple);
                     ^~~~~~~~~~~~~~~~~~~~~~~~~~~~~~
polkitbackendinteractiveauthority.c:911:7: warning: 'g_simple_async_result_set_from_error' is deprecated [-Wdeprecated-declarations]
       g_simple_async_result_set_from_error (simple, error);
       ^~~~~~~~~~~~~~~~~~~~~~~~~~~~~~~~~~~~
In file included from /usr/include/glib-2.0/gio/gio.h:117,
                 from ../../src/polkit/polkitactiondescription.h:30,
                 from ../../src/polkit/polkit.h:30,
                 from polkitbackendinteractiveauthority.c:35:
/usr/include/glib-2.0/gio/gsimpleasyncresult.h:113:21: note: declared here
 void                g_simple_async_result_set_from_error   (GSimpleAsyncResult      *simple,
                     ^~~~~~~~~~~~~~~~~~~~~~~~~~~~~~~~~~~~
polkitbackendinteractiveauthority.c:912:7: warning: 'g_simple_async_result_complete' is deprecated [-Wdeprecated-declarations]
       g_simple_async_result_complete (simple);
       ^~~~~~~~~~~~~~~~~~~~~~~~~~~~~~
In file included from /usr/include/glib-2.0/gio/gio.h:117,
                 from ../../src/polkit/polkitactiondescription.h:30,
                 from ../../src/polkit/polkit.h:30,
                 from polkitbackendinteractiveauthority.c:35:
/usr/include/glib-2.0/gio/gsimpleasyncresult.h:104:21: note: declared here
 void                g_simple_async_result_complete         (GSimpleAsyncResult      *simple);
                     ^~~~~~~~~~~~~~~~~~~~~~~~~~~~~~
polkitbackendinteractiveauthority.c:956:15: warning: 'g_simple_async_result_set_error' is deprecated [-Wdeprecated-declarations]
               g_simple_async_result_set_error (simple,
               ^~~~~~~~~~~~~~~~~~~~~~~~~~~~~~~
In file included from /usr/include/glib-2.0/gio/gio.h:117,
                 from ../../src/polkit/polkitactiondescription.h:30,
                 from ../../src/polkit/polkit.h:30,
                 from polkitbackendinteractiveauthority.c:35:
/usr/include/glib-2.0/gio/gsimpleasyncresult.h:122:21: note: declared here
 void                g_simple_async_result_set_error        (GSimpleAsyncResult      *simple,
                     ^~~~~~~~~~~~~~~~~~~~~~~~~~~~~~~
polkitbackendinteractiveauthority.c:964:15: warning: 'g_simple_async_result_set_error' is deprecated [-Wdeprecated-declarations]
               g_simple_async_result_set_error (simple,
               ^~~~~~~~~~~~~~~~~~~~~~~~~~~~~~~
In file included from /usr/include/glib-2.0/gio/gio.h:117,
                 from ../../src/polkit/polkitactiondescription.h:30,
                 from ../../src/polkit/polkit.h:30,
                 from polkitbackendinteractiveauthority.c:35:
/usr/include/glib-2.0/gio/gsimpleasyncresult.h:122:21: note: declared here
 void                g_simple_async_result_set_error        (GSimpleAsyncResult      *simple,
                     ^~~~~~~~~~~~~~~~~~~~~~~~~~~~~~~
polkitbackendinteractiveauthority.c:970:11: warning: 'g_simple_async_result_complete' is deprecated [-Wdeprecated-declarations]
           g_simple_async_result_complete (simple);
           ^~~~~~~~~~~~~~~~~~~~~~~~~~~~~~
In file included from /usr/include/glib-2.0/gio/gio.h:117,
                 from ../../src/polkit/polkitactiondescription.h:30,
                 from ../../src/polkit/polkit.h:30,
                 from polkitbackendinteractiveauthority.c:35:
/usr/include/glib-2.0/gio/gsimpleasyncresult.h:104:21: note: declared here
 void                g_simple_async_result_complete         (GSimpleAsyncResult      *simple);
                     ^~~~~~~~~~~~~~~~~~~~~~~~~~~~~~
polkitbackendinteractiveauthority.c:988:7: warning: 'g_simple_async_result_set_from_error' is deprecated [-Wdeprecated-declarations]
       g_simple_async_result_set_from_error (simple, error);
       ^~~~~~~~~~~~~~~~~~~~~~~~~~~~~~~~~~~~
In file included from /usr/include/glib-2.0/gio/gio.h:117,
                 from ../../src/polkit/polkitactiondescription.h:30,
                 from ../../src/polkit/polkit.h:30,
                 from polkitbackendinteractiveauthority.c:35:
/usr/include/glib-2.0/gio/gsimpleasyncresult.h:113:21: note: declared here
 void                g_simple_async_result_set_from_error   (GSimpleAsyncResult      *simple,
                     ^~~~~~~~~~~~~~~~~~~~~~~~~~~~~~~~~~~~
polkitbackendinteractiveauthority.c:989:7: warning: 'g_simple_async_result_complete' is deprecated [-Wdeprecated-declarations]
       g_simple_async_result_complete (simple);
       ^~~~~~~~~~~~~~~~~~~~~~~~~~~~~~
In file included from /usr/include/glib-2.0/gio/gio.h:117,
                 from ../../src/polkit/polkitactiondescription.h:30,
                 from ../../src/polkit/polkit.h:30,
                 from polkitbackendinteractiveauthority.c:35:
/usr/include/glib-2.0/gio/gsimpleasyncresult.h:104:21: note: declared here
 void                g_simple_async_result_complete         (GSimpleAsyncResult      *simple);
                     ^~~~~~~~~~~~~~~~~~~~~~~~~~~~~~
polkitbackendinteractiveauthority.c:1029:3: warning: 'g_simple_async_result_set_op_res_gpointer' is deprecated [-Wdeprecated-declarations]
   g_simple_async_result_set_op_res_gpointer (simple,
   ^~~~~~~~~~~~~~~~~~~~~~~~~~~~~~~~~~~~~~~~~
In file included from /usr/include/glib-2.0/gio/gio.h:117,
                 from ../../src/polkit/polkitactiondescription.h:30,
                 from ../../src/polkit/polkit.h:30,
                 from polkitbackendinteractiveauthority.c:35:
/usr/include/glib-2.0/gio/gsimpleasyncresult.h:75:21: note: declared here
 void                g_simple_async_result_set_op_res_gpointer (GSimpleAsyncResult      *simple,
                     ^~~~~~~~~~~~~~~~~~~~~~~~~~~~~~~~~~~~~~~~~
polkitbackendinteractiveauthority.c:1032:3: warning: 'g_simple_async_result_complete' is deprecated [-Wdeprecated-declarations]
   g_simple_async_result_complete (simple);
   ^~~~~~~~~~~~~~~~~~~~~~~~~~~~~~
In file included from /usr/include/glib-2.0/gio/gio.h:117,
                 from ../../src/polkit/polkitactiondescription.h:30,
                 from ../../src/polkit/polkit.h:30,
                 from polkitbackendinteractiveauthority.c:35:
/usr/include/glib-2.0/gio/gsimpleasyncresult.h:104:21: note: declared here
 void                g_simple_async_result_complete         (GSimpleAsyncResult      *simple);
                     ^~~~~~~~~~~~~~~~~~~~~~~~~~~~~~
  CXX      libpolkit_backend_1_la-polkitbackendjsauthority.lo
polkitbackendjsauthority.cpp: In function 'void utils_on_cancelled(GCancellable*, gpointer)':
polkitbackendjsauthority.cpp:1668:56: warning: 'void g_simple_async_result_take_error(GSimpleAsyncResult*, GError*)' is deprecated [-Wdeprecated-declarations]
   g_simple_async_result_take_error (data->simple, error);
                                                        ^
In file included from /usr/include/glib-2.0/gio/gio.h:117,
                 from ../../src/polkit/polkitactiondescription.h:30,
                 from ../../src/polkit/polkit.h:30,
                 from polkitbackendjsauthority.cpp:37:
/usr/include/glib-2.0/gio/gsimpleasyncresult.h:116:21: note: declared here
 void                g_simple_async_result_take_error       (GSimpleAsyncResult      *simple,
                     ^~~~~~~~~~~~~~~~~~~~~~~~~~~~~~~~
polkitbackendjsauthority.cpp:1668:56: warning: 'void g_simple_async_result_take_error(GSimpleAsyncResult*, GError*)' is deprecated [-Wdeprecated-declarations]
   g_simple_async_result_take_error (data->simple, error);
                                                        ^
In file included from /usr/include/glib-2.0/gio/gio.h:117,
                 from ../../src/polkit/polkitactiondescription.h:30,
                 from ../../src/polkit/polkit.h:30,
                 from polkitbackendjsauthority.cpp:37:
/usr/include/glib-2.0/gio/gsimpleasyncresult.h:116:21: note: declared here
 void                g_simple_async_result_take_error       (GSimpleAsyncResult      *simple,
                     ^~~~~~~~~~~~~~~~~~~~~~~~~~~~~~~~
polkitbackendjsauthority.cpp:1669:55: warning: 'void g_simple_async_result_complete_in_idle(GSimpleAsyncResult*)' is deprecated [-Wdeprecated-declarations]
   g_simple_async_result_complete_in_idle (data->simple);
                                                       ^
In file included from /usr/include/glib-2.0/gio/gio.h:117,
                 from ../../src/polkit/polkitactiondescription.h:30,
                 from ../../src/polkit/polkit.h:30,
                 from polkitbackendjsauthority.cpp:37:
/usr/include/glib-2.0/gio/gsimpleasyncresult.h:106:21: note: declared here
 void                g_simple_async_result_complete_in_idle (GSimpleAsyncResult      *simple);
                     ^~~~~~~~~~~~~~~~~~~~~~~~~~~~~~~~~~~~~~
polkitbackendjsauthority.cpp:1669:55: warning: 'void g_simple_async_result_complete_in_idle(GSimpleAsyncResult*)' is deprecated [-Wdeprecated-declarations]
   g_simple_async_result_complete_in_idle (data->simple);
                                                       ^
In file included from /usr/include/glib-2.0/gio/gio.h:117,
                 from ../../src/polkit/polkitactiondescription.h:30,
                 from ../../src/polkit/polkit.h:30,
                 from polkitbackendjsauthority.cpp:37:
/usr/include/glib-2.0/gio/gsimpleasyncresult.h:106:21: note: declared here
 void                g_simple_async_result_complete_in_idle (GSimpleAsyncResult      *simple);
                     ^~~~~~~~~~~~~~~~~~~~~~~~~~~~~~~~~~~~~~
polkitbackendjsauthority.cpp: In function 'void utils_child_watch_cb(GPid, gint, gpointer)':
polkitbackendjsauthority.cpp:1728:55: warning: 'void g_simple_async_result_complete_in_idle(GSimpleAsyncResult*)' is deprecated [-Wdeprecated-declarations]
   g_simple_async_result_complete_in_idle (data->simple);
                                                       ^
In file included from /usr/include/glib-2.0/gio/gio.h:117,
                 from ../../src/polkit/polkitactiondescription.h:30,
                 from ../../src/polkit/polkit.h:30,
                 from polkitbackendjsauthority.cpp:37:
/usr/include/glib-2.0/gio/gsimpleasyncresult.h:106:21: note: declared here
 void                g_simple_async_result_complete_in_idle (GSimpleAsyncResult      *simple);
                     ^~~~~~~~~~~~~~~~~~~~~~~~~~~~~~~~~~~~~~
polkitbackendjsauthority.cpp:1728:55: warning: 'void g_simple_async_result_complete_in_idle(GSimpleAsyncResult*)' is deprecated [-Wdeprecated-declarations]
   g_simple_async_result_complete_in_idle (data->simple);
                                                       ^
In file included from /usr/include/glib-2.0/gio/gio.h:117,
                 from ../../src/polkit/polkitactiondescription.h:30,
                 from ../../src/polkit/polkit.h:30,
                 from polkitbackendjsauthority.cpp:37:
/usr/include/glib-2.0/gio/gsimpleasyncresult.h:106:21: note: declared here
 void                g_simple_async_result_complete_in_idle (GSimpleAsyncResult      *simple);
                     ^~~~~~~~~~~~~~~~~~~~~~~~~~~~~~~~~~~~~~
polkitbackendjsauthority.cpp: In function 'gboolean utils_timeout_cb(gpointer)':
polkitbackendjsauthority.cpp:1743:55: warning: 'void g_simple_async_result_complete_in_idle(GSimpleAsyncResult*)' is deprecated [-Wdeprecated-declarations]
   g_simple_async_result_complete_in_idle (data->simple);
                                                       ^
In file included from /usr/include/glib-2.0/gio/gio.h:117,
                 from ../../src/polkit/polkitactiondescription.h:30,
                 from ../../src/polkit/polkit.h:30,
                 from polkitbackendjsauthority.cpp:37:
/usr/include/glib-2.0/gio/gsimpleasyncresult.h:106:21: note: declared here
 void                g_simple_async_result_complete_in_idle (GSimpleAsyncResult      *simple);
                     ^~~~~~~~~~~~~~~~~~~~~~~~~~~~~~~~~~~~~~
polkitbackendjsauthority.cpp:1743:55: warning: 'void g_simple_async_result_complete_in_idle(GSimpleAsyncResult*)' is deprecated [-Wdeprecated-declarations]
   g_simple_async_result_complete_in_idle (data->simple);
                                                       ^
In file included from /usr/include/glib-2.0/gio/gio.h:117,
                 from ../../src/polkit/polkitactiondescription.h:30,
                 from ../../src/polkit/polkit.h:30,
                 from polkitbackendjsauthority.cpp:37:
/usr/include/glib-2.0/gio/gsimpleasyncresult.h:106:21: note: declared here
 void                g_simple_async_result_complete_in_idle (GSimpleAsyncResult      *simple);
                     ^~~~~~~~~~~~~~~~~~~~~~~~~~~~~~~~~~~~~~
polkitbackendjsauthority.cpp: In function 'void utils_spawn(const gchar* const*, guint, GCancellable*, GAsyncReadyCallback, gpointer)':
polkitbackendjsauthority.cpp:1764:67: warning: 'GSimpleAsyncResult* g_simple_async_result_new(GObject*, GAsyncReadyCallback, gpointer, gpointer)' is deprecated: Use 'g_task_new' instead [-Wdeprecated-declarations]
                                             (gpointer*)utils_spawn);
                                                                   ^
In file included from /usr/include/glib-2.0/gio/gio.h:117,
                 from ../../src/polkit/polkitactiondescription.h:30,
                 from ../../src/polkit/polkit.h:30,
                 from polkitbackendjsauthority.cpp:37:
/usr/include/glib-2.0/gio/gsimpleasyncresult.h:51:21: note: declared here
 GSimpleAsyncResult *g_simple_async_result_new              (GObject                 *source_object,
                     ^~~~~~~~~~~~~~~~~~~~~~~~~
polkitbackendjsauthority.cpp:1764:67: warning: 'GSimpleAsyncResult* g_simple_async_result_new(GObject*, GAsyncReadyCallback, gpointer, gpointer)' is deprecated: Use 'g_task_new' instead [-Wdeprecated-declarations]
                                             (gpointer*)utils_spawn);
                                                                   ^
In file included from /usr/include/glib-2.0/gio/gio.h:117,
                 from ../../src/polkit/polkitactiondescription.h:30,
                 from ../../src/polkit/polkit.h:30,
                 from polkitbackendjsauthority.cpp:37:
/usr/include/glib-2.0/gio/gsimpleasyncresult.h:51:21: note: declared here
 GSimpleAsyncResult *g_simple_async_result_new              (GObject                 *source_object,
                     ^~~~~~~~~~~~~~~~~~~~~~~~~
polkitbackendjsauthority.cpp:1777:104: warning: 'void g_simple_async_result_set_op_res_gpointer(GSimpleAsyncResult*, gpointer, GDestroyNotify)' is deprecated [-Wdeprecated-declarations]
   g_simple_async_result_set_op_res_gpointer (data->simple, data, (GDestroyNotify) utils_spawn_data_free);
                                                                                                        ^
In file included from /usr/include/glib-2.0/gio/gio.h:117,
                 from ../../src/polkit/polkitactiondescription.h:30,
                 from ../../src/polkit/polkit.h:30,
                 from polkitbackendjsauthority.cpp:37:
/usr/include/glib-2.0/gio/gsimpleasyncresult.h:75:21: note: declared here
 void                g_simple_async_result_set_op_res_gpointer (GSimpleAsyncResult      *simple,
                     ^~~~~~~~~~~~~~~~~~~~~~~~~~~~~~~~~~~~~~~~~
polkitbackendjsauthority.cpp:1777:104: warning: 'void g_simple_async_result_set_op_res_gpointer(GSimpleAsyncResult*, gpointer, GDestroyNotify)' is deprecated [-Wdeprecated-declarations]
   g_simple_async_result_set_op_res_gpointer (data->simple, data, (GDestroyNotify) utils_spawn_data_free);
                                                                                                        ^
In file included from /usr/include/glib-2.0/gio/gio.h:117,
                 from ../../src/polkit/polkitactiondescription.h:30,
                 from ../../src/polkit/polkit.h:30,
                 from polkitbackendjsauthority.cpp:37:
/usr/include/glib-2.0/gio/gsimpleasyncresult.h:75:21: note: declared here
 void                g_simple_async_result_set_op_res_gpointer (GSimpleAsyncResult      *simple,
                     ^~~~~~~~~~~~~~~~~~~~~~~~~~~~~~~~~~~~~~~~~
polkitbackendjsauthority.cpp:1786:64: warning: 'void g_simple_async_result_take_error(GSimpleAsyncResult*, GError*)' is deprecated [-Wdeprecated-declarations]
           g_simple_async_result_take_error (data->simple, error);
                                                                ^
In file included from /usr/include/glib-2.0/gio/gio.h:117,
                 from ../../src/polkit/polkitactiondescription.h:30,
                 from ../../src/polkit/polkit.h:30,
                 from polkitbackendjsauthority.cpp:37:
/usr/include/glib-2.0/gio/gsimpleasyncresult.h:116:21: note: declared here
 void                g_simple_async_result_take_error       (GSimpleAsyncResult      *simple,
                     ^~~~~~~~~~~~~~~~~~~~~~~~~~~~~~~~
polkitbackendjsauthority.cpp:1786:64: warning: 'void g_simple_async_result_take_error(GSimpleAsyncResult*, GError*)' is deprecated [-Wdeprecated-declarations]
           g_simple_async_result_take_error (data->simple, error);
                                                                ^
In file included from /usr/include/glib-2.0/gio/gio.h:117,
                 from ../../src/polkit/polkitactiondescription.h:30,
                 from ../../src/polkit/polkit.h:30,
                 from polkitbackendjsauthority.cpp:37:
/usr/include/glib-2.0/gio/gsimpleasyncresult.h:116:21: note: declared here
 void                g_simple_async_result_take_error       (GSimpleAsyncResult      *simple,
                     ^~~~~~~~~~~~~~~~~~~~~~~~~~~~~~~~
polkitbackendjsauthority.cpp:1787:63: warning: 'void g_simple_async_result_complete_in_idle(GSimpleAsyncResult*)' is deprecated [-Wdeprecated-declarations]
           g_simple_async_result_complete_in_idle (data->simple);
                                                               ^
In file included from /usr/include/glib-2.0/gio/gio.h:117,
                 from ../../src/polkit/polkitactiondescription.h:30,
                 from ../../src/polkit/polkit.h:30,
                 from polkitbackendjsauthority.cpp:37:
/usr/include/glib-2.0/gio/gsimpleasyncresult.h:106:21: note: declared here
 void                g_simple_async_result_complete_in_idle (GSimpleAsyncResult      *simple);
                     ^~~~~~~~~~~~~~~~~~~~~~~~~~~~~~~~~~~~~~
polkitbackendjsauthority.cpp:1787:63: warning: 'void g_simple_async_result_complete_in_idle(GSimpleAsyncResult*)' is deprecated [-Wdeprecated-declarations]
           g_simple_async_result_complete_in_idle (data->simple);
                                                               ^
In file included from /usr/include/glib-2.0/gio/gio.h:117,
                 from ../../src/polkit/polkitactiondescription.h:30,
                 from ../../src/polkit/polkit.h:30,
                 from polkitbackendjsauthority.cpp:37:
/usr/include/glib-2.0/gio/gsimpleasyncresult.h:106:21: note: declared here
 void                g_simple_async_result_complete_in_idle (GSimpleAsyncResult      *simple);
                     ^~~~~~~~~~~~~~~~~~~~~~~~~~~~~~~~~~~~~~
polkitbackendjsauthority.cpp:1812:60: warning: 'void g_simple_async_result_take_error(GSimpleAsyncResult*, GError*)' is deprecated [-Wdeprecated-declarations]
       g_simple_async_result_take_error (data->simple, error);
                                                            ^
In file included from /usr/include/glib-2.0/gio/gio.h:117,
                 from ../../src/polkit/polkitactiondescription.h:30,
                 from ../../src/polkit/polkit.h:30,
                 from polkitbackendjsauthority.cpp:37:
/usr/include/glib-2.0/gio/gsimpleasyncresult.h:116:21: note: declared here
 void                g_simple_async_result_take_error       (GSimpleAsyncResult      *simple,
                     ^~~~~~~~~~~~~~~~~~~~~~~~~~~~~~~~
polkitbackendjsauthority.cpp:1812:60: warning: 'void g_simple_async_result_take_error(GSimpleAsyncResult*, GError*)' is deprecated [-Wdeprecated-declarations]
       g_simple_async_result_take_error (data->simple, error);
                                                            ^
In file included from /usr/include/glib-2.0/gio/gio.h:117,
                 from ../../src/polkit/polkitactiondescription.h:30,
                 from ../../src/polkit/polkit.h:30,
                 from polkitbackendjsauthority.cpp:37:
/usr/include/glib-2.0/gio/gsimpleasyncresult.h:116:21: note: declared here
 void                g_simple_async_result_take_error       (GSimpleAsyncResult      *simple,
                     ^~~~~~~~~~~~~~~~~~~~~~~~~~~~~~~~
polkitbackendjsauthority.cpp:1813:59: warning: 'void g_simple_async_result_complete_in_idle(GSimpleAsyncResult*)' is deprecated [-Wdeprecated-declarations]
       g_simple_async_result_complete_in_idle (data->simple);
                                                           ^
In file included from /usr/include/glib-2.0/gio/gio.h:117,
                 from ../../src/polkit/polkitactiondescription.h:30,
                 from ../../src/polkit/polkit.h:30,
                 from polkitbackendjsauthority.cpp:37:
/usr/include/glib-2.0/gio/gsimpleasyncresult.h:106:21: note: declared here
 void                g_simple_async_result_complete_in_idle (GSimpleAsyncResult      *simple);
                     ^~~~~~~~~~~~~~~~~~~~~~~~~~~~~~~~~~~~~~
polkitbackendjsauthority.cpp:1813:59: warning: 'void g_simple_async_result_complete_in_idle(GSimpleAsyncResult*)' is deprecated [-Wdeprecated-declarations]
       g_simple_async_result_complete_in_idle (data->simple);
                                                           ^
In file included from /usr/include/glib-2.0/gio/gio.h:117,
                 from ../../src/polkit/polkitactiondescription.h:30,
                 from ../../src/polkit/polkit.h:30,
                 from polkitbackendjsauthority.cpp:37:
/usr/include/glib-2.0/gio/gsimpleasyncresult.h:106:21: note: declared here
 void                g_simple_async_result_complete_in_idle (GSimpleAsyncResult      *simple);
                     ^~~~~~~~~~~~~~~~~~~~~~~~~~~~~~~~~~~~~~
In file included from /usr/lib64/glib-2.0/include/glibconfig.h:9,
                 from /usr/include/glib-2.0/glib/gtypes.h:32,
                 from /usr/include/glib-2.0/glib/galloca.h:32,
                 from /usr/include/glib-2.0/glib.h:30,
                 from /usr/include/glib-2.0/glib/gprintf.h:21,
                 from /usr/include/glib-2.0/glib/gstdio.h:22,
                 from polkitbackendjsauthority.cpp:33:
polkitbackendjsauthority.cpp: In function 'gboolean utils_spawn_finish(GAsyncResult*, gint*, gchar**, gchar**, GError**)':
polkitbackendjsauthority.cpp:1864:63: warning: 'void* g_simple_async_result_get_source_tag(GSimpleAsyncResult*)' is deprecated [-Wdeprecated-declarations]
   g_warn_if_fail (g_simple_async_result_get_source_tag (simple) == utils_spawn);
                                                               ^
/usr/include/glib-2.0/glib/gmacros.h:418:8: note: in definition of macro '_G_BOOLEAN_EXPR'
    if (expr)                                    \
        ^~~~
/usr/include/glib-2.0/glib/gmessages.h:497:8: note: in expansion of macro 'G_LIKELY'
     if G_LIKELY (expr) ; \
        ^~~~~~~~
polkitbackendjsauthority.cpp:1864:3: note: in expansion of macro 'g_warn_if_fail'
   g_warn_if_fail (g_simple_async_result_get_source_tag (simple) == utils_spawn);
   ^~~~~~~~~~~~~~
In file included from /usr/include/glib-2.0/gio/gio.h:117,
                 from ../../src/polkit/polkitactiondescription.h:30,
                 from ../../src/polkit/polkit.h:30,
                 from polkitbackendjsauthority.cpp:37:
/usr/include/glib-2.0/gio/gsimpleasyncresult.h:99:21: note: declared here
 gpointer            g_simple_async_result_get_source_tag   (GSimpleAsyncResult      *simple);
                     ^~~~~~~~~~~~~~~~~~~~~~~~~~~~~~~~~~~~
In file included from /usr/lib64/glib-2.0/include/glibconfig.h:9,
                 from /usr/include/glib-2.0/glib/gtypes.h:32,
                 from /usr/include/glib-2.0/glib/galloca.h:32,
                 from /usr/include/glib-2.0/glib.h:30,
                 from /usr/include/glib-2.0/glib/gprintf.h:21,
                 from /usr/include/glib-2.0/glib/gstdio.h:22,
                 from polkitbackendjsauthority.cpp:33:
polkitbackendjsauthority.cpp:1864:63: warning: 'void* g_simple_async_result_get_source_tag(GSimpleAsyncResult*)' is deprecated [-Wdeprecated-declarations]
   g_warn_if_fail (g_simple_async_result_get_source_tag (simple) == utils_spawn);
                                                               ^
/usr/include/glib-2.0/glib/gmacros.h:418:8: note: in definition of macro '_G_BOOLEAN_EXPR'
    if (expr)                                    \
        ^~~~
/usr/include/glib-2.0/glib/gmessages.h:497:8: note: in expansion of macro 'G_LIKELY'
     if G_LIKELY (expr) ; \
        ^~~~~~~~
polkitbackendjsauthority.cpp:1864:3: note: in expansion of macro 'g_warn_if_fail'
   g_warn_if_fail (g_simple_async_result_get_source_tag (simple) == utils_spawn);
   ^~~~~~~~~~~~~~
In file included from /usr/include/glib-2.0/gio/gio.h:117,
                 from ../../src/polkit/polkitactiondescription.h:30,
                 from ../../src/polkit/polkit.h:30,
                 from polkitbackendjsauthority.cpp:37:
/usr/include/glib-2.0/gio/gsimpleasyncresult.h:99:21: note: declared here
 gpointer            g_simple_async_result_get_source_tag   (GSimpleAsyncResult      *simple);
                     ^~~~~~~~~~~~~~~~~~~~~~~~~~~~~~~~~~~~
polkitbackendjsauthority.cpp:1866:59: warning: 'gboolean g_simple_async_result_propagate_error(GSimpleAsyncResult*, GError**)' is deprecated [-Wdeprecated-declarations]
   if (g_simple_async_result_propagate_error (simple, error))
                                                           ^
In file included from /usr/include/glib-2.0/gio/gio.h:117,
                 from ../../src/polkit/polkitactiondescription.h:30,
                 from ../../src/polkit/polkit.h:30,
                 from polkitbackendjsauthority.cpp:37:
/usr/include/glib-2.0/gio/gsimpleasyncresult.h:119:21: note: declared here
 gboolean            g_simple_async_result_propagate_error  (GSimpleAsyncResult      *simple,
                     ^~~~~~~~~~~~~~~~~~~~~~~~~~~~~~~~~~~~~
polkitbackendjsauthority.cpp:1866:59: warning: 'gboolean g_simple_async_result_propagate_error(GSimpleAsyncResult*, GError**)' is deprecated [-Wdeprecated-declarations]
   if (g_simple_async_result_propagate_error (simple, error))
                                                           ^
In file included from /usr/include/glib-2.0/gio/gio.h:117,
                 from ../../src/polkit/polkitactiondescription.h:30,
                 from ../../src/polkit/polkit.h:30,
                 from polkitbackendjsauthority.cpp:37:
/usr/include/glib-2.0/gio/gsimpleasyncresult.h:119:21: note: declared here
 gboolean            g_simple_async_result_propagate_error  (GSimpleAsyncResult      *simple,
                     ^~~~~~~~~~~~~~~~~~~~~~~~~~~~~~~~~~~~~
polkitbackendjsauthority.cpp:1869:76: warning: 'void* g_simple_async_result_get_op_res_gpointer(GSimpleAsyncResult*)' is deprecated [-Wdeprecated-declarations]
   data = (UtilsSpawnData*)g_simple_async_result_get_op_res_gpointer (simple);
                                                                            ^
In file included from /usr/include/glib-2.0/gio/gio.h:117,
                 from ../../src/polkit/polkitactiondescription.h:30,
                 from ../../src/polkit/polkit.h:30,
                 from polkitbackendjsauthority.cpp:37:
/usr/include/glib-2.0/gio/gsimpleasyncresult.h:79:21: note: declared here
 gpointer            g_simple_async_result_get_op_res_gpointer (GSimpleAsyncResult      *simple);
                     ^~~~~~~~~~~~~~~~~~~~~~~~~~~~~~~~~~~~~~~~~
polkitbackendjsauthority.cpp:1869:76: warning: 'void* g_simple_async_result_get_op_res_gpointer(GSimpleAsyncResult*)' is deprecated [-Wdeprecated-declarations]
   data = (UtilsSpawnData*)g_simple_async_result_get_op_res_gpointer (simple);
                                                                            ^
In file included from /usr/include/glib-2.0/gio/gio.h:117,
                 from ../../src/polkit/polkitactiondescription.h:30,
                 from ../../src/polkit/polkit.h:30,
                 from polkitbackendjsauthority.cpp:37:
/usr/include/glib-2.0/gio/gsimpleasyncresult.h:79:21: note: declared here
 gpointer            g_simple_async_result_get_op_res_gpointer (GSimpleAsyncResult      *simple);
                     ^~~~~~~~~~~~~~~~~~~~~~~~~~~~~~~~~~~~~~~~~
  CC       libpolkit_backend_1_la-polkitbackendactionpool.lo
  CC       libpolkit_backend_1_la-polkitbackendactionlookup.lo
  CC       libpolkit_backend_1_la-polkitbackendsessionmonitor-systemd.lo
  CXXLD    libpolkit-backend-1.la
  CC       polkitd-polkitd.o
polkitd.c: In function 'become_user':
polkitd.c:130:3: warning: ignoring return value of 'setregid', declared with attribute warn_unused_result [-Wunused-result]
   setregid (pw->pw_gid, pw->pw_gid);
   ^~~~~~~~~~~~~~~~~~~~~~~~~~~~~~~~~
polkitd.c:131:3: warning: ignoring return value of 'setreuid', declared with attribute warn_unused_result [-Wunused-result]
   setreuid (pw->pw_uid, pw->pw_uid);
   ^~~~~~~~~~~~~~~~~~~~~~~~~~~~~~~~~
  CXXLD    polkitd
make[4]: Leaving directory '/usr/src/RPM/BUILD/polkit-0.115/src/polkitbackend'
make[3]: Leaving directory '/usr/src/RPM/BUILD/polkit-0.115/src/polkitbackend'
Making all in polkitagent
make[3]: Entering directory '/usr/src/RPM/BUILD/polkit-0.115/src/polkitagent'
glib-genmarshal --prefix=_polkit_agent_marshal ./polkitagentmarshal.list --header > polkitagentmarshal.h.tmp && mv polkitagentmarshal.h.tmp polkitagentmarshal.h
INFO: Reading ./polkitagentmarshal.list...
(echo "#include \"polkitagentmarshal.h\""; glib-genmarshal --prefix=_polkit_agent_marshal ./polkitagentmarshal.list --body) > polkitagentmarshal.c.tmp && mv polkitagentmarshal.c.tmp polkitagentmarshal.c
INFO: Reading ./polkitagentmarshal.list...
touch marshal.stamp
( top_builddir=`cd ../.. && pwd`; \
 cd . && glib-mkenums --template polkitagentenumtypes.c.template polkitagentlistener.h) > \
   polkitagentenumtypes.c.tmp && mv polkitagentenumtypes.c.tmp polkitagentenumtypes.c
( top_builddir=`cd ../.. && pwd`; \
 cd . && glib-mkenums --template polkitagentenumtypes.h.template polkitagentlistener.h) > \
   polkitagentenumtypes.h.tmp && mv polkitagentenumtypes.h.tmp polkitagentenumtypes.h
git.mk: Generating .gitignore
make  all-am
make[4]: Entering directory '/usr/src/RPM/BUILD/polkit-0.115/src/polkitagent'
  CC       libpolkit_agent_1_la-polkitagentenumtypes.lo
  CC       libpolkit_agent_1_la-polkitagentmarshal.lo
  CC       libpolkit_agent_1_la-polkitagentsession.lo
  CC       libpolkit_agent_1_la-polkitagentlistener.lo
  CC       libpolkit_agent_1_la-polkitagenttextlistener.lo
polkitagenttextlistener.c: In function 'on_completed':
polkitagenttextlistener.c:215:3: warning: 'g_simple_async_result_complete_in_idle' is deprecated [-Wdeprecated-declarations]
   g_simple_async_result_complete_in_idle (listener->simple);
   ^~~~~~~~~~~~~~~~~~~~~~~~~~~~~~~~~~~~~~
In file included from /usr/include/glib-2.0/gio/gio.h:117,
                 from ../../src/polkit/polkitactiondescription.h:30,
                 from ../../src/polkit/polkitprivate.h:26,
                 from polkitagenttextlistener.c:34:
/usr/include/glib-2.0/gio/gsimpleasyncresult.h:106:21: note: declared here
 void                g_simple_async_result_complete_in_idle (GSimpleAsyncResult      *simple);
                     ^~~~~~~~~~~~~~~~~~~~~~~~~~~~~~~~~~~~~~
polkitagenttextlistener.c: In function 'polkit_agent_text_listener_initiate_authentication':
polkitagenttextlistener.c:457:3: warning: 'g_simple_async_result_new' is deprecated: Use 'g_task_new' instead [-Wdeprecated-declarations]
   simple = g_simple_async_result_new (G_OBJECT (listener),
   ^~~~~~
In file included from /usr/include/glib-2.0/gio/gio.h:117,
                 from ../../src/polkit/polkitactiondescription.h:30,
                 from ../../src/polkit/polkitprivate.h:26,
                 from polkitagenttextlistener.c:34:
/usr/include/glib-2.0/gio/gsimpleasyncresult.h:51:21: note: declared here
 GSimpleAsyncResult *g_simple_async_result_new              (GObject                 *source_object,
                     ^~~~~~~~~~~~~~~~~~~~~~~~~
polkitagenttextlistener.c:463:7: warning: 'g_simple_async_result_set_error' is deprecated [-Wdeprecated-declarations]
       g_simple_async_result_set_error (simple,
       ^~~~~~~~~~~~~~~~~~~~~~~~~~~~~~~
In file included from /usr/include/glib-2.0/gio/gio.h:117,
                 from ../../src/polkit/polkitactiondescription.h:30,
                 from ../../src/polkit/polkitprivate.h:26,
                 from polkitagenttextlistener.c:34:
/usr/include/glib-2.0/gio/gsimpleasyncresult.h:122:21: note: declared here
 void                g_simple_async_result_set_error        (GSimpleAsyncResult      *simple,
                     ^~~~~~~~~~~~~~~~~~~~~~~~~~~~~~~
polkitagenttextlistener.c:467:7: warning: 'g_simple_async_result_complete_in_idle' is deprecated [-Wdeprecated-declarations]
       g_simple_async_result_complete_in_idle (simple);
       ^~~~~~~~~~~~~~~~~~~~~~~~~~~~~~~~~~~~~~
In file included from /usr/include/glib-2.0/gio/gio.h:117,
                 from ../../src/polkit/polkitactiondescription.h:30,
                 from ../../src/polkit/polkitprivate.h:26,
                 from polkitagenttextlistener.c:34:
/usr/include/glib-2.0/gio/gsimpleasyncresult.h:106:21: note: declared here
 void                g_simple_async_result_complete_in_idle (GSimpleAsyncResult      *simple);
                     ^~~~~~~~~~~~~~~~~~~~~~~~~~~~~~~~~~~~~~
polkitagenttextlistener.c:493:11: warning: 'g_simple_async_result_set_error' is deprecated [-Wdeprecated-declarations]
           g_simple_async_result_set_error (simple,
           ^~~~~~~~~~~~~~~~~~~~~~~~~~~~~~~
In file included from /usr/include/glib-2.0/gio/gio.h:117,
                 from ../../src/polkit/polkitactiondescription.h:30,
                 from ../../src/polkit/polkitprivate.h:26,
                 from polkitagenttextlistener.c:34:
/usr/include/glib-2.0/gio/gsimpleasyncresult.h:122:21: note: declared here
 void                g_simple_async_result_set_error        (GSimpleAsyncResult      *simple,
                     ^~~~~~~~~~~~~~~~~~~~~~~~~~~~~~~
polkitagenttextlistener.c:497:11: warning: 'g_simple_async_result_complete_in_idle' is deprecated [-Wdeprecated-declarations]
           g_simple_async_result_complete_in_idle (simple);
           ^~~~~~~~~~~~~~~~~~~~~~~~~~~~~~~~~~~~~~
In file included from /usr/include/glib-2.0/gio/gio.h:117,
                 from ../../src/polkit/polkitactiondescription.h:30,
                 from ../../src/polkit/polkitprivate.h:26,
                 from polkitagenttextlistener.c:34:
/usr/include/glib-2.0/gio/gsimpleasyncresult.h:106:21: note: declared here
 void                g_simple_async_result_complete_in_idle (GSimpleAsyncResult      *simple);
                     ^~~~~~~~~~~~~~~~~~~~~~~~~~~~~~~~~~~~~~
polkitagenttextlistener.c: In function 'polkit_agent_text_listener_initiate_authentication_finish':
polkitagenttextlistener.c:551:3: warning: 'g_simple_async_result_get_source_tag' is deprecated [-Wdeprecated-declarations]
   g_warn_if_fail (g_simple_async_result_get_source_tag (G_SIMPLE_ASYNC_RESULT (res)) ==
   ^~~~~~~~~~~~~~
In file included from /usr/include/glib-2.0/gio/gio.h:117,
                 from ../../src/polkit/polkitactiondescription.h:30,
                 from ../../src/polkit/polkitprivate.h:26,
                 from polkitagenttextlistener.c:34:
/usr/include/glib-2.0/gio/gsimpleasyncresult.h:99:21: note: declared here
 gpointer            g_simple_async_result_get_source_tag   (GSimpleAsyncResult      *simple);
                     ^~~~~~~~~~~~~~~~~~~~~~~~~~~~~~~~~~~~
polkitagenttextlistener.c:556:3: warning: 'g_simple_async_result_propagate_error' is deprecated [-Wdeprecated-declarations]
   if (g_simple_async_result_propagate_error (G_SIMPLE_ASYNC_RESULT (res), error))
   ^~
In file included from /usr/include/glib-2.0/gio/gio.h:117,
                 from ../../src/polkit/polkitactiondescription.h:30,
                 from ../../src/polkit/polkitprivate.h:26,
                 from polkitagenttextlistener.c:34:
/usr/include/glib-2.0/gio/gsimpleasyncresult.h:119:21: note: declared here
 gboolean            g_simple_async_result_propagate_error  (GSimpleAsyncResult      *simple,
                     ^~~~~~~~~~~~~~~~~~~~~~~~~~~~~~~~~~~~~
  CCLD     libpolkit-agent-1.la
  CC       polkit_agent_helper_1-polkitagenthelperprivate.o
  CC       polkit_agent_helper_1-polkitagenthelper-pam.o
  CCLD     polkit-agent-helper-1
  GISCAN   PolkitAgent-1.0.gir
  GICOMP   PolkitAgent-1.0.gir
make[4]: Leaving directory '/usr/src/RPM/BUILD/polkit-0.115/src/polkitagent'
make[3]: Leaving directory '/usr/src/RPM/BUILD/polkit-0.115/src/polkitagent'
Making all in programs
make[3]: Entering directory '/usr/src/RPM/BUILD/polkit-0.115/src/programs'
  CC       pkexec-pkexec.o
pkexec.c: In function 'main':
pkexec.c:930:7: warning: ignoring return value of 'setreuid', declared with attribute warn_unused_result [-Wunused-result]
       setreuid (0, 0);
       ^~~~~~~~~~~~~~~
pkexec.c:983:3: warning: ignoring return value of 'setregid', declared with attribute warn_unused_result [-Wunused-result]
   setregid (pw->pw_gid, pw->pw_gid);
   ^~~~~~~~~~~~~~~~~~~~~~~~~~~~~~~~~
pkexec.c:984:3: warning: ignoring return value of 'setreuid', declared with attribute warn_unused_result [-Wunused-result]
   setreuid (pw->pw_uid, pw->pw_uid);
   ^~~~~~~~~~~~~~~~~~~~~~~~~~~~~~~~~
  CCLD     pkexec
  CC       pkcheck-pkcheck.o
  CCLD     pkcheck
  CC       pkaction-pkaction.o
  CCLD     pkaction
  CC       pkttyagent-pkttyagent.o
  CCLD     pkttyagent
git.mk: Generating .gitignore
make[3]: Leaving directory '/usr/src/RPM/BUILD/polkit-0.115/src/programs'
Making all in examples
make[3]: Entering directory '/usr/src/RPM/BUILD/polkit-0.115/src/examples'
  CC       pk_example_frobnicate-frobnicate.o
  CCLD     pk-example-frobnicate
  CC       cancel-cancel.o
  CCLD     cancel
  ITMRG  org.freedesktop.policykit.examples.pkexec.policy
git.mk: Generating .gitignore
make[3]: Leaving directory '/usr/src/RPM/BUILD/polkit-0.115/src/examples'
make[3]: Entering directory '/usr/src/RPM/BUILD/polkit-0.115/src'
make[3]: Nothing to be done for 'all-am'.
make[3]: Leaving directory '/usr/src/RPM/BUILD/polkit-0.115/src'
git.mk: Generating .gitignore
make[2]: Leaving directory '/usr/src/RPM/BUILD/polkit-0.115/src'
Making all in docs
make[2]: Entering directory '/usr/src/RPM/BUILD/polkit-0.115/docs'
Making all in man
make[3]: Entering directory '/usr/src/RPM/BUILD/polkit-0.115/docs/man'
/usr/bin/xsltproc -nonet --stringparam man.base.url.for.relative.links /usr/share/gtk-doc/html/polkit-1/ --xinclude http://docbook.sourceforge.net/release/xsl/current/manpages/docbook.xsl polkit.xml
Error: no ID for constraint linkend: "polkitd.8".
Error: no ID for constraint linkend: "pkcheck.1".
Error: no ID for constraint linkend: "PolkitAgentTextListener-struct".
Error: no ID for constraint linkend: "pkttyagent.1".
Error: no ID for constraint linkend: "pkaction.1".
Error: no ID for constraint linkend: "pkexec.1".
Error: no ID for constraint linkend: "PolkitIdentity-struct".
Error: no ID for constraint linkend: "pkexec.1".
Error: no ID for constraint linkend: "pkexec.1".
Error: no ID for constraint linkend: "polkitd.8".
Error: no ID for constraint linkend: "pkaction.1".
Error: no ID for constraint linkend: "pkcheck.1".
Error: no ID for constraint linkend: "pkexec.1".
Error: no ID for constraint linkend: "pkttyagent.1".
Note: Writing polkit.8
/usr/bin/xsltproc -nonet --stringparam man.base.url.for.relative.links /usr/share/gtk-doc/html/polkit-1/ --xinclude http://docbook.sourceforge.net/release/xsl/current/manpages/docbook.xsl polkitd.xml
Error: no ID for constraint linkend: "polkit.8".
Error: no ID for constraint linkend: "polkit.8".
Error: no ID for constraint linkend: "pkaction.1".
Error: no ID for constraint linkend: "pkcheck.1".
Error: no ID for constraint linkend: "pkexec.1".
Error: no ID for constraint linkend: "pkttyagent.1".
Note: Writing polkitd.8
/usr/bin/xsltproc -nonet --stringparam man.base.url.for.relative.links /usr/share/gtk-doc/html/polkit-1/ --xinclude http://docbook.sourceforge.net/release/xsl/current/manpages/docbook.xsl pkexec.xml
Error: no ID for constraint linkend: "polkit.8".
Error: no ID for constraint linkend: "polkitd.8".
Error: no ID for constraint linkend: "pkaction.1".
Error: no ID for constraint linkend: "pkcheck.1".
Error: no ID for constraint linkend: "pkttyagent.1".
Note: Writing pkexec.1
/usr/bin/xsltproc -nonet --stringparam man.base.url.for.relative.links /usr/share/gtk-doc/html/polkit-1/ --xinclude http://docbook.sourceforge.net/release/xsl/current/manpages/docbook.xsl pkcheck.xml
Error: no ID for constraint linkend: "polkit.8".
Error: no ID for constraint linkend: "polkitd.8".
Error: no ID for constraint linkend: "pkaction.1".
Error: no ID for constraint linkend: "pkexec.1".
Error: no ID for constraint linkend: "pkttyagent.1".
Note: Writing pkcheck.1
/usr/bin/xsltproc -nonet --stringparam man.base.url.for.relative.links /usr/share/gtk-doc/html/polkit-1/ --xinclude http://docbook.sourceforge.net/release/xsl/current/manpages/docbook.xsl pkaction.xml
Error: no ID for constraint linkend: "polkit.8".
Error: no ID for constraint linkend: "polkitd.8".
Error: no ID for constraint linkend: "pkcheck.1".
Error: no ID for constraint linkend: "pkexec.1".
Error: no ID for constraint linkend: "pkttyagent.1".
Note: Writing pkaction.1
/usr/bin/xsltproc -nonet --stringparam man.base.url.for.relative.links /usr/share/gtk-doc/html/polkit-1/ --xinclude http://docbook.sourceforge.net/release/xsl/current/manpages/docbook.xsl pkttyagent.xml
Error: no ID for constraint linkend: "eggdbus-signal-org.freedesktop.PolicyKit1.Authority::Changed".
Error: no ID for constraint linkend: "polkit.8".
Error: no ID for constraint linkend: "polkitd.8".
Error: no ID for constraint linkend: "pkaction.1".
Error: no ID for constraint linkend: "pkcheck.1".
Error: no ID for constraint linkend: "pkexec.1".
Note: Writing pkttyagent.1
git.mk: Generating .gitignore
make[3]: Leaving directory '/usr/src/RPM/BUILD/polkit-0.115/docs/man'
Making all in polkit
make[3]: Entering directory '/usr/src/RPM/BUILD/polkit-0.115/docs/polkit'
  DOC   Preparing build
  DOC   Scanning header files
  DOC   Introspecting gobjects
  DOC   Building XML
  DOC   Building XML
./polkit-1-unused.txt:1: warning: 7 unused declarations. They should be added to polkit-1-sections.txt in the appropriate place.
  DOC   Building HTML
  DOC   Fixing cross-references
html/PolkitActionDescription.html:466: warning: no link for: "NULL:CAPS" -> (<code class="literal">NULL</code>).
html/PolkitAgentListener.html:167: warning: no link for: "GList" -> (<span class="type">GList</span>).
html/PolkitAgentListener.html:168: warning: no link for: "GCancellable" -> (<span class="type">GCancellable</span>).
html/PolkitAgentListener.html:169: warning: no link for: "GAsyncReadyCallback" -> (<span class="type">GAsyncReadyCallback</span>).
html/PolkitAgentListener.html:260: warning: no link for: "GAsyncResult" -> (<span class="type">GAsyncResult</span>).
html/PolkitAgentListener.html:261: warning: no link for: "GError" -> (<span class="type">GError</span>).
html/PolkitAgentListener.html:293: warning: no link for: "TRUE:CAPS" -> (<code class="literal">TRUE</code>).
html/PolkitAgentListener.html:386: warning: no link for: "GVariant" -> (<span class="type">GVariant</span>).
html/PolkitAgentListener.html:555: warning: no link for: "GObjectClass" -> (<span class="type">GObjectClass</span>).
html/PolkitAgentSession.html:133: warning: no link for: "G-SIGNAL-RUN-LAST:CAPS" -> (Run Last).
html/PolkitAgentSession.html:195: warning: no link for: "FALSE:CAPS" -> (<code class="literal">FALSE</code>).
html/PolkitAgentSession.html:235: warning: no link for: "g-object-unref" -> (<code class="function">g_object_unref()</code>).
html/PolkitAuthority.html:576: warning: no link for: "GObject-notify" -> (<span class="type">“notify”</span>).
html/PolkitAuthority.html:595: warning: no link for: "g-free" -> (<code class="function">g_free()</code>).
html/PolkitAuthority.html:989: warning: no link for: "g-list-free" -> (<code class="function">g_list_free()</code>).
html/PolkitAuthorizationResult.html:345: warning: no link for: "api-index-0.101" -> (0.101).
html/PolkitDetails.html:228: warning: no link for: "g-strfreev" -> (<code class="function">g_strfreev()</code>).
html/PolkitIdentity.html:129: warning: no link for: "g-hash-table-new" -> (<code class="function">g_hash_table_new()</code>).
html/PolkitIdentity.html:290: warning: no link for: "GTypeInterface" -> (<span class="type">GTypeInterface</span>).
html/PolkitPermission.html:33: warning: no link for: "GPermission" -> (<span class="type">GPermission</span>).
html/PolkitPermission.html:150: warning: no link for: "GtkLockButton" -> (<span class="type">GtkLockButton</span>).
git.mk: Generating .gitignore
make[3]: Leaving directory '/usr/src/RPM/BUILD/polkit-0.115/docs/polkit'
make[3]: Entering directory '/usr/src/RPM/BUILD/polkit-0.115/docs'
make[3]: Nothing to be done for 'all-am'.
make[3]: Leaving directory '/usr/src/RPM/BUILD/polkit-0.115/docs'
git.mk: Generating .gitignore
make[2]: Leaving directory '/usr/src/RPM/BUILD/polkit-0.115/docs'
Making all in po
make[2]: Entering directory '/usr/src/RPM/BUILD/polkit-0.115/po'
  MSGFMT cs.gmo
  MSGFMT da.gmo
  MSGFMT de.gmo
  MSGFMT hr.gmo
  MSGFMT hu.gmo
  MSGFMT id.gmo
  MSGFMT it.gmo
  MSGFMT pl.gmo
  MSGFMT pt_BR.gmo
  MSGFMT sk.gmo
  MSGFMT sv.gmo
  MSGFMT tr.gmo
  MSGFMT uk.gmo
  MSGFMT zh_CN.gmo
  MSGFMT zh_TW.gmo
make[2]: Leaving directory '/usr/src/RPM/BUILD/polkit-0.115/po'
Making all in test
make[2]: Entering directory '/usr/src/RPM/BUILD/polkit-0.115/test'
Making all in mocklibc
make[3]: Entering directory '/usr/src/RPM/BUILD/polkit-0.115/test/mocklibc'
make  all-recursive
make[4]: Entering directory '/usr/src/RPM/BUILD/polkit-0.115/test/mocklibc'
Making all in src
make[5]: Entering directory '/usr/src/RPM/BUILD/polkit-0.115/test/mocklibc/src'
/bin/sh ../libtool  --tag=CC   --mode=compile x86_64-alt-linux-gcc -DHAVE_CONFIG_H -I. -I..     -pipe -frecord-gcc-switches -Wall -g -O2 -c -o pwd.lo pwd.c
libtool: compile:  x86_64-alt-linux-gcc -DHAVE_CONFIG_H -I. -I.. -pipe -frecord-gcc-switches -Wall -g -O2 -c pwd.c  -fPIC -DPIC -o .libs/pwd.o
/bin/sh ../libtool  --tag=CC   --mode=compile x86_64-alt-linux-gcc -DHAVE_CONFIG_H -I. -I..     -pipe -frecord-gcc-switches -Wall -g -O2 -c -o grp.lo grp.c
libtool: compile:  x86_64-alt-linux-gcc -DHAVE_CONFIG_H -I. -I.. -pipe -frecord-gcc-switches -Wall -g -O2 -c grp.c  -fPIC -DPIC -o .libs/grp.o
/bin/sh ../libtool  --tag=CC   --mode=compile x86_64-alt-linux-gcc -DHAVE_CONFIG_H -I. -I..     -pipe -frecord-gcc-switches -Wall -g -O2 -c -o netdb.lo netdb.c
libtool: compile:  x86_64-alt-linux-gcc -DHAVE_CONFIG_H -I. -I.. -pipe -frecord-gcc-switches -Wall -g -O2 -c netdb.c  -fPIC -DPIC -o .libs/netdb.o
/bin/sh ../libtool  --tag=CC   --mode=compile x86_64-alt-linux-gcc -DHAVE_CONFIG_H -I. -I..     -pipe -frecord-gcc-switches -Wall -g -O2 -c -o netgroup.lo netgroup.c
libtool: compile:  x86_64-alt-linux-gcc -DHAVE_CONFIG_H -I. -I.. -pipe -frecord-gcc-switches -Wall -g -O2 -c netgroup.c  -fPIC -DPIC -o .libs/netgroup.o
/bin/sh ../libtool  --tag=CC   --mode=link x86_64-alt-linux-gcc  -pipe -frecord-gcc-switches -Wall -g -O2   -o libmocklibc.la -rpath /usr/lib64 pwd.lo grp.lo netdb.lo netgroup.lo  
libtool: link: x86_64-alt-linux-gcc -shared  -fPIC -DPIC  .libs/pwd.o .libs/grp.o .libs/netdb.o .libs/netgroup.o    -O2   -Wl,-soname -Wl,libmocklibc.so.0 -o .libs/libmocklibc.so.0.0.0
libtool: link: (cd ".libs" && rm -f "libmocklibc.so.0" && ln -s "libmocklibc.so.0.0.0" "libmocklibc.so.0")
libtool: link: (cd ".libs" && rm -f "libmocklibc.so" && ln -s "libmocklibc.so.0.0.0" "libmocklibc.so")
libtool: link: ( cd ".libs" && rm -f "libmocklibc.la" && ln -s "../libmocklibc.la" "libmocklibc.la" )
x86_64-alt-linux-gcc -DHAVE_CONFIG_H -I. -I..     -pipe -frecord-gcc-switches -Wall -g -O2 -c -o netgroup-debug.o netgroup-debug.c
netgroup-debug.c: In function 'netgroup_debug_print_entry':
netgroup-debug.c:25:3: warning: implicit declaration of function 'print_indent' [-Wimplicit-function-declaration]
   print_indent(stream, indent);
   ^~~~~~~~~~~~
/bin/sh ../libtool  --tag=CC   --mode=link x86_64-alt-linux-gcc  -pipe -frecord-gcc-switches -Wall -g -O2   -o mocklibc-debug-netgroup netgroup-debug.o libmocklibc.la 
libtool: link: x86_64-alt-linux-gcc -pipe -frecord-gcc-switches -Wall -g -O2 -o .libs/mocklibc-debug-netgroup netgroup-debug.o  ./.libs/libmocklibc.so
make[5]: Leaving directory '/usr/src/RPM/BUILD/polkit-0.115/test/mocklibc/src'
Making all in bin
make[5]: Entering directory '/usr/src/RPM/BUILD/polkit-0.115/test/mocklibc/bin'
sed -e 's|@libdir[@]|/usr/lib64|g' -e 's|@libname[@]|libmocklibc.so|g' -e 's|@top_srcdir[@]|..|g' -e 's|@top_builddir[@]|..|g' ./mocklibc.in > mocklibc
chmod a+x mocklibc
make[5]: Leaving directory '/usr/src/RPM/BUILD/polkit-0.115/test/mocklibc/bin'
make[5]: Entering directory '/usr/src/RPM/BUILD/polkit-0.115/test/mocklibc'
make[5]: Leaving directory '/usr/src/RPM/BUILD/polkit-0.115/test/mocklibc'
make[4]: Leaving directory '/usr/src/RPM/BUILD/polkit-0.115/test/mocklibc'
make[3]: Leaving directory '/usr/src/RPM/BUILD/polkit-0.115/test/mocklibc'
Making all in .
make[3]: Entering directory '/usr/src/RPM/BUILD/polkit-0.115/test'
  CC       polkittesthelper.lo
  CCLD     libpolkit-test-helper.la
make[3]: Leaving directory '/usr/src/RPM/BUILD/polkit-0.115/test'
Making all in polkit
make[3]: Entering directory '/usr/src/RPM/BUILD/polkit-0.115/test/polkit'
git.mk: Generating .gitignore
make[3]: Leaving directory '/usr/src/RPM/BUILD/polkit-0.115/test/polkit'
Making all in polkitbackend
make[3]: Entering directory '/usr/src/RPM/BUILD/polkit-0.115/test/polkitbackend'
  CC       test-polkitbackendjsauthority.o
  CXXLD    polkitbackendjsauthoritytest
git.mk: Generating .gitignore
make[3]: Leaving directory '/usr/src/RPM/BUILD/polkit-0.115/test/polkitbackend'
git.mk: Generating .gitignore
make[2]: Leaving directory '/usr/src/RPM/BUILD/polkit-0.115/test'
make[2]: Entering directory '/usr/src/RPM/BUILD/polkit-0.115'
make[2]: Leaving directory '/usr/src/RPM/BUILD/polkit-0.115'
make[1]: Leaving directory '/usr/src/RPM/BUILD/polkit-0.115'
make: Leaving directory '/usr/src/RPM/BUILD/polkit-0.115'
+ exit 0
Executing(%install): /bin/sh -e /usr/src/tmp/rpm-tmp.50311
+ umask 022
+ /bin/mkdir -p /usr/src/RPM/BUILD
+ cd /usr/src/RPM/BUILD
+ /bin/chmod -Rf u+rwX -- /usr/src/tmp/polkit-buildroot
+ :
+ /bin/rm -rf -- /usr/src/tmp/polkit-buildroot
+ cd polkit-0.115
+ make 'INSTALL=/bin/install -p' install DESTDIR=/usr/src/tmp/polkit-buildroot
make: Entering directory '/usr/src/RPM/BUILD/polkit-0.115'
Making install in actions
make[1]: Entering directory '/usr/src/RPM/BUILD/polkit-0.115/actions'
make[2]: Entering directory '/usr/src/RPM/BUILD/polkit-0.115/actions'
make[2]: Nothing to be done for 'install-exec-am'.
 /bin/mkdir -p '/usr/src/tmp/polkit-buildroot/usr/share/polkit-1/actions'
 /bin/install -p -m 644 org.freedesktop.policykit.policy '/usr/src/tmp/polkit-buildroot/usr/share/polkit-1/actions'
make[2]: Leaving directory '/usr/src/RPM/BUILD/polkit-0.115/actions'
make[1]: Leaving directory '/usr/src/RPM/BUILD/polkit-0.115/actions'
Making install in data
make[1]: Entering directory '/usr/src/RPM/BUILD/polkit-0.115/data'
make[2]: Entering directory '/usr/src/RPM/BUILD/polkit-0.115/data'
make[2]: Nothing to be done for 'install-exec-am'.
 /bin/mkdir -p '/usr/src/tmp/polkit-buildroot/usr/share/dbus-1/system.d'
 /bin/install -p -m 644 org.freedesktop.PolicyKit1.conf '/usr/src/tmp/polkit-buildroot/usr/share/dbus-1/system.d'
 /bin/mkdir -p '/usr/src/tmp/polkit-buildroot/usr/share/gettext/its'
 /bin/install -p -m 644 polkit.loc polkit.its '/usr/src/tmp/polkit-buildroot/usr/share/gettext/its'
 /bin/mkdir -p '/usr/src/tmp/polkit-buildroot/etc/pam.d'
 /bin/install -p -m 644 polkit-1 '/usr/src/tmp/polkit-buildroot/etc/pam.d'
 /bin/mkdir -p '/usr/src/tmp/polkit-buildroot/usr/lib64/pkgconfig'
 /bin/install -p -m 644 polkit-gobject-1.pc polkit-agent-1.pc '/usr/src/tmp/polkit-buildroot/usr/lib64/pkgconfig'
 /bin/mkdir -p '/usr/src/tmp/polkit-buildroot/usr/share/dbus-1/system-services'
 /bin/install -p -m 644 org.freedesktop.PolicyKit1.service '/usr/src/tmp/polkit-buildroot/usr/share/dbus-1/system-services'
 /bin/mkdir -p '/usr/src/tmp/polkit-buildroot/lib/systemd/system'
 /bin/install -p -m 644 polkit.service '/usr/src/tmp/polkit-buildroot/lib/systemd/system'
make[2]: Leaving directory '/usr/src/RPM/BUILD/polkit-0.115/data'
make[1]: Leaving directory '/usr/src/RPM/BUILD/polkit-0.115/data'
Making install in src
make[1]: Entering directory '/usr/src/RPM/BUILD/polkit-0.115/src'
Making install in polkit
make[2]: Entering directory '/usr/src/RPM/BUILD/polkit-0.115/src/polkit'
make  install-am
make[3]: Entering directory '/usr/src/RPM/BUILD/polkit-0.115/src/polkit'
make[4]: Entering directory '/usr/src/RPM/BUILD/polkit-0.115/src/polkit'
 /bin/mkdir -p '/usr/src/tmp/polkit-buildroot/usr/lib64'
 /bin/sh ../../libtool   --mode=install /bin/install -p   libpolkit-gobject-1.la '/usr/src/tmp/polkit-buildroot/usr/lib64'
libtool: install: /bin/install -p .libs/libpolkit-gobject-1.so.0.0.0 /usr/src/tmp/polkit-buildroot/usr/lib64/libpolkit-gobject-1.so.0.0.0
libtool: install: (cd /usr/src/tmp/polkit-buildroot/usr/lib64 && { ln -s -f libpolkit-gobject-1.so.0.0.0 libpolkit-gobject-1.so.0 || { rm -f libpolkit-gobject-1.so.0 && ln -s libpolkit-gobject-1.so.0.0.0 libpolkit-gobject-1.so.0; }; })
libtool: install: (cd /usr/src/tmp/polkit-buildroot/usr/lib64 && { ln -s -f libpolkit-gobject-1.so.0.0.0 libpolkit-gobject-1.so || { rm -f libpolkit-gobject-1.so && ln -s libpolkit-gobject-1.so.0.0.0 libpolkit-gobject-1.so; }; })
libtool: install: /bin/install -p .libs/libpolkit-gobject-1.lai /usr/src/tmp/polkit-buildroot/usr/lib64/libpolkit-gobject-1.la
libtool: install: warning: remember to run `libtool --finish /usr/lib64'
 /bin/mkdir -p '/usr/src/tmp/polkit-buildroot/usr/share/gir-1.0'
 /bin/install -p -m 644 Polkit-1.0.gir '/usr/src/tmp/polkit-buildroot/usr/share/gir-1.0'
 /bin/mkdir -p '/usr/src/tmp/polkit-buildroot/usr/include/polkit-1/polkit'
 /bin/install -p -m 644 polkit.h polkitprivate.h polkittypes.h polkitenumtypes.h polkitactiondescription.h polkitauthorityfeatures.h polkitdetails.h polkitauthority.h polkiterror.h polkitsubject.h polkitunixprocess.h polkitunixsession.h polkitsystembusname.h polkitidentity.h polkitunixuser.h polkitunixgroup.h polkitunixnetgroup.h polkitauthorizationresult.h polkitcheckauthorizationflags.h polkitimplicitauthorization.h polkittemporaryauthorization.h polkitpermission.h '/usr/src/tmp/polkit-buildroot/usr/include/polkit-1/polkit'
 /bin/mkdir -p '/usr/src/tmp/polkit-buildroot/usr/lib64/girepository-1.0'
 /bin/install -p -m 644 Polkit-1.0.typelib '/usr/src/tmp/polkit-buildroot/usr/lib64/girepository-1.0'
make[4]: Leaving directory '/usr/src/RPM/BUILD/polkit-0.115/src/polkit'
make[3]: Leaving directory '/usr/src/RPM/BUILD/polkit-0.115/src/polkit'
make[2]: Leaving directory '/usr/src/RPM/BUILD/polkit-0.115/src/polkit'
Making install in polkitbackend
make[2]: Entering directory '/usr/src/RPM/BUILD/polkit-0.115/src/polkitbackend'
make  install-am
make[3]: Entering directory '/usr/src/RPM/BUILD/polkit-0.115/src/polkitbackend'
make[4]: Entering directory '/usr/src/RPM/BUILD/polkit-0.115/src/polkitbackend'
make[4]: Nothing to be done for 'install-exec-am'.
 /bin/mkdir -p '/usr/src/tmp/polkit-buildroot/usr/libexec/polkit-1'
  /bin/sh ../../libtool   --mode=install /bin/install -p polkitd '/usr/src/tmp/polkit-buildroot/usr/libexec/polkit-1'
libtool: install: warning: `../../src/polkit/libpolkit-gobject-1.la' has not been installed in `/usr/lib64'
libtool: install: warning: `/usr/src/RPM/BUILD/polkit-0.115/src/polkit/libpolkit-gobject-1.la' has not been installed in `/usr/lib64'
libtool: install: /bin/install -p .libs/polkitd /usr/src/tmp/polkit-buildroot/usr/libexec/polkit-1/polkitd
 /bin/mkdir -p '/usr/src/tmp/polkit-buildroot/etc/polkit-1/rules.d'
 /bin/install -p -m 644 50-default.rules '/usr/src/tmp/polkit-buildroot/etc/polkit-1/rules.d'
make  install-data-hook
make[5]: Entering directory '/usr/src/RPM/BUILD/polkit-0.115/src/polkitbackend'
mkdir -p /usr/src/tmp/polkit-buildroot/etc/polkit-1/rules.d
chmod 700 /usr/src/tmp/polkit-buildroot/etc/polkit-1/rules.d
chown polkitd /usr/src/tmp/polkit-buildroot/etc/polkit-1/rules.d
chown: invalid user: 'polkitd'
make[5]: [Makefile:1041: install-data-hook] Error 1 (ignored)
mkdir -p /usr/src/tmp/polkit-buildroot/usr/share/polkit-1/rules.d
chmod 700 /usr/src/tmp/polkit-buildroot/usr/share/polkit-1/rules.d
chown polkitd /usr/src/tmp/polkit-buildroot/usr/share/polkit-1/rules.d
chown: invalid user: 'polkitd'
make[5]: [Makefile:1044: install-data-hook] Error 1 (ignored)
make[5]: Leaving directory '/usr/src/RPM/BUILD/polkit-0.115/src/polkitbackend'
make[4]: Leaving directory '/usr/src/RPM/BUILD/polkit-0.115/src/polkitbackend'
make[3]: Leaving directory '/usr/src/RPM/BUILD/polkit-0.115/src/polkitbackend'
make[2]: Leaving directory '/usr/src/RPM/BUILD/polkit-0.115/src/polkitbackend'
Making install in polkitagent
make[2]: Entering directory '/usr/src/RPM/BUILD/polkit-0.115/src/polkitagent'
make  install-am
make[3]: Entering directory '/usr/src/RPM/BUILD/polkit-0.115/src/polkitagent'
make[4]: Entering directory '/usr/src/RPM/BUILD/polkit-0.115/src/polkitagent'
 /bin/mkdir -p '/usr/src/tmp/polkit-buildroot/usr/lib64'
 /bin/sh ../../libtool   --mode=install /bin/install -p   libpolkit-agent-1.la '/usr/src/tmp/polkit-buildroot/usr/lib64'
libtool: install: warning: relinking `libpolkit-agent-1.la'
libtool: install: (cd /usr/src/RPM/BUILD/polkit-0.115/src/polkitagent; /bin/sh /usr/src/RPM/BUILD/polkit-0.115/libtool  --silent --tag CC --mode=relink x86_64-alt-linux-gcc -D_POLKIT_COMPILATION -D_POLKIT_AGENT_COMPILATION -pthread -I/usr/include/gio-unix-2.0/ -I/usr/include/glib-2.0 -I/usr/lib64/glib-2.0/include -pipe -frecord-gcc-switches -Wall -g -O2 -export-symbols-regex "(^polkit_.*)" -Wl,--as-needed -o libpolkit-agent-1.la -rpath /usr/lib64 libpolkit_agent_1_la-polkitagentenumtypes.lo libpolkit_agent_1_la-polkitagentmarshal.lo libpolkit_agent_1_la-polkitagentsession.lo libpolkit_agent_1_la-polkitagentlistener.lo libpolkit_agent_1_la-polkitagenttextlistener.lo -Wl,--export-dynamic -lgmodule-2.0 -pthread -lgio-2.0 -lgobject-2.0 -lglib-2.0 ../../src/polkit/libpolkit-gobject-1.la -lexpat -inst-prefix-dir /usr/src/tmp/polkit-buildroot)
libtool: install: /bin/install -p .libs/libpolkit-agent-1.so.0.0.0T /usr/src/tmp/polkit-buildroot/usr/lib64/libpolkit-agent-1.so.0.0.0
libtool: install: (cd /usr/src/tmp/polkit-buildroot/usr/lib64 && { ln -s -f libpolkit-agent-1.so.0.0.0 libpolkit-agent-1.so.0 || { rm -f libpolkit-agent-1.so.0 && ln -s libpolkit-agent-1.so.0.0.0 libpolkit-agent-1.so.0; }; })
libtool: install: (cd /usr/src/tmp/polkit-buildroot/usr/lib64 && { ln -s -f libpolkit-agent-1.so.0.0.0 libpolkit-agent-1.so || { rm -f libpolkit-agent-1.so && ln -s libpolkit-agent-1.so.0.0.0 libpolkit-agent-1.so; }; })
libtool: install: /bin/install -p .libs/libpolkit-agent-1.lai /usr/src/tmp/polkit-buildroot/usr/lib64/libpolkit-agent-1.la
libtool: install: warning: remember to run `libtool --finish /usr/lib64'
 /bin/mkdir -p '/usr/src/tmp/polkit-buildroot/usr/share/gir-1.0'
 /bin/install -p -m 644 PolkitAgent-1.0.gir '/usr/src/tmp/polkit-buildroot/usr/share/gir-1.0'
 /bin/mkdir -p '/usr/src/tmp/polkit-buildroot/usr/include/polkit-1/polkitagent'
 /bin/install -p -m 644 polkitagent.h polkitagentenumtypes.h polkitagenttypes.h polkitagentsession.h polkitagentlistener.h polkitagenttextlistener.h '/usr/src/tmp/polkit-buildroot/usr/include/polkit-1/polkitagent'
 /bin/mkdir -p '/usr/src/tmp/polkit-buildroot/usr/libexec/polkit-1'
  /bin/sh ../../libtool   --mode=install /bin/install -p polkit-agent-helper-1 '/usr/src/tmp/polkit-buildroot/usr/libexec/polkit-1'
libtool: install: warning: `../../src/polkit/libpolkit-gobject-1.la' has not been installed in `/usr/lib64'
libtool: install: /bin/install -p .libs/polkit-agent-helper-1 /usr/src/tmp/polkit-buildroot/usr/libexec/polkit-1/polkit-agent-helper-1
 /bin/mkdir -p '/usr/src/tmp/polkit-buildroot/usr/lib64/girepository-1.0'
 /bin/install -p -m 644 PolkitAgent-1.0.typelib '/usr/src/tmp/polkit-buildroot/usr/lib64/girepository-1.0'
make  install-data-hook
make[5]: Entering directory '/usr/src/RPM/BUILD/polkit-0.115/src/polkitagent'
chown root /usr/src/tmp/polkit-buildroot/usr/libexec/polkit-1/polkit-agent-helper-1
chown: changing ownership of '/usr/src/tmp/polkit-buildroot/usr/libexec/polkit-1/polkit-agent-helper-1': Operation not permitted
make[5]: [Makefile:1120: install-data-hook] Error 1 (ignored)
chmod 4755 /usr/src/tmp/polkit-buildroot/usr/libexec/polkit-1/polkit-agent-helper-1
make[5]: Leaving directory '/usr/src/RPM/BUILD/polkit-0.115/src/polkitagent'
make[4]: Leaving directory '/usr/src/RPM/BUILD/polkit-0.115/src/polkitagent'
make[3]: Leaving directory '/usr/src/RPM/BUILD/polkit-0.115/src/polkitagent'
make[2]: Leaving directory '/usr/src/RPM/BUILD/polkit-0.115/src/polkitagent'
Making install in programs
make[2]: Entering directory '/usr/src/RPM/BUILD/polkit-0.115/src/programs'
make[3]: Entering directory '/usr/src/RPM/BUILD/polkit-0.115/src/programs'
 /bin/mkdir -p '/usr/src/tmp/polkit-buildroot/usr/bin'
  /bin/sh ../../libtool   --mode=install /bin/install -p pkexec pkcheck pkaction pkttyagent '/usr/src/tmp/polkit-buildroot/usr/bin'
libtool: install: warning: `../../src/polkit/libpolkit-gobject-1.la' has not been installed in `/usr/lib64'
libtool: install: warning: `../../src/polkitagent/libpolkit-agent-1.la' has not been installed in `/usr/lib64'
libtool: install: /bin/install -p .libs/pkexec /usr/src/tmp/polkit-buildroot/usr/bin/pkexec
libtool: install: warning: `../../src/polkit/libpolkit-gobject-1.la' has not been installed in `/usr/lib64'
libtool: install: warning: `../../src/polkitagent/libpolkit-agent-1.la' has not been installed in `/usr/lib64'
libtool: install: /bin/install -p .libs/pkcheck /usr/src/tmp/polkit-buildroot/usr/bin/pkcheck
libtool: install: warning: `../../src/polkit/libpolkit-gobject-1.la' has not been installed in `/usr/lib64'
libtool: install: /bin/install -p .libs/pkaction /usr/src/tmp/polkit-buildroot/usr/bin/pkaction
libtool: install: warning: `../../src/polkit/libpolkit-gobject-1.la' has not been installed in `/usr/lib64'
libtool: install: warning: `../../src/polkitagent/libpolkit-agent-1.la' has not been installed in `/usr/lib64'
libtool: install: /bin/install -p .libs/pkttyagent /usr/src/tmp/polkit-buildroot/usr/bin/pkttyagent
make  install-exec-hook
make[4]: Entering directory '/usr/src/RPM/BUILD/polkit-0.115/src/programs'
chmod 4755 /usr/src/tmp/polkit-buildroot/usr/bin/pkexec
make[4]: Leaving directory '/usr/src/RPM/BUILD/polkit-0.115/src/programs'
make[3]: Nothing to be done for 'install-data-am'.
make[3]: Leaving directory '/usr/src/RPM/BUILD/polkit-0.115/src/programs'
make[2]: Leaving directory '/usr/src/RPM/BUILD/polkit-0.115/src/programs'
Making install in examples
make[2]: Entering directory '/usr/src/RPM/BUILD/polkit-0.115/src/examples'
make[3]: Entering directory '/usr/src/RPM/BUILD/polkit-0.115/src/examples'
 /bin/mkdir -p '/usr/src/tmp/polkit-buildroot/usr/bin'
  /bin/sh ../../libtool   --mode=install /bin/install -p pk-example-frobnicate '/usr/src/tmp/polkit-buildroot/usr/bin'
libtool: install: /bin/install -p pk-example-frobnicate /usr/src/tmp/polkit-buildroot/usr/bin/pk-example-frobnicate
 /bin/mkdir -p '/usr/src/tmp/polkit-buildroot/usr/share/polkit-1/actions'
 /bin/install -p -m 644 org.freedesktop.policykit.examples.pkexec.policy '/usr/src/tmp/polkit-buildroot/usr/share/polkit-1/actions'
make[3]: Leaving directory '/usr/src/RPM/BUILD/polkit-0.115/src/examples'
make[2]: Leaving directory '/usr/src/RPM/BUILD/polkit-0.115/src/examples'
make[2]: Entering directory '/usr/src/RPM/BUILD/polkit-0.115/src'
make[3]: Entering directory '/usr/src/RPM/BUILD/polkit-0.115/src'
make[3]: Nothing to be done for 'install-exec-am'.
make[3]: Nothing to be done for 'install-data-am'.
make[3]: Leaving directory '/usr/src/RPM/BUILD/polkit-0.115/src'
make[2]: Leaving directory '/usr/src/RPM/BUILD/polkit-0.115/src'
make[1]: Leaving directory '/usr/src/RPM/BUILD/polkit-0.115/src'
Making install in docs
make[1]: Entering directory '/usr/src/RPM/BUILD/polkit-0.115/docs'
Making install in man
make[2]: Entering directory '/usr/src/RPM/BUILD/polkit-0.115/docs/man'
make[3]: Entering directory '/usr/src/RPM/BUILD/polkit-0.115/docs/man'
make[3]: Nothing to be done for 'install-exec-am'.
 /bin/mkdir -p '/usr/src/tmp/polkit-buildroot/usr/share/man/man1'
 /bin/install -p -m 644 pkexec.1 pkcheck.1 pkaction.1 pkttyagent.1 '/usr/src/tmp/polkit-buildroot/usr/share/man/man1'
 /bin/mkdir -p '/usr/src/tmp/polkit-buildroot/usr/share/man/man8'
 /bin/install -p -m 644 polkit.8 polkitd.8 '/usr/src/tmp/polkit-buildroot/usr/share/man/man8'
make[3]: Leaving directory '/usr/src/RPM/BUILD/polkit-0.115/docs/man'
make[2]: Leaving directory '/usr/src/RPM/BUILD/polkit-0.115/docs/man'
Making install in polkit
make[2]: Entering directory '/usr/src/RPM/BUILD/polkit-0.115/docs/polkit'
make[3]: Entering directory '/usr/src/RPM/BUILD/polkit-0.115/docs/polkit'
make[3]: Nothing to be done for 'install-exec-am'.
 /bin/install -p -m 644 ./html/Identities.html
 /bin/install -p -m 644 ./html/PolkitActionDescription.html
 /bin/install -p -m 644 ./html/PolkitAgentListener.html
 /bin/install -p -m 644 ./html/PolkitAgentSession.html
 /bin/install -p -m 644 ./html/PolkitAgentTextListener.html
 /bin/install -p -m 644 ./html/PolkitAuthority.html
 /bin/install -p -m 644 ./html/PolkitAuthorizationResult.html
 /bin/install -p -m 644 ./html/PolkitDetails.html
 /bin/install -p -m 644 ./html/PolkitIdentity.html
 /bin/install -p -m 644 ./html/PolkitPermission.html
 /bin/install -p -m 644 ./html/PolkitSubject.html
 /bin/install -p -m 644 ./html/PolkitSystemBusName.html
 /bin/install -p -m 644 ./html/PolkitTemporaryAuthorization.html
 /bin/install -p -m 644 ./html/PolkitUnixGroup.html
 /bin/install -p -m 644 ./html/PolkitUnixNetgroup.html
 /bin/install -p -m 644 ./html/PolkitUnixProcess.html
 /bin/install -p -m 644 ./html/PolkitUnixSession.html
 /bin/install -p -m 644 ./html/PolkitUnixUser.html
 /bin/install -p -m 644 ./html/annotation-glossary.html
 /bin/install -p -m 644 ./html/eggdbus-interface-org.freedesktop.PolicyKit1.AuthenticationAgent.html
 /bin/install -p -m 644 ./html/eggdbus-interface-org.freedesktop.PolicyKit1.Authority.html
 /bin/install -p -m 644 ./html/home.png
 /bin/install -p -m 644 ./html/index.html
 /bin/install -p -m 644 ./html/left-insensitive.png
 /bin/install -p -m 644 ./html/left.png
 /bin/install -p -m 644 ./html/license.html
 /bin/install -p -m 644 ./html/manpages.html
 /bin/install -p -m 644 ./html/overview.html
 /bin/install -p -m 644 ./html/pkaction.1.html
 /bin/install -p -m 644 ./html/pkcheck.1.html
 /bin/install -p -m 644 ./html/pkexec.1.html
 /bin/install -p -m 644 ./html/pkttyagent.1.html
 /bin/install -p -m 644 ./html/polit-index.html
 /bin/install -p -m 644 ./html/polkit-1-PolkitError.html
 /bin/install -p -m 644 ./html/polkit-1.devhelp2
 /bin/install -p -m 644 ./html/polkit-agents.html
 /bin/install -p -m 644 ./html/polkit-apps.html
 /bin/install -p -m 644 ./html/polkit-architecture.html
 /bin/install -p -m 644 ./html/polkit-architecture.png
 /bin/install -p -m 644 ./html/polkit-authentication-agent-example-wheel.html
 /bin/install -p -m 644 ./html/polkit-authentication-agent-example-wheel.png
 /bin/install -p -m 644 ./html/polkit-authentication-agent-example.html
 /bin/install -p -m 644 ./html/polkit-authentication-agent-example.png
 /bin/install -p -m 644 ./html/polkit-hierarchy.html
 /bin/install -p -m 644 ./html/polkit-intro.html
 /bin/install -p -m 644 ./html/polkit.8.html
 /bin/install -p -m 644 ./html/polkitd.8.html
 /bin/install -p -m 644 ./html/ref-api.html
 /bin/install -p -m 644 ./html/ref-authentication-agent-api.html
 /bin/install -p -m 644 ./html/ref-dbus-api.html
 /bin/install -p -m 644 ./html/right-insensitive.png
 /bin/install -p -m 644 ./html/right.png
 /bin/install -p -m 644 ./html/style.css
 /bin/install -p -m 644 ./html/subjects.html
 /bin/install -p -m 644 ./html/up-insensitive.png
 /bin/install -p -m 644 ./html/up.png
make[3]: Leaving directory '/usr/src/RPM/BUILD/polkit-0.115/docs/polkit'
make[2]: Leaving directory '/usr/src/RPM/BUILD/polkit-0.115/docs/polkit'
make[2]: Entering directory '/usr/src/RPM/BUILD/polkit-0.115/docs'
make[3]: Entering directory '/usr/src/RPM/BUILD/polkit-0.115/docs'
make[3]: Nothing to be done for 'install-exec-am'.
make[3]: Nothing to be done for 'install-data-am'.
make[3]: Leaving directory '/usr/src/RPM/BUILD/polkit-0.115/docs'
make[2]: Leaving directory '/usr/src/RPM/BUILD/polkit-0.115/docs'
make[1]: Leaving directory '/usr/src/RPM/BUILD/polkit-0.115/docs'
Making install in po
make[1]: Entering directory '/usr/src/RPM/BUILD/polkit-0.115/po'
linguas="cs da de hr hu id it pl pt_BR sk sv tr uk zh_CN zh_TW "; \
for lang in $linguas; do \
  dir=/usr/src/tmp/polkit-buildroot/usr/share/locale/$lang/LC_MESSAGES; \
  /bin/sh /usr/src/RPM/BUILD/polkit-0.115/install-sh -d $dir; \
  if test -r $lang.gmo; then \
    /bin/install -p -m 644 $lang.gmo $dir/polkit-1.mo; \
    echo "installing $lang.gmo as $dir/polkit-1.mo"; \
  else \
    /bin/install -p -m 644 ./$lang.gmo $dir/polkit-1.mo; \
    echo "installing ./$lang.gmo as" \
	 "$dir/polkit-1.mo"; \
  fi; \
  if test -r $lang.gmo.m; then \
    /bin/install -p -m 644 $lang.gmo.m $dir/polkit-1.mo.m; \
    echo "installing $lang.gmo.m as $dir/polkit-1.mo.m"; \
  else \
    if test -r ./$lang.gmo.m ; then \
      /bin/install -p -m 644 ./$lang.gmo.m \
	$dir/polkit-1.mo.m; \
      echo "installing ./$lang.gmo.m as" \
	   "$dir/polkit-1.mo.m"; \
    else \
      true; \
    fi; \
  fi; \
done
installing cs.gmo as /usr/src/tmp/polkit-buildroot/usr/share/locale/cs/LC_MESSAGES/polkit-1.mo
installing da.gmo as /usr/src/tmp/polkit-buildroot/usr/share/locale/da/LC_MESSAGES/polkit-1.mo
installing de.gmo as /usr/src/tmp/polkit-buildroot/usr/share/locale/de/LC_MESSAGES/polkit-1.mo
installing hr.gmo as /usr/src/tmp/polkit-buildroot/usr/share/locale/hr/LC_MESSAGES/polkit-1.mo
installing hu.gmo as /usr/src/tmp/polkit-buildroot/usr/share/locale/hu/LC_MESSAGES/polkit-1.mo
installing id.gmo as /usr/src/tmp/polkit-buildroot/usr/share/locale/id/LC_MESSAGES/polkit-1.mo
installing it.gmo as /usr/src/tmp/polkit-buildroot/usr/share/locale/it/LC_MESSAGES/polkit-1.mo
installing pl.gmo as /usr/src/tmp/polkit-buildroot/usr/share/locale/pl/LC_MESSAGES/polkit-1.mo
installing pt_BR.gmo as /usr/src/tmp/polkit-buildroot/usr/share/locale/pt_BR/LC_MESSAGES/polkit-1.mo
installing sk.gmo as /usr/src/tmp/polkit-buildroot/usr/share/locale/sk/LC_MESSAGES/polkit-1.mo
installing sv.gmo as /usr/src/tmp/polkit-buildroot/usr/share/locale/sv/LC_MESSAGES/polkit-1.mo
installing tr.gmo as /usr/src/tmp/polkit-buildroot/usr/share/locale/tr/LC_MESSAGES/polkit-1.mo
installing uk.gmo as /usr/src/tmp/polkit-buildroot/usr/share/locale/uk/LC_MESSAGES/polkit-1.mo
installing zh_CN.gmo as /usr/src/tmp/polkit-buildroot/usr/share/locale/zh_CN/LC_MESSAGES/polkit-1.mo
installing zh_TW.gmo as /usr/src/tmp/polkit-buildroot/usr/share/locale/zh_TW/LC_MESSAGES/polkit-1.mo
make[1]: Leaving directory '/usr/src/RPM/BUILD/polkit-0.115/po'
Making install in test
make[1]: Entering directory '/usr/src/RPM/BUILD/polkit-0.115'
make[2]: Entering directory '/usr/src/RPM/BUILD/polkit-0.115'
make[2]: Nothing to be done for 'install-exec-am'.
make[2]: Nothing to be done for 'install-data-am'.
make[2]: Leaving directory '/usr/src/RPM/BUILD/polkit-0.115'
make[1]: Leaving directory '/usr/src/RPM/BUILD/polkit-0.115'
make: Leaving directory '/usr/src/RPM/BUILD/polkit-0.115'
+ /usr/lib/rpm/find-lang polkit-1
+ /usr/lib/rpm/brp-alt
Cleaning files in /usr/src/tmp/polkit-buildroot (auto)
removed './usr/lib64/libpolkit-agent-1.la'
removed './usr/lib64/libpolkit-gobject-1.la'
mode of 'usr/share/polkit-1/rules.d' changed from 0700 (rwx------) to 0755 (rwxr-xr-x)
mode of './usr/bin/pkexec' changed from 4755 (rwsr-xr-x) to 4711 (rws--x--x)
mode of './usr/libexec/polkit-1/polkit-agent-helper-1' changed from 4755 (rwsr-xr-x) to 4711 (rws--x--x)
mode of './usr/lib64/libpolkit-agent-1.so.0.0.0' changed from 0755 (rwxr-xr-x) to 0644 (rw-r--r--)
mode of './usr/lib64/libpolkit-gobject-1.so.0.0.0' changed from 0755 (rwxr-xr-x) to 0644 (rw-r--r--)
Verifying and fixing files in /usr/src/tmp/polkit-buildroot (binconfig,pkgconfig,libtool,desktop)
/usr/lib64/pkgconfig/polkit-agent-1.pc: Libs: '-L${libdir} -lpolkit-agent-1' --> '-lpolkit-agent-1'
/usr/lib64/pkgconfig/polkit-gobject-1.pc: Libs: '-L${libdir} -lpolkit-gobject-1' --> '-lpolkit-gobject-1'
Checking contents of files in /usr/src/tmp/polkit-buildroot/ (default)
Compressing files in /usr/src/tmp/polkit-buildroot (auto)
Adjusting library links in /usr/src/tmp/polkit-buildroot
./lib:
./usr/lib64:
	libpolkit-gobject-1.so.0 -> libpolkit-gobject-1.so.0.0.0
	libpolkit-agent-1.so.0 -> libpolkit-agent-1.so.0.0.0
Verifying ELF objects in /usr/src/tmp/polkit-buildroot (arch=normal,fhs=normal,lfs=relaxed,lint=relaxed,rpath=normal,stack=normal,textrel=normal,unresolved=normal)
Hardlinking identical .pyc and .opt-?.pyc files
Hardlinking identical .pyc and .pyo files
Executing(%check): /bin/sh -e /usr/src/tmp/rpm-tmp.4434
Check is turned off by --disable check
Processing files: polkit-0.115-alt4
Finding Provides (using /usr/lib/rpm/find-provides)
Executing: /bin/sh -e /usr/src/tmp/rpm-tmp.2kAiso
find-provides: running scripts (alternatives,debuginfo,gir,lib,pam,perl,pkgconfig,python,python3,shell,typelib)
Finding Requires (using /usr/lib/rpm/find-requires)
Executing: /bin/sh -e /usr/src/tmp/rpm-tmp.gV5Kkb
find-requires: running scripts (cpp,debuginfo,files,gir-js,gir-python,gir,lib,pam,perl,pkgconfig,pkgconfiglib,python,python3,rpmlib,shebang,shell,static,symlinks,typelib)
Finding Requires(pre) (using /usr/lib/rpm/find-scriptlet-requires)
Executing: /bin/sh -e /usr/src/tmp/rpm-tmp.yL4ctc
Provides: pam0(polkit-1)
PreReq: dbus
Requires: libpolkit = 0.115-alt4, /etc/pam.d, /lib64/ld-linux-x86-64.so.2, libc.so.6(GLIBC_2.2.5)(64bit), libc.so.6(GLIBC_2.3.4)(64bit), libc.so.6(GLIBC_2.4)(64bit), libexpat.so.1()(64bit) >= set:kgE3cnblKbojEsaAEXyfxTdZC3R0, libgcc_s.so.1(GCC_3.0)(64bit), libgio-2.0.so.0()(64bit) >= set:oiDUBtH1eF8yZixp1os9FGi6gAHKo47TZx6JucM9urwIXM7EOqyN2eobCbm1xpmD7PN3Vu8ZB7Zq5S0yTRoZplPD5KTJINMpyAXn42Rqi78P91fSepqXFbGWPTU2tK3vJAn21nkm7tW3Y0, libglib-2.0.so.0()(64bit) >= set:og1iApF5D3jJ1MCkaq3aONVHMrdy3zPZqoAIPbuybr2lWHmjSsI00Zhkeq64xfwonmoOwPFCC6oNZ7SdkAB7b7xv5rqU1V5Nc0cbOHWTAruZxDuo0pPaDDMFnaeIkCSsBfqZLy4vQokbgd2pylkGdeYxzJ4yusfWgeE4gBM346zxhxgKDAItIwSGoUfWWkVO17OC03x0QfFTq1Wh1IZ3pGxuIKsBRbwvPsEHogJCHLmtlwUG1Zqbv5yQxMxJOAeAwI5vFCZ5kJDz82JDUlpZsZFoH8hZecNXuJXkC4c1am6Rbt5W2QDxE3HQauqrmVaw1SZErplvbUcrmOQqB0JyLK8i9mLxhUWBV9YFiEy3TqEoGm6G2UCFqbnmcx5, libgobject-2.0.so.0()(64bit) >= set:mhyuYfLEwDvzODXkLwYZKYckwrQAFA3PLyCYkGRVsv9kJedifOhdYrTlYuQ0opIznNcf0, libmozjs-60.so()(64bit) >= set:oiRCyKjQ3S6nbNEofwXmhqw8wSZtzivSMEOtQ7mnOAZszBjH7FR4DdXGZB4QPhppoK77HgZ6Z3Zh7kckaEaN0En6u3E4yCNkZvdHAamS8ko8fsNn5ml81UklqEGLFui4ubdWEIh4dMWQ0fGH47G, libmozjs-60.so(js)(64bit), libpam(include), libpam.so.0()(64bit) >= set:jfaUklyLtkDQAXlm2pUg1DY0, libpam.so.0(LIBPAM_1.0)(64bit), libpolkit-agent-1.so.0()(64bit) >= set:heO4ABcmJa3, libpolkit-gobject-1.so.0()(64bit) >= set:levQvCtKLp6dH1DyWzsTA5bqH6iOhA49FolZknzdpDFpQs8wVZDKxe0w35obSV3P4mlkZEmvUai6FCcuVtV9GvUwmgMUll3KZ3NUN9jiGJ3OcgBAXbOhIvApFd2h7Zhp5NZKEUbVFg2w87BbCyUtybuRAku4VeukYrZjIDZj7133Jwr9PdOV0, libpthread.so.0(GLIBC_2.2.5)(64bit), libstdc++.so.6(CXXABI_1.3)(64bit), libstdc++.so.6(CXXABI_1.3.9)(64bit), libstdc++.so.6(GLIBCXX_3.4)(64bit), libsystemd.so.0()(64bit) >= set:mi3ZHRcUraFfrVRirFARkjIeGTeY0pl28, libsystemd.so.0(LIBSYSTEMD_209)(64bit), libsystemd.so.0(LIBSYSTEMD_213)(64bit), pam0(system-auth), rtld(GNU_HASH)
Requires(interp): /bin/sh
Requires(rpmlib): rpmlib(SetVersions)
Requires(pre): /bin/sh, /usr/sbin/groupadd, /usr/sbin/useradd
Finding debuginfo files (using /usr/lib/rpm/find-debuginfo-files)
Executing: /bin/sh -e /usr/src/tmp/rpm-tmp.mCHXgj
Creating polkit-debuginfo package
Processing files: libpolkit-0.115-alt4
Finding Provides (using /usr/lib/rpm/find-provides)
Executing: /bin/sh -e /usr/src/tmp/rpm-tmp.m18D7u
find-provides: running scripts (alternatives,debuginfo,gir,lib,pam,perl,pkgconfig,python,python3,shell,typelib)
Finding Requires (using /usr/lib/rpm/find-requires)
Executing: /bin/sh -e /usr/src/tmp/rpm-tmp.Ixes4L
find-requires: running scripts (cpp,debuginfo,files,gir-js,gir-python,gir,lib,pam,perl,pkgconfig,pkgconfiglib,python,python3,rpmlib,shebang,shell,static,symlinks,typelib)
Provides: libpolkit1 = 0.115-alt4, libpolkit-agent-1.so.0()(64bit) = set:hdRcBl1XQmcoIql6ZehvARvtFmDflb7, libpolkit-gobject-1.so.0()(64bit) = set:ldZoWPEPZ6eZlrc6qXRjmkHSaMfIfWW5WB5J16vGmRgiehOe0QrzzLT3fV3aIS5etcSAtiPcUIAd8ZzXKB8xrU1En2oV2EPMLyP7cjYaXLkZAnJ9h1oa0D0UX5T9REbaZgUBbDWbxEZg7e8sOZwADFb38ukR89huiUS5YfIgCiZ4OA8RGPZxIFa38KFSKL87NZpcHvZbmwEPgtEpTIyEbrkU1y8zpnteVl83WBusoS10CVl6syujs7OASZ6q8LW7uC0nskjgSg3hArYIlvZdHoZv06L4IQZpzvT0Rg375WOg5BVSMBX2
Requires: libc.so.6(GLIBC_2.2.5)(64bit), libc.so.6(GLIBC_2.3.4)(64bit), libc.so.6(GLIBC_2.4)(64bit), libgio-2.0.so.0()(64bit) >= set:oiDUB1a8noK3gc57vxaMwoeKAVcUDbVfH6gAKPgeh2NF246aGzQ0bxUwEo54CpleN7OJugNGhqpElN7E5RBNwTlihYX6wF7EU6jFLQ9uZJaTfe9UZ3uNiZ2X9GMj3mtm89GhZphDCHsjoGtWEjbrllxEZr7, libglib-2.0.so.0()(64bit) >= set:ohpEqNVJFYoM1yZbKYMHhEtZq9yglPkZFJU904neXHT53yd3Q8KkjB68qZnSzOJs6xTaSQM3V5Rc0O9Uu7bveowjHYhcyvQMEmEpJsaFZ8Cye15yooQZ1tBasWJZxJJh6jpLyTqiGYgdzwxhFh3G6ZlK2uNhcEBsSH26ntYRBL2btEYxUg2IHAfwcYESyoIjoH7LaTDZCyd59GTVyTRRKCOAhb5E4YjxTGJ0JPgkUS0sq3mWZhpMZCplvrEyF7Y2JyrPwoKGVQprgG4i5FSvil0Kp2, libgobject-2.0.so.0()(64bit) >= set:mg2fwU3ZFnW12jyUCoZ5GUOaclZvdfzWP51Z2lXVxnPaKoPPBFgMcP9EZh9ZeUqy9fbZsNecExzZFgZl2lZk1ZCWhdUTeHUZecnbzi9sY5HXavENHoC7mU0, libpthread.so.0(GLIBC_2.2.5)(64bit), libsystemd.so.0()(64bit) >= set:mjEAY4HzXJzfgm, libsystemd.so.0(LIBSYSTEMD_209)(64bit), libsystemd.so.0(LIBSYSTEMD_213)(64bit), rtld(GNU_HASH)
Requires(rpmlib): rpmlib(SetVersions)
Obsoletes: libpolkit1 < 0.115
Finding debuginfo files (using /usr/lib/rpm/find-debuginfo-files)
Executing: /bin/sh -e /usr/src/tmp/rpm-tmp.QmPj0d
Creating libpolkit-debuginfo package
Processing files: libpolkit-devel-0.115-alt4
Finding Provides (using /usr/lib/rpm/find-provides)
Executing: /bin/sh -e /usr/src/tmp/rpm-tmp.i4yZZK
find-provides: running scripts (alternatives,debuginfo,gir,lib,pam,perl,pkgconfig,python,python3,shell,typelib)
Finding Requires (using /usr/lib/rpm/find-requires)
Executing: /bin/sh -e /usr/src/tmp/rpm-tmp.AeGIBn
find-requires: running scripts (cpp,debuginfo,files,gir-js,gir-python,gir,lib,pam,perl,pkgconfig,pkgconfiglib,python,python3,rpmlib,shebang,shell,static,symlinks,typelib)
In file included from /usr/src/tmp/polkit-buildroot/usr/include/polkit-1/polkit/polkitprivate.h:25:
/usr/src/tmp/polkit-buildroot/usr/include/polkit-1/polkit/polkitimplicitauthorization.h:23:2: error: #error "Only <polkit/polkit.h> can be included directly, this file may disappear or change contents."
 #error "Only <polkit/polkit.h> can be included directly, this file may disappear or change contents."
  ^~~~~
In file included from /usr/src/tmp/polkit-buildroot/usr/include/polkit-1/polkit/polkitprivate.h:26:
/usr/src/tmp/polkit-buildroot/usr/include/polkit-1/polkit/polkitactiondescription.h:23:2: error: #error "Only <polkit/polkit.h> can be included directly, this file may disappear or change contents."
 #error "Only <polkit/polkit.h> can be included directly, this file may disappear or change contents."
  ^~~~~
In file included from /usr/src/tmp/polkit-buildroot/usr/include/polkit-1/polkit/polkitprivate.h:27:
/usr/src/tmp/polkit-buildroot/usr/include/polkit-1/polkit/polkitsubject.h:23:2: error: #error "Only <polkit/polkit.h> can be included directly, this file may disappear or change contents."
 #error "Only <polkit/polkit.h> can be included directly, this file may disappear or change contents."
  ^~~~~
In file included from /usr/src/tmp/polkit-buildroot/usr/include/polkit-1/polkit/polkitprivate.h:28:
/usr/src/tmp/polkit-buildroot/usr/include/polkit-1/polkit/polkitauthorizationresult.h:23:2: error: #error "Only <polkit/polkit.h> can be included directly, this file may disappear or change contents."
 #error "Only <polkit/polkit.h> can be included directly, this file may disappear or change contents."
  ^~~~~
In file included from /usr/src/tmp/polkit-buildroot/usr/include/polkit-1/polkit/polkitprivate.h:29:
/usr/src/tmp/polkit-buildroot/usr/include/polkit-1/polkit/polkittemporaryauthorization.h:23:2: error: #error "Only <polkit/polkit.h> can be included directly, this file may disappear or change contents."
 #error "Only <polkit/polkit.h> can be included directly, this file may disappear or change contents."
  ^~~~~
cpp.req: /usr/src/tmp/polkit-buildroot/usr/include/polkit-1/polkit/polkitprivate.h: cpp failed, trying c++ mode
In file included from /usr/src/tmp/polkit-buildroot/usr/include/polkit-1/polkit/polkitprivate.h:25:
/usr/src/tmp/polkit-buildroot/usr/include/polkit-1/polkit/polkitimplicitauthorization.h:23:2: error: #error "Only <polkit/polkit.h> can be included directly, this file may disappear or change contents."
 #error "Only <polkit/polkit.h> can be included directly, this file may disappear or change contents."
  ^~~~~
In file included from /usr/src/tmp/polkit-buildroot/usr/include/polkit-1/polkit/polkitprivate.h:26:
/usr/src/tmp/polkit-buildroot/usr/include/polkit-1/polkit/polkitactiondescription.h:23:2: error: #error "Only <polkit/polkit.h> can be included directly, this file may disappear or change contents."
 #error "Only <polkit/polkit.h> can be included directly, this file may disappear or change contents."
  ^~~~~
In file included from /usr/src/tmp/polkit-buildroot/usr/include/polkit-1/polkit/polkitprivate.h:27:
/usr/src/tmp/polkit-buildroot/usr/include/polkit-1/polkit/polkitsubject.h:23:2: error: #error "Only <polkit/polkit.h> can be included directly, this file may disappear or change contents."
 #error "Only <polkit/polkit.h> can be included directly, this file may disappear or change contents."
  ^~~~~
In file included from /usr/src/tmp/polkit-buildroot/usr/include/polkit-1/polkit/polkitprivate.h:28:
/usr/src/tmp/polkit-buildroot/usr/include/polkit-1/polkit/polkitauthorizationresult.h:23:2: error: #error "Only <polkit/polkit.h> can be included directly, this file may disappear or change contents."
 #error "Only <polkit/polkit.h> can be included directly, this file may disappear or change contents."
  ^~~~~
In file included from /usr/src/tmp/polkit-buildroot/usr/include/polkit-1/polkit/polkitprivate.h:29:
/usr/src/tmp/polkit-buildroot/usr/include/polkit-1/polkit/polkittemporaryauthorization.h:23:2: error: #error "Only <polkit/polkit.h> can be included directly, this file may disappear or change contents."
 #error "Only <polkit/polkit.h> can be included directly, this file may disappear or change contents."
  ^~~~~
cpp.req: WARNING: /usr/src/tmp/polkit-buildroot/usr/include/polkit-1/polkit/polkitprivate.h: cpp failed
/usr/src/tmp/polkit-buildroot/usr/include/polkit-1/polkitagent/polkitagent.h:26:2: error: #error "libpolkitagent is unstable API and subject to change. You must define POLKIT_AGENT_I_KNOW_API_IS_SUBJECT_TO_CHANGE to acknowledge this."
 #error "libpolkitagent is unstable API and subject to change. You must define POLKIT_AGENT_I_KNOW_API_IS_SUBJECT_TO_CHANGE to acknowledge this."
  ^~~~~
cpp.req: /usr/src/tmp/polkit-buildroot/usr/include/polkit-1/polkitagent/polkitagent.h: cpp failed, trying c++ mode
/usr/src/tmp/polkit-buildroot/usr/include/polkit-1/polkitagent/polkitagent.h:26:2: error: #error "libpolkitagent is unstable API and subject to change. You must define POLKIT_AGENT_I_KNOW_API_IS_SUBJECT_TO_CHANGE to acknowledge this."
 #error "libpolkitagent is unstable API and subject to change. You must define POLKIT_AGENT_I_KNOW_API_IS_SUBJECT_TO_CHANGE to acknowledge this."
  ^~~~~
cpp.req: WARNING: /usr/src/tmp/polkit-buildroot/usr/include/polkit-1/polkitagent/polkitagent.h: cpp failed
/usr/src/tmp/polkit-buildroot/usr/include/polkit-1/polkitagent/polkitagenttypes.h:23:2: error: #error "Only <polkitagent/polkitagent.h> can be included directly, this file may disappear or change contents"
 #error "Only <polkitagent/polkitagent.h> can be included directly, this file may disappear or change contents"
  ^~~~~
cpp.req: /usr/src/tmp/polkit-buildroot/usr/include/polkit-1/polkitagent/polkitagenttypes.h: cpp failed, trying c++ mode
/usr/src/tmp/polkit-buildroot/usr/include/polkit-1/polkitagent/polkitagenttypes.h:23:2: error: #error "Only <polkitagent/polkitagent.h> can be included directly, this file may disappear or change contents"
 #error "Only <polkitagent/polkitagent.h> can be included directly, this file may disappear or change contents"
  ^~~~~
cpp.req: WARNING: /usr/src/tmp/polkit-buildroot/usr/include/polkit-1/polkitagent/polkitagenttypes.h: cpp failed
/usr/src/tmp/polkit-buildroot/usr/include/polkit-1/polkitagent/polkitagentsession.h:23:2: error: #error "Only <polkitagent/polkitagent.h> can be included directly, this file may disappear or change contents"
 #error "Only <polkitagent/polkitagent.h> can be included directly, this file may disappear or change contents"
  ^~~~~
In file included from /usr/src/tmp/polkit-buildroot/usr/include/polkit-1/polkitagent/polkitagentsession.h:30:
/usr/src/tmp/polkit-buildroot/usr/include/polkit-1/polkitagent/polkitagenttypes.h:23:2: error: #error "Only <polkitagent/polkitagent.h> can be included directly, this file may disappear or change contents"
 #error "Only <polkitagent/polkitagent.h> can be included directly, this file may disappear or change contents"
  ^~~~~
cpp.req: /usr/src/tmp/polkit-buildroot/usr/include/polkit-1/polkitagent/polkitagentsession.h: cpp failed, trying c++ mode
/usr/src/tmp/polkit-buildroot/usr/include/polkit-1/polkitagent/polkitagentsession.h:23:2: error: #error "Only <polkitagent/polkitagent.h> can be included directly, this file may disappear or change contents"
 #error "Only <polkitagent/polkitagent.h> can be included directly, this file may disappear or change contents"
  ^~~~~
In file included from /usr/src/tmp/polkit-buildroot/usr/include/polkit-1/polkitagent/polkitagentsession.h:30:
/usr/src/tmp/polkit-buildroot/usr/include/polkit-1/polkitagent/polkitagenttypes.h:23:2: error: #error "Only <polkitagent/polkitagent.h> can be included directly, this file may disappear or change contents"
 #error "Only <polkitagent/polkitagent.h> can be included directly, this file may disappear or change contents"
  ^~~~~
cpp.req: WARNING: /usr/src/tmp/polkit-buildroot/usr/include/polkit-1/polkitagent/polkitagentsession.h: cpp failed
/usr/src/tmp/polkit-buildroot/usr/include/polkit-1/polkitagent/polkitagentlistener.h:23:2: error: #error "Only <polkitagent/polkitagent.h> can be included directly, this file may disappear or change contents"
 #error "Only <polkitagent/polkitagent.h> can be included directly, this file may disappear or change contents"
  ^~~~~
In file included from /usr/src/tmp/polkit-buildroot/usr/include/polkit-1/polkitagent/polkitagentlistener.h:30:
/usr/src/tmp/polkit-buildroot/usr/include/polkit-1/polkitagent/polkitagenttypes.h:23:2: error: #error "Only <polkitagent/polkitagent.h> can be included directly, this file may disappear or change contents"
 #error "Only <polkitagent/polkitagent.h> can be included directly, this file may disappear or change contents"
  ^~~~~
cpp.req: /usr/src/tmp/polkit-buildroot/usr/include/polkit-1/polkitagent/polkitagentlistener.h: cpp failed, trying c++ mode
/usr/src/tmp/polkit-buildroot/usr/include/polkit-1/polkitagent/polkitagentlistener.h:23:2: error: #error "Only <polkitagent/polkitagent.h> can be included directly, this file may disappear or change contents"
 #error "Only <polkitagent/polkitagent.h> can be included directly, this file may disappear or change contents"
  ^~~~~
In file included from /usr/src/tmp/polkit-buildroot/usr/include/polkit-1/polkitagent/polkitagentlistener.h:30:
/usr/src/tmp/polkit-buildroot/usr/include/polkit-1/polkitagent/polkitagenttypes.h:23:2: error: #error "Only <polkitagent/polkitagent.h> can be included directly, this file may disappear or change contents"
 #error "Only <polkitagent/polkitagent.h> can be included directly, this file may disappear or change contents"
  ^~~~~
cpp.req: WARNING: /usr/src/tmp/polkit-buildroot/usr/include/polkit-1/polkitagent/polkitagentlistener.h: cpp failed
/usr/src/tmp/polkit-buildroot/usr/include/polkit-1/polkitagent/polkitagenttextlistener.h:23:2: error: #error "Only <polkitagent/polkitagent.h> can be included directly, this file may disappear or change contents"
 #error "Only <polkitagent/polkitagent.h> can be included directly, this file may disappear or change contents"
  ^~~~~
In file included from /usr/src/tmp/polkit-buildroot/usr/include/polkit-1/polkitagent/polkitagenttextlistener.h:30:
/usr/src/tmp/polkit-buildroot/usr/include/polkit-1/polkitagent/polkitagenttypes.h:23:2: error: #error "Only <polkitagent/polkitagent.h> can be included directly, this file may disappear or change contents"
 #error "Only <polkitagent/polkitagent.h> can be included directly, this file may disappear or change contents"
  ^~~~~
cpp.req: /usr/src/tmp/polkit-buildroot/usr/include/polkit-1/polkitagent/polkitagenttextlistener.h: cpp failed, trying c++ mode
/usr/src/tmp/polkit-buildroot/usr/include/polkit-1/polkitagent/polkitagenttextlistener.h:23:2: error: #error "Only <polkitagent/polkitagent.h> can be included directly, this file may disappear or change contents"
 #error "Only <polkitagent/polkitagent.h> can be included directly, this file may disappear or change contents"
  ^~~~~
In file included from /usr/src/tmp/polkit-buildroot/usr/include/polkit-1/polkitagent/polkitagenttextlistener.h:30:
/usr/src/tmp/polkit-buildroot/usr/include/polkit-1/polkitagent/polkitagenttypes.h:23:2: error: #error "Only <polkitagent/polkitagent.h> can be included directly, this file may disappear or change contents"
 #error "Only <polkitagent/polkitagent.h> can be included directly, this file may disappear or change contents"
  ^~~~~
cpp.req: WARNING: /usr/src/tmp/polkit-buildroot/usr/include/polkit-1/polkitagent/polkitagenttextlistener.h: cpp failed
Provides: libpolkit1-devel = 0.115-alt4, pkgconfig(polkit-agent-1) = 0.116, pkgconfig(polkit-gobject-1) = 0.116
Requires: libpolkit = 0.115-alt4, /usr/lib64/libpolkit-agent-1.so.0.0.0, /usr/lib64/libpolkit-gobject-1.so.0.0.0, /usr/lib64/pkgconfig, glib2-devel, libgio-devel, pkgconfig(gio-2.0) >= 2.18, pkgconfig(glib-2.0) >= 2.18
Obsoletes: libpolkit1-devel < 0.115
Finding debuginfo files (using /usr/lib/rpm/find-debuginfo-files)
Executing: /bin/sh -e /usr/src/tmp/rpm-tmp.eeCygb
Processing files: libpolkit-gir-0.115-alt4
Finding Provides (using /usr/lib/rpm/find-provides)
Executing: /bin/sh -e /usr/src/tmp/rpm-tmp.a3lYq4
find-provides: running scripts (alternatives,debuginfo,gir,lib,pam,perl,pkgconfig,python,python3,shell,typelib)
Finding Requires (using /usr/lib/rpm/find-requires)
Executing: /bin/sh -e /usr/src/tmp/rpm-tmp.GwNUw2
find-requires: running scripts (cpp,debuginfo,files,gir-js,gir-python,gir,lib,pam,perl,pkgconfig,pkgconfiglib,python,python3,rpmlib,shebang,shell,static,symlinks,typelib)
Provides: libpolkit1-gir = 0.115-alt4, typelib(Polkit) = 1.0, typelib(PolkitAgent) = 1.0
Requires: libpolkit = 0.115-alt4, typelib(Gio) = 2.0
Obsoletes: libpolkit1-gir < 0.115
Finding debuginfo files (using /usr/lib/rpm/find-debuginfo-files)
Executing: /bin/sh -e /usr/src/tmp/rpm-tmp.OrtoM4
Processing files: libpolkit-gir-devel-0.115-alt4
Finding Provides (using /usr/lib/rpm/find-provides)
Executing: /bin/sh -e /usr/src/tmp/rpm-tmp.U7rSEc
find-provides: running scripts (alternatives,debuginfo,gir,lib,pam,perl,pkgconfig,python,python3,shell,typelib)
Finding Requires (using /usr/lib/rpm/find-requires)
Executing: /bin/sh -e /usr/src/tmp/rpm-tmp.EK6XBq
find-requires: running scripts (cpp,debuginfo,files,gir-js,gir-python,gir,lib,pam,perl,pkgconfig,pkgconfiglib,python,python3,rpmlib,shebang,shell,static,symlinks,typelib)
Provides: libpolkit1-gir-devel = 0.115-alt4, gir(Polkit) = 1.0, gir(PolkitAgent) = 1.0
Requires: libpolkit-gir = 0.115-alt4, libpolkit-devel = 0.115-alt4, gir(Gio) = 2.0
Obsoletes: libpolkit1-gir-devel < 0.115
Processing files: polkit-debuginfo-0.115-alt4
Finding Provides (using /usr/lib/rpm/find-provides)
Executing: /bin/sh -e /usr/src/tmp/rpm-tmp.OYXa3I
find-provides: running scripts (debuginfo)
Finding Requires (using /usr/lib/rpm/find-requires)
Executing: /bin/sh -e /usr/src/tmp/rpm-tmp.g4HF55
find-requires: running scripts (debuginfo)
Requires: polkit = 0.115-alt4, /usr/lib/debug/lib64/ld-linux-x86-64.so.2.debug, debug64(libc.so.6), debug64(libexpat.so.1), debug64(libgcc_s.so.1), debug64(libgio-2.0.so.0), debug64(libglib-2.0.so.0), debug64(libgobject-2.0.so.0), debug64(libmozjs-60.so), debug64(libpam.so.0), debug64(libpolkit-agent-1.so.0), debug64(libpolkit-gobject-1.so.0), debug64(libpthread.so.0), debug64(libstdc++.so.6), debug64(libsystemd.so.0)
Processing files: libpolkit-debuginfo-0.115-alt4
Finding Provides (using /usr/lib/rpm/find-provides)
Executing: /bin/sh -e /usr/src/tmp/rpm-tmp.MxvkqA
find-provides: running scripts (debuginfo)
Finding Requires (using /usr/lib/rpm/find-requires)
Executing: /bin/sh -e /usr/src/tmp/rpm-tmp.cK9d48
find-requires: running scripts (debuginfo)
Provides: debug64(libpolkit-agent-1.so.0), debug64(libpolkit-gobject-1.so.0)
Requires: libpolkit = 0.115-alt4, debug64(libc.so.6), debug64(libgio-2.0.so.0), debug64(libglib-2.0.so.0), debug64(libgobject-2.0.so.0), debug64(libpthread.so.0), debug64(libsystemd.so.0)
Adding to polkit-debuginfo a strict dependency on libpolkit-debuginfo
Removing from polkit-debuginfo 21 sources provided by libpolkit-debuginfo
also prunning dir /usr/src/debug/polkit-0.115/src/polkit
Removing 2 extra deps from polkit due to dependency on libpolkit
Removing 2 extra deps from libpolkit-devel due to dependency on libpolkit
Removing 2 extra deps from polkit-debuginfo due to dependency on libpolkit-debuginfo
Removing 8 extra deps from polkit due to repentancy on libpolkit
Removing 6 extra deps from polkit-debuginfo due to repentancy on libpolkit-debuginfo
Wrote: /usr/src/RPM/RPMS/x86_64/polkit-0.115-alt4.x86_64.rpm
Wrote: /usr/src/RPM/RPMS/x86_64/libpolkit-0.115-alt4.x86_64.rpm
Wrote: /usr/src/RPM/RPMS/x86_64/libpolkit-devel-0.115-alt4.x86_64.rpm
Wrote: /usr/src/RPM/RPMS/x86_64/libpolkit-gir-0.115-alt4.x86_64.rpm
Wrote: /usr/src/RPM/RPMS/noarch/libpolkit-gir-devel-0.115-alt4.noarch.rpm
Wrote: /usr/src/RPM/RPMS/x86_64/polkit-debuginfo-0.115-alt4.x86_64.rpm
Wrote: /usr/src/RPM/RPMS/x86_64/libpolkit-debuginfo-0.115-alt4.x86_64.rpm
62.28user 7.76system 2:57.00elapsed 39%CPU (0avgtext+0avgdata 170544maxresident)k
0inputs+0outputs (0major+4422107minor)pagefaults 0swaps
78.40user 11.67system 3:23.24elapsed 44%CPU (0avgtext+0avgdata 170544maxresident)k
1952inputs+0outputs (0major+5129944minor)pagefaults 0swaps
--- libpolkit-0.115-alt4.x86_64.rpm.repo	2018-12-06 14:42:31.000000000 +0000
+++ libpolkit-0.115-alt4.x86_64.rpm.hasher	2019-01-01 03:13:53.086173502 +0000
@@ -20,3 +20,2 @@
 Provides: libpolkit-gobject-1.so.0()(64bit) = set:ldZoWPEPZ6eZlrc6qXRjmkHSaMfIfWW5WB5J16vGmRgiehOe0QrzzLT3fV3aIS5etcSAtiPcUIAd8ZzXKB8xrU1En2oV2EPMLyP7cjYaXLkZAnJ9h1oa0D0UX5T9REbaZgUBbDWbxEZg7e8sOZwADFb38ukR89huiUS5YfIgCiZ4OA8RGPZxIFa38KFSKL87NZpcHvZbmwEPgtEpTIyEbrkU1y8zpnteVl83WBusoS10CVl6syujs7OASZ6q8LW7uC0nskjgSg3hArYIlvZdHoZv06L4IQZpzvT0Rg375WOg5BVSMBX2
-Provides: .sisyphus.217425.100.1.1-libpolkit-0.115-alt4  
 Provides: libpolkit = 0.115-alt4
--- libpolkit-debuginfo-0.115-alt4.x86_64.rpm.repo	2018-12-06 14:42:31.000000000 +0000
+++ libpolkit-debuginfo-0.115-alt4.x86_64.rpm.hasher	2019-01-01 03:13:53.117173191 +0000
@@ -53,3 +53,3 @@
 /usr/src/debug/polkit-0.115/src/polkitagent/polkitagenttypes.h	100644	
-Requires: .sisyphus.217425.100.1.1-libpolkit-0.115-alt4  
+Requires: libpolkit = 0.115-alt4
 Requires: debug64(libc.so.6)  
@@ -63,3 +63,2 @@
 Provides: debug64(libpolkit-gobject-1.so.0)  
-Provides: .sisyphus.217425.100.1.1-libpolkit-debuginfo-0.115-alt4  
 Provides: libpolkit-debuginfo = 0.115-alt4
--- libpolkit-devel-0.115-alt4.x86_64.rpm.repo	2018-12-06 14:42:31.000000000 +0000
+++ libpolkit-devel-0.115-alt4.x86_64.rpm.hasher	2019-01-01 03:13:53.133173031 +0000
@@ -94,3 +94,3 @@
 /usr/share/gtk-doc/html/polkit-1/up.png	100644	
-Requires: .sisyphus.217425.100.1.1-libpolkit-0.115-alt4  
+Requires: libpolkit = 0.115-alt4
 Requires: /usr/lib64/pkgconfig  
@@ -104,3 +104,2 @@
 Provides: pkgconfig(polkit-gobject-1) = 0.116
-Provides: .sisyphus.217425.100.1.1-libpolkit-devel-0.115-alt4  
 Provides: libpolkit-devel = 0.115-alt4
--- libpolkit-gir-0.115-alt4.x86_64.rpm.repo	2018-12-06 14:42:31.000000000 +0000
+++ libpolkit-gir-0.115-alt4.x86_64.rpm.hasher	2019-01-01 03:13:53.148172880 +0000
@@ -2,3 +2,3 @@
 /usr/lib64/girepository-1.0/PolkitAgent-1.0.typelib	100644	
-Requires: .sisyphus.217425.100.1.1-libpolkit-0.115-alt4  
+Requires: libpolkit = 0.115-alt4
 Requires: typelib(Gio) = 2.0
@@ -8,3 +8,2 @@
 Provides: typelib(PolkitAgent) = 1.0
-Provides: .sisyphus.217425.100.1.1-libpolkit-gir-0.115-alt4  
 Provides: libpolkit-gir = 0.115-alt4
--- libpolkit-gir-devel-0.115-alt4.noarch.rpm.repo	2018-12-06 14:42:31.000000000 +0000
+++ libpolkit-gir-devel-0.115-alt4.noarch.rpm.hasher	2019-01-01 03:13:53.164172720 +0000
@@ -2,4 +2,4 @@
 /usr/share/gir-1.0/PolkitAgent-1.0.gir	100644	
-Requires: .sisyphus.217425.100.1.1-libpolkit-gir-0.115-alt4  
-Requires: .sisyphus.217425.100.1.1-libpolkit-devel-0.115-alt4  
+Requires: libpolkit-gir = 0.115-alt4
+Requires: libpolkit-devel = 0.115-alt4
 Requires: gir(Gio) = 2.0
--- polkit-0.115-alt4.x86_64.rpm.repo	2018-12-06 14:42:31.000000000 +0000
+++ polkit-0.115-alt4.x86_64.rpm.hasher	2019-01-01 03:13:53.179172570 +0000
@@ -39,3 +39,3 @@
 /usr/share/polkit-1/rules.d	40700	
-Requires: .sisyphus.217425.100.1.1-libpolkit-0.115-alt4  
+Requires: libpolkit = 0.115-alt4
 Requires: dbus  
@@ -63,3 +63,2 @@
 Provides: pam0(polkit-1)  
-Provides: .sisyphus.217425.100.1.1-polkit-0.115-alt4  
 Provides: polkit = 0.115-alt4
--- polkit-debuginfo-0.115-alt4.x86_64.rpm.repo	2018-12-06 14:42:31.000000000 +0000
+++ polkit-debuginfo-0.115-alt4.x86_64.rpm.hasher	2019-01-01 03:13:53.251171847 +0000
@@ -33,3 +33,3 @@
 /usr/src/debug/polkit-0.115/src/programs/pkttyagent.c	100644	
-Requires: .sisyphus.217425.100.1.1-polkit-0.115-alt4  
+Requires: polkit = 0.115-alt4
 Requires: /usr/lib/debug/lib64/ld-linux-x86-64.so.2.debug  
@@ -40,3 +40,3 @@
 Requires: debug64(libstdc++.so.6)  
-Requires: .sisyphus.217425.100.1.1-libpolkit-debuginfo-0.115-alt4  
+Requires: libpolkit-debuginfo = 0.115-alt4
 Requires: rpmlib(PayloadIsLzma)