<86>Dec 27 05:01:18 userdel[1022]: delete user 'rooter'
<86>Dec 27 05:01:18 userdel[1022]: removed group 'rooter' owned by 'rooter'
<86>Dec 27 05:01:18 userdel[1022]: removed shadow group 'rooter' owned by 'rooter'
<86>Dec 27 05:01:18 groupadd[1075]: group added to /etc/group: name=rooter, GID=555
<86>Dec 27 05:01:18 groupadd[1075]: group added to /etc/gshadow: name=rooter
<86>Dec 27 05:01:18 groupadd[1075]: new group: name=rooter, GID=555
<86>Dec 27 05:01:18 useradd[1110]: new user: name=rooter, UID=555, GID=555, home=/root, shell=/bin/bash
<86>Dec 27 05:01:18 userdel[1168]: delete user 'builder'
<86>Dec 27 05:01:18 userdel[1168]: removed group 'builder' owned by 'builder'
<86>Dec 27 05:01:18 userdel[1168]: removed shadow group 'builder' owned by 'builder'
<86>Dec 27 05:01:18 groupadd[1210]: group added to /etc/group: name=builder, GID=556
<86>Dec 27 05:01:18 groupadd[1210]: group added to /etc/gshadow: name=builder
<86>Dec 27 05:01:18 groupadd[1210]: new group: name=builder, GID=556
<86>Dec 27 05:01:18 useradd[1225]: new user: name=builder, UID=556, GID=556, home=/usr/src, shell=/bin/bash
<13>Dec 27 05:01:22 rpmi: rpm-build-licenses-2.0.5-alt2 1454794749 installed
<13>Dec 27 05:01:25 rpmi: libexpat-2.2.4-alt1 1503305341 installed
<13>Dec 27 05:01:25 rpmi: liblz4-1:1.8.3-alt1 sisyphus.213737.100 1538009646 installed
<13>Dec 27 05:01:25 rpmi: libgpg-error-1.31-alt1.S1 1529015796 installed
<13>Dec 27 05:01:25 rpmi: libgcrypt20-1.8.3-alt4 sisyphus.218050.200 1545223148 installed
<13>Dec 27 05:01:25 rpmi: libsystemd-1:239-alt3 sisyphus.215710.300 1540765573 installed
<13>Dec 27 05:01:26 rpmi: libdbus-1.12.12-alt1 sisyphus.217336.100 1544000947 installed
<13>Dec 27 05:01:26 rpmi: dbus-tools-1.12.12-alt1 sisyphus.217336.100 1544000947 installed
<86>Dec 27 05:01:26 groupadd[12557]: group added to /etc/group: name=messagebus, GID=499
<86>Dec 27 05:01:26 groupadd[12557]: group added to /etc/gshadow: name=messagebus
<86>Dec 27 05:01:26 groupadd[12557]: new group: name=messagebus, GID=499
<86>Dec 27 05:01:26 useradd[12568]: new user: name=messagebus, UID=499, GID=499, home=/run/dbus, shell=/dev/null
<13>Dec 27 05:01:26 rpmi: dbus-1.12.12-alt1 sisyphus.217336.100 1544000947 installed
<13>Dec 27 05:01:26 rpmi: libdbus-devel-1.12.12-alt1 sisyphus.217336.100 1544000947 installed
<13>Dec 27 05:01:26 rpmi: libexpat-devel-2.2.4-alt1 1503305341 installed
Building target platforms: x86_64
Building for target x86_64
Wrote: /usr/src/in/nosrpm/libnih-1.0.3-alt2.nosrc.rpm
Installing libnih-1.0.3-alt2.src.rpm
Building target platforms: x86_64
Building for target x86_64
Executing(%prep): /bin/sh -e /usr/src/tmp/rpm-tmp.67861
+ umask 022
+ /bin/mkdir -p /usr/src/RPM/BUILD
+ cd /usr/src/RPM/BUILD
+ cd /usr/src/RPM/BUILD
+ rm -rf libnih-1.0.3
+ echo 'Source #0 (libnih-1.0.3.tar):'
Source #0 (libnih-1.0.3.tar):
+ /bin/tar -xf /usr/src/RPM/SOURCES/libnih-1.0.3.tar
+ cd libnih-1.0.3
+ /bin/chmod -c -Rf u+rwX,go-w .
+ echo 'Patch #0 (libnih-1.0.3-alt2.patch):'
Patch #0 (libnih-1.0.3-alt2.patch):
+ /usr/bin/patch -p1
patching file nih-dbus/Makefile.am
patching file nih/Makefile.am
+ echo 'Patch #1 (0001-Fallback-to-lstat-if-dirent.d_type-is-not-available-.patch):'
Patch #1 (0001-Fallback-to-lstat-if-dirent.d_type-is-not-available-.patch):
+ /usr/bin/patch -p1
patching file nih/file.c
patching file nih/tests/test_file.c
+ echo 'Patch #2 (libnih-1.0.3-debian-test-child-ignore-spurious-sigcont.patch):'
Patch #2 (libnih-1.0.3-debian-test-child-ignore-spurious-sigcont.patch):
+ /usr/bin/patch -p1
patching file nih/tests/test_child.c
+ exit 0
Executing(%build): /bin/sh -e /usr/src/tmp/rpm-tmp.67861
+ umask 022
+ /bin/mkdir -p /usr/src/RPM/BUILD
+ cd /usr/src/RPM/BUILD
+ cd libnih-1.0.3
+ autoreconf -fisv
autoreconf-default: Entering directory `.'
autoreconf-default: running: autopoint --force
Copying file intl/plural.c
Copying file m4/intldir.m4
Copying file po/Makevars.template
autoreconf-default: running: aclocal --force --install -I m4
aclocal-default: overwriting 'm4/libtool.m4' with '/usr/share/libtool/aclocal/libtool.m4'
aclocal-default: overwriting 'm4/ltoptions.m4' with '/usr/share/libtool/aclocal/ltoptions.m4'
aclocal-default: overwriting 'm4/ltversion.m4' with '/usr/share/libtool/aclocal/ltversion.m4'
aclocal-default: overwriting 'm4/lt~obsolete.m4' with '/usr/share/libtool/aclocal/lt~obsolete.m4'
aclocal-default: overwriting 'm4/pkg.m4' with '/usr/share/aclocal/pkg.m4'
autoreconf-default: configure.ac: tracing
autoreconf-default: running: libtoolize --force --install
libtoolize-default: putting auxiliary files in `.'.
libtoolize-default: linking file `./config.guess'
libtoolize-default: linking file `./config.sub'
libtoolize-default: linking file `./install-sh'
libtoolize-default: linking file `./ltmain.sh'
libtoolize-default: putting macros in AC_CONFIG_MACRO_DIR, `m4'.
libtoolize-default: linking file `m4/libtool.m4'
libtoolize-default: linking file `m4/ltoptions.m4'
libtoolize-default: linking file `m4/ltsugar.m4'
libtoolize-default: linking file `m4/ltversion.m4'
libtoolize-default: linking file `m4/lt~obsolete.m4'
autoreconf-default: configure.ac: not using Intltool
autoreconf-default: configure.ac: not using gtk-doc
autoreconf-default: running: /usr/bin/autoconf-2.60 --force
autoreconf-default: running: /usr/bin/autoheader-2.60 --force
autoreconf-default: running: automake --add-missing --force-missing
configure.ac:19: warning: The 'AM_PROG_MKDIR_P' macro is deprecated, and its use is discouraged.
configure.ac:19: You should use the Autoconf-provided 'AC_PROG_MKDIR_P' macro instead,
configure.ac:19: and use '$(MKDIR_P)' instead of '$(mkdir_p)'in your Makefile.am files.
nih-dbus-tool/Makefile.am:291: warning: source file 'tests/demarshal_factory.c' is in a subdirectory,
nih-dbus-tool/Makefile.am:291: but option 'subdir-objects' is disabled
automake-default: warning: possible forward-incompatibility.
automake-default: At least a source file is in a subdirectory, but the 'subdir-objects'
automake-default: automake option hasn't been enabled.  For now, the corresponding output
automake-default: object file(s) will be placed in the top-level directory.  However,
automake-default: this behaviour will change in future Automake versions: they will
automake-default: unconditionally cause object files to be placed in the same subdirectory
automake-default: of the corresponding sources.
automake-default: You are advised to start using 'subdir-objects' option throughout your
automake-default: project, to avoid future incompatibilities.
nih-dbus-tool/Makefile.am:302: warning: source file 'tests/interface_factory.c' is in a subdirectory,
nih-dbus-tool/Makefile.am:302: but option 'subdir-objects' is disabled
nih-dbus-tool/Makefile.am:280: warning: source file 'tests/marshal_factory.c' is in a subdirectory,
nih-dbus-tool/Makefile.am:280: but option 'subdir-objects' is disabled
nih-dbus-tool/Makefile.am:316: warning: source file 'tests/method_factory.c' is in a subdirectory,
nih-dbus-tool/Makefile.am:316: but option 'subdir-objects' is disabled
nih-dbus-tool/Makefile.am:344: warning: source file 'tests/property_factory.c' is in a subdirectory,
nih-dbus-tool/Makefile.am:344: but option 'subdir-objects' is disabled
nih-dbus-tool/Makefile.am:330: warning: source file 'tests/signal_factory.c' is in a subdirectory,
nih-dbus-tool/Makefile.am:330: but option 'subdir-objects' is disabled
nih-dbus-tool/Makefile.am:192: warning: source file 'tests/test_annotation.c' is in a subdirectory,
nih-dbus-tool/Makefile.am:192: but option 'subdir-objects' is disabled
nih-dbus-tool/Makefile.am:182: warning: source file 'tests/test_argument.c' is in a subdirectory,
nih-dbus-tool/Makefile.am:182: but option 'subdir-objects' is disabled
nih-dbus-tool/Makefile.am:223: warning: source file 'tests/test_com.netsplit.Nih.Test_object.c' is in a subdirectory,
nih-dbus-tool/Makefile.am:223: but option 'subdir-objects' is disabled
nih-dbus-tool/Makefile.am:223: warning: source file 'tests/com.netsplit.Nih.Test_impl.c' is in a subdirectory,
nih-dbus-tool/Makefile.am:223: but option 'subdir-objects' is disabled
nih-dbus-tool/Makefile.am:241: warning: source file 'tests/com.netsplit.Nih.Test_object.c' is in a subdirectory,
nih-dbus-tool/Makefile.am:241: but option 'subdir-objects' is disabled
nih-dbus-tool/Makefile.am:231: warning: source file 'tests/test_com.netsplit.Nih.Test_proxy.c' is in a subdirectory,
nih-dbus-tool/Makefile.am:231: but option 'subdir-objects' is disabled
nih-dbus-tool/Makefile.am:231: warning: source file 'tests/com.netsplit.Nih.Test_impl.c' is in a subdirectory,
nih-dbus-tool/Makefile.am:231: but option 'subdir-objects' is disabled
nih-dbus-tool/Makefile.am:255: warning: source file 'tests/com.netsplit.Nih.Test_proxy.c' is in a subdirectory,
nih-dbus-tool/Makefile.am:255: but option 'subdir-objects' is disabled
nih-dbus-tool/Makefile.am:106: warning: source file 'tests/test_demarshal.c' is in a subdirectory,
nih-dbus-tool/Makefile.am:106: but option 'subdir-objects' is disabled
nih-dbus-tool/Makefile.am:108: warning: source file 'tests/demarshal_code.c' is in a subdirectory,
nih-dbus-tool/Makefile.am:108: but option 'subdir-objects' is disabled
nih-dbus-tool/Makefile.am:83: warning: source file 'tests/test_indent.c' is in a subdirectory,
nih-dbus-tool/Makefile.am:83: but option 'subdir-objects' is disabled
nih-dbus-tool/Makefile.am:126: warning: source file 'tests/test_interface.c' is in a subdirectory,
nih-dbus-tool/Makefile.am:126: but option 'subdir-objects' is disabled
nih-dbus-tool/Makefile.am:128: warning: source file 'tests/interface_code.c' is in a subdirectory,
nih-dbus-tool/Makefile.am:128: but option 'subdir-objects' is disabled
nih-dbus-tool/Makefile.am:72: warning: source file 'tests/test_main.c' is in a subdirectory,
nih-dbus-tool/Makefile.am:72: but option 'subdir-objects' is disabled
nih-dbus-tool/Makefile.am:96: warning: source file 'tests/test_marshal.c' is in a subdirectory,
nih-dbus-tool/Makefile.am:96: but option 'subdir-objects' is disabled
nih-dbus-tool/Makefile.am:98: warning: source file 'tests/marshal_code.c' is in a subdirectory,
nih-dbus-tool/Makefile.am:98: but option 'subdir-objects' is disabled
nih-dbus-tool/Makefile.am:140: warning: source file 'tests/test_method.c' is in a subdirectory,
nih-dbus-tool/Makefile.am:140: but option 'subdir-objects' is disabled
nih-dbus-tool/Makefile.am:142: warning: source file 'tests/method_code.c' is in a subdirectory,
nih-dbus-tool/Makefile.am:142: but option 'subdir-objects' is disabled
nih-dbus-tool/Makefile.am:116: warning: source file 'tests/test_node.c' is in a subdirectory,
nih-dbus-tool/Makefile.am:116: but option 'subdir-objects' is disabled
nih-dbus-tool/Makefile.am:212: warning: source file 'tests/test_output.c' is in a subdirectory,
nih-dbus-tool/Makefile.am:212: but option 'subdir-objects' is disabled
nih-dbus-tool/Makefile.am:202: warning: source file 'tests/test_parse.c' is in a subdirectory,
nih-dbus-tool/Makefile.am:202: but option 'subdir-objects' is disabled
nih-dbus-tool/Makefile.am:168: warning: source file 'tests/test_property.c' is in a subdirectory,
nih-dbus-tool/Makefile.am:168: but option 'subdir-objects' is disabled
nih-dbus-tool/Makefile.am:170: warning: source file 'tests/property_code.c' is in a subdirectory,
nih-dbus-tool/Makefile.am:170: but option 'subdir-objects' is disabled
nih-dbus-tool/Makefile.am:154: warning: source file 'tests/test_signal.c' is in a subdirectory,
nih-dbus-tool/Makefile.am:154: but option 'subdir-objects' is disabled
nih-dbus-tool/Makefile.am:156: warning: source file 'tests/signal_code.c' is in a subdirectory,
nih-dbus-tool/Makefile.am:156: but option 'subdir-objects' is disabled
nih-dbus-tool/Makefile.am:77: warning: source file 'tests/test_symbol.c' is in a subdirectory,
nih-dbus-tool/Makefile.am:77: but option 'subdir-objects' is disabled
nih-dbus-tool/Makefile.am:89: warning: source file 'tests/test_type.c' is in a subdirectory,
nih-dbus-tool/Makefile.am:89: but option 'subdir-objects' is disabled
parallel-tests: installing './test-driver'
nih-dbus/Makefile.am:74: warning: source file 'tests/test_dbus_connection.c' is in a subdirectory,
nih-dbus/Makefile.am:74: but option 'subdir-objects' is disabled
nih-dbus/Makefile.am:70: warning: source file 'tests/test_dbus_error.c' is in a subdirectory,
nih-dbus/Makefile.am:70: but option 'subdir-objects' is disabled
nih-dbus/Makefile.am:78: warning: source file 'tests/test_dbus_message.c' is in a subdirectory,
nih-dbus/Makefile.am:78: but option 'subdir-objects' is disabled
nih-dbus/Makefile.am:82: warning: source file 'tests/test_dbus_object.c' is in a subdirectory,
nih-dbus/Makefile.am:82: but option 'subdir-objects' is disabled
nih-dbus/Makefile.am:86: warning: source file 'tests/test_dbus_pending_data.c' is in a subdirectory,
nih-dbus/Makefile.am:86: but option 'subdir-objects' is disabled
nih-dbus/Makefile.am:90: warning: source file 'tests/test_dbus_proxy.c' is in a subdirectory,
nih-dbus/Makefile.am:90: but option 'subdir-objects' is disabled
nih-dbus/Makefile.am:94: warning: source file 'tests/test_dbus_util.c' is in a subdirectory,
nih-dbus/Makefile.am:94: but option 'subdir-objects' is disabled
nih/Makefile.am:102: warning: source file 'tests/test_alloc.c' is in a subdirectory,
nih/Makefile.am:102: but option 'subdir-objects' is disabled
nih/Makefile.am:130: warning: source file 'tests/test_child.c' is in a subdirectory,
nih/Makefile.am:130: but option 'subdir-objects' is disabled
nih/Makefile.am:154: warning: source file 'tests/test_command.c' is in a subdirectory,
nih/Makefile.am:154: but option 'subdir-objects' is disabled
nih/Makefile.am:158: warning: source file 'tests/test_config.c' is in a subdirectory,
nih/Makefile.am:158: but option 'subdir-objects' is disabled
nih/Makefile.am:166: warning: source file 'tests/test_error.c' is in a subdirectory,
nih/Makefile.am:166: but option 'subdir-objects' is disabled
nih/Makefile.am:138: warning: source file 'tests/test_file.c' is in a subdirectory,
nih/Makefile.am:138: but option 'subdir-objects' is disabled
nih/Makefile.am:114: warning: source file 'tests/test_hash.c' is in a subdirectory,
nih/Makefile.am:114: but option 'subdir-objects' is disabled
nih/Makefile.am:134: warning: source file 'tests/test_io.c' is in a subdirectory,
nih/Makefile.am:134: but option 'subdir-objects' is disabled
nih/Makefile.am:110: warning: source file 'tests/test_list.c' is in a subdirectory,
nih/Makefile.am:110: but option 'subdir-objects' is disabled
nih/Makefile.am:162: warning: source file 'tests/test_logging.c' is in a subdirectory,
nih/Makefile.am:162: but option 'subdir-objects' is disabled
nih/Makefile.am:146: warning: source file 'tests/test_main.c' is in a subdirectory,
nih/Makefile.am:146: but option 'subdir-objects' is disabled
nih/Makefile.am:150: warning: source file 'tests/test_option.c' is in a subdirectory,
nih/Makefile.am:150: but option 'subdir-objects' is disabled
nih/Makefile.am:126: warning: source file 'tests/test_signal.c' is in a subdirectory,
nih/Makefile.am:126: but option 'subdir-objects' is disabled
nih/Makefile.am:106: warning: source file 'tests/test_string.c' is in a subdirectory,
nih/Makefile.am:106: but option 'subdir-objects' is disabled
nih/Makefile.am:122: warning: source file 'tests/test_timer.c' is in a subdirectory,
nih/Makefile.am:122: but option 'subdir-objects' is disabled
nih/Makefile.am:118: warning: source file 'tests/test_tree.c' is in a subdirectory,
nih/Makefile.am:118: but option 'subdir-objects' is disabled
nih/Makefile.am:142: warning: source file 'tests/test_watch.c' is in a subdirectory,
nih/Makefile.am:142: but option 'subdir-objects' is disabled
autoreconf-default: Leaving directory `.'
+ CFLAGS='-pipe -frecord-gcc-switches -Wall -g -O2'
+ export CFLAGS
+ CXXFLAGS='-pipe -frecord-gcc-switches -Wall -g -O2'
+ export CXXFLAGS
+ FFLAGS='-pipe -frecord-gcc-switches -Wall -g -O2'
+ export FFLAGS
+ '[' -n '' ']'
++ printf %s '-pipe -frecord-gcc-switches -Wall -g -O2'
++ sed -r 's/(^|[[:space:]]+)-[^m][^[:space:]]*//g'
+ ASFLAGS=
+ export ASFLAGS
+ export lt_cv_deplibs_check_method=pass_all
+ lt_cv_deplibs_check_method=pass_all
+ readlink -e -- ./configure
+ xargs -ri dirname -- '{}'
+ xargs -ri find '{}' -type f '(' -name config.sub -or -name config.guess ')' -printf '%h/\n'
+ xargs -rn1 install -pm755 -- /usr/share/gnu-config/config.sub /usr/share/gnu-config/config.guess
+ sort -u
+ ./configure --build=x86_64-alt-linux --host=x86_64-alt-linux --prefix=/usr --exec-prefix=/usr --bindir=/usr/bin --sbindir=/usr/sbin --sysconfdir=/etc --datadir=/usr/share --includedir=/usr/include --libdir=/usr/lib64 --libexecdir=/usr/lib --localstatedir=/var/lib --sharedstatedir=/var/lib --mandir=/usr/share/man --infodir=/usr/share/info --disable-dependency-tracking --without-included-gettext --disable-static
checking for x86_64-alt-linux-gcc... x86_64-alt-linux-gcc
checking whether the C compiler works... yes
checking for C compiler default output file name... a.out
checking for suffix of executables... 
checking whether we are cross compiling... no
checking for suffix of object files... o
checking whether we are using the GNU C compiler... yes
checking whether x86_64-alt-linux-gcc accepts -g... yes
checking for x86_64-alt-linux-gcc option to accept ISO C89... none needed
checking whether x86_64-alt-linux-gcc understands -c and -o together... yes
checking how to run the C preprocessor... x86_64-alt-linux-gcc -E
checking for grep that handles long lines and -e... /bin/grep
checking for egrep... /bin/grep -E
checking for ANSI C header files... yes
checking for sys/types.h... yes
checking for sys/stat.h... yes
checking for stdlib.h... yes
checking for string.h... yes
checking for memory.h... yes
checking for strings.h... yes
checking for inttypes.h... yes
checking for stdint.h... yes
checking for unistd.h... yes
checking minix/config.h usability... no
checking minix/config.h presence... no
checking for minix/config.h... no
checking whether it is safe to define __EXTENSIONS__... yes
checking for a BSD-compatible install... /bin/install -c
checking whether build environment is sane... yes
/bin/sh: /usr/src/missing: No such file or directory
configure: WARNING: 'missing' script is too old or missing
checking for a thread-safe mkdir -p... /bin/mkdir -p
checking for gawk... gawk
checking whether make sets $(MAKE)... yes
checking for style of include used by make... GNU
checking whether make supports nested variables... yes
checking dependency style of x86_64-alt-linux-gcc... none
checking whether make supports nested variables... (cached) yes
checking whether to enable maintainer-specific portions of Makefiles... yes
checking build system type... x86_64-alt-linux-gnu
checking host system type... x86_64-alt-linux-gnu
checking how to print strings... printf
checking for a sed that does not truncate output... /bin/sed
checking for fgrep... /bin/grep -F
checking for ld used by x86_64-alt-linux-gcc... /usr/bin/ld
checking if the linker (/usr/bin/ld) is GNU ld... yes
checking for BSD- or MS-compatible name lister (nm)... /usr/bin/nm -B
checking the name lister (/usr/bin/nm -B) interface... BSD nm
checking whether ln -s works... yes
checking the maximum length of command line arguments... 1572864
checking whether the shell understands some XSI constructs... yes
checking whether the shell understands "+="... yes
checking how to convert x86_64-alt-linux-gnu file names to x86_64-alt-linux-gnu format... func_convert_file_noop
checking how to convert x86_64-alt-linux-gnu file names to toolchain format... func_convert_file_noop
checking for /usr/bin/ld option to reload object files... -r
checking for x86_64-alt-linux-objdump... no
checking for objdump... objdump
checking how to recognize dependent libraries... (cached) pass_all
checking for x86_64-alt-linux-dlltool... no
checking for dlltool... no
checking how to associate runtime and link libraries... printf %s\n
checking for x86_64-alt-linux-ar... no
checking for ar... ar
checking for archiver @FILE support... @
checking for x86_64-alt-linux-strip... no
checking for strip... strip
checking for x86_64-alt-linux-ranlib... no
checking for ranlib... ranlib
checking command to parse /usr/bin/nm -B output from x86_64-alt-linux-gcc object... ok
checking for sysroot... no
checking for x86_64-alt-linux-mt... no
checking for mt... no
checking if : is a manifest tool... no
checking for dlfcn.h... yes
checking for objdir... .libs
checking if x86_64-alt-linux-gcc supports -fno-rtti -fno-exceptions... no
checking for x86_64-alt-linux-gcc option to produce PIC... -fPIC -DPIC
checking if x86_64-alt-linux-gcc PIC flag -fPIC -DPIC works... yes
checking if x86_64-alt-linux-gcc static flag -static works... no
checking if x86_64-alt-linux-gcc supports -c -o file.o... yes
checking if x86_64-alt-linux-gcc supports -c -o file.o... (cached) yes
checking whether the x86_64-alt-linux-gcc linker (/usr/bin/ld -m elf_x86_64) supports shared libraries... yes
checking whether -lc should be explicitly linked in... no
checking dynamic linker characteristics... GNU/Linux ld.so
checking how to hardcode library paths into programs... immediate
checking whether stripping libraries is possible... yes
checking if libtool supports shared libraries... yes
checking whether to build shared libraries... yes
checking whether to build static libraries... no
checking whether NLS is requested... yes
checking for msgfmt... /usr/bin/msgfmt
checking for gmsgfmt... /usr/bin/msgfmt
checking for xgettext... /usr/bin/xgettext
checking for msgmerge... /usr/bin/msgmerge
checking whether we are using the GNU C Library 2 or newer... yes
checking for x86_64-alt-linux-ranlib... ranlib
checking for simple visibility declarations... yes
checking for inline... inline
checking for size_t... yes
checking for stdint.h... yes
checking for working alloca.h... yes
checking for alloca... yes
checking for stdlib.h... (cached) yes
checking for unistd.h... (cached) yes
checking for sys/param.h... yes
checking for getpagesize... yes
checking for working mmap... yes
checking whether integer division by zero raises SIGFPE... yes
checking for inttypes.h... yes
checking for unsigned long long int... yes
checking for inttypes.h... (cached) yes
checking whether the inttypes.h PRIxNN macros are broken... no
checking for ld used by GCC... /usr/bin/ld -m elf_x86_64
checking if the linker (/usr/bin/ld -m elf_x86_64) is GNU ld... yes
checking for shared library run path origin... done
checking whether imported symbols can be declared weak... yes
checking pthread.h usability... yes
checking pthread.h presence... yes
checking for pthread.h... yes
checking for pthread_kill in -lpthread... yes
checking for pthread_rwlock_t... yes
checking for multithread API to use... posix
checking argz.h usability... yes
checking argz.h presence... yes
checking for argz.h... yes
checking for inttypes.h... (cached) yes
checking limits.h usability... yes
checking limits.h presence... yes
checking for limits.h... yes
checking for unistd.h... (cached) yes
checking for sys/param.h... (cached) yes
checking for getcwd... yes
checking for getegid... yes
checking for geteuid... yes
checking for getgid... yes
checking for getuid... yes
checking for mempcpy... yes
checking for munmap... yes
checking for stpcpy... yes
checking for strcasecmp... yes
checking for strdup... yes
checking for strtoul... yes
checking for tsearch... yes
checking for argz_count... yes
checking for argz_stringify... yes
checking for argz_next... yes
checking for __fsetlocking... yes
checking whether feof_unlocked is declared... yes
checking whether fgets_unlocked is declared... yes
checking for iconv... yes
checking for working iconv... yes
checking for iconv declaration... 
         extern size_t iconv (iconv_t cd, char * *inbuf, size_t *inbytesleft, char * *outbuf, size_t *outbytesleft);
checking for NL_LOCALE_NAME macro... yes
checking for bison... bison
checking version of bison... 3.0.5, ok
checking for long long int... yes
checking for wchar_t... yes
checking for wint_t... yes
checking for intmax_t... yes
checking whether printf() supports POSIX/XSI format strings... yes
checking whether we are using the GNU C Library 2.1 or newer... yes
checking for stdint.h... (cached) yes
checking for SIZE_MAX... yes
checking for stdint.h... (cached) yes
checking for CFPreferencesCopyAppValue... no
checking for CFLocaleCopyCurrent... no
checking for ptrdiff_t... yes
checking stddef.h usability... yes
checking stddef.h presence... yes
checking for stddef.h... yes
checking for stdlib.h... (cached) yes
checking for string.h... (cached) yes
checking for asprintf... yes
checking for fwprintf... yes
checking for putenv... yes
checking for setenv... yes
checking for setlocale... yes
checking for snprintf... yes
checking for wcslen... yes
checking whether _snprintf is declared... no
checking whether _snwprintf is declared... no
checking whether getc_unlocked is declared... yes
checking for nl_langinfo and CODESET... yes
checking for LC_MESSAGES... yes
checking for CFPreferencesCopyAppValue... (cached) no
checking for CFLocaleCopyCurrent... (cached) no
checking whether included gettext is requested... no
checking for GNU gettext in libc... yes
checking whether to use NLS... yes
checking where the gettext function comes from... libc
checking for x86_64-alt-linux-gcc... (cached) x86_64-alt-linux-gcc
checking whether we are using the GNU C compiler... (cached) yes
checking whether x86_64-alt-linux-gcc accepts -g... (cached) yes
checking for x86_64-alt-linux-gcc option to accept ISO C89... (cached) none needed
checking whether x86_64-alt-linux-gcc understands -c and -o together... (cached) yes
checking for x86_64-alt-linux-pkg-config... no
checking for pkg-config... /usr/bin/pkg-config
checking pkg-config is at least version 0.22... yes
checking for dbus-1 >= 1.2.16... yes
checking for XML_ParserCreate in -lexpat... yes
checking for XML_StopParser in -lexpat... yes
checking valgrind/valgrind.h usability... no
checking valgrind/valgrind.h presence... no
checking for valgrind/valgrind.h... no
checking for x86_64-alt-linux-gcc option to accept ISO C99... none needed
checking for linker version script argument... -Wl,--version-script
checking that generated files are newer than configure... done
configure: creating ./config.status
config.status: creating Makefile
config.status: creating m4/Makefile
config.status: creating intl/Makefile
config.status: creating nih/Makefile
config.status: creating nih/libnih.pc
config.status: creating nih-dbus/Makefile
config.status: creating nih-dbus/libnih-dbus.pc
config.status: creating nih-dbus-tool/Makefile
config.status: creating po/Makefile.in
config.status: creating config.h
config.status: executing depfiles commands
config.status: executing libtool commands
config.status: executing po-directories commands
config.status: creating po/POTFILES
config.status: creating po/Makefile
+ make -j8
make  all-recursive
Making all in m4
make[2]: Nothing to be done for 'all'.
Making all in intl
make[2]: Nothing to be done for 'all'.
Making all in nih
make[2]: Entering directory '/usr/src/RPM/BUILD/libnih-1.0.3/nih'
  CC       timer.lo
make[2]: Leaving directory '/usr/src/RPM/BUILD/libnih-1.0.3/nih'
make[2]: Entering directory '/usr/src/RPM/BUILD/libnih-1.0.3/nih'
  CC       signal.lo
make[2]: Leaving directory '/usr/src/RPM/BUILD/libnih-1.0.3/nih'
make[2]: Entering directory '/usr/src/RPM/BUILD/libnih-1.0.3/nih'
  CC       list.lo
make[2]: Leaving directory '/usr/src/RPM/BUILD/libnih-1.0.3/nih'
make[2]: Entering directory '/usr/src/RPM/BUILD/libnih-1.0.3/nih'
  CC       child.lo
make[2]: Leaving directory '/usr/src/RPM/BUILD/libnih-1.0.3/nih'
make[2]: Entering directory '/usr/src/RPM/BUILD/libnih-1.0.3/nih'
  CC       hash.lo
make[2]: Leaving directory '/usr/src/RPM/BUILD/libnih-1.0.3/nih'
make[2]: Entering directory '/usr/src/RPM/BUILD/libnih-1.0.3/nih'
  CC       tree.lo
make[2]: Leaving directory '/usr/src/RPM/BUILD/libnih-1.0.3/nih'
make[2]: Entering directory '/usr/src/RPM/BUILD/libnih-1.0.3/nih'
  CC       string.lo
make[2]: Leaving directory '/usr/src/RPM/BUILD/libnih-1.0.3/nih'
make[2]: Entering directory '/usr/src/RPM/BUILD/libnih-1.0.3/nih'
  CC       alloc.lo
make[2]: Leaving directory '/usr/src/RPM/BUILD/libnih-1.0.3/nih'
make[2]: Entering directory '/usr/src/RPM/BUILD/libnih-1.0.3/nih'
  CC       main.lo
make[2]: Leaving directory '/usr/src/RPM/BUILD/libnih-1.0.3/nih'
make[2]: Entering directory '/usr/src/RPM/BUILD/libnih-1.0.3/nih'
  CC       watch.lo
make[2]: Leaving directory '/usr/src/RPM/BUILD/libnih-1.0.3/nih'
make[2]: Entering directory '/usr/src/RPM/BUILD/libnih-1.0.3/nih'
  CC       command.lo
make[2]: Leaving directory '/usr/src/RPM/BUILD/libnih-1.0.3/nih'
make[2]: Entering directory '/usr/src/RPM/BUILD/libnih-1.0.3/nih'
  CC       file.lo
make[2]: Leaving directory '/usr/src/RPM/BUILD/libnih-1.0.3/nih'
make[2]: Entering directory '/usr/src/RPM/BUILD/libnih-1.0.3/nih'
  CC       logging.lo
make[2]: Leaving directory '/usr/src/RPM/BUILD/libnih-1.0.3/nih'
make[2]: Entering directory '/usr/src/RPM/BUILD/libnih-1.0.3/nih'
  CC       error.lo
make[2]: Leaving directory '/usr/src/RPM/BUILD/libnih-1.0.3/nih'
make[2]: Entering directory '/usr/src/RPM/BUILD/libnih-1.0.3/nih'
  CC       option.lo
make[2]: Leaving directory '/usr/src/RPM/BUILD/libnih-1.0.3/nih'
make[2]: Entering directory '/usr/src/RPM/BUILD/libnih-1.0.3/nih'
  CC       config.lo
make[2]: Leaving directory '/usr/src/RPM/BUILD/libnih-1.0.3/nih'
make[2]: Entering directory '/usr/src/RPM/BUILD/libnih-1.0.3/nih'
  CC       io.lo
make[2]: Leaving directory '/usr/src/RPM/BUILD/libnih-1.0.3/nih'
make[2]: Entering directory '/usr/src/RPM/BUILD/libnih-1.0.3/nih'
  CCLD     libnih.la
make[2]: Leaving directory '/usr/src/RPM/BUILD/libnih-1.0.3/nih'
Making all in nih-dbus
make[2]: Entering directory '/usr/src/RPM/BUILD/libnih-1.0.3/nih-dbus'
  CC       dbus_message.lo
make[2]: Leaving directory '/usr/src/RPM/BUILD/libnih-1.0.3/nih-dbus'
make[2]: Entering directory '/usr/src/RPM/BUILD/libnih-1.0.3/nih-dbus'
  CC       dbus_pending_data.lo
make[2]: Leaving directory '/usr/src/RPM/BUILD/libnih-1.0.3/nih-dbus'
make[2]: Entering directory '/usr/src/RPM/BUILD/libnih-1.0.3/nih-dbus'
  CC       dbus_error.lo
make[2]: Leaving directory '/usr/src/RPM/BUILD/libnih-1.0.3/nih-dbus'
make[2]: Entering directory '/usr/src/RPM/BUILD/libnih-1.0.3/nih-dbus'
  CC       dbus_util.lo
make[2]: Leaving directory '/usr/src/RPM/BUILD/libnih-1.0.3/nih-dbus'
make[2]: Entering directory '/usr/src/RPM/BUILD/libnih-1.0.3/nih-dbus'
  CC       dbus_proxy.lo
make[2]: Leaving directory '/usr/src/RPM/BUILD/libnih-1.0.3/nih-dbus'
make[2]: Entering directory '/usr/src/RPM/BUILD/libnih-1.0.3/nih-dbus'
  CC       dbus_connection.lo
make[2]: Leaving directory '/usr/src/RPM/BUILD/libnih-1.0.3/nih-dbus'
make[2]: Entering directory '/usr/src/RPM/BUILD/libnih-1.0.3/nih-dbus'
  CC       dbus_object.lo
make[2]: Leaving directory '/usr/src/RPM/BUILD/libnih-1.0.3/nih-dbus'
make[2]: Entering directory '/usr/src/RPM/BUILD/libnih-1.0.3/nih-dbus'
  CCLD     libnih-dbus.la
make[2]: Leaving directory '/usr/src/RPM/BUILD/libnih-1.0.3/nih-dbus'
Making all in nih-dbus-tool
make[2]: Entering directory '/usr/src/RPM/BUILD/libnih-1.0.3/nih-dbus-tool'
  CC       indent.o
make[2]: Leaving directory '/usr/src/RPM/BUILD/libnih-1.0.3/nih-dbus-tool'
make[2]: Entering directory '/usr/src/RPM/BUILD/libnih-1.0.3/nih-dbus-tool'
  CC       symbol.o
make[2]: Leaving directory '/usr/src/RPM/BUILD/libnih-1.0.3/nih-dbus-tool'
make[2]: Entering directory '/usr/src/RPM/BUILD/libnih-1.0.3/nih-dbus-tool'
  CC       main.o
make[2]: Leaving directory '/usr/src/RPM/BUILD/libnih-1.0.3/nih-dbus-tool'
make[2]: Entering directory '/usr/src/RPM/BUILD/libnih-1.0.3/nih-dbus-tool'
  CC       demarshal.o
make[2]: Leaving directory '/usr/src/RPM/BUILD/libnih-1.0.3/nih-dbus-tool'
make[2]: Entering directory '/usr/src/RPM/BUILD/libnih-1.0.3/nih-dbus-tool'
  CC       type.o
make[2]: Leaving directory '/usr/src/RPM/BUILD/libnih-1.0.3/nih-dbus-tool'
make[2]: Entering directory '/usr/src/RPM/BUILD/libnih-1.0.3/nih-dbus-tool'
  CC       marshal.o
make[2]: Leaving directory '/usr/src/RPM/BUILD/libnih-1.0.3/nih-dbus-tool'
make[2]: Entering directory '/usr/src/RPM/BUILD/libnih-1.0.3/nih-dbus-tool'
  CC       argument.o
make[2]: Leaving directory '/usr/src/RPM/BUILD/libnih-1.0.3/nih-dbus-tool'
make[2]: Entering directory '/usr/src/RPM/BUILD/libnih-1.0.3/nih-dbus-tool'
  CC       annotation.o
make[2]: Leaving directory '/usr/src/RPM/BUILD/libnih-1.0.3/nih-dbus-tool'
make[2]: Entering directory '/usr/src/RPM/BUILD/libnih-1.0.3/nih-dbus-tool'
  CC       parse.o
make[2]: Leaving directory '/usr/src/RPM/BUILD/libnih-1.0.3/nih-dbus-tool'
make[2]: Entering directory '/usr/src/RPM/BUILD/libnih-1.0.3/nih-dbus-tool'
  CC       signal.o
make[2]: Leaving directory '/usr/src/RPM/BUILD/libnih-1.0.3/nih-dbus-tool'
make[2]: Entering directory '/usr/src/RPM/BUILD/libnih-1.0.3/nih-dbus-tool'
  CC       output.o
make[2]: Leaving directory '/usr/src/RPM/BUILD/libnih-1.0.3/nih-dbus-tool'
make[2]: Entering directory '/usr/src/RPM/BUILD/libnih-1.0.3/nih-dbus-tool'
  CC       interface.o
In file included from /usr/include/string.h:507,
                 from interface.c:26:
In function 'memset',
    inlined from 'interface_properties_array' at interface.c:1005:4:
/usr/include/bits/string_fortified.h:71:10: warning: '__builtin_memset' specified size between 18446744073709551611 and 18446744073709551615 exceeds maximum object size 9223372036854775807 [-Wstringop-overflow=]
   return __builtin___memset_chk (__dest, __ch, __len, __bos0 (__dest));
          ^~~~~~~~~~~~~~~~~~~~~~~~~~~~~~~~~~~~~~~~~~~~~~~~~~~~~~~~~~~~~
make[2]: Leaving directory '/usr/src/RPM/BUILD/libnih-1.0.3/nih-dbus-tool'
make[2]: Entering directory '/usr/src/RPM/BUILD/libnih-1.0.3/nih-dbus-tool'
  CC       node.o
make[2]: Leaving directory '/usr/src/RPM/BUILD/libnih-1.0.3/nih-dbus-tool'
make[2]: Entering directory '/usr/src/RPM/BUILD/libnih-1.0.3/nih-dbus-tool'
  CC       property.o
make[2]: Leaving directory '/usr/src/RPM/BUILD/libnih-1.0.3/nih-dbus-tool'
make[2]: Entering directory '/usr/src/RPM/BUILD/libnih-1.0.3/nih-dbus-tool'
  CC       method.o
make[2]: Leaving directory '/usr/src/RPM/BUILD/libnih-1.0.3/nih-dbus-tool'
make[2]: Entering directory '/usr/src/RPM/BUILD/libnih-1.0.3/nih-dbus-tool'
  CCLD     nih-dbus-tool
make[2]: Leaving directory '/usr/src/RPM/BUILD/libnih-1.0.3/nih-dbus-tool'
make[2]: Entering directory '/usr/src/RPM/BUILD/libnih-1.0.3/nih-dbus-tool'
  GEN      tests/com.netsplit.Nih.Test_object.c
make[2]: Leaving directory '/usr/src/RPM/BUILD/libnih-1.0.3/nih-dbus-tool'
make[2]: Entering directory '/usr/src/RPM/BUILD/libnih-1.0.3/nih-dbus-tool'
  GEN      tests/com.netsplit.Nih.Test_object.h
make[2]: Leaving directory '/usr/src/RPM/BUILD/libnih-1.0.3/nih-dbus-tool'
make[2]: Entering directory '/usr/src/RPM/BUILD/libnih-1.0.3/nih-dbus-tool'
  GEN      tests/com.netsplit.Nih.Test_proxy.c
make[2]: Leaving directory '/usr/src/RPM/BUILD/libnih-1.0.3/nih-dbus-tool'
make[2]: Entering directory '/usr/src/RPM/BUILD/libnih-1.0.3/nih-dbus-tool'
  GEN      tests/com.netsplit.Nih.Test_proxy.h
make[2]: Leaving directory '/usr/src/RPM/BUILD/libnih-1.0.3/nih-dbus-tool'
make  all-am
make[3]: Nothing to be done for 'all-am'.
Making all in po
+ exit 0
Executing(%install): /bin/sh -e /usr/src/tmp/rpm-tmp.62272
+ umask 022
+ /bin/mkdir -p /usr/src/RPM/BUILD
+ cd /usr/src/RPM/BUILD
+ /bin/chmod -Rf u+rwX -- /usr/src/tmp/libnih-buildroot
+ :
+ /bin/rm -rf -- /usr/src/tmp/libnih-buildroot
+ cd libnih-1.0.3
+ make 'INSTALL=/bin/install -p' install DESTDIR=/usr/src/tmp/libnih-buildroot
make: Entering directory '/usr/src/RPM/BUILD/libnih-1.0.3'
Making install in m4
make[1]: Entering directory '/usr/src/RPM/BUILD/libnih-1.0.3/m4'
make[2]: Entering directory '/usr/src/RPM/BUILD/libnih-1.0.3/m4'
make[2]: Nothing to be done for 'install-exec-am'.
 /bin/mkdir -p '/usr/src/tmp/libnih-buildroot/usr/share/aclocal'
 /bin/install -p -m 644 libnih.m4 '/usr/src/tmp/libnih-buildroot/usr/share/aclocal'
make[2]: Leaving directory '/usr/src/RPM/BUILD/libnih-1.0.3/m4'
make[1]: Leaving directory '/usr/src/RPM/BUILD/libnih-1.0.3/m4'
Making install in intl
make[1]: Entering directory '/usr/src/RPM/BUILD/libnih-1.0.3/intl'
if { test "libnih" = "gettext-runtime" || test "libnih" = "gettext-tools"; } \
   && test 'no' = yes; then \
  /bin/mkdir -p /usr/src/tmp/libnih-buildroot/usr/lib64 /usr/src/tmp/libnih-buildroot/usr/include; \
  /bin/install -p -m 644 libintl.h /usr/src/tmp/libnih-buildroot/usr/include/libintl.h; \
  /bin/sh ../libtool --mode=install \
    /bin/install -p -m 644 libintl.a /usr/src/tmp/libnih-buildroot/usr/lib64/libintl.a; \
  if test "@RELOCATABLE@" = yes; then \
    dependencies=`sed -n -e 's,^dependency_libs=\(.*\),\1,p' < /usr/src/tmp/libnih-buildroot/usr/lib64/libintl.la | sed -e "s,^',," -e "s,'\$,,"`; \
    if test -n "$dependencies"; then \
      rm -f /usr/src/tmp/libnih-buildroot/usr/lib64/libintl.la; \
    fi; \
  fi; \
else \
  : ; \
fi
if test "libnih" = "gettext-tools" \
   && test 'no' = no \
   && test yes != no; then \
  /bin/mkdir -p /usr/src/tmp/libnih-buildroot/usr/lib64; \
  /bin/sh ../libtool --mode=install \
    /bin/install -p -m 644 libgnuintl.a /usr/src/tmp/libnih-buildroot/usr/lib64/libgnuintl.a; \
  rm -f /usr/src/tmp/libnih-buildroot/usr/lib64/preloadable_libintl.so; \
  /bin/install -p -m 644 /usr/src/tmp/libnih-buildroot/usr/lib64/libgnuintl.so /usr/src/tmp/libnih-buildroot/usr/lib64/preloadable_libintl.so; \
  /bin/sh ../libtool --mode=uninstall \
    rm -f /usr/src/tmp/libnih-buildroot/usr/lib64/libgnuintl.a; \
else \
  : ; \
fi
if test 'no' = yes; then \
  test yes != no || /bin/mkdir -p /usr/src/tmp/libnih-buildroot/usr/lib64; \
  temp=/usr/src/tmp/libnih-buildroot/usr/lib64/t-charset.alias; \
  dest=/usr/src/tmp/libnih-buildroot/usr/lib64/charset.alias; \
  if test -f /usr/src/tmp/libnih-buildroot/usr/lib64/charset.alias; then \
    orig=/usr/src/tmp/libnih-buildroot/usr/lib64/charset.alias; \
    sed -f ref-add.sed $orig > $temp; \
    /bin/install -p -m 644 $temp $dest; \
    rm -f $temp; \
  else \
    if test yes = no; then \
      orig=charset.alias; \
      sed -f ref-add.sed $orig > $temp; \
      /bin/install -p -m 644 $temp $dest; \
      rm -f $temp; \
    fi; \
  fi; \
  /bin/mkdir -p /usr/src/tmp/libnih-buildroot/usr/share/locale; \
  test -f /usr/src/tmp/libnih-buildroot/usr/share/locale/locale.alias \
    && orig=/usr/src/tmp/libnih-buildroot/usr/share/locale/locale.alias \
    || orig=./locale.alias; \
  temp=/usr/src/tmp/libnih-buildroot/usr/share/locale/t-locale.alias; \
  dest=/usr/src/tmp/libnih-buildroot/usr/share/locale/locale.alias; \
  sed -f ref-add.sed $orig > $temp; \
  /bin/install -p -m 644 $temp $dest; \
  rm -f $temp; \
else \
  : ; \
fi
if test "libnih" = "gettext-tools"; then \
  /bin/mkdir -p /usr/src/tmp/libnih-buildroot/usr/share/gettext/intl; \
  /bin/install -p -m 644 VERSION /usr/src/tmp/libnih-buildroot/usr/share/gettext/intl/VERSION; \
  /bin/install -p -m 644 ChangeLog.inst /usr/src/tmp/libnih-buildroot/usr/share/gettext/intl/ChangeLog; \
  dists="COPYING.LIB-2.0 COPYING.LIB-2.1 Makefile.in config.charset locale.alias ref-add.sin ref-del.sin export.h libintl.rc gmo.h gettextP.h hash-string.h loadinfo.h plural-exp.h eval-plural.h localcharset.h lock.h relocatable.h tsearch.h tsearch.c xsize.h printf-args.h printf-args.c printf-parse.h wprintf-parse.h printf-parse.c vasnprintf.h vasnwprintf.h vasnprintf.c os2compat.h libgnuintl.h.in bindtextdom.c dcgettext.c dgettext.c gettext.c finddomain.c hash-string.c loadmsgcat.c localealias.c textdomain.c l10nflist.c explodename.c dcigettext.c dcngettext.c dngettext.c ngettext.c plural.y plural-exp.c localcharset.c lock.c relocatable.c langprefs.c localename.c log.c printf.c version.c osdep.c os2compat.c intl-exports.c intl-compat.c"; \
  for file in $dists; do \
    /bin/install -p -m 644 ./$file \
		    /usr/src/tmp/libnih-buildroot/usr/share/gettext/intl/$file; \
  done; \
  chmod a+x /usr/src/tmp/libnih-buildroot/usr/share/gettext/intl/config.charset; \
  dists="plural.c"; \
  for file in $dists; do \
    if test -f $file; then dir=.; else dir=.; fi; \
    /bin/install -p -m 644 $dir/$file \
		    /usr/src/tmp/libnih-buildroot/usr/share/gettext/intl/$file; \
  done; \
  dists="xopen-msg.sed linux-msg.sed po2tbl.sed.in cat-compat.c COPYING.LIB-2 gettext.h libgettext.h plural-eval.c libgnuintl.h libgnuintl.h_vms Makefile.vms libgnuintl.h.msvc-static libgnuintl.h.msvc-shared Makefile.msvc"; \
  for file in $dists; do \
    rm -f /usr/src/tmp/libnih-buildroot/usr/share/gettext/intl/$file; \
  done; \
else \
  : ; \
fi
make[1]: Leaving directory '/usr/src/RPM/BUILD/libnih-1.0.3/intl'
Making install in nih
make[1]: Entering directory '/usr/src/RPM/BUILD/libnih-1.0.3/nih'
make[2]: Entering directory '/usr/src/RPM/BUILD/libnih-1.0.3/nih'
 /bin/mkdir -p '/usr/src/tmp/libnih-buildroot/usr/lib64'
 /bin/sh ../libtool   --mode=install /bin/install -p   libnih.la '/usr/src/tmp/libnih-buildroot/usr/lib64'
libtool: install: /bin/install -p .libs/libnih.so.1.0.0 /usr/src/tmp/libnih-buildroot/usr/lib64/libnih.so.1.0.0
libtool: install: (cd /usr/src/tmp/libnih-buildroot/usr/lib64 && { ln -s -f libnih.so.1.0.0 libnih.so.1 || { rm -f libnih.so.1 && ln -s libnih.so.1.0.0 libnih.so.1; }; })
libtool: install: (cd /usr/src/tmp/libnih-buildroot/usr/lib64 && { ln -s -f libnih.so.1.0.0 libnih.so || { rm -f libnih.so && ln -s libnih.so.1.0.0 libnih.so; }; })
libtool: install: /bin/install -p .libs/libnih.lai /usr/src/tmp/libnih-buildroot/usr/lib64/libnih.la
libtool: install: warning: remember to run `libtool --finish /usr/lib64'
 /bin/mkdir -p '/usr/src/tmp/libnih-buildroot/usr/include'
 /bin/install -p -m 644 libnih.h '/usr/src/tmp/libnih-buildroot/usr/include'
 /bin/mkdir -p '/usr/src/tmp/libnih-buildroot/usr/include/nih'
 /bin/install -p -m 644 macros.h alloc.h string.h list.h hash.h tree.h timer.h signal.h child.h io.h file.h watch.h main.h option.h command.h config.h logging.h error.h errors.h test.h test_output.h test_values.h test_process.h test_divert.h test_files.h test_alloc.h test_list.h test_hash.h '/usr/src/tmp/libnih-buildroot/usr/include/nih'
 /bin/mkdir -p '/usr/src/tmp/libnih-buildroot/usr/lib64/pkgconfig'
 /bin/install -p -m 644 libnih.pc '/usr/src/tmp/libnih-buildroot/usr/lib64/pkgconfig'
make[2]: Leaving directory '/usr/src/RPM/BUILD/libnih-1.0.3/nih'
make[1]: Leaving directory '/usr/src/RPM/BUILD/libnih-1.0.3/nih'
Making install in nih-dbus
make[1]: Entering directory '/usr/src/RPM/BUILD/libnih-1.0.3/nih-dbus'
make[2]: Entering directory '/usr/src/RPM/BUILD/libnih-1.0.3/nih-dbus'
 /bin/mkdir -p '/usr/src/tmp/libnih-buildroot/usr/lib64'
 /bin/sh ../libtool   --mode=install /bin/install -p   libnih-dbus.la '/usr/src/tmp/libnih-buildroot/usr/lib64'
libtool: install: warning: relinking `libnih-dbus.la'
libtool: install: (cd /usr/src/RPM/BUILD/libnih-1.0.3/nih-dbus; /bin/sh /usr/src/RPM/BUILD/libnih-1.0.3/libtool  --silent --tag CC --mode=relink x86_64-alt-linux-gcc -I/usr/include/dbus-1.0 -I/usr/lib64/dbus-1.0/include -pipe -frecord-gcc-switches -Wall -g -O2 -version-info 1:0:0 -Wl,--version-script=./libnih-dbus.ver -o libnih-dbus.la -rpath /usr/lib64 dbus_error.lo dbus_connection.lo dbus_message.lo dbus_object.lo dbus_pending_data.lo dbus_proxy.lo dbus_util.lo ../nih/libnih.la -ldbus-1 -lrt -inst-prefix-dir /usr/src/tmp/libnih-buildroot)
libtool: install: /bin/install -p .libs/libnih-dbus.so.1.0.0T /usr/src/tmp/libnih-buildroot/usr/lib64/libnih-dbus.so.1.0.0
libtool: install: (cd /usr/src/tmp/libnih-buildroot/usr/lib64 && { ln -s -f libnih-dbus.so.1.0.0 libnih-dbus.so.1 || { rm -f libnih-dbus.so.1 && ln -s libnih-dbus.so.1.0.0 libnih-dbus.so.1; }; })
libtool: install: (cd /usr/src/tmp/libnih-buildroot/usr/lib64 && { ln -s -f libnih-dbus.so.1.0.0 libnih-dbus.so || { rm -f libnih-dbus.so && ln -s libnih-dbus.so.1.0.0 libnih-dbus.so; }; })
libtool: install: /bin/install -p .libs/libnih-dbus.lai /usr/src/tmp/libnih-buildroot/usr/lib64/libnih-dbus.la
libtool: install: warning: remember to run `libtool --finish /usr/lib64'
 /bin/mkdir -p '/usr/src/tmp/libnih-buildroot/usr/include'
 /bin/install -p -m 644 libnih-dbus.h '/usr/src/tmp/libnih-buildroot/usr/include'
 /bin/mkdir -p '/usr/src/tmp/libnih-buildroot/usr/include/nih-dbus'
 /bin/install -p -m 644 dbus_error.h dbus_connection.h dbus_message.h dbus_interface.h dbus_object.h dbus_pending_data.h dbus_proxy.h dbus_util.h errors.h test_dbus.h '/usr/src/tmp/libnih-buildroot/usr/include/nih-dbus'
 /bin/mkdir -p '/usr/src/tmp/libnih-buildroot/usr/lib64/pkgconfig'
 /bin/install -p -m 644 libnih-dbus.pc '/usr/src/tmp/libnih-buildroot/usr/lib64/pkgconfig'
make[2]: Leaving directory '/usr/src/RPM/BUILD/libnih-1.0.3/nih-dbus'
make[1]: Leaving directory '/usr/src/RPM/BUILD/libnih-1.0.3/nih-dbus'
Making install in nih-dbus-tool
make[1]: Entering directory '/usr/src/RPM/BUILD/libnih-1.0.3/nih-dbus-tool'
make  install-am
make[2]: Entering directory '/usr/src/RPM/BUILD/libnih-1.0.3/nih-dbus-tool'
make[3]: Entering directory '/usr/src/RPM/BUILD/libnih-1.0.3/nih-dbus-tool'
 /bin/mkdir -p '/usr/src/tmp/libnih-buildroot/usr/bin'
  /bin/sh ../libtool   --mode=install /bin/install -p nih-dbus-tool '/usr/src/tmp/libnih-buildroot/usr/bin'
libtool: install: warning: `../nih/libnih.la' has not been installed in `/usr/lib64'
libtool: install: /bin/install -p .libs/nih-dbus-tool /usr/src/tmp/libnih-buildroot/usr/bin/nih-dbus-tool
 /bin/mkdir -p '/usr/src/tmp/libnih-buildroot/usr/share/man/man1'
 /bin/install -p -m 644 man/nih-dbus-tool.1 '/usr/src/tmp/libnih-buildroot/usr/share/man/man1'
make[3]: Leaving directory '/usr/src/RPM/BUILD/libnih-1.0.3/nih-dbus-tool'
make[2]: Leaving directory '/usr/src/RPM/BUILD/libnih-1.0.3/nih-dbus-tool'
make[1]: Leaving directory '/usr/src/RPM/BUILD/libnih-1.0.3/nih-dbus-tool'
Making install in po
make[1]: Entering directory '/usr/src/RPM/BUILD/libnih-1.0.3/po'
/bin/mkdir -p /usr/src/tmp/libnih-buildroot/usr/share
if test "libnih" = "gettext-tools"; then \
  /bin/mkdir -p /usr/src/tmp/libnih-buildroot/usr/share/gettext/po; \
  for file in Makefile.in.in remove-potcdate.sin quot.sed boldquot.sed en@quot.header en@boldquot.header insert-header.sin Rules-quot   Makevars.template; do \
    /bin/install -p -m 644 ./$file \
		    /usr/src/tmp/libnih-buildroot/usr/share/gettext/po/$file; \
  done; \
  for file in Makevars; do \
    rm -f /usr/src/tmp/libnih-buildroot/usr/share/gettext/po/$file; \
  done; \
else \
  : ; \
fi
make[1]: Leaving directory '/usr/src/RPM/BUILD/libnih-1.0.3/po'
make[1]: Entering directory '/usr/src/RPM/BUILD/libnih-1.0.3'
make[2]: Entering directory '/usr/src/RPM/BUILD/libnih-1.0.3'
make[2]: Nothing to be done for 'install-exec-am'.
make[2]: Nothing to be done for 'install-data-am'.
make[2]: Leaving directory '/usr/src/RPM/BUILD/libnih-1.0.3'
make[1]: Leaving directory '/usr/src/RPM/BUILD/libnih-1.0.3'
make: Leaving directory '/usr/src/RPM/BUILD/libnih-1.0.3'
+ /usr/lib/rpm/brp-alt
Cleaning files in /usr/src/tmp/libnih-buildroot (auto)
removed './usr/lib64/libnih-dbus.la'
removed './usr/lib64/libnih.la'
mode of './usr/lib64/libnih-dbus.so.1.0.0' changed from 0755 (rwxr-xr-x) to 0644 (rw-r--r--)
mode of './usr/lib64/libnih.so.1.0.0' changed from 0755 (rwxr-xr-x) to 0644 (rw-r--r--)
Verifying and fixing files in /usr/src/tmp/libnih-buildroot (binconfig,pkgconfig,libtool,desktop)
/usr/lib64/pkgconfig/libnih-dbus.pc: Cflags: '-I${includedir}' --> ''
/usr/lib64/pkgconfig/libnih-dbus.pc: Libs: '-L${libdir} -lnih-dbus' --> '-lnih-dbus'
/usr/lib64/pkgconfig/libnih.pc: Cflags: '-I${includedir}' --> ''
/usr/lib64/pkgconfig/libnih.pc: Libs: '-L${libdir} -lnih' --> '-lnih'
Checking contents of files in /usr/src/tmp/libnih-buildroot/ (default)
Compressing files in /usr/src/tmp/libnih-buildroot (auto)
Adjusting library links in /usr/src/tmp/libnih-buildroot
./usr/lib64:
	libnih.so.1 -> libnih.so.1.0.0
	libnih-dbus.so.1 -> libnih-dbus.so.1.0.0
Verifying ELF objects in /usr/src/tmp/libnih-buildroot (arch=normal,fhs=normal,lfs=relaxed,lint=relaxed,rpath=normal,stack=normal,textrel=normal,unresolved=normal)
Hardlinking identical .pyc and .pyo files
Executing(%check): /bin/sh -e /usr/src/tmp/rpm-tmp.6588
+ umask 022
+ /bin/mkdir -p /usr/src/RPM/BUILD
+ cd /usr/src/RPM/BUILD
+ cd libnih-1.0.3
+ make check
make: Entering directory '/usr/src/RPM/BUILD/libnih-1.0.3'
Making check in m4
make[1]: Entering directory '/usr/src/RPM/BUILD/libnih-1.0.3/m4'
make[1]: Nothing to be done for 'check'.
make[1]: Leaving directory '/usr/src/RPM/BUILD/libnih-1.0.3/m4'
Making check in intl
make[1]: Entering directory '/usr/src/RPM/BUILD/libnih-1.0.3/intl'
make[1]: Nothing to be done for 'check'.
make[1]: Leaving directory '/usr/src/RPM/BUILD/libnih-1.0.3/intl'
Making check in nih
make[1]: Entering directory '/usr/src/RPM/BUILD/libnih-1.0.3/nih'
make  test_alloc test_string test_list test_hash test_tree test_timer test_signal test_child test_io test_file test_watch test_main test_option test_command test_config test_logging test_error
make[2]: Entering directory '/usr/src/RPM/BUILD/libnih-1.0.3/nih'
  CC       test_alloc.o
  CCLD     test_alloc
  CC       test_string.o
  CCLD     test_string
  CC       test_list.o
  CCLD     test_list
  CC       test_hash.o
tests/test_hash.c: In function 'test_lookup':
tests/test_hash.c:473:29: warning: variable 'entry3' set but not used [-Wunused-but-set-variable]
  NihList *entry1, *entry2, *entry3, *ptr;
                             ^~~~~~
  CCLD     test_hash
  CC       test_tree.o
  CCLD     test_tree
  CC       test_timer.o
  CCLD     test_timer
  CC       test_signal.o
  CCLD     test_signal
  CC       test_child.o
In file included from ../nih/test.h:32,
                 from tests/test_child.c:22:
tests/test_child.c: In function 'test_poll':
../nih/test_process.h:63:5: warning: suggest explicit braces to avoid ambiguous 'else' [-Wdangling-else]
  if (_pid == 0) \
     ^
tests/test_child.c:136:2: note: in expansion of macro 'TEST_CHILD'
  TEST_CHILD (pid) {
  ^~~~~~~~~~
../nih/test_process.h:63:5: warning: suggest explicit braces to avoid ambiguous 'else' [-Wdangling-else]
  if (_pid == 0) \
     ^
tests/test_child.c:168:2: note: in expansion of macro 'TEST_CHILD'
  TEST_CHILD (pid) {
  ^~~~~~~~~~
../nih/test_process.h:63:5: warning: suggest explicit braces to avoid ambiguous 'else' [-Wdangling-else]
  if (_pid == 0) \
     ^
tests/test_child.c:200:2: note: in expansion of macro 'TEST_CHILD'
  TEST_CHILD (pid) {
  ^~~~~~~~~~
../nih/test_process.h:63:5: warning: suggest explicit braces to avoid ambiguous 'else' [-Wdangling-else]
  if (_pid == 0) \
     ^
tests/test_child.c:234:2: note: in expansion of macro 'TEST_CHILD'
  TEST_CHILD (pid) {
  ^~~~~~~~~~
../nih/test_process.h:63:5: warning: suggest explicit braces to avoid ambiguous 'else' [-Wdangling-else]
  if (_pid == 0) \
     ^
tests/test_child.c:282:2: note: in expansion of macro 'TEST_CHILD'
  TEST_CHILD (pid) {
  ^~~~~~~~~~
../nih/test_process.h:63:5: warning: suggest explicit braces to avoid ambiguous 'else' [-Wdangling-else]
  if (_pid == 0) \
     ^
tests/test_child.c:347:2: note: in expansion of macro 'TEST_CHILD'
  TEST_CHILD (pid) {
  ^~~~~~~~~~
../nih/test_process.h:63:5: warning: suggest explicit braces to avoid ambiguous 'else' [-Wdangling-else]
  if (_pid == 0) \
     ^
tests/test_child.c:409:2: note: in expansion of macro 'TEST_CHILD'
  TEST_CHILD (pid) {
  ^~~~~~~~~~
../nih/test_process.h:63:5: warning: suggest explicit braces to avoid ambiguous 'else' [-Wdangling-else]
  if (_pid == 0) \
     ^
tests/test_child.c:491:2: note: in expansion of macro 'TEST_CHILD'
  TEST_CHILD (pid) {
  ^~~~~~~~~~
../nih/test_process.h:63:5: warning: suggest explicit braces to avoid ambiguous 'else' [-Wdangling-else]
  if (_pid == 0) \
     ^
tests/test_child.c:549:2: note: in expansion of macro 'TEST_CHILD'
  TEST_CHILD (pid) {
  ^~~~~~~~~~
../nih/test_process.h:63:5: warning: suggest explicit braces to avoid ambiguous 'else' [-Wdangling-else]
  if (_pid == 0) \
     ^
tests/test_child.c:583:2: note: in expansion of macro 'TEST_CHILD'
  TEST_CHILD (pid) {
  ^~~~~~~~~~
../nih/test_process.h:63:5: warning: suggest explicit braces to avoid ambiguous 'else' [-Wdangling-else]
  if (_pid == 0) \
     ^
tests/test_child.c:614:2: note: in expansion of macro 'TEST_CHILD'
  TEST_CHILD (pid) {
  ^~~~~~~~~~
../nih/test_process.h:63:5: warning: suggest explicit braces to avoid ambiguous 'else' [-Wdangling-else]
  if (_pid == 0) \
     ^
tests/test_child.c:643:2: note: in expansion of macro 'TEST_CHILD'
  TEST_CHILD (pid) {
  ^~~~~~~~~~
  CCLD     test_child
  CC       test_io.o
  CCLD     test_io
  CC       test_file.o
  CCLD     test_file
  CC       test_watch.o
  CCLD     test_watch
  CC       test_main.o
In file included from ../nih/test.h:32,
                 from tests/test_main.c:22:
tests/test_main.c: In function 'test_daemonise':
../nih/test_process.h:63:5: warning: suggest explicit braces to avoid ambiguous 'else' [-Wdangling-else]
  if (_pid == 0) \
     ^
tests/test_main.c:236:2: note: in expansion of macro 'TEST_CHILD'
  TEST_CHILD (pid) {
  ^~~~~~~~~~
tests/test_main.c: In function 'test_main_loop':
tests/test_main.c:460:19: warning: variable 'timer' set but not used [-Wunused-but-set-variable]
  NihTimer        *timer;
                   ^~~~~
  CCLD     test_main
  CC       test_option.o
tests/test_option.c: In function 'test_version':
tests/test_option.c:1577:12: warning: variable 'args' set but not used [-Wunused-but-set-variable]
     char **args;
            ^~~~
In file included from ../nih/test.h:32,
                 from tests/test_option.c:22:
../nih/test_process.h:63:5: warning: suggest explicit braces to avoid ambiguous 'else' [-Wdangling-else]
  if (_pid == 0) \
     ^
tests/test_option.c:1575:3: note: in expansion of macro 'TEST_CHILD'
   TEST_CHILD (pid) {
   ^~~~~~~~~~
tests/test_option.c: In function 'test_help':
tests/test_option.c:1655:12: warning: variable 'args' set but not used [-Wunused-but-set-variable]
     char **args;
            ^~~~
In file included from ../nih/test.h:32,
                 from tests/test_option.c:22:
../nih/test_process.h:63:5: warning: suggest explicit braces to avoid ambiguous 'else' [-Wdangling-else]
  if (_pid == 0) \
     ^
tests/test_option.c:1651:3: note: in expansion of macro 'TEST_CHILD'
   TEST_CHILD (pid) {
   ^~~~~~~~~~
  CCLD     test_option
  CC       test_command.o
In file included from ../nih/test.h:32,
                 from tests/test_command.c:22:
tests/test_command.c: In function 'test_help':
../nih/test_process.h:63:5: warning: suggest explicit braces to avoid ambiguous 'else' [-Wdangling-else]
  if (_pid == 0) \
     ^
tests/test_command.c:612:3: note: in expansion of macro 'TEST_CHILD'
   TEST_CHILD (pid) {
   ^~~~~~~~~~
../nih/test_process.h:63:5: warning: suggest explicit braces to avoid ambiguous 'else' [-Wdangling-else]
  if (_pid == 0) \
     ^
tests/test_command.c:667:3: note: in expansion of macro 'TEST_CHILD'
   TEST_CHILD (pid) {
   ^~~~~~~~~~
../nih/test_process.h:63:5: warning: suggest explicit braces to avoid ambiguous 'else' [-Wdangling-else]
  if (_pid == 0) \
     ^
tests/test_command.c:719:3: note: in expansion of macro 'TEST_CHILD'
   TEST_CHILD (pid) {
   ^~~~~~~~~~
../nih/test_process.h:63:5: warning: suggest explicit braces to avoid ambiguous 'else' [-Wdangling-else]
  if (_pid == 0) \
     ^
tests/test_command.c:777:3: note: in expansion of macro 'TEST_CHILD'
   TEST_CHILD (pid) {
   ^~~~~~~~~~
../nih/test_process.h:63:5: warning: suggest explicit braces to avoid ambiguous 'else' [-Wdangling-else]
  if (_pid == 0) \
     ^
tests/test_command.c:840:3: note: in expansion of macro 'TEST_CHILD'
   TEST_CHILD (pid) {
   ^~~~~~~~~~
  CCLD     test_command
  CC       test_config.o
  CCLD     test_config
  CC       test_logging.o
  CCLD     test_logging
  CC       test_error.o
In file included from ../nih/test.h:32,
                 from tests/test_error.c:22:
tests/test_error.c: In function 'test_raise_error':
../nih/test_process.h:63:5: warning: suggest explicit braces to avoid ambiguous 'else' [-Wdangling-else]
  if (_pid == 0) \
     ^
tests/test_error.c:190:4: note: in expansion of macro 'TEST_CHILD'
    TEST_CHILD (pid) {
    ^~~~~~~~~~
tests/test_error.c: In function 'test_pop_context':
../nih/test_process.h:63:5: warning: suggest explicit braces to avoid ambiguous 'else' [-Wdangling-else]
  if (_pid == 0) \
     ^
tests/test_error.c:445:4: note: in expansion of macro 'TEST_CHILD'
    TEST_CHILD (pid) {
    ^~~~~~~~~~
  CCLD     test_error
make[2]: Leaving directory '/usr/src/RPM/BUILD/libnih-1.0.3/nih'
make  check-TESTS
make[2]: Entering directory '/usr/src/RPM/BUILD/libnih-1.0.3/nih'
make[3]: Entering directory '/usr/src/RPM/BUILD/libnih-1.0.3/nih'
PASS: test_alloc
PASS: test_string
PASS: test_list
PASS: test_hash
PASS: test_tree
PASS: test_timer
PASS: test_signal
PASS: test_child
PASS: test_io
PASS: test_file
PASS: test_watch
PASS: test_main
PASS: test_option
PASS: test_command
PASS: test_config
PASS: test_logging
PASS: test_error
make[4]: Entering directory '/usr/src/RPM/BUILD/libnih-1.0.3/nih'
make[4]: Nothing to be done for 'all'.
make[4]: Leaving directory '/usr/src/RPM/BUILD/libnih-1.0.3/nih'
============================================================================
Testsuite summary for libnih 1.0.3
============================================================================
# TOTAL: 17
# PASS:  17
# SKIP:  0
# XFAIL: 0
# FAIL:  0
# XPASS: 0
# ERROR: 0
============================================================================
make[3]: Leaving directory '/usr/src/RPM/BUILD/libnih-1.0.3/nih'
make[2]: Leaving directory '/usr/src/RPM/BUILD/libnih-1.0.3/nih'
make[1]: Leaving directory '/usr/src/RPM/BUILD/libnih-1.0.3/nih'
Making check in nih-dbus
make[1]: Entering directory '/usr/src/RPM/BUILD/libnih-1.0.3/nih-dbus'
make  test_dbus_error test_dbus_connection test_dbus_message test_dbus_object test_dbus_pending_data test_dbus_proxy test_dbus_util
make[2]: Entering directory '/usr/src/RPM/BUILD/libnih-1.0.3/nih-dbus'
  CC       test_dbus_error.o
  CCLD     test_dbus_error
  CC       test_dbus_connection.o
In file included from ../nih-dbus/test_dbus.h:26,
                 from tests/test_dbus_connection.c:23:
tests/test_dbus_connection.c: In function 'test_connect':
tests/test_dbus_connection.c:197:13: warning: suggest parentheses around assignment used as truth value [-Wparentheses]
     assert (sh = nih_signal_add_handler (NULL, SIGTERM,
             ^~
In file included from ../nih/test.h:32,
                 from tests/test_dbus_connection.c:22:
../nih/test_process.h:101:5: warning: suggest explicit braces to avoid ambiguous 'else' [-Wdangling-else]
  if (_pid == 0) \
     ^
tests/test_dbus_connection.c:193:4: note: in expansion of macro 'TEST_CHILD_WAIT'
    TEST_CHILD_WAIT (dbus_pid, wait_fd) {
    ^~~~~~~~~~~~~~~
In file included from ../nih-dbus/test_dbus.h:26,
                 from tests/test_dbus_connection.c:23:
tests/test_dbus_connection.c:288:13: warning: suggest parentheses around assignment used as truth value [-Wparentheses]
     assert (sh = nih_signal_add_handler (NULL, SIGTERM,
             ^~
In file included from ../nih/test.h:32,
                 from tests/test_dbus_connection.c:22:
../nih/test_process.h:101:5: warning: suggest explicit braces to avoid ambiguous 'else' [-Wdangling-else]
  if (_pid == 0) \
     ^
tests/test_dbus_connection.c:284:4: note: in expansion of macro 'TEST_CHILD_WAIT'
    TEST_CHILD_WAIT (dbus_pid, wait_fd) {
    ^~~~~~~~~~~~~~~
In file included from ../nih-dbus/test_dbus.h:26,
                 from tests/test_dbus_connection.c:23:
tests/test_dbus_connection.c:374:13: warning: suggest parentheses around assignment used as truth value [-Wparentheses]
     assert (sh = nih_signal_add_handler (NULL, SIGTERM,
             ^~
In file included from ../nih/test.h:32,
                 from tests/test_dbus_connection.c:22:
../nih/test_process.h:101:5: warning: suggest explicit braces to avoid ambiguous 'else' [-Wdangling-else]
  if (_pid == 0) \
     ^
tests/test_dbus_connection.c:370:4: note: in expansion of macro 'TEST_CHILD_WAIT'
    TEST_CHILD_WAIT (dbus_pid, wait_fd) {
    ^~~~~~~~~~~~~~~
In file included from ../nih-dbus/test_dbus.h:26,
                 from tests/test_dbus_connection.c:23:
tests/test_dbus_connection.c:460:13: warning: suggest parentheses around assignment used as truth value [-Wparentheses]
     assert (sh = nih_signal_add_handler (NULL, SIGTERM,
             ^~
In file included from ../nih/test.h:32,
                 from tests/test_dbus_connection.c:22:
../nih/test_process.h:101:5: warning: suggest explicit braces to avoid ambiguous 'else' [-Wdangling-else]
  if (_pid == 0) \
     ^
tests/test_dbus_connection.c:456:4: note: in expansion of macro 'TEST_CHILD_WAIT'
    TEST_CHILD_WAIT (dbus_pid, wait_fd) {
    ^~~~~~~~~~~~~~~
In file included from ../nih-dbus/test_dbus.h:26,
                 from tests/test_dbus_connection.c:23:
tests/test_dbus_connection.c:569:13: warning: suggest parentheses around assignment used as truth value [-Wparentheses]
     assert (sh = nih_signal_add_handler (NULL, SIGTERM,
             ^~
In file included from ../nih/test.h:32,
                 from tests/test_dbus_connection.c:22:
../nih/test_process.h:101:5: warning: suggest explicit braces to avoid ambiguous 'else' [-Wdangling-else]
  if (_pid == 0) \
     ^
tests/test_dbus_connection.c:565:4: note: in expansion of macro 'TEST_CHILD_WAIT'
    TEST_CHILD_WAIT (dbus_pid, wait_fd) {
    ^~~~~~~~~~~~~~~
In file included from ../nih-dbus/test_dbus.h:26,
                 from tests/test_dbus_connection.c:23:
tests/test_dbus_connection.c:662:13: warning: suggest parentheses around assignment used as truth value [-Wparentheses]
     assert (sh = nih_signal_add_handler (NULL, SIGTERM,
             ^~
In file included from ../nih/test.h:32,
                 from tests/test_dbus_connection.c:22:
../nih/test_process.h:101:5: warning: suggest explicit braces to avoid ambiguous 'else' [-Wdangling-else]
  if (_pid == 0) \
     ^
tests/test_dbus_connection.c:658:4: note: in expansion of macro 'TEST_CHILD_WAIT'
    TEST_CHILD_WAIT (dbus_pid, wait_fd) {
    ^~~~~~~~~~~~~~~
In file included from ../nih-dbus/test_dbus.h:26,
                 from tests/test_dbus_connection.c:23:
tests/test_dbus_connection.c:782:13: warning: suggest parentheses around assignment used as truth value [-Wparentheses]
     assert (sh  = nih_signal_add_handler (NULL, SIGTERM,
             ^~
In file included from ../nih/test.h:32,
                 from tests/test_dbus_connection.c:22:
../nih/test_process.h:101:5: warning: suggest explicit braces to avoid ambiguous 'else' [-Wdangling-else]
  if (_pid == 0) \
     ^
tests/test_dbus_connection.c:778:4: note: in expansion of macro 'TEST_CHILD_WAIT'
    TEST_CHILD_WAIT (dbus_pid, wait_fd) {
    ^~~~~~~~~~~~~~~
In file included from ../nih-dbus/test_dbus.h:26,
                 from tests/test_dbus_connection.c:23:
tests/test_dbus_connection.c: In function 'test_bus':
tests/test_dbus_connection.c:1081:12: warning: suggest parentheses around assignment used as truth value [-Wparentheses]
    assert (sh = nih_signal_add_handler (NULL, SIGTERM,
            ^~
In file included from ../nih/test.h:32,
                 from tests/test_dbus_connection.c:22:
../nih/test_process.h:101:5: warning: suggest explicit braces to avoid ambiguous 'else' [-Wdangling-else]
  if (_pid == 0) \
     ^
tests/test_dbus_connection.c:1077:3: note: in expansion of macro 'TEST_CHILD_WAIT'
   TEST_CHILD_WAIT (pid2, wait_fd) {
   ^~~~~~~~~~~~~~~
../nih/test_process.h:63:5: warning: suggest explicit braces to avoid ambiguous 'else' [-Wdangling-else]
  if (_pid == 0) \
     ^
tests/test_dbus_connection.c:1076:2: note: in expansion of macro 'TEST_CHILD'
  TEST_CHILD (pid1) {
  ^~~~~~~~~~
In file included from ../nih-dbus/test_dbus.h:26,
                 from tests/test_dbus_connection.c:23:
tests/test_dbus_connection.c: In function 'test_setup':
tests/test_dbus_connection.c:1175:11: warning: suggest parentheses around assignment used as truth value [-Wparentheses]
   assert (sh = nih_signal_add_handler (NULL, SIGTERM,
           ^~
In file included from ../nih/test.h:32,
                 from tests/test_dbus_connection.c:22:
../nih/test_process.h:101:5: warning: suggest explicit braces to avoid ambiguous 'else' [-Wdangling-else]
  if (_pid == 0) \
     ^
tests/test_dbus_connection.c:1171:2: note: in expansion of macro 'TEST_CHILD_WAIT'
  TEST_CHILD_WAIT (dbus_pid, wait_fd) {
  ^~~~~~~~~~~~~~~
  CCLD     test_dbus_connection
  CC       test_dbus_message.o
  CCLD     test_dbus_message
  CC       test_dbus_object.o
  CCLD     test_dbus_object
  CC       test_dbus_pending_data.o
  CCLD     test_dbus_pending_data
  CC       test_dbus_proxy.o
  CCLD     test_dbus_proxy
  CC       test_dbus_util.o
  CCLD     test_dbus_util
make[2]: Leaving directory '/usr/src/RPM/BUILD/libnih-1.0.3/nih-dbus'
make  check-TESTS
make[2]: Entering directory '/usr/src/RPM/BUILD/libnih-1.0.3/nih-dbus'
make[3]: Entering directory '/usr/src/RPM/BUILD/libnih-1.0.3/nih-dbus'
PASS: test_dbus_error
PASS: test_dbus_connection
PASS: test_dbus_message
PASS: test_dbus_object
PASS: test_dbus_pending_data
PASS: test_dbus_proxy
PASS: test_dbus_util
make[4]: Entering directory '/usr/src/RPM/BUILD/libnih-1.0.3/nih-dbus'
make[4]: Nothing to be done for 'all'.
make[4]: Leaving directory '/usr/src/RPM/BUILD/libnih-1.0.3/nih-dbus'
============================================================================
Testsuite summary for libnih 1.0.3
============================================================================
# TOTAL: 7
# PASS:  7
# SKIP:  0
# XFAIL: 0
# FAIL:  0
# XPASS: 0
# ERROR: 0
============================================================================
make[3]: Leaving directory '/usr/src/RPM/BUILD/libnih-1.0.3/nih-dbus'
make[2]: Leaving directory '/usr/src/RPM/BUILD/libnih-1.0.3/nih-dbus'
make[1]: Leaving directory '/usr/src/RPM/BUILD/libnih-1.0.3/nih-dbus'
Making check in nih-dbus-tool
make[1]: Entering directory '/usr/src/RPM/BUILD/libnih-1.0.3/nih-dbus-tool'
make  check-am
make[2]: Entering directory '/usr/src/RPM/BUILD/libnih-1.0.3/nih-dbus-tool'
make  test_main test_symbol test_indent test_type test_marshal test_demarshal test_node test_interface test_method test_signal test_property test_argument test_annotation test_parse test_output test_com.netsplit.Nih.Test_object test_com.netsplit.Nih.Test_proxy marshal_factory demarshal_factory interface_factory method_factory signal_factory property_factory
make[3]: Entering directory '/usr/src/RPM/BUILD/libnih-1.0.3/nih-dbus-tool'
  CC       test_main-test_main.o
  CC       test_main-main.o
  CCLD     test_main
  CC       test_symbol.o
  CCLD     test_symbol
  CC       test_indent.o
  CCLD     test_indent
  CC       test_type.o
  CCLD     test_type
  CC       test_marshal.o
  CC       marshal_factory.o
  CCLD     marshal_factory
  GEN      tests/marshal_code.c
  CC       marshal_code.o
  CCLD     test_marshal
  CC       test_demarshal.o
  CC       demarshal_factory.o
In file included from tests/demarshal_factory.c:31:
tests/demarshal_factory.c: In function 'demarshal_function':
tests/demarshal_factory.c:76:11: warning: suggest parentheses around assignment used as truth value [-Wparentheses]
   assert (arg_type = nih_strdup (NULL, var->type));
           ^~~~~~~~
  CCLD     demarshal_factory
  GEN      tests/demarshal_code.c
  CC       demarshal_code.o
  CCLD     test_demarshal
  CC       test_node.o
In file included from tests/test_node.c:27:
tests/test_node.c: In function 'test_start_tag':
tests/test_node.c:175:10: warning: suggest parentheses around assignment used as truth value [-Wparentheses]
  assert (xmlp = XML_ParserCreate ("UTF-8"));
          ^~~~
tests/test_node.c: In function 'test_end_tag':
tests/test_node.c:458:10: warning: suggest parentheses around assignment used as truth value [-Wparentheses]
  assert (xmlp = XML_ParserCreate ("UTF-8"));
          ^~~~
  CCLD     test_node
  CC       test_interface.o
In file included from tests/test_interface.c:30:
tests/test_interface.c: In function 'test_start_tag':
tests/test_interface.c:202:10: warning: suggest parentheses around assignment used as truth value [-Wparentheses]
  assert (xmlp = XML_ParserCreate ("UTF-8"));
          ^~~~
tests/test_interface.c: In function 'test_end_tag':
tests/test_interface.c:518:10: warning: suggest parentheses around assignment used as truth value [-Wparentheses]
  assert (xmlp = XML_ParserCreate ("UTF-8"));
          ^~~~
In file included from ../nih/test.h:32,
                 from tests/test_interface.c:22:
tests/test_interface.c: In function 'test_proxy_get_all_sync_function':
../nih/test_process.h:63:5: warning: suggest explicit braces to avoid ambiguous 'else' [-Wdangling-else]
  if (_pid == 0) \
     ^
tests/test_interface.c:5500:3: note: in expansion of macro 'TEST_CHILD'
   TEST_CHILD (pid) {
   ^~~~~~~~~~
../nih/test_process.h:63:5: warning: suggest explicit braces to avoid ambiguous 'else' [-Wdangling-else]
  if (_pid == 0) \
     ^
tests/test_interface.c:5646:3: note: in expansion of macro 'TEST_CHILD'
   TEST_CHILD (pid) {
   ^~~~~~~~~~
../nih/test_process.h:63:5: warning: suggest explicit braces to avoid ambiguous 'else' [-Wdangling-else]
  if (_pid == 0) \
     ^
tests/test_interface.c:5789:3: note: in expansion of macro 'TEST_CHILD'
   TEST_CHILD (pid) {
   ^~~~~~~~~~
../nih/test_process.h:63:5: warning: suggest explicit braces to avoid ambiguous 'else' [-Wdangling-else]
  if (_pid == 0) \
     ^
tests/test_interface.c:5956:3: note: in expansion of macro 'TEST_CHILD'
   TEST_CHILD (pid) {
   ^~~~~~~~~~
../nih/test_process.h:63:5: warning: suggest explicit braces to avoid ambiguous 'else' [-Wdangling-else]
  if (_pid == 0) \
     ^
tests/test_interface.c:6076:3: note: in expansion of macro 'TEST_CHILD'
   TEST_CHILD (pid) {
   ^~~~~~~~~~
../nih/test_process.h:63:5: warning: suggest explicit braces to avoid ambiguous 'else' [-Wdangling-else]
  if (_pid == 0) \
     ^
tests/test_interface.c:6216:3: note: in expansion of macro 'TEST_CHILD'
   TEST_CHILD (pid) {
   ^~~~~~~~~~
../nih/test_process.h:63:5: warning: suggest explicit braces to avoid ambiguous 'else' [-Wdangling-else]
  if (_pid == 0) \
     ^
tests/test_interface.c:6356:3: note: in expansion of macro 'TEST_CHILD'
   TEST_CHILD (pid) {
   ^~~~~~~~~~
../nih/test_process.h:63:5: warning: suggest explicit braces to avoid ambiguous 'else' [-Wdangling-else]
  if (_pid == 0) \
     ^
tests/test_interface.c:6484:3: note: in expansion of macro 'TEST_CHILD'
   TEST_CHILD (pid) {
   ^~~~~~~~~~
../nih/test_process.h:63:5: warning: suggest explicit braces to avoid ambiguous 'else' [-Wdangling-else]
  if (_pid == 0) \
     ^
tests/test_interface.c:6589:3: note: in expansion of macro 'TEST_CHILD'
   TEST_CHILD (pid) {
   ^~~~~~~~~~
../nih/test_process.h:63:5: warning: suggest explicit braces to avoid ambiguous 'else' [-Wdangling-else]
  if (_pid == 0) \
     ^
tests/test_interface.c:6684:3: note: in expansion of macro 'TEST_CHILD'
   TEST_CHILD (pid) {
   ^~~~~~~~~~
../nih/test_process.h:63:5: warning: suggest explicit braces to avoid ambiguous 'else' [-Wdangling-else]
  if (_pid == 0) \
     ^
tests/test_interface.c:6773:3: note: in expansion of macro 'TEST_CHILD'
   TEST_CHILD (pid) {
   ^~~~~~~~~~
  CC       interface_factory.o
  CCLD     interface_factory
  GEN      tests/interface_code.c
  CC       interface_code.o
  CCLD     test_interface
  CC       test_method.o
In file included from tests/test_method.c:33:
tests/test_method.c: In function 'test_start_tag':
tests/test_method.c:194:10: warning: suggest parentheses around assignment used as truth value [-Wparentheses]
  assert (xmlp = XML_ParserCreate ("UTF-8"));
          ^~~~
tests/test_method.c: In function 'test_end_tag':
tests/test_method.c:508:10: warning: suggest parentheses around assignment used as truth value [-Wparentheses]
  assert (xmlp = XML_ParserCreate ("UTF-8"));
          ^~~~
In file included from ../nih/test.h:32,
                 from tests/test_method.c:22:
tests/test_method.c: In function 'test_proxy_sync_function':
../nih/test_process.h:63:5: warning: suggest explicit braces to avoid ambiguous 'else' [-Wdangling-else]
  if (_pid == 0) \
     ^
tests/test_method.c:8984:3: note: in expansion of macro 'TEST_CHILD'
   TEST_CHILD (pid) {
   ^~~~~~~~~~
../nih/test_process.h:63:5: warning: suggest explicit braces to avoid ambiguous 'else' [-Wdangling-else]
  if (_pid == 0) \
     ^
tests/test_method.c:9126:3: note: in expansion of macro 'TEST_CHILD'
   TEST_CHILD (pid) {
   ^~~~~~~~~~
../nih/test_process.h:63:5: warning: suggest explicit braces to avoid ambiguous 'else' [-Wdangling-else]
  if (_pid == 0) \
     ^
tests/test_method.c:9213:3: note: in expansion of macro 'TEST_CHILD'
   TEST_CHILD (pid) {
   ^~~~~~~~~~
../nih/test_process.h:63:5: warning: suggest explicit braces to avoid ambiguous 'else' [-Wdangling-else]
  if (_pid == 0) \
     ^
tests/test_method.c:9374:3: note: in expansion of macro 'TEST_CHILD'
   TEST_CHILD (pid) {
   ^~~~~~~~~~
../nih/test_process.h:63:5: warning: suggest explicit braces to avoid ambiguous 'else' [-Wdangling-else]
  if (_pid == 0) \
     ^
tests/test_method.c:9503:3: note: in expansion of macro 'TEST_CHILD'
   TEST_CHILD (pid) {
   ^~~~~~~~~~
../nih/test_process.h:63:5: warning: suggest explicit braces to avoid ambiguous 'else' [-Wdangling-else]
  if (_pid == 0) \
     ^
tests/test_method.c:9628:3: note: in expansion of macro 'TEST_CHILD'
   TEST_CHILD (pid) {
   ^~~~~~~~~~
  CC       method_factory.o
  CCLD     method_factory
  GEN      tests/method_code.c
  CC       method_code.o
  CCLD     test_method
  CC       test_signal.o
In file included from tests/test_signal.c:30:
tests/test_signal.c: In function 'test_start_tag':
tests/test_signal.c:186:10: warning: suggest parentheses around assignment used as truth value [-Wparentheses]
  assert (xmlp = XML_ParserCreate ("UTF-8"));
          ^~~~
tests/test_signal.c: In function 'test_end_tag':
tests/test_signal.c:498:10: warning: suggest parentheses around assignment used as truth value [-Wparentheses]
  assert (xmlp = XML_ParserCreate ("UTF-8"));
          ^~~~
  CC       signal_factory.o
  CCLD     signal_factory
  GEN      tests/signal_code.c
  CC       signal_code.o
  CCLD     test_signal
  CC       test_property.o
In file included from tests/test_property.c:30:
tests/test_property.c: In function 'test_start_tag':
tests/test_property.c:188:10: warning: suggest parentheses around assignment used as truth value [-Wparentheses]
  assert (xmlp = XML_ParserCreate ("UTF-8"));
          ^~~~
tests/test_property.c: In function 'test_end_tag':
tests/test_property.c:723:10: warning: suggest parentheses around assignment used as truth value [-Wparentheses]
  assert (xmlp = XML_ParserCreate ("UTF-8"));
          ^~~~
In file included from ../nih/test.h:32,
                 from tests/test_property.c:22:
tests/test_property.c: In function 'test_proxy_get_sync_function':
../nih/test_process.h:63:5: warning: suggest explicit braces to avoid ambiguous 'else' [-Wdangling-else]
  if (_pid == 0) \
     ^
tests/test_property.c:7924:3: note: in expansion of macro 'TEST_CHILD'
   TEST_CHILD (pid) {
   ^~~~~~~~~~
../nih/test_process.h:63:5: warning: suggest explicit braces to avoid ambiguous 'else' [-Wdangling-else]
  if (_pid == 0) \
     ^
tests/test_property.c:8032:3: note: in expansion of macro 'TEST_CHILD'
   TEST_CHILD (pid) {
   ^~~~~~~~~~
../nih/test_process.h:63:5: warning: suggest explicit braces to avoid ambiguous 'else' [-Wdangling-else]
  if (_pid == 0) \
     ^
tests/test_property.c:8182:3: note: in expansion of macro 'TEST_CHILD'
   TEST_CHILD (pid) {
   ^~~~~~~~~~
../nih/test_process.h:63:5: warning: suggest explicit braces to avoid ambiguous 'else' [-Wdangling-else]
  if (_pid == 0) \
     ^
tests/test_property.c:8291:3: note: in expansion of macro 'TEST_CHILD'
   TEST_CHILD (pid) {
   ^~~~~~~~~~
../nih/test_process.h:63:5: warning: suggest explicit braces to avoid ambiguous 'else' [-Wdangling-else]
  if (_pid == 0) \
     ^
tests/test_property.c:8394:3: note: in expansion of macro 'TEST_CHILD'
   TEST_CHILD (pid) {
   ^~~~~~~~~~
../nih/test_process.h:63:5: warning: suggest explicit braces to avoid ambiguous 'else' [-Wdangling-else]
  if (_pid == 0) \
     ^
tests/test_property.c:8491:3: note: in expansion of macro 'TEST_CHILD'
   TEST_CHILD (pid) {
   ^~~~~~~~~~
tests/test_property.c: In function 'test_proxy_set_sync_function':
../nih/test_process.h:63:5: warning: suggest explicit braces to avoid ambiguous 'else' [-Wdangling-else]
  if (_pid == 0) \
     ^
tests/test_property.c:9111:3: note: in expansion of macro 'TEST_CHILD'
   TEST_CHILD (pid) {
   ^~~~~~~~~~
../nih/test_process.h:63:5: warning: suggest explicit braces to avoid ambiguous 'else' [-Wdangling-else]
  if (_pid == 0) \
     ^
tests/test_property.c:9219:3: note: in expansion of macro 'TEST_CHILD'
   TEST_CHILD (pid) {
   ^~~~~~~~~~
../nih/test_process.h:63:5: warning: suggest explicit braces to avoid ambiguous 'else' [-Wdangling-else]
  if (_pid == 0) \
     ^
tests/test_property.c:9380:3: note: in expansion of macro 'TEST_CHILD'
   TEST_CHILD (pid) {
   ^~~~~~~~~~
tests/test_property.c:8736:18: warning: variable 'parent' set but not used [-Wunused-but-set-variable]
  void *          parent = NULL;
                  ^~~~~~
  CC       property_factory.o
  CCLD     property_factory
  GEN      tests/property_code.c
  CC       property_code.o
  CCLD     test_property
  CC       test_argument.o
In file included from tests/test_argument.c:27:
tests/test_argument.c: In function 'test_start_tag':
tests/test_argument.c:193:10: warning: suggest parentheses around assignment used as truth value [-Wparentheses]
  assert (xmlp = XML_ParserCreate ("UTF-8"));
          ^~~~
tests/test_argument.c: In function 'test_end_tag':
tests/test_argument.c:978:10: warning: suggest parentheses around assignment used as truth value [-Wparentheses]
  assert (xmlp = XML_ParserCreate ("UTF-8"));
          ^~~~
  CCLD     test_argument
  CC       test_annotation.o
In file included from tests/test_annotation.c:27:
tests/test_annotation.c: In function 'test_start_tag':
tests/test_annotation.c:72:10: warning: suggest parentheses around assignment used as truth value [-Wparentheses]
  assert (xmlp = XML_ParserCreate ("UTF-8"));
          ^~~~
tests/test_annotation.c: In function 'test_end_tag':
tests/test_annotation.c:867:10: warning: suggest parentheses around assignment used as truth value [-Wparentheses]
  assert (xmlp = XML_ParserCreate ("UTF-8"));
          ^~~~
  CCLD     test_annotation
  CC       test_parse.o
In file included from ../nih/test_divert.h:28,
                 from ../nih/test.h:33,
                 from tests/test_parse.c:22:
tests/test_parse.c: In function 'test_start_tag':
tests/test_parse.c:442:10: warning: suggest parentheses around assignment used as truth value [-Wparentheses]
  assert (xmlp = XML_ParserCreate ("UTF-8"));
          ^~~~
tests/test_parse.c: In function 'test_end_tag':
tests/test_parse.c:1077:10: warning: suggest parentheses around assignment used as truth value [-Wparentheses]
  assert (xmlp = XML_ParserCreate ("UTF-8"));
          ^~~~
  CCLD     test_parse
  CC       test_output.o
  CCLD     test_output
  CC       test_com.netsplit.Nih.Test_object.o
  CC       com.netsplit.Nih.Test_impl.o
  CC       com.netsplit.Nih.Test_object.o
  CCLD     test_com.netsplit.Nih.Test_object
  CC       test_com.netsplit.Nih.Test_proxy.o
In file included from ../nih/test.h:32,
                 from tests/test_com.netsplit.Nih.Test_proxy.c:23:
tests/test_com.netsplit.Nih.Test_proxy.c: In function 'test_ordinary_method_sync':
../nih/test_process.h:101:5: warning: suggest explicit braces to avoid ambiguous 'else' [-Wdangling-else]
  if (_pid == 0) \
     ^
tests/test_com.netsplit.Nih.Test_proxy.c:581:2: note: in expansion of macro 'TEST_CHILD_WAIT'
  TEST_CHILD_WAIT (server_pid, wait_fd) {
  ^~~~~~~~~~~~~~~
tests/test_com.netsplit.Nih.Test_proxy.c: In function 'test_nameless_method_sync':
../nih/test_process.h:101:5: warning: suggest explicit braces to avoid ambiguous 'else' [-Wdangling-else]
  if (_pid == 0) \
     ^
tests/test_com.netsplit.Nih.Test_proxy.c:1299:2: note: in expansion of macro 'TEST_CHILD_WAIT'
  TEST_CHILD_WAIT (server_pid, wait_fd) {
  ^~~~~~~~~~~~~~~
tests/test_com.netsplit.Nih.Test_proxy.c: In function 'test_async_method_sync':
../nih/test_process.h:101:5: warning: suggest explicit braces to avoid ambiguous 'else' [-Wdangling-else]
  if (_pid == 0) \
     ^
tests/test_com.netsplit.Nih.Test_proxy.c:2033:2: note: in expansion of macro 'TEST_CHILD_WAIT'
  TEST_CHILD_WAIT (server_pid, wait_fd) {
  ^~~~~~~~~~~~~~~
tests/test_com.netsplit.Nih.Test_proxy.c: In function 'test_byte_to_str_sync':
../nih/test_process.h:101:5: warning: suggest explicit braces to avoid ambiguous 'else' [-Wdangling-else]
  if (_pid == 0) \
     ^
tests/test_com.netsplit.Nih.Test_proxy.c:2755:2: note: in expansion of macro 'TEST_CHILD_WAIT'
  TEST_CHILD_WAIT (server_pid, wait_fd) {
  ^~~~~~~~~~~~~~~
tests/test_com.netsplit.Nih.Test_proxy.c: In function 'test_str_to_byte_sync':
../nih/test_process.h:101:5: warning: suggest explicit braces to avoid ambiguous 'else' [-Wdangling-else]
  if (_pid == 0) \
     ^
tests/test_com.netsplit.Nih.Test_proxy.c:3469:2: note: in expansion of macro 'TEST_CHILD_WAIT'
  TEST_CHILD_WAIT (server_pid, wait_fd) {
  ^~~~~~~~~~~~~~~
tests/test_com.netsplit.Nih.Test_proxy.c: In function 'test_boolean_to_str_sync':
../nih/test_process.h:101:5: warning: suggest explicit braces to avoid ambiguous 'else' [-Wdangling-else]
  if (_pid == 0) \
     ^
tests/test_com.netsplit.Nih.Test_proxy.c:4110:2: note: in expansion of macro 'TEST_CHILD_WAIT'
  TEST_CHILD_WAIT (server_pid, wait_fd) {
  ^~~~~~~~~~~~~~~
tests/test_com.netsplit.Nih.Test_proxy.c: In function 'test_str_to_boolean_sync':
../nih/test_process.h:101:5: warning: suggest explicit braces to avoid ambiguous 'else' [-Wdangling-else]
  if (_pid == 0) \
     ^
tests/test_com.netsplit.Nih.Test_proxy.c:4782:2: note: in expansion of macro 'TEST_CHILD_WAIT'
  TEST_CHILD_WAIT (server_pid, wait_fd) {
  ^~~~~~~~~~~~~~~
tests/test_com.netsplit.Nih.Test_proxy.c: In function 'test_int16_to_str_sync':
../nih/test_process.h:101:5: warning: suggest explicit braces to avoid ambiguous 'else' [-Wdangling-else]
  if (_pid == 0) \
     ^
tests/test_com.netsplit.Nih.Test_proxy.c:5498:2: note: in expansion of macro 'TEST_CHILD_WAIT'
  TEST_CHILD_WAIT (server_pid, wait_fd) {
  ^~~~~~~~~~~~~~~
tests/test_com.netsplit.Nih.Test_proxy.c: In function 'test_str_to_int16_sync':
../nih/test_process.h:101:5: warning: suggest explicit braces to avoid ambiguous 'else' [-Wdangling-else]
  if (_pid == 0) \
     ^
tests/test_com.netsplit.Nih.Test_proxy.c:6212:2: note: in expansion of macro 'TEST_CHILD_WAIT'
  TEST_CHILD_WAIT (server_pid, wait_fd) {
  ^~~~~~~~~~~~~~~
tests/test_com.netsplit.Nih.Test_proxy.c: In function 'test_uint16_to_str_sync':
../nih/test_process.h:101:5: warning: suggest explicit braces to avoid ambiguous 'else' [-Wdangling-else]
  if (_pid == 0) \
     ^
tests/test_com.netsplit.Nih.Test_proxy.c:6928:2: note: in expansion of macro 'TEST_CHILD_WAIT'
  TEST_CHILD_WAIT (server_pid, wait_fd) {
  ^~~~~~~~~~~~~~~
tests/test_com.netsplit.Nih.Test_proxy.c: In function 'test_str_to_uint16_sync':
../nih/test_process.h:101:5: warning: suggest explicit braces to avoid ambiguous 'else' [-Wdangling-else]
  if (_pid == 0) \
     ^
tests/test_com.netsplit.Nih.Test_proxy.c:7642:2: note: in expansion of macro 'TEST_CHILD_WAIT'
  TEST_CHILD_WAIT (server_pid, wait_fd) {
  ^~~~~~~~~~~~~~~
tests/test_com.netsplit.Nih.Test_proxy.c: In function 'test_int32_to_str_sync':
../nih/test_process.h:101:5: warning: suggest explicit braces to avoid ambiguous 'else' [-Wdangling-else]
  if (_pid == 0) \
     ^
tests/test_com.netsplit.Nih.Test_proxy.c:8358:2: note: in expansion of macro 'TEST_CHILD_WAIT'
  TEST_CHILD_WAIT (server_pid, wait_fd) {
  ^~~~~~~~~~~~~~~
tests/test_com.netsplit.Nih.Test_proxy.c: In function 'test_str_to_int32_sync':
../nih/test_process.h:101:5: warning: suggest explicit braces to avoid ambiguous 'else' [-Wdangling-else]
  if (_pid == 0) \
     ^
tests/test_com.netsplit.Nih.Test_proxy.c:9072:2: note: in expansion of macro 'TEST_CHILD_WAIT'
  TEST_CHILD_WAIT (server_pid, wait_fd) {
  ^~~~~~~~~~~~~~~
tests/test_com.netsplit.Nih.Test_proxy.c: In function 'test_uint32_to_str_sync':
../nih/test_process.h:101:5: warning: suggest explicit braces to avoid ambiguous 'else' [-Wdangling-else]
  if (_pid == 0) \
     ^
tests/test_com.netsplit.Nih.Test_proxy.c:9788:2: note: in expansion of macro 'TEST_CHILD_WAIT'
  TEST_CHILD_WAIT (server_pid, wait_fd) {
  ^~~~~~~~~~~~~~~
tests/test_com.netsplit.Nih.Test_proxy.c: In function 'test_str_to_uint32_sync':
../nih/test_process.h:101:5: warning: suggest explicit braces to avoid ambiguous 'else' [-Wdangling-else]
  if (_pid == 0) \
     ^
tests/test_com.netsplit.Nih.Test_proxy.c:10502:2: note: in expansion of macro 'TEST_CHILD_WAIT'
  TEST_CHILD_WAIT (server_pid, wait_fd) {
  ^~~~~~~~~~~~~~~
tests/test_com.netsplit.Nih.Test_proxy.c: In function 'test_int64_to_str_sync':
../nih/test_process.h:101:5: warning: suggest explicit braces to avoid ambiguous 'else' [-Wdangling-else]
  if (_pid == 0) \
     ^
tests/test_com.netsplit.Nih.Test_proxy.c:11218:2: note: in expansion of macro 'TEST_CHILD_WAIT'
  TEST_CHILD_WAIT (server_pid, wait_fd) {
  ^~~~~~~~~~~~~~~
tests/test_com.netsplit.Nih.Test_proxy.c: In function 'test_str_to_int64_sync':
../nih/test_process.h:101:5: warning: suggest explicit braces to avoid ambiguous 'else' [-Wdangling-else]
  if (_pid == 0) \
     ^
tests/test_com.netsplit.Nih.Test_proxy.c:11932:2: note: in expansion of macro 'TEST_CHILD_WAIT'
  TEST_CHILD_WAIT (server_pid, wait_fd) {
  ^~~~~~~~~~~~~~~
tests/test_com.netsplit.Nih.Test_proxy.c: In function 'test_uint64_to_str_sync':
../nih/test_process.h:101:5: warning: suggest explicit braces to avoid ambiguous 'else' [-Wdangling-else]
  if (_pid == 0) \
     ^
tests/test_com.netsplit.Nih.Test_proxy.c:12648:2: note: in expansion of macro 'TEST_CHILD_WAIT'
  TEST_CHILD_WAIT (server_pid, wait_fd) {
  ^~~~~~~~~~~~~~~
tests/test_com.netsplit.Nih.Test_proxy.c: In function 'test_str_to_uint64_sync':
../nih/test_process.h:101:5: warning: suggest explicit braces to avoid ambiguous 'else' [-Wdangling-else]
  if (_pid == 0) \
     ^
tests/test_com.netsplit.Nih.Test_proxy.c:13362:2: note: in expansion of macro 'TEST_CHILD_WAIT'
  TEST_CHILD_WAIT (server_pid, wait_fd) {
  ^~~~~~~~~~~~~~~
tests/test_com.netsplit.Nih.Test_proxy.c: In function 'test_double_to_str_sync':
../nih/test_process.h:101:5: warning: suggest explicit braces to avoid ambiguous 'else' [-Wdangling-else]
  if (_pid == 0) \
     ^
tests/test_com.netsplit.Nih.Test_proxy.c:14078:2: note: in expansion of macro 'TEST_CHILD_WAIT'
  TEST_CHILD_WAIT (server_pid, wait_fd) {
  ^~~~~~~~~~~~~~~
tests/test_com.netsplit.Nih.Test_proxy.c: In function 'test_str_to_double_sync':
../nih/test_process.h:101:5: warning: suggest explicit braces to avoid ambiguous 'else' [-Wdangling-else]
  if (_pid == 0) \
     ^
tests/test_com.netsplit.Nih.Test_proxy.c:14792:2: note: in expansion of macro 'TEST_CHILD_WAIT'
  TEST_CHILD_WAIT (server_pid, wait_fd) {
  ^~~~~~~~~~~~~~~
tests/test_com.netsplit.Nih.Test_proxy.c: In function 'test_object_path_to_str_sync':
../nih/test_process.h:101:5: warning: suggest explicit braces to avoid ambiguous 'else' [-Wdangling-else]
  if (_pid == 0) \
     ^
tests/test_com.netsplit.Nih.Test_proxy.c:15508:2: note: in expansion of macro 'TEST_CHILD_WAIT'
  TEST_CHILD_WAIT (server_pid, wait_fd) {
  ^~~~~~~~~~~~~~~
tests/test_com.netsplit.Nih.Test_proxy.c: In function 'test_str_to_object_path_sync':
../nih/test_process.h:101:5: warning: suggest explicit braces to avoid ambiguous 'else' [-Wdangling-else]
  if (_pid == 0) \
     ^
tests/test_com.netsplit.Nih.Test_proxy.c:16226:2: note: in expansion of macro 'TEST_CHILD_WAIT'
  TEST_CHILD_WAIT (server_pid, wait_fd) {
  ^~~~~~~~~~~~~~~
tests/test_com.netsplit.Nih.Test_proxy.c: In function 'test_signature_to_str_sync':
../nih/test_process.h:101:5: warning: suggest explicit braces to avoid ambiguous 'else' [-Wdangling-else]
  if (_pid == 0) \
     ^
tests/test_com.netsplit.Nih.Test_proxy.c:16944:2: note: in expansion of macro 'TEST_CHILD_WAIT'
  TEST_CHILD_WAIT (server_pid, wait_fd) {
  ^~~~~~~~~~~~~~~
tests/test_com.netsplit.Nih.Test_proxy.c: In function 'test_str_to_signature_sync':
../nih/test_process.h:101:5: warning: suggest explicit braces to avoid ambiguous 'else' [-Wdangling-else]
  if (_pid == 0) \
     ^
tests/test_com.netsplit.Nih.Test_proxy.c:17662:2: note: in expansion of macro 'TEST_CHILD_WAIT'
  TEST_CHILD_WAIT (server_pid, wait_fd) {
  ^~~~~~~~~~~~~~~
tests/test_com.netsplit.Nih.Test_proxy.c: In function 'test_struct_to_str_sync':
../nih/test_process.h:101:5: warning: suggest explicit braces to avoid ambiguous 'else' [-Wdangling-else]
  if (_pid == 0) \
     ^
tests/test_com.netsplit.Nih.Test_proxy.c:18406:2: note: in expansion of macro 'TEST_CHILD_WAIT'
  TEST_CHILD_WAIT (server_pid, wait_fd) {
  ^~~~~~~~~~~~~~~
tests/test_com.netsplit.Nih.Test_proxy.c: In function 'test_str_to_struct_sync':
../nih/test_process.h:101:5: warning: suggest explicit braces to avoid ambiguous 'else' [-Wdangling-else]
  if (_pid == 0) \
     ^
tests/test_com.netsplit.Nih.Test_proxy.c:19144:2: note: in expansion of macro 'TEST_CHILD_WAIT'
  TEST_CHILD_WAIT (server_pid, wait_fd) {
  ^~~~~~~~~~~~~~~
tests/test_com.netsplit.Nih.Test_proxy.c: In function 'test_int32_array_to_str_sync':
../nih/test_process.h:101:5: warning: suggest explicit braces to avoid ambiguous 'else' [-Wdangling-else]
  if (_pid == 0) \
     ^
tests/test_com.netsplit.Nih.Test_proxy.c:19911:2: note: in expansion of macro 'TEST_CHILD_WAIT'
  TEST_CHILD_WAIT (server_pid, wait_fd) {
  ^~~~~~~~~~~~~~~
tests/test_com.netsplit.Nih.Test_proxy.c: In function 'test_str_to_int32_array_sync':
../nih/test_process.h:101:5: warning: suggest explicit braces to avoid ambiguous 'else' [-Wdangling-else]
  if (_pid == 0) \
     ^
tests/test_com.netsplit.Nih.Test_proxy.c:20664:2: note: in expansion of macro 'TEST_CHILD_WAIT'
  TEST_CHILD_WAIT (server_pid, wait_fd) {
  ^~~~~~~~~~~~~~~
tests/test_com.netsplit.Nih.Test_proxy.c: In function 'test_str_array_to_str_sync':
../nih/test_process.h:101:5: warning: suggest explicit braces to avoid ambiguous 'else' [-Wdangling-else]
  if (_pid == 0) \
     ^
tests/test_com.netsplit.Nih.Test_proxy.c:21453:2: note: in expansion of macro 'TEST_CHILD_WAIT'
  TEST_CHILD_WAIT (server_pid, wait_fd) {
  ^~~~~~~~~~~~~~~
tests/test_com.netsplit.Nih.Test_proxy.c: In function 'test_str_to_str_array_sync':
../nih/test_process.h:101:5: warning: suggest explicit braces to avoid ambiguous 'else' [-Wdangling-else]
  if (_pid == 0) \
     ^
tests/test_com.netsplit.Nih.Test_proxy.c:22207:2: note: in expansion of macro 'TEST_CHILD_WAIT'
  TEST_CHILD_WAIT (server_pid, wait_fd) {
  ^~~~~~~~~~~~~~~
tests/test_com.netsplit.Nih.Test_proxy.c: In function 'test_int32_array_array_to_str_sync':
../nih/test_process.h:101:5: warning: suggest explicit braces to avoid ambiguous 'else' [-Wdangling-else]
  if (_pid == 0) \
     ^
tests/test_com.netsplit.Nih.Test_proxy.c:23056:2: note: in expansion of macro 'TEST_CHILD_WAIT'
  TEST_CHILD_WAIT (server_pid, wait_fd) {
  ^~~~~~~~~~~~~~~
tests/test_com.netsplit.Nih.Test_proxy.c: In function 'test_str_to_int32_array_array_sync':
../nih/test_process.h:101:5: warning: suggest explicit braces to avoid ambiguous 'else' [-Wdangling-else]
  if (_pid == 0) \
     ^
tests/test_com.netsplit.Nih.Test_proxy.c:23883:2: note: in expansion of macro 'TEST_CHILD_WAIT'
  TEST_CHILD_WAIT (server_pid, wait_fd) {
  ^~~~~~~~~~~~~~~
tests/test_com.netsplit.Nih.Test_proxy.c: In function 'test_struct_array_to_str_sync':
../nih/test_process.h:101:5: warning: suggest explicit braces to avoid ambiguous 'else' [-Wdangling-else]
  if (_pid == 0) \
     ^
tests/test_com.netsplit.Nih.Test_proxy.c:24702:2: note: in expansion of macro 'TEST_CHILD_WAIT'
  TEST_CHILD_WAIT (server_pid, wait_fd) {
  ^~~~~~~~~~~~~~~
tests/test_com.netsplit.Nih.Test_proxy.c: In function 'test_str_to_struct_array_sync':
../nih/test_process.h:101:5: warning: suggest explicit braces to avoid ambiguous 'else' [-Wdangling-else]
  if (_pid == 0) \
     ^
tests/test_com.netsplit.Nih.Test_proxy.c:25471:2: note: in expansion of macro 'TEST_CHILD_WAIT'
  TEST_CHILD_WAIT (server_pid, wait_fd) {
  ^~~~~~~~~~~~~~~
tests/test_com.netsplit.Nih.Test_proxy.c: In function 'test_dict_entry_array_to_str_sync':
../nih/test_process.h:101:5: warning: suggest explicit braces to avoid ambiguous 'else' [-Wdangling-else]
  if (_pid == 0) \
     ^
tests/test_com.netsplit.Nih.Test_proxy.c:26265:2: note: in expansion of macro 'TEST_CHILD_WAIT'
  TEST_CHILD_WAIT (server_pid, wait_fd) {
  ^~~~~~~~~~~~~~~
tests/test_com.netsplit.Nih.Test_proxy.c: In function 'test_str_to_dict_entry_array_sync':
../nih/test_process.h:101:5: warning: suggest explicit braces to avoid ambiguous 'else' [-Wdangling-else]
  if (_pid == 0) \
     ^
tests/test_com.netsplit.Nih.Test_proxy.c:27034:2: note: in expansion of macro 'TEST_CHILD_WAIT'
  TEST_CHILD_WAIT (server_pid, wait_fd) {
  ^~~~~~~~~~~~~~~
tests/test_com.netsplit.Nih.Test_proxy.c: In function 'test_unix_fd_to_str_sync':
../nih/test_process.h:101:5: warning: suggest explicit braces to avoid ambiguous 'else' [-Wdangling-else]
  if (_pid == 0) \
     ^
tests/test_com.netsplit.Nih.Test_proxy.c:27616:2: note: in expansion of macro 'TEST_CHILD_WAIT'
  TEST_CHILD_WAIT (server_pid, wait_fd) {
  ^~~~~~~~~~~~~~~
tests/test_com.netsplit.Nih.Test_proxy.c: In function 'test_str_to_unix_fd_sync':
../nih/test_process.h:101:5: warning: suggest explicit braces to avoid ambiguous 'else' [-Wdangling-else]
  if (_pid == 0) \
     ^
tests/test_com.netsplit.Nih.Test_proxy.c:28248:2: note: in expansion of macro 'TEST_CHILD_WAIT'
  TEST_CHILD_WAIT (server_pid, wait_fd) {
  ^~~~~~~~~~~~~~~
tests/test_com.netsplit.Nih.Test_proxy.c: In function 'test_get_byte_sync':
../nih/test_process.h:101:5: warning: suggest explicit braces to avoid ambiguous 'else' [-Wdangling-else]
  if (_pid == 0) \
     ^
tests/test_com.netsplit.Nih.Test_proxy.c:30828:2: note: in expansion of macro 'TEST_CHILD_WAIT'
  TEST_CHILD_WAIT (server_pid, wait_fd) {
  ^~~~~~~~~~~~~~~
../nih/test_process.h:101:5: warning: suggest explicit braces to avoid ambiguous 'else' [-Wdangling-else]
  if (_pid == 0) \
     ^
tests/test_com.netsplit.Nih.Test_proxy.c:30900:2: note: in expansion of macro 'TEST_CHILD_WAIT'
  TEST_CHILD_WAIT (server_pid, wait_fd) {
  ^~~~~~~~~~~~~~~
../nih/test_process.h:101:5: warning: suggest explicit braces to avoid ambiguous 'else' [-Wdangling-else]
  if (_pid == 0) \
     ^
tests/test_com.netsplit.Nih.Test_proxy.c:30979:2: note: in expansion of macro 'TEST_CHILD_WAIT'
  TEST_CHILD_WAIT (server_pid, wait_fd) {
  ^~~~~~~~~~~~~~~
tests/test_com.netsplit.Nih.Test_proxy.c: In function 'test_set_byte_sync':
../nih/test_process.h:101:5: warning: suggest explicit braces to avoid ambiguous 'else' [-Wdangling-else]
  if (_pid == 0) \
     ^
tests/test_com.netsplit.Nih.Test_proxy.c:31610:2: note: in expansion of macro 'TEST_CHILD_WAIT'
  TEST_CHILD_WAIT (server_pid, wait_fd) {
  ^~~~~~~~~~~~~~~
tests/test_com.netsplit.Nih.Test_proxy.c: In function 'test_get_boolean_sync':
../nih/test_process.h:101:5: warning: suggest explicit braces to avoid ambiguous 'else' [-Wdangling-else]
  if (_pid == 0) \
     ^
tests/test_com.netsplit.Nih.Test_proxy.c:32249:2: note: in expansion of macro 'TEST_CHILD_WAIT'
  TEST_CHILD_WAIT (server_pid, wait_fd) {
  ^~~~~~~~~~~~~~~
../nih/test_process.h:101:5: warning: suggest explicit braces to avoid ambiguous 'else' [-Wdangling-else]
  if (_pid == 0) \
     ^
tests/test_com.netsplit.Nih.Test_proxy.c:32321:2: note: in expansion of macro 'TEST_CHILD_WAIT'
  TEST_CHILD_WAIT (server_pid, wait_fd) {
  ^~~~~~~~~~~~~~~
tests/test_com.netsplit.Nih.Test_proxy.c: In function 'test_set_boolean_sync':
../nih/test_process.h:101:5: warning: suggest explicit braces to avoid ambiguous 'else' [-Wdangling-else]
  if (_pid == 0) \
     ^
tests/test_com.netsplit.Nih.Test_proxy.c:32876:2: note: in expansion of macro 'TEST_CHILD_WAIT'
  TEST_CHILD_WAIT (server_pid, wait_fd) {
  ^~~~~~~~~~~~~~~
tests/test_com.netsplit.Nih.Test_proxy.c: In function 'test_get_int16_sync':
../nih/test_process.h:101:5: warning: suggest explicit braces to avoid ambiguous 'else' [-Wdangling-else]
  if (_pid == 0) \
     ^
tests/test_com.netsplit.Nih.Test_proxy.c:33551:2: note: in expansion of macro 'TEST_CHILD_WAIT'
  TEST_CHILD_WAIT (server_pid, wait_fd) {
  ^~~~~~~~~~~~~~~
../nih/test_process.h:101:5: warning: suggest explicit braces to avoid ambiguous 'else' [-Wdangling-else]
  if (_pid == 0) \
     ^
tests/test_com.netsplit.Nih.Test_proxy.c:33623:2: note: in expansion of macro 'TEST_CHILD_WAIT'
  TEST_CHILD_WAIT (server_pid, wait_fd) {
  ^~~~~~~~~~~~~~~
../nih/test_process.h:101:5: warning: suggest explicit braces to avoid ambiguous 'else' [-Wdangling-else]
  if (_pid == 0) \
     ^
tests/test_com.netsplit.Nih.Test_proxy.c:33702:2: note: in expansion of macro 'TEST_CHILD_WAIT'
  TEST_CHILD_WAIT (server_pid, wait_fd) {
  ^~~~~~~~~~~~~~~
tests/test_com.netsplit.Nih.Test_proxy.c: In function 'test_set_int16_sync':
../nih/test_process.h:101:5: warning: suggest explicit braces to avoid ambiguous 'else' [-Wdangling-else]
  if (_pid == 0) \
     ^
tests/test_com.netsplit.Nih.Test_proxy.c:34333:2: note: in expansion of macro 'TEST_CHILD_WAIT'
  TEST_CHILD_WAIT (server_pid, wait_fd) {
  ^~~~~~~~~~~~~~~
tests/test_com.netsplit.Nih.Test_proxy.c: In function 'test_get_uint16_sync':
../nih/test_process.h:101:5: warning: suggest explicit braces to avoid ambiguous 'else' [-Wdangling-else]
  if (_pid == 0) \
     ^
tests/test_com.netsplit.Nih.Test_proxy.c:35048:2: note: in expansion of macro 'TEST_CHILD_WAIT'
  TEST_CHILD_WAIT (server_pid, wait_fd) {
  ^~~~~~~~~~~~~~~
../nih/test_process.h:101:5: warning: suggest explicit braces to avoid ambiguous 'else' [-Wdangling-else]
  if (_pid == 0) \
     ^
tests/test_com.netsplit.Nih.Test_proxy.c:35120:2: note: in expansion of macro 'TEST_CHILD_WAIT'
  TEST_CHILD_WAIT (server_pid, wait_fd) {
  ^~~~~~~~~~~~~~~
../nih/test_process.h:101:5: warning: suggest explicit braces to avoid ambiguous 'else' [-Wdangling-else]
  if (_pid == 0) \
     ^
tests/test_com.netsplit.Nih.Test_proxy.c:35199:2: note: in expansion of macro 'TEST_CHILD_WAIT'
  TEST_CHILD_WAIT (server_pid, wait_fd) {
  ^~~~~~~~~~~~~~~
tests/test_com.netsplit.Nih.Test_proxy.c: In function 'test_set_uint16_sync':
../nih/test_process.h:101:5: warning: suggest explicit braces to avoid ambiguous 'else' [-Wdangling-else]
  if (_pid == 0) \
     ^
tests/test_com.netsplit.Nih.Test_proxy.c:35830:2: note: in expansion of macro 'TEST_CHILD_WAIT'
  TEST_CHILD_WAIT (server_pid, wait_fd) {
  ^~~~~~~~~~~~~~~
tests/test_com.netsplit.Nih.Test_proxy.c: In function 'test_get_int32_sync':
../nih/test_process.h:101:5: warning: suggest explicit braces to avoid ambiguous 'else' [-Wdangling-else]
  if (_pid == 0) \
     ^
tests/test_com.netsplit.Nih.Test_proxy.c:36545:2: note: in expansion of macro 'TEST_CHILD_WAIT'
  TEST_CHILD_WAIT (server_pid, wait_fd) {
  ^~~~~~~~~~~~~~~
../nih/test_process.h:101:5: warning: suggest explicit braces to avoid ambiguous 'else' [-Wdangling-else]
  if (_pid == 0) \
     ^
tests/test_com.netsplit.Nih.Test_proxy.c:36617:2: note: in expansion of macro 'TEST_CHILD_WAIT'
  TEST_CHILD_WAIT (server_pid, wait_fd) {
  ^~~~~~~~~~~~~~~
../nih/test_process.h:101:5: warning: suggest explicit braces to avoid ambiguous 'else' [-Wdangling-else]
  if (_pid == 0) \
     ^
tests/test_com.netsplit.Nih.Test_proxy.c:36696:2: note: in expansion of macro 'TEST_CHILD_WAIT'
  TEST_CHILD_WAIT (server_pid, wait_fd) {
  ^~~~~~~~~~~~~~~
tests/test_com.netsplit.Nih.Test_proxy.c: In function 'test_set_int32_sync':
../nih/test_process.h:101:5: warning: suggest explicit braces to avoid ambiguous 'else' [-Wdangling-else]
  if (_pid == 0) \
     ^
tests/test_com.netsplit.Nih.Test_proxy.c:37327:2: note: in expansion of macro 'TEST_CHILD_WAIT'
  TEST_CHILD_WAIT (server_pid, wait_fd) {
  ^~~~~~~~~~~~~~~
tests/test_com.netsplit.Nih.Test_proxy.c: In function 'test_get_uint32_sync':
../nih/test_process.h:101:5: warning: suggest explicit braces to avoid ambiguous 'else' [-Wdangling-else]
  if (_pid == 0) \
     ^
tests/test_com.netsplit.Nih.Test_proxy.c:38042:2: note: in expansion of macro 'TEST_CHILD_WAIT'
  TEST_CHILD_WAIT (server_pid, wait_fd) {
  ^~~~~~~~~~~~~~~
../nih/test_process.h:101:5: warning: suggest explicit braces to avoid ambiguous 'else' [-Wdangling-else]
  if (_pid == 0) \
     ^
tests/test_com.netsplit.Nih.Test_proxy.c:38114:2: note: in expansion of macro 'TEST_CHILD_WAIT'
  TEST_CHILD_WAIT (server_pid, wait_fd) {
  ^~~~~~~~~~~~~~~
../nih/test_process.h:101:5: warning: suggest explicit braces to avoid ambiguous 'else' [-Wdangling-else]
  if (_pid == 0) \
     ^
tests/test_com.netsplit.Nih.Test_proxy.c:38193:2: note: in expansion of macro 'TEST_CHILD_WAIT'
  TEST_CHILD_WAIT (server_pid, wait_fd) {
  ^~~~~~~~~~~~~~~
tests/test_com.netsplit.Nih.Test_proxy.c: In function 'test_set_uint32_sync':
../nih/test_process.h:101:5: warning: suggest explicit braces to avoid ambiguous 'else' [-Wdangling-else]
  if (_pid == 0) \
     ^
tests/test_com.netsplit.Nih.Test_proxy.c:38824:2: note: in expansion of macro 'TEST_CHILD_WAIT'
  TEST_CHILD_WAIT (server_pid, wait_fd) {
  ^~~~~~~~~~~~~~~
tests/test_com.netsplit.Nih.Test_proxy.c: In function 'test_get_int64_sync':
../nih/test_process.h:101:5: warning: suggest explicit braces to avoid ambiguous 'else' [-Wdangling-else]
  if (_pid == 0) \
     ^
tests/test_com.netsplit.Nih.Test_proxy.c:39539:2: note: in expansion of macro 'TEST_CHILD_WAIT'
  TEST_CHILD_WAIT (server_pid, wait_fd) {
  ^~~~~~~~~~~~~~~
../nih/test_process.h:101:5: warning: suggest explicit braces to avoid ambiguous 'else' [-Wdangling-else]
  if (_pid == 0) \
     ^
tests/test_com.netsplit.Nih.Test_proxy.c:39611:2: note: in expansion of macro 'TEST_CHILD_WAIT'
  TEST_CHILD_WAIT (server_pid, wait_fd) {
  ^~~~~~~~~~~~~~~
../nih/test_process.h:101:5: warning: suggest explicit braces to avoid ambiguous 'else' [-Wdangling-else]
  if (_pid == 0) \
     ^
tests/test_com.netsplit.Nih.Test_proxy.c:39690:2: note: in expansion of macro 'TEST_CHILD_WAIT'
  TEST_CHILD_WAIT (server_pid, wait_fd) {
  ^~~~~~~~~~~~~~~
tests/test_com.netsplit.Nih.Test_proxy.c: In function 'test_set_int64_sync':
../nih/test_process.h:101:5: warning: suggest explicit braces to avoid ambiguous 'else' [-Wdangling-else]
  if (_pid == 0) \
     ^
tests/test_com.netsplit.Nih.Test_proxy.c:40321:2: note: in expansion of macro 'TEST_CHILD_WAIT'
  TEST_CHILD_WAIT (server_pid, wait_fd) {
  ^~~~~~~~~~~~~~~
tests/test_com.netsplit.Nih.Test_proxy.c: In function 'test_get_uint64_sync':
../nih/test_process.h:101:5: warning: suggest explicit braces to avoid ambiguous 'else' [-Wdangling-else]
  if (_pid == 0) \
     ^
tests/test_com.netsplit.Nih.Test_proxy.c:41036:2: note: in expansion of macro 'TEST_CHILD_WAIT'
  TEST_CHILD_WAIT (server_pid, wait_fd) {
  ^~~~~~~~~~~~~~~
../nih/test_process.h:101:5: warning: suggest explicit braces to avoid ambiguous 'else' [-Wdangling-else]
  if (_pid == 0) \
     ^
tests/test_com.netsplit.Nih.Test_proxy.c:41108:2: note: in expansion of macro 'TEST_CHILD_WAIT'
  TEST_CHILD_WAIT (server_pid, wait_fd) {
  ^~~~~~~~~~~~~~~
../nih/test_process.h:101:5: warning: suggest explicit braces to avoid ambiguous 'else' [-Wdangling-else]
  if (_pid == 0) \
     ^
tests/test_com.netsplit.Nih.Test_proxy.c:41187:2: note: in expansion of macro 'TEST_CHILD_WAIT'
  TEST_CHILD_WAIT (server_pid, wait_fd) {
  ^~~~~~~~~~~~~~~
tests/test_com.netsplit.Nih.Test_proxy.c: In function 'test_set_uint64_sync':
../nih/test_process.h:101:5: warning: suggest explicit braces to avoid ambiguous 'else' [-Wdangling-else]
  if (_pid == 0) \
     ^
tests/test_com.netsplit.Nih.Test_proxy.c:41818:2: note: in expansion of macro 'TEST_CHILD_WAIT'
  TEST_CHILD_WAIT (server_pid, wait_fd) {
  ^~~~~~~~~~~~~~~
tests/test_com.netsplit.Nih.Test_proxy.c: In function 'test_get_double_sync':
../nih/test_process.h:101:5: warning: suggest explicit braces to avoid ambiguous 'else' [-Wdangling-else]
  if (_pid == 0) \
     ^
tests/test_com.netsplit.Nih.Test_proxy.c:42533:2: note: in expansion of macro 'TEST_CHILD_WAIT'
  TEST_CHILD_WAIT (server_pid, wait_fd) {
  ^~~~~~~~~~~~~~~
../nih/test_process.h:101:5: warning: suggest explicit braces to avoid ambiguous 'else' [-Wdangling-else]
  if (_pid == 0) \
     ^
tests/test_com.netsplit.Nih.Test_proxy.c:42605:2: note: in expansion of macro 'TEST_CHILD_WAIT'
  TEST_CHILD_WAIT (server_pid, wait_fd) {
  ^~~~~~~~~~~~~~~
../nih/test_process.h:101:5: warning: suggest explicit braces to avoid ambiguous 'else' [-Wdangling-else]
  if (_pid == 0) \
     ^
tests/test_com.netsplit.Nih.Test_proxy.c:42684:2: note: in expansion of macro 'TEST_CHILD_WAIT'
  TEST_CHILD_WAIT (server_pid, wait_fd) {
  ^~~~~~~~~~~~~~~
tests/test_com.netsplit.Nih.Test_proxy.c: In function 'test_set_double_sync':
../nih/test_process.h:101:5: warning: suggest explicit braces to avoid ambiguous 'else' [-Wdangling-else]
  if (_pid == 0) \
     ^
tests/test_com.netsplit.Nih.Test_proxy.c:43315:2: note: in expansion of macro 'TEST_CHILD_WAIT'
  TEST_CHILD_WAIT (server_pid, wait_fd) {
  ^~~~~~~~~~~~~~~
tests/test_com.netsplit.Nih.Test_proxy.c: In function 'test_get_string_sync':
../nih/test_process.h:101:5: warning: suggest explicit braces to avoid ambiguous 'else' [-Wdangling-else]
  if (_pid == 0) \
     ^
tests/test_com.netsplit.Nih.Test_proxy.c:44035:2: note: in expansion of macro 'TEST_CHILD_WAIT'
  TEST_CHILD_WAIT (server_pid, wait_fd) {
  ^~~~~~~~~~~~~~~
../nih/test_process.h:101:5: warning: suggest explicit braces to avoid ambiguous 'else' [-Wdangling-else]
  if (_pid == 0) \
     ^
tests/test_com.netsplit.Nih.Test_proxy.c:44108:2: note: in expansion of macro 'TEST_CHILD_WAIT'
  TEST_CHILD_WAIT (server_pid, wait_fd) {
  ^~~~~~~~~~~~~~~
../nih/test_process.h:101:5: warning: suggest explicit braces to avoid ambiguous 'else' [-Wdangling-else]
  if (_pid == 0) \
     ^
tests/test_com.netsplit.Nih.Test_proxy.c:44187:2: note: in expansion of macro 'TEST_CHILD_WAIT'
  TEST_CHILD_WAIT (server_pid, wait_fd) {
  ^~~~~~~~~~~~~~~
tests/test_com.netsplit.Nih.Test_proxy.c: In function 'test_set_string_sync':
../nih/test_process.h:101:5: warning: suggest explicit braces to avoid ambiguous 'else' [-Wdangling-else]
  if (_pid == 0) \
     ^
tests/test_com.netsplit.Nih.Test_proxy.c:44819:2: note: in expansion of macro 'TEST_CHILD_WAIT'
  TEST_CHILD_WAIT (server_pid, wait_fd) {
  ^~~~~~~~~~~~~~~
tests/test_com.netsplit.Nih.Test_proxy.c: In function 'test_get_object_path_sync':
../nih/test_process.h:101:5: warning: suggest explicit braces to avoid ambiguous 'else' [-Wdangling-else]
  if (_pid == 0) \
     ^
tests/test_com.netsplit.Nih.Test_proxy.c:45545:2: note: in expansion of macro 'TEST_CHILD_WAIT'
  TEST_CHILD_WAIT (server_pid, wait_fd) {
  ^~~~~~~~~~~~~~~
../nih/test_process.h:101:5: warning: suggest explicit braces to avoid ambiguous 'else' [-Wdangling-else]
  if (_pid == 0) \
     ^
tests/test_com.netsplit.Nih.Test_proxy.c:45618:2: note: in expansion of macro 'TEST_CHILD_WAIT'
  TEST_CHILD_WAIT (server_pid, wait_fd) {
  ^~~~~~~~~~~~~~~
../nih/test_process.h:101:5: warning: suggest explicit braces to avoid ambiguous 'else' [-Wdangling-else]
  if (_pid == 0) \
     ^
tests/test_com.netsplit.Nih.Test_proxy.c:45697:2: note: in expansion of macro 'TEST_CHILD_WAIT'
  TEST_CHILD_WAIT (server_pid, wait_fd) {
  ^~~~~~~~~~~~~~~
tests/test_com.netsplit.Nih.Test_proxy.c: In function 'test_set_object_path_sync':
../nih/test_process.h:101:5: warning: suggest explicit braces to avoid ambiguous 'else' [-Wdangling-else]
  if (_pid == 0) \
     ^
tests/test_com.netsplit.Nih.Test_proxy.c:46329:2: note: in expansion of macro 'TEST_CHILD_WAIT'
  TEST_CHILD_WAIT (server_pid, wait_fd) {
  ^~~~~~~~~~~~~~~
tests/test_com.netsplit.Nih.Test_proxy.c: In function 'test_get_signature_sync':
../nih/test_process.h:101:5: warning: suggest explicit braces to avoid ambiguous 'else' [-Wdangling-else]
  if (_pid == 0) \
     ^
tests/test_com.netsplit.Nih.Test_proxy.c:47056:2: note: in expansion of macro 'TEST_CHILD_WAIT'
  TEST_CHILD_WAIT (server_pid, wait_fd) {
  ^~~~~~~~~~~~~~~
../nih/test_process.h:101:5: warning: suggest explicit braces to avoid ambiguous 'else' [-Wdangling-else]
  if (_pid == 0) \
     ^
tests/test_com.netsplit.Nih.Test_proxy.c:47129:2: note: in expansion of macro 'TEST_CHILD_WAIT'
  TEST_CHILD_WAIT (server_pid, wait_fd) {
  ^~~~~~~~~~~~~~~
../nih/test_process.h:101:5: warning: suggest explicit braces to avoid ambiguous 'else' [-Wdangling-else]
  if (_pid == 0) \
     ^
tests/test_com.netsplit.Nih.Test_proxy.c:47208:2: note: in expansion of macro 'TEST_CHILD_WAIT'
  TEST_CHILD_WAIT (server_pid, wait_fd) {
  ^~~~~~~~~~~~~~~
tests/test_com.netsplit.Nih.Test_proxy.c: In function 'test_set_signature_sync':
../nih/test_process.h:101:5: warning: suggest explicit braces to avoid ambiguous 'else' [-Wdangling-else]
  if (_pid == 0) \
     ^
tests/test_com.netsplit.Nih.Test_proxy.c:47840:2: note: in expansion of macro 'TEST_CHILD_WAIT'
  TEST_CHILD_WAIT (server_pid, wait_fd) {
  ^~~~~~~~~~~~~~~
tests/test_com.netsplit.Nih.Test_proxy.c: In function 'test_get_structure_sync':
../nih/test_process.h:101:5: warning: suggest explicit braces to avoid ambiguous 'else' [-Wdangling-else]
  if (_pid == 0) \
     ^
tests/test_com.netsplit.Nih.Test_proxy.c:48576:2: note: in expansion of macro 'TEST_CHILD_WAIT'
  TEST_CHILD_WAIT (server_pid, wait_fd) {
  ^~~~~~~~~~~~~~~
../nih/test_process.h:101:5: warning: suggest explicit braces to avoid ambiguous 'else' [-Wdangling-else]
  if (_pid == 0) \
     ^
tests/test_com.netsplit.Nih.Test_proxy.c:48656:2: note: in expansion of macro 'TEST_CHILD_WAIT'
  TEST_CHILD_WAIT (server_pid, wait_fd) {
  ^~~~~~~~~~~~~~~
../nih/test_process.h:101:5: warning: suggest explicit braces to avoid ambiguous 'else' [-Wdangling-else]
  if (_pid == 0) \
     ^
tests/test_com.netsplit.Nih.Test_proxy.c:48738:2: note: in expansion of macro 'TEST_CHILD_WAIT'
  TEST_CHILD_WAIT (server_pid, wait_fd) {
  ^~~~~~~~~~~~~~~
tests/test_com.netsplit.Nih.Test_proxy.c: In function 'test_set_structure_sync':
../nih/test_process.h:101:5: warning: suggest explicit braces to avoid ambiguous 'else' [-Wdangling-else]
  if (_pid == 0) \
     ^
tests/test_com.netsplit.Nih.Test_proxy.c:49401:2: note: in expansion of macro 'TEST_CHILD_WAIT'
  TEST_CHILD_WAIT (server_pid, wait_fd) {
  ^~~~~~~~~~~~~~~
tests/test_com.netsplit.Nih.Test_proxy.c: In function 'test_get_int32_array_sync':
../nih/test_process.h:101:5: warning: suggest explicit braces to avoid ambiguous 'else' [-Wdangling-else]
  if (_pid == 0) \
     ^
tests/test_com.netsplit.Nih.Test_proxy.c:50188:2: note: in expansion of macro 'TEST_CHILD_WAIT'
  TEST_CHILD_WAIT (server_pid, wait_fd) {
  ^~~~~~~~~~~~~~~
../nih/test_process.h:101:5: warning: suggest explicit braces to avoid ambiguous 'else' [-Wdangling-else]
  if (_pid == 0) \
     ^
tests/test_com.netsplit.Nih.Test_proxy.c:50280:2: note: in expansion of macro 'TEST_CHILD_WAIT'
  TEST_CHILD_WAIT (server_pid, wait_fd) {
  ^~~~~~~~~~~~~~~
../nih/test_process.h:101:5: warning: suggest explicit braces to avoid ambiguous 'else' [-Wdangling-else]
  if (_pid == 0) \
     ^
tests/test_com.netsplit.Nih.Test_proxy.c:50362:2: note: in expansion of macro 'TEST_CHILD_WAIT'
  TEST_CHILD_WAIT (server_pid, wait_fd) {
  ^~~~~~~~~~~~~~~
tests/test_com.netsplit.Nih.Test_proxy.c: In function 'test_set_int32_array_sync':
../nih/test_process.h:101:5: warning: suggest explicit braces to avoid ambiguous 'else' [-Wdangling-else]
  if (_pid == 0) \
     ^
tests/test_com.netsplit.Nih.Test_proxy.c:51071:2: note: in expansion of macro 'TEST_CHILD_WAIT'
  TEST_CHILD_WAIT (server_pid, wait_fd) {
  ^~~~~~~~~~~~~~~
tests/test_com.netsplit.Nih.Test_proxy.c: In function 'test_get_str_array_sync':
../nih/test_process.h:101:5: warning: suggest explicit braces to avoid ambiguous 'else' [-Wdangling-else]
  if (_pid == 0) \
     ^
tests/test_com.netsplit.Nih.Test_proxy.c:51874:2: note: in expansion of macro 'TEST_CHILD_WAIT'
  TEST_CHILD_WAIT (server_pid, wait_fd) {
  ^~~~~~~~~~~~~~~
../nih/test_process.h:101:5: warning: suggest explicit braces to avoid ambiguous 'else' [-Wdangling-else]
  if (_pid == 0) \
     ^
tests/test_com.netsplit.Nih.Test_proxy.c:51969:2: note: in expansion of macro 'TEST_CHILD_WAIT'
  TEST_CHILD_WAIT (server_pid, wait_fd) {
  ^~~~~~~~~~~~~~~
../nih/test_process.h:101:5: warning: suggest explicit braces to avoid ambiguous 'else' [-Wdangling-else]
  if (_pid == 0) \
     ^
tests/test_com.netsplit.Nih.Test_proxy.c:52051:2: note: in expansion of macro 'TEST_CHILD_WAIT'
  TEST_CHILD_WAIT (server_pid, wait_fd) {
  ^~~~~~~~~~~~~~~
tests/test_com.netsplit.Nih.Test_proxy.c: In function 'test_set_str_array_sync':
../nih/test_process.h:101:5: warning: suggest explicit braces to avoid ambiguous 'else' [-Wdangling-else]
  if (_pid == 0) \
     ^
tests/test_com.netsplit.Nih.Test_proxy.c:52756:2: note: in expansion of macro 'TEST_CHILD_WAIT'
  TEST_CHILD_WAIT (server_pid, wait_fd) {
  ^~~~~~~~~~~~~~~
tests/test_com.netsplit.Nih.Test_proxy.c: In function 'test_get_int32_array_array_sync':
../nih/test_process.h:101:5: warning: suggest explicit braces to avoid ambiguous 'else' [-Wdangling-else]
  if (_pid == 0) \
     ^
tests/test_com.netsplit.Nih.Test_proxy.c:53624:2: note: in expansion of macro 'TEST_CHILD_WAIT'
  TEST_CHILD_WAIT (server_pid, wait_fd) {
  ^~~~~~~~~~~~~~~
../nih/test_process.h:101:5: warning: suggest explicit braces to avoid ambiguous 'else' [-Wdangling-else]
  if (_pid == 0) \
     ^
tests/test_com.netsplit.Nih.Test_proxy.c:53752:2: note: in expansion of macro 'TEST_CHILD_WAIT'
  TEST_CHILD_WAIT (server_pid, wait_fd) {
  ^~~~~~~~~~~~~~~
../nih/test_process.h:101:5: warning: suggest explicit braces to avoid ambiguous 'else' [-Wdangling-else]
  if (_pid == 0) \
     ^
tests/test_com.netsplit.Nih.Test_proxy.c:53838:2: note: in expansion of macro 'TEST_CHILD_WAIT'
  TEST_CHILD_WAIT (server_pid, wait_fd) {
  ^~~~~~~~~~~~~~~
tests/test_com.netsplit.Nih.Test_proxy.c: In function 'test_set_int32_array_array_sync':
../nih/test_process.h:101:5: warning: suggest explicit braces to avoid ambiguous 'else' [-Wdangling-else]
  if (_pid == 0) \
     ^
tests/test_com.netsplit.Nih.Test_proxy.c:54666:2: note: in expansion of macro 'TEST_CHILD_WAIT'
  TEST_CHILD_WAIT (server_pid, wait_fd) {
  ^~~~~~~~~~~~~~~
tests/test_com.netsplit.Nih.Test_proxy.c: In function 'test_get_struct_array_sync':
../nih/test_process.h:101:5: warning: suggest explicit braces to avoid ambiguous 'else' [-Wdangling-else]
  if (_pid == 0) \
     ^
tests/test_com.netsplit.Nih.Test_proxy.c:55536:2: note: in expansion of macro 'TEST_CHILD_WAIT'
  TEST_CHILD_WAIT (server_pid, wait_fd) {
  ^~~~~~~~~~~~~~~
../nih/test_process.h:101:5: warning: suggest explicit braces to avoid ambiguous 'else' [-Wdangling-else]
  if (_pid == 0) \
     ^
tests/test_com.netsplit.Nih.Test_proxy.c:55635:2: note: in expansion of macro 'TEST_CHILD_WAIT'
  TEST_CHILD_WAIT (server_pid, wait_fd) {
  ^~~~~~~~~~~~~~~
../nih/test_process.h:101:5: warning: suggest explicit braces to avoid ambiguous 'else' [-Wdangling-else]
  if (_pid == 0) \
     ^
tests/test_com.netsplit.Nih.Test_proxy.c:55717:2: note: in expansion of macro 'TEST_CHILD_WAIT'
  TEST_CHILD_WAIT (server_pid, wait_fd) {
  ^~~~~~~~~~~~~~~
tests/test_com.netsplit.Nih.Test_proxy.c: In function 'test_set_struct_array_sync':
../nih/test_process.h:101:5: warning: suggest explicit braces to avoid ambiguous 'else' [-Wdangling-else]
  if (_pid == 0) \
     ^
tests/test_com.netsplit.Nih.Test_proxy.c:56430:2: note: in expansion of macro 'TEST_CHILD_WAIT'
  TEST_CHILD_WAIT (server_pid, wait_fd) {
  ^~~~~~~~~~~~~~~
tests/test_com.netsplit.Nih.Test_proxy.c: In function 'test_get_dict_entry_array_sync':
../nih/test_process.h:101:5: warning: suggest explicit braces to avoid ambiguous 'else' [-Wdangling-else]
  if (_pid == 0) \
     ^
tests/test_com.netsplit.Nih.Test_proxy.c:57241:2: note: in expansion of macro 'TEST_CHILD_WAIT'
  TEST_CHILD_WAIT (server_pid, wait_fd) {
  ^~~~~~~~~~~~~~~
../nih/test_process.h:101:5: warning: suggest explicit braces to avoid ambiguous 'else' [-Wdangling-else]
  if (_pid == 0) \
     ^
tests/test_com.netsplit.Nih.Test_proxy.c:57340:2: note: in expansion of macro 'TEST_CHILD_WAIT'
  TEST_CHILD_WAIT (server_pid, wait_fd) {
  ^~~~~~~~~~~~~~~
../nih/test_process.h:101:5: warning: suggest explicit braces to avoid ambiguous 'else' [-Wdangling-else]
  if (_pid == 0) \
     ^
tests/test_com.netsplit.Nih.Test_proxy.c:57422:2: note: in expansion of macro 'TEST_CHILD_WAIT'
  TEST_CHILD_WAIT (server_pid, wait_fd) {
  ^~~~~~~~~~~~~~~
tests/test_com.netsplit.Nih.Test_proxy.c: In function 'test_set_dict_entry_array_sync':
../nih/test_process.h:101:5: warning: suggest explicit braces to avoid ambiguous 'else' [-Wdangling-else]
  if (_pid == 0) \
     ^
tests/test_com.netsplit.Nih.Test_proxy.c:58135:2: note: in expansion of macro 'TEST_CHILD_WAIT'
  TEST_CHILD_WAIT (server_pid, wait_fd) {
  ^~~~~~~~~~~~~~~
tests/test_com.netsplit.Nih.Test_proxy.c: In function 'test_get_unix_fd_sync':
../nih/test_process.h:101:5: warning: suggest explicit braces to avoid ambiguous 'else' [-Wdangling-else]
  if (_pid == 0) \
     ^
tests/test_com.netsplit.Nih.Test_proxy.c:58835:2: note: in expansion of macro 'TEST_CHILD_WAIT'
  TEST_CHILD_WAIT (server_pid, wait_fd) {
  ^~~~~~~~~~~~~~~
../nih/test_process.h:101:5: warning: suggest explicit braces to avoid ambiguous 'else' [-Wdangling-else]
  if (_pid == 0) \
     ^
tests/test_com.netsplit.Nih.Test_proxy.c:58909:2: note: in expansion of macro 'TEST_CHILD_WAIT'
  TEST_CHILD_WAIT (server_pid, wait_fd) {
  ^~~~~~~~~~~~~~~
tests/test_com.netsplit.Nih.Test_proxy.c: In function 'test_set_unix_fd_sync':
../nih/test_process.h:101:5: warning: suggest explicit braces to avoid ambiguous 'else' [-Wdangling-else]
  if (_pid == 0) \
     ^
tests/test_com.netsplit.Nih.Test_proxy.c:59391:2: note: in expansion of macro 'TEST_CHILD_WAIT'
  TEST_CHILD_WAIT (server_pid, wait_fd) {
  ^~~~~~~~~~~~~~~
tests/test_com.netsplit.Nih.Test_proxy.c: In function 'test_get_all_sync':
../nih/test_process.h:101:5: warning: suggest explicit braces to avoid ambiguous 'else' [-Wdangling-else]
  if (_pid == 0) \
     ^
tests/test_com.netsplit.Nih.Test_proxy.c:60449:2: note: in expansion of macro 'TEST_CHILD_WAIT'
  TEST_CHILD_WAIT (server_pid, wait_fd) {
  ^~~~~~~~~~~~~~~
../nih/test_process.h:101:5: warning: suggest explicit braces to avoid ambiguous 'else' [-Wdangling-else]
  if (_pid == 0) \
     ^
tests/test_com.netsplit.Nih.Test_proxy.c:60769:2: note: in expansion of macro 'TEST_CHILD_WAIT'
  TEST_CHILD_WAIT (server_pid, wait_fd) {
  ^~~~~~~~~~~~~~~
../nih/test_process.h:101:5: warning: suggest explicit braces to avoid ambiguous 'else' [-Wdangling-else]
  if (_pid == 0) \
     ^
tests/test_com.netsplit.Nih.Test_proxy.c:60934:2: note: in expansion of macro 'TEST_CHILD_WAIT'
  TEST_CHILD_WAIT (server_pid, wait_fd) {
  ^~~~~~~~~~~~~~~
  CC       com.netsplit.Nih.Test_proxy.o
  CCLD     test_com.netsplit.Nih.Test_proxy
make[3]: 'marshal_factory' is up to date.
make[3]: 'demarshal_factory' is up to date.
make[3]: 'interface_factory' is up to date.
make[3]: 'method_factory' is up to date.
make[3]: 'signal_factory' is up to date.
make[3]: 'property_factory' is up to date.
make[3]: Leaving directory '/usr/src/RPM/BUILD/libnih-1.0.3/nih-dbus-tool'
make  check-TESTS
make[3]: Entering directory '/usr/src/RPM/BUILD/libnih-1.0.3/nih-dbus-tool'
make[4]: Entering directory '/usr/src/RPM/BUILD/libnih-1.0.3/nih-dbus-tool'
PASS: test_main
PASS: test_symbol
PASS: test_indent
PASS: test_type
PASS: test_marshal
PASS: test_demarshal
PASS: test_node
PASS: test_interface
PASS: test_method
PASS: test_signal
PASS: test_property
PASS: test_argument
PASS: test_annotation
PASS: test_parse
PASS: test_output
PASS: test_com.netsplit.Nih.Test_object
PASS: test_com.netsplit.Nih.Test_proxy
make[5]: Entering directory '/usr/src/RPM/BUILD/libnih-1.0.3/nih-dbus-tool'
make  all-am
make[6]: Entering directory '/usr/src/RPM/BUILD/libnih-1.0.3/nih-dbus-tool'
make[6]: Nothing to be done for 'all-am'.
make[6]: Leaving directory '/usr/src/RPM/BUILD/libnih-1.0.3/nih-dbus-tool'
make[5]: Leaving directory '/usr/src/RPM/BUILD/libnih-1.0.3/nih-dbus-tool'
============================================================================
Testsuite summary for libnih 1.0.3
============================================================================
# TOTAL: 17
# PASS:  17
# SKIP:  0
# XFAIL: 0
# FAIL:  0
# XPASS: 0
# ERROR: 0
============================================================================
make[4]: Leaving directory '/usr/src/RPM/BUILD/libnih-1.0.3/nih-dbus-tool'
make[3]: Leaving directory '/usr/src/RPM/BUILD/libnih-1.0.3/nih-dbus-tool'
make[2]: Leaving directory '/usr/src/RPM/BUILD/libnih-1.0.3/nih-dbus-tool'
make[1]: Leaving directory '/usr/src/RPM/BUILD/libnih-1.0.3/nih-dbus-tool'
Making check in po
make[1]: Entering directory '/usr/src/RPM/BUILD/libnih-1.0.3/po'
make[1]: Leaving directory '/usr/src/RPM/BUILD/libnih-1.0.3/po'
make[1]: Entering directory '/usr/src/RPM/BUILD/libnih-1.0.3'
make[1]: Leaving directory '/usr/src/RPM/BUILD/libnih-1.0.3'
make: Leaving directory '/usr/src/RPM/BUILD/libnih-1.0.3'
+ exit 0
Processing files: libnih-1.0.3-alt2
Finding Provides (using /usr/lib/rpm/find-provides)
Executing: /bin/sh -e /usr/src/tmp/rpm-tmp.1eb3Lw
find-provides: running scripts (debuginfo,lib,pam,perl,pkgconfig,python,shell)
Finding Requires (using /usr/lib/rpm/find-requires)
Executing: /bin/sh -e /usr/src/tmp/rpm-tmp.5HLpjb
find-requires: running scripts (cpp,debuginfo,files,lib,pam,perl,pkgconfig,pkgconfiglib,python,rpmlib,shebang,shell,static,symlinks)
++ /bin/sed -e '/^libc\.so\.6(GLIBC_PRIVATE)\((64bit)\)\?$/d'
--- find-requires-deps	2018-12-27 05:14:32.120877268 +0000
+++ filter-requires-deps	2018-12-27 05:14:32.127877079 +0000
@@ -6,3 +6,2 @@
 libc.so.6(GLIBC_2.7)(64bit)
-libc.so.6(GLIBC_PRIVATE)(64bit)
 librt.so.1()(64bit) >= set:jiq20
Provides: libnih.so.1()(64bit) = set:ldmVzGunBUa7BcGq5u6PaFBqMZD6T8QxS0Kl7YuPPL89ZDgyPSgkTldZH7mu4eEkcLqP4eQKtMU5Ra8H56xEFAIvM7cQs0cRu7P327oGxiYszDtq6ObqsONjhDPstzlahkAXS167fCnQxLXu2piZcv4oYrESu1qCa79Q0Guy6takwrMyZv8gQIAh5k6EZ8zdzV1PBFhOfxUOg85z0Cy4GdB6yDkCEUJoHAQt5HStgU1YqMPKAW6eIh2D3EEfAHqZ27tZ38S150Vs886L2wHcTWgX8rIU09Y6GiDhHMnn9eYWjd9SBRV8PwRU5YR5yApYOiAqUpAIg6gsB85upRD3KkgQgK3qkUIpXBibPDBmS0IlCaK5LcIjXGH0, libnih.so.1(LIBNIH_1.0.1)(64bit), libnih.so.1(LIBNIH_1_0)(64bit)
Requires: libc.so.6(GLIBC_2.14)(64bit), libc.so.6(GLIBC_2.15)(64bit), libc.so.6(GLIBC_2.2.5)(64bit), libc.so.6(GLIBC_2.3.4)(64bit), libc.so.6(GLIBC_2.4)(64bit), libc.so.6(GLIBC_2.7)(64bit), librt.so.1()(64bit) >= set:jiq20, librt.so.1(GLIBC_2.2.5)(64bit), rtld(GNU_HASH)
Requires(rpmlib): rpmlib(SetVersions)
Finding debuginfo files (using /usr/lib/rpm/find-debuginfo-files)
Executing: /bin/sh -e /usr/src/tmp/rpm-tmp.5qVMlX
Creating libnih-debuginfo package
Processing files: libnih-devel-1.0.3-alt2
Finding Provides (using /usr/lib/rpm/find-provides)
Executing: /bin/sh -e /usr/src/tmp/rpm-tmp.n4C8oO
find-provides: running scripts (debuginfo,lib,pam,perl,pkgconfig,python,shell)
Finding Requires (using /usr/lib/rpm/find-requires)
Executing: /bin/sh -e /usr/src/tmp/rpm-tmp.SfEdzK
find-requires: running scripts (cpp,debuginfo,files,lib,pam,perl,pkgconfig,pkgconfiglib,python,rpmlib,shebang,shell,static,symlinks)
++ /bin/sed -e '/^libc\.so\.6(GLIBC_PRIVATE)\((64bit)\)\?$/d'
Provides: pkgconfig(libnih) = 1.0.3
Requires: libnih = 1.0.3-alt2, /usr/lib64/libnih.so.1.0.0, /usr/lib64/pkgconfig
Finding debuginfo files (using /usr/lib/rpm/find-debuginfo-files)
Executing: /bin/sh -e /usr/src/tmp/rpm-tmp.88DwbT
Processing files: libnih-dbus-1.0.3-alt2
Finding Provides (using /usr/lib/rpm/find-provides)
Executing: /bin/sh -e /usr/src/tmp/rpm-tmp.TQwFN6
find-provides: running scripts (debuginfo,lib,pam,perl,pkgconfig,python,shell)
Finding Requires (using /usr/lib/rpm/find-requires)
Executing: /bin/sh -e /usr/src/tmp/rpm-tmp.Gd5G8o
find-requires: running scripts (cpp,debuginfo,files,lib,pam,perl,pkgconfig,pkgconfiglib,python,rpmlib,shebang,shell,static,symlinks)
++ /bin/sed -e '/^libc\.so\.6(GLIBC_PRIVATE)\((64bit)\)\?$/d'
Provides: libnih-dbus.so.1()(64bit) = set:hdXsZvwDMkVM5D54iruzlgi7cTqf, libnih-dbus.so.1(LIBNIH_DBUS_1_0)(64bit)
Requires: libnih = 1.0.3-alt2, libc.so.6(GLIBC_2.2.5)(64bit), libc.so.6(GLIBC_2.3.4)(64bit), libdbus-1.so.3()(64bit) >= set:ngU5Uglcv1LZBQ8UHUG08kRD6W2rLcf6FrBFZoZooT61LkA2An4phJEzkxeJqmqwDlZhPlESIUnpYK6vnoffSY6f3NOcv0IV1OVAGvtSkoZbPb0f5gA3u90ay6gNI9EJKv6Dws6AJZxB6nYNnRG2wMKZoicDPC5gRAyCwWYG96Zpn5JZkD, libdbus-1.so.3(LIBDBUS_1_3)(64bit), libnih.so.1()(64bit) >= set:lfHYiG5B00LLqPoq5zZcyEV104DruFqPf2gOWALIoZBIXBwo6e2W820mUoWC0fXBidUmZdZorrTKNZ3A60, libnih.so.1(LIBNIH_1_0)(64bit), librt.so.1()(64bit) >= set:jiq20, librt.so.1(GLIBC_2.2.5)(64bit), rtld(GNU_HASH)
Requires(rpmlib): rpmlib(SetVersions)
Finding debuginfo files (using /usr/lib/rpm/find-debuginfo-files)
Executing: /bin/sh -e /usr/src/tmp/rpm-tmp.GQ5zZO
Creating libnih-dbus-debuginfo package
Processing files: libnih-dbus-devel-1.0.3-alt2
Finding Provides (using /usr/lib/rpm/find-provides)
Executing: /bin/sh -e /usr/src/tmp/rpm-tmp.EIyiOj
find-provides: running scripts (debuginfo,lib,pam,perl,pkgconfig,python,shell)
Finding Requires (using /usr/lib/rpm/find-requires)
Executing: /bin/sh -e /usr/src/tmp/rpm-tmp.ryqDwT
find-requires: running scripts (cpp,debuginfo,files,lib,pam,perl,pkgconfig,pkgconfiglib,python,rpmlib,shebang,shell,static,symlinks)
In file included from /usr/src/tmp/libnih-buildroot/usr/include/libnih-dbus.h:24:
/usr/src/tmp/libnih-buildroot/usr/include/nih-dbus/dbus_connection.h:69:10: fatal error: dbus/dbus.h: No such file or directory
 #include <dbus/dbus.h>
          ^~~~~~~~~~~~~
compilation terminated.
cpp.req: /usr/src/tmp/libnih-buildroot/usr/include/libnih-dbus.h: cpp failed, trying c++ mode
x86_64-alt-linux-cpp: error trying to exec 'cc1plus': execvp: No such file or directory
cpp.req: WARNING: /usr/src/tmp/libnih-buildroot/usr/include/libnih-dbus.h: cpp failed
/usr/src/tmp/libnih-buildroot/usr/include/nih-dbus/test_dbus.h:32:10: fatal error: dbus/dbus.h: No such file or directory
 #include <dbus/dbus.h>
          ^~~~~~~~~~~~~
compilation terminated.
cpp.req: WARNING: /usr/src/tmp/libnih-buildroot/usr/include/nih-dbus/test_dbus.h: cpp failed
/usr/src/tmp/libnih-buildroot/usr/include/nih-dbus/dbus_proxy.h:27:10: fatal error: dbus/dbus.h: No such file or directory
 #include <dbus/dbus.h>
          ^~~~~~~~~~~~~
compilation terminated.
cpp.req: WARNING: /usr/src/tmp/libnih-buildroot/usr/include/nih-dbus/dbus_proxy.h: cpp failed
In file included from /usr/src/tmp/libnih-buildroot/usr/include/nih-dbus/dbus_interface.h:25,
                 from /usr/src/tmp/libnih-buildroot/usr/include/nih-dbus/dbus_object.h:25:
/usr/src/tmp/libnih-buildroot/usr/include/nih-dbus/dbus_message.h:40:10: fatal error: dbus/dbus.h: No such file or directory
 #include <dbus/dbus.h>
          ^~~~~~~~~~~~~
compilation terminated.
cpp.req: WARNING: /usr/src/tmp/libnih-buildroot/usr/include/nih-dbus/dbus_object.h: cpp failed
/usr/src/tmp/libnih-buildroot/usr/include/nih-dbus/dbus_message.h:40:10: fatal error: dbus/dbus.h: No such file or directory
 #include <dbus/dbus.h>
          ^~~~~~~~~~~~~
compilation terminated.
cpp.req: WARNING: /usr/src/tmp/libnih-buildroot/usr/include/nih-dbus/dbus_message.h: cpp failed
In file included from /usr/src/tmp/libnih-buildroot/usr/include/nih-dbus/dbus_interface.h:25:
/usr/src/tmp/libnih-buildroot/usr/include/nih-dbus/dbus_message.h:40:10: fatal error: dbus/dbus.h: No such file or directory
 #include <dbus/dbus.h>
          ^~~~~~~~~~~~~
compilation terminated.
cpp.req: WARNING: /usr/src/tmp/libnih-buildroot/usr/include/nih-dbus/dbus_interface.h: cpp failed
/usr/src/tmp/libnih-buildroot/usr/include/nih-dbus/dbus_connection.h:69:10: fatal error: dbus/dbus.h: No such file or directory
 #include <dbus/dbus.h>
          ^~~~~~~~~~~~~
compilation terminated.
cpp.req: WARNING: /usr/src/tmp/libnih-buildroot/usr/include/nih-dbus/dbus_connection.h: cpp failed
/usr/src/tmp/libnih-buildroot/usr/include/nih-dbus/dbus_pending_data.h:39:10: fatal error: dbus/dbus.h: No such file or directory
 #include <dbus/dbus.h>
          ^~~~~~~~~~~~~
compilation terminated.
cpp.req: WARNING: /usr/src/tmp/libnih-buildroot/usr/include/nih-dbus/dbus_pending_data.h: cpp failed
++ /bin/sed -e '/^libc\.so\.6(GLIBC_PRIVATE)\((64bit)\)\?$/d'
Provides: pkgconfig(libnih-dbus) = 1.0.3
Requires: libnih-dbus = 1.0.3-alt2, libnih-devel = 1.0.3-alt2, /lib64/ld-linux-x86-64.so.2, /usr/include/nih/error.h, /usr/include/nih/errors.h, /usr/include/nih/macros.h, /usr/lib64/libnih-dbus.so.1.0.0, /usr/lib64/pkgconfig, libc.so.6(GLIBC_2.14)(64bit), libc.so.6(GLIBC_2.2.5)(64bit), libc.so.6(GLIBC_2.3)(64bit), libc.so.6(GLIBC_2.3.4)(64bit), libdbus-1.so.3()(64bit) >= set:njxa0oZGJ0MVPfGoER9x3s22ClgNCNgLv161, libdbus-1.so.3(LIBDBUS_1_3)(64bit), libexpat.so.1()(64bit) >= set:kgE3cSd0bTvlj5vDpCjhPLZaZyZkE91hdZC, libnih.so.1()(64bit) >= set:lf3XXwZkIMZ0Ek6pgA8LkJ5S0VpeuHgoIsBQqLgKDALFZghgwlpe2Sttd7097ckxdeVUCLW52a9tXCvJ3OYh0, libnih.so.1(LIBNIH_1_0)(64bit), rtld(GNU_HASH)
Requires(rpmlib): rpmlib(SetVersions)
Finding debuginfo files (using /usr/lib/rpm/find-debuginfo-files)
Executing: /bin/sh -e /usr/src/tmp/rpm-tmp.zL5EmD
Creating libnih-dbus-devel-debuginfo package
Processing files: libnih-debuginfo-1.0.3-alt2
Finding Provides (using /usr/lib/rpm/find-provides)
Executing: /bin/sh -e /usr/src/tmp/rpm-tmp.VvhUas
find-provides: running scripts (debuginfo)
Finding Requires (using /usr/lib/rpm/find-requires)
Executing: /bin/sh -e /usr/src/tmp/rpm-tmp.cOJjPl
find-requires: running scripts (debuginfo)
++ /bin/sed -e '/^libc\.so\.6(GLIBC_PRIVATE)\((64bit)\)\?$/d'
Provides: debug64(libnih.so.1)
Requires: libnih = 1.0.3-alt2, debug64(libc.so.6), debug64(librt.so.1)
Processing files: libnih-dbus-debuginfo-1.0.3-alt2
Finding Provides (using /usr/lib/rpm/find-provides)
Executing: /bin/sh -e /usr/src/tmp/rpm-tmp.jsKgrk
find-provides: running scripts (debuginfo)
Finding Requires (using /usr/lib/rpm/find-requires)
Executing: /bin/sh -e /usr/src/tmp/rpm-tmp.FKo0Mn
find-requires: running scripts (debuginfo)
++ /bin/sed -e '/^libc\.so\.6(GLIBC_PRIVATE)\((64bit)\)\?$/d'
Provides: debug64(libnih-dbus.so.1)
Requires: libnih-dbus = 1.0.3-alt2, debug64(libc.so.6), debug64(libdbus-1.so.3), debug64(libnih.so.1), debug64(librt.so.1)
Processing files: libnih-dbus-devel-debuginfo-1.0.3-alt2
Finding Provides (using /usr/lib/rpm/find-provides)
Executing: /bin/sh -e /usr/src/tmp/rpm-tmp.pOpqyy
find-provides: running scripts (debuginfo)
Finding Requires (using /usr/lib/rpm/find-requires)
Executing: /bin/sh -e /usr/src/tmp/rpm-tmp.8eDkiO
find-requires: running scripts (debuginfo)
++ /bin/sed -e '/^libc\.so\.6(GLIBC_PRIVATE)\((64bit)\)\?$/d'
Requires: libnih-dbus-devel = 1.0.3-alt2, /usr/lib/debug/lib64/ld-linux-x86-64.so.2.debug, debug64(libc.so.6), debug64(libdbus-1.so.3), debug64(libexpat.so.1), debug64(libnih.so.1)
Adding to libnih-dbus-debuginfo a strict dependency on libnih-debuginfo
Adding to libnih-dbus-devel-debuginfo a strict dependency on libnih-debuginfo
Removing from libnih-dbus-debuginfo 11 sources provided by libnih-debuginfo
also prunning dir /usr/src/debug/libnih-1.0.3/nih
Removing from libnih-dbus-devel-debuginfo 8 sources provided by libnih-debuginfo
also prunning dir /usr/src/debug/libnih-1.0.3/nih
Adding to libnih-dbus-devel-debuginfo a strict dependency on libnih-dbus-debuginfo
Removing from libnih-dbus-devel-debuginfo 1 sources provided by libnih-dbus-debuginfo
also prunning dir /usr/src/debug/libnih-1.0.3/nih-dbus
Removing 1 extra deps from libnih-devel due to dependency on libnih
Removing 2 extra deps from libnih-dbus due to dependency on libnih
Removing 3 extra deps from libnih-dbus-devel due to dependency on libnih-devel
Removing 1 extra deps from libnih-dbus-devel due to dependency on libnih-dbus
Removing 1 extra deps from libnih-dbus-debuginfo due to dependency on libnih-debuginfo
Removing 1 extra deps from libnih-dbus-devel-debuginfo due to dependency on libnih-debuginfo
Removing 2 extra deps from libnih-dbus-devel due to dependency on libnih
Removing 6 extra deps from libnih-dbus due to repentancy on libnih
Removing 5 extra deps from libnih-dbus-devel due to repentancy on libnih
Removing 1 extra deps from libnih-dbus-devel due to repentancy on libnih-devel
Removing 1 extra deps from libnih-dbus-devel due to repentancy on libnih-dbus
Removing 2 extra deps from libnih-dbus-debuginfo due to repentancy on libnih-debuginfo
Removing 1 extra deps from libnih-dbus-devel-debuginfo due to repentancy on libnih-debuginfo
Removing 2 extra deps from libnih-dbus-devel-debuginfo due to repentancy on libnih-dbus-debuginfo
Wrote: /usr/src/RPM/RPMS/x86_64/libnih-1.0.3-alt2.x86_64.rpm
Wrote: /usr/src/RPM/RPMS/x86_64/libnih-devel-1.0.3-alt2.x86_64.rpm
Wrote: /usr/src/RPM/RPMS/x86_64/libnih-dbus-1.0.3-alt2.x86_64.rpm
Wrote: /usr/src/RPM/RPMS/x86_64/libnih-dbus-devel-1.0.3-alt2.x86_64.rpm
Wrote: /usr/src/RPM/RPMS/x86_64/libnih-debuginfo-1.0.3-alt2.x86_64.rpm
Wrote: /usr/src/RPM/RPMS/x86_64/libnih-dbus-debuginfo-1.0.3-alt2.x86_64.rpm
Wrote: /usr/src/RPM/RPMS/x86_64/libnih-dbus-devel-debuginfo-1.0.3-alt2.x86_64.rpm
543.67user 26.00system 13:42.29elapsed 69%CPU (0avgtext+0avgdata 1063220maxresident)k
0inputs+0outputs (0major+4681825minor)pagefaults 0swaps
561.29user 33.20system 14:08.82elapsed 70%CPU (0avgtext+0avgdata 1063220maxresident)k
0inputs+0outputs (0major+5315563minor)pagefaults 0swaps