<86>Dec 19 02:15:37 userdel[6747]: delete user 'rooter'
<86>Dec 19 02:15:37 groupadd[6929]: group added to /etc/group: name=rooter, GID=663
<86>Dec 19 02:15:37 groupadd[6929]: group added to /etc/gshadow: name=rooter
<86>Dec 19 02:15:37 groupadd[6929]: new group: name=rooter, GID=663
<86>Dec 19 02:15:37 useradd[7002]: new user: name=rooter, UID=663, GID=663, home=/root, shell=/bin/bash
<86>Dec 19 02:15:37 userdel[7236]: delete user 'builder'
<86>Dec 19 02:15:37 groupadd[7430]: group added to /etc/group: name=builder, GID=664
<86>Dec 19 02:15:37 groupadd[7430]: group added to /etc/gshadow: name=builder
<86>Dec 19 02:15:37 groupadd[7430]: new group: name=builder, GID=664
<86>Dec 19 02:15:37 useradd[7634]: new user: name=builder, UID=664, GID=664, home=/usr/src, shell=/bin/bash
<13>Dec 19 02:15:42 rpmi: javapackages-tools-1:5.0.0-alt1_12jpp8 1525973129 installed
<13>Dec 19 02:15:42 rpmi: libjpeg-2:1.5.1-alt1 1498218302 installed
<13>Dec 19 02:15:42 rpmi: liblksctp-1.0.17-alt2 1523113258 installed
<13>Dec 19 02:15:42 rpmi: libpng16-1.6.35-alt1 sisyphus.214397.100 1539159326 installed
<13>Dec 19 02:15:42 rpmi: libexpat-2.2.4-alt1 1503305341 installed
<13>Dec 19 02:15:42 rpmi: lksctp-tools-1.0.17-alt2 1523113258 installed
<13>Dec 19 02:15:42 rpmi: ant-lib-0:1.10.3-alt1_2jpp8 1528243545 installed
<13>Dec 19 02:15:42 rpmi: hamcrest-core-0:1.3-alt3_23jpp8 1525893879 installed
<13>Dec 19 02:15:42 rpmi: java-common-1.5.0-alt1 1329330500 installed
<13>Dec 19 02:15:42 rpmi: rpm-macros-java-1:5.0.0-alt1_12jpp8 1525973129 installed
<13>Dec 19 02:15:42 rpmi: libpcap0.8-2:1.1.1-alt3 1298589613 installed
<13>Dec 19 02:15:42 rpmi: libgdbm-1.8.3-alt10 1454943313 installed
<13>Dec 19 02:15:42 rpmi: libgpg-error-1.31-alt1.S1 1529015796 installed
<13>Dec 19 02:15:42 rpmi: libgcrypt20-1.8.3-alt3 sisyphus.214019.140 1538990261 installed
<13>Dec 19 02:15:42 rpmi: libxslt-1.1.32-alt2 1517429962 installed
<13>Dec 19 02:15:42 rpmi: libgif-4.1.6-alt3 1299634266 installed
<13>Dec 19 02:15:42 rpmi: libalsa-1:1.1.7-alt1 sisyphus.215150.100 1539797654 installed
<13>Dec 19 02:15:42 rpmi: libX11-locales-3:1.6.7-alt1 sisyphus.214413.200 1539171080 installed
<13>Dec 19 02:15:42 rpmi: libXdmcp-1.1.1-alt1 1334617699 installed
<13>Dec 19 02:15:42 rpmi: libXau-1.0.8-alt1 1369565807 installed
<13>Dec 19 02:15:42 rpmi: libxcb-1.13.1-alt1 sisyphus.214413.100 1539170828 installed
<13>Dec 19 02:15:42 rpmi: libX11-3:1.6.7-alt1 sisyphus.214413.200 1539171080 installed
<13>Dec 19 02:15:42 rpmi: libXext-1.3.3-alt1 1409902932 installed
<13>Dec 19 02:15:42 rpmi: libXi-1.7.9-alt1.S1 1515755338 installed
<13>Dec 19 02:15:42 rpmi: libXtst-1.2.2-alt1 1369984880 installed
<13>Dec 19 02:15:42 rpmi: libXcomposite-0.4.3-alt3 1297306939 installed
<13>Dec 19 02:15:42 rpmi: libXrender-0.9.8-alt1 1371312110 installed
<13>Dec 19 02:15:42 rpmi: libsqlite3-3.25.2-alt2 sisyphus.215082.100 1539700192 installed
<13>Dec 19 02:15:42 rpmi: libnspr-1:4.20-alt1 sisyphus.216395.100 1542113038 installed
<13>Dec 19 02:15:43 rpmi: javazi-2018g-alt2 sisyphus.215795.200 1540855508 installed
<13>Dec 19 02:15:43 rpmi: libgraphite2-1.3.12-alt2.1 sisyphus.215942.100 1540990747 installed
<13>Dec 19 02:15:43 rpmi: libharfbuzz-2.1.3-alt1 sisyphus.216837.100 1543085726 installed
<13>Dec 19 02:15:43 rpmi: libfreetype-2.9.1-alt1.S1 1530781049 installed
<13>Dec 19 02:15:43 rpmi: fontconfig-2.13.1-alt1 sisyphus.215917.100 1540973883 installed
Updating fonts cache: [ DONE ]
<29>Dec 19 02:15:44 fontconfig: Updating fonts cache: succeeded
<13>Dec 19 02:15:44 rpmi: fonts-type1-xorg-7.0.0-alt4 1188553211 installed
<13>Dec 19 02:15:44 rpmi: libtasn1-4.13-alt2 1521133848 installed
<13>Dec 19 02:15:44 rpmi: libp11-kit-0.23.9-alt5 1525798241 installed
<13>Dec 19 02:15:44 rpmi: rpm-macros-alternatives-0.4.5-alt1.1 1404382149 installed
<13>Dec 19 02:15:44 rpmi: alternatives-0.4.5-alt1.1 1404382149 installed
<13>Dec 19 02:15:44 rpmi: ca-certificates-2018.11.12-alt1 sisyphus.216395.300 1542114035 installed
<13>Dec 19 02:15:44 rpmi: ca-trust-0.1.1-alt2 1515595785 installed
<13>Dec 19 02:15:44 rpmi: p11-kit-trust-0.23.9-alt5 1525798241 installed
<13>Dec 19 02:15:44 rpmi: libcrypto1.1-1.1.0j-alt1 sisyphus.216647.100 1542743840 installed
<13>Dec 19 02:15:44 rpmi: libssl1.1-1.1.0j-alt1 sisyphus.216647.100 1542743840 installed
<13>Dec 19 02:15:44 rpmi: rpm-build-python3-0.1.13.1-alt2 1535450458 installed
<13>Dec 19 02:15:44 rpmi: tests-for-installed-python3-pkgs-0.1.13.1-alt2 1535450458 installed
<13>Dec 19 02:15:44 rpmi: python3-3.6.5-alt1.1 1535734400 installed
<13>Dec 19 02:15:45 rpmi: python3-base-3.6.5-alt1.1 1535734400 installed
<13>Dec 19 02:15:45 rpmi: libpython3-3.6.5-alt1.1 1535734400 installed
<13>Dec 19 02:15:45 rpmi: python3-module-six-1.11.0-alt2 1535611135 installed
<13>Dec 19 02:15:45 rpmi: python3-module-genshi-0.7-alt1.1.1.1 1460400303 installed
<13>Dec 19 02:15:45 rpmi: python3-module-webencodings-0.5.1-alt1.1 1517943573 installed
<13>Dec 19 02:15:45 rpmi: python3-module-html5lib-1:0.999999999-alt4.qa1 sisyphus.214868.100 1539741045 installed
<13>Dec 19 02:15:45 rpmi: python3-module-lxml-4.2.1-alt1.1 1525118997 installed
<13>Dec 19 02:15:45 rpmi: python3-module-cssselect-0.9.1-alt1.2 1526980827 installed
<13>Dec 19 02:15:45 rpmi: python3-module-javapackages-1:5.0.0-alt1_12jpp8 1525973129 installed
<13>Dec 19 02:15:45 rpmi: ca-trust-java-0.1.1-alt2 1515595785 installed
<13>Dec 19 02:15:45 rpmi: libnss-3.40.0-alt1 sisyphus.216395.200 1542113793 installed
<13>Dec 19 02:15:47 rpmi: java-1.8.0-openjdk-headless-0:1.8.0.151-alt1_5.b12jpp8 1529924888 installed
<13>Dec 19 02:15:49 rpmi: java-1.8.0-openjdk-0:1.8.0.151-alt1_5.b12jpp8 1529924888 installed
<13>Dec 19 02:15:50 rpmi: java-1.8.0-openjdk-devel-0:1.8.0.151-alt1_5.b12jpp8 1529924888 installed
<13>Dec 19 02:15:50 rpmi: rpm-build-java-1:5.0.0-alt1_12jpp8 1525973129 installed
<13>Dec 19 02:15:50 rpmi: libpcap-devel-2:1.1.1-alt3 1298589613 installed
<13>Dec 19 02:15:50 rpmi: junit-1:4.12-alt1_8jpp8 1525900612 installed
<13>Dec 19 02:15:50 rpmi: ant-0:1.10.3-alt1_2jpp8 1528243545 installed
Building target platforms: x86_64
Building for target x86_64
Wrote: /usr/src/in/nosrpm/jpcap-0.7-alt4.nosrc.rpm
Installing jpcap-0.7-alt4.src.rpm
Building target platforms: x86_64
Building for target x86_64
Executing(%prep): /bin/sh -e /usr/src/tmp/rpm-tmp.25389
+ umask 022
+ /bin/mkdir -p /usr/src/RPM/BUILD
+ cd /usr/src/RPM/BUILD
+ cd /usr/src/RPM/BUILD
+ rm -rf jpcap-0.7
+ echo 'Source #0 (jpcap-0.7.tar.gz):'
Source #0 (jpcap-0.7.tar.gz):
+ /bin/gzip -dc /usr/src/RPM/SOURCES/jpcap-0.7.tar.gz
+ /bin/tar -xf -
+ cd jpcap-0.7
+ /bin/chmod -c -Rf u+rwX,go-w .
+ sed -i 's/-shared/-shared -fPIC/g' src/c/Makefile
+ sed -i '1i #include<malloc.h>' src/c/JpcapWriter.c
+ exit 0
Executing(%build): /bin/sh -e /usr/src/tmp/rpm-tmp.25359
+ umask 022
+ /bin/mkdir -p /usr/src/RPM/BUILD
+ cd /usr/src/RPM/BUILD
+ cd jpcap-0.7
+ cd src/c
+ make clean
make: Entering directory '/usr/src/RPM/BUILD/jpcap-0.7/src/c'
rm libjpcap.so
rm: cannot remove 'libjpcap.so': No such file or directory
make: [Makefile:56: clean] Error 1 (ignored)
make: Leaving directory '/usr/src/RPM/BUILD/jpcap-0.7/src/c'
+ make
make: Entering directory '/usr/src/RPM/BUILD/jpcap-0.7/src/c'
gcc -shared -fPIC -L. -I/usr/lib/jvm/java/include -I/usr/lib/jvm/java/include/linux\
	 -I/usr/include\
	JpcapCaptor.c JpcapSender.c JpcapWriter.c\
          packet_arp.c packet_datalink.c packet_icmp.c packet_ip.c\
          packet_ipv6.c packet_tcp.c packet_udp.c\
	-o libjpcap.so -lpcap
JpcapCaptor.c: In function 'Java_jpcap_JpcapCaptor_getDeviceList':
JpcapCaptor.c:286:5: warning: implicit declaration of function 'close'; did you mean 'pclose'? [-Wimplicit-function-declaration]
     close(sd);
     ^~~~~
     pclose
JpcapCaptor.c: In function 'Java_jpcap_JpcapCaptor_processPacket':
JpcapCaptor.c:449:57: warning: cast to pointer from integer of different size [-Wint-to-pointer-cast]
   pkt_cnt=pcap_dispatch(pcds[id],cnt,dispatcher_handler,(u_char *)id);
                                                         ^
JpcapCaptor.c: In function 'Java_jpcap_JpcapCaptor_loopPacket':
JpcapCaptor.c:468:53: warning: cast to pointer from integer of different size [-Wint-to-pointer-cast]
   pkt_cnt=pcap_loop(pcds[id],cnt,dispatcher_handler,(u_char *)id);
                                                     ^
JpcapCaptor.c: In function 'dispatcher_handler':
JpcapCaptor.c:682:10: warning: cast from pointer to integer of different size [-Wpointer-to-int-cast]
   int ID=(int)id;
          ^
JpcapSender.c: In function 'Java_jpcap_JpcapSender_nativeCloseRawSocket':
JpcapSender.c:403:3: warning: implicit declaration of function 'close'; did you mean 'pclose'? [-Wimplicit-function-declaration]
   close(soc_num);
   ^~~~~
   pclose
In file included from packet_icmp.c:16:
packet_icmp.c: In function 'analyze_icmp':
packet_icmp.c:82:7: warning: implicit declaration of function 'inet_ntoa' [-Wimplicit-function-declaration]
       inet_ntoa(*(struct in_addr *)(icmp_pkt->icmp_data+8+(i<<3))));
       ^~~~~~~~~
Jpcap_sub.h:29:54: note: in definition of macro 'NewString'
 #define NewString(str)      (*env)->NewStringUTF(env,str)
                                                      ^~~
packet_icmp.c:81:29: warning: cast to pointer from integer of different size [-Wint-to-pointer-cast]
  jstring addr_str=NewString((const char *)
                             ^
Jpcap_sub.h:29:54: note: in definition of macro 'NewString'
 #define NewString(str)      (*env)->NewStringUTF(env,str)
                                                      ^~~
packet_icmp.c:83:11: warning: cast from pointer to integer of different size [-Wpointer-to-int-cast]
  prefs[i]=(int)(icmp_pkt->icmp_data+8+(i<<3)+4);
           ^
make: Leaving directory '/usr/src/RPM/BUILD/jpcap-0.7/src/c'
+ cd ../..
+ mkdir bin
+ JAVA_HOME=/usr/lib/jvm/java
+ ant -Dant.build.javac.source=1.6 -Dant.build.javac.target=1.6 jar
Buildfile: /usr/src/RPM/BUILD/jpcap-0.7/build.xml

compile:
    [javac] /usr/src/RPM/BUILD/jpcap-0.7/build.xml:29: warning: 'includeantruntime' was not set, defaulting to build.sysclasspath=last; set to false for repeatable builds
    [javac] Compiling 16 source files to /usr/src/RPM/BUILD/jpcap-0.7/bin
    [javac] warning: [options] bootstrap class path not set in conjunction with -source 1.6
    [javac] Note: /usr/src/RPM/BUILD/jpcap-0.7/src/java/jpcap/packet/IPPacket.java uses unchecked or unsafe operations.
    [javac] Note: Recompile with -Xlint:unchecked for details.
    [javac] 1 warning

jar:
      [jar] Building jar: /usr/src/RPM/BUILD/jpcap-0.7/lib/jpcap.jar

BUILD SUCCESSFUL
Total time: 2 seconds
+ JAVA_HOME=/usr/lib/jvm/java
+ ant -Dant.build.javac.source=1.6 -Dant.build.javac.target=1.6 javadoc
Buildfile: /usr/src/RPM/BUILD/jpcap-0.7/build.xml

javadoc:
  [javadoc] Generating Javadoc
  [javadoc] Javadoc execution
  [javadoc] Loading source files for package jpcap...
  [javadoc] Loading source files for package jpcap.packet...
  [javadoc] Constructing Javadoc information...
  [javadoc] Standard Doclet version 1.8.0_151
  [javadoc] Building tree for all the packages and classes...
  [javadoc] /usr/src/RPM/BUILD/jpcap-0.7/src/java/jpcap/JpcapCaptor.java:114: error: self-closing element not allowed
  [javadoc] 	 * Captures the specified number of packets consecutively.<br/>
  [javadoc] 	                                                          ^
  [javadoc] /usr/src/RPM/BUILD/jpcap-0.7/src/java/jpcap/JpcapCaptor.java:148: error: invalid uri: "#processPacket(int, jpcap.PacketReceiver)"
  [javadoc] 	 * Same as <a href="#processPacket(int, jpcap.PacketReceiver)">processPacket()</a>
  [javadoc] 	              ^
  [javadoc] /usr/src/RPM/BUILD/jpcap-0.7/src/java/jpcap/JpcapCaptor.java:151: warning: no @param for count
  [javadoc] 	public int dispatchPacket(int count, PacketReceiver handler){
  [javadoc] 	           ^
  [javadoc] /usr/src/RPM/BUILD/jpcap-0.7/src/java/jpcap/JpcapCaptor.java:151: warning: no @param for handler
  [javadoc] 	public int dispatchPacket(int count, PacketReceiver handler){
  [javadoc] 	           ^
  [javadoc] /usr/src/RPM/BUILD/jpcap-0.7/src/java/jpcap/JpcapCaptor.java:151: warning: no @return
  [javadoc] 	public int dispatchPacket(int count, PacketReceiver handler){
  [javadoc] 	           ^
  [javadoc] /usr/src/RPM/BUILD/jpcap-0.7/src/java/jpcap/JpcapSender.java:32: error: reference not found
  [javadoc] 	 * @throws IOException
  [javadoc] 	   ^
  [javadoc] /usr/src/RPM/BUILD/jpcap-0.7/src/java/jpcap/JpcapSender.java:36: warning: no @throws for java.io.IOException
  [javadoc] 	public static JpcapSender openDevice(NetworkInterface device) throws java.io.IOException {
  [javadoc] 	                          ^
  [javadoc] /usr/src/RPM/BUILD/jpcap-0.7/src/java/jpcap/JpcapSender.java:53: error: reference not found
  [javadoc] 	 * @throws IOException
  [javadoc] 	   ^
  [javadoc] /usr/src/RPM/BUILD/jpcap-0.7/src/java/jpcap/JpcapSender.java:58: warning: no @throws for java.io.IOException
  [javadoc] 	public static JpcapSender openRawSocket() throws java.io.IOException {
  [javadoc] 	                          ^
  [javadoc] /usr/src/RPM/BUILD/jpcap-0.7/src/java/jpcap/JpcapWriter.java:22: error: reference not found
  [javadoc]      * @throws IOException If the file cannot be opened
  [javadoc]        ^
  [javadoc] /usr/src/RPM/BUILD/jpcap-0.7/src/java/jpcap/JpcapWriter.java:24: warning: no @return
  [javadoc] 	public static JpcapWriter openDumpFile(JpcapCaptor jpcap,String filename) throws java.io.IOException{
  [javadoc] 	                          ^
  [javadoc] /usr/src/RPM/BUILD/jpcap-0.7/src/java/jpcap/JpcapWriter.java:24: warning: no @throws for java.io.IOException
  [javadoc] 	public static JpcapWriter openDumpFile(JpcapCaptor jpcap,String filename) throws java.io.IOException{
  [javadoc] 	                          ^
  [javadoc] /usr/src/RPM/BUILD/jpcap-0.7/src/java/jpcap/packet/EthernetPacket.java:73: error: bad use of '>'
  [javadoc]          * Format: Fsrc_mac -> dst_mac (frametype)
  [javadoc]                              ^
  [javadoc] /usr/src/RPM/BUILD/jpcap-0.7/src/java/jpcap/packet/IPPacket.java:265: error: bad use of '>'
  [javadoc] 	 * Format(IPv4): src_ip->dst_ip protocol(protocol) priority(priority)
  [javadoc] 	                        ^
  [javadoc] /usr/src/RPM/BUILD/jpcap-0.7/src/java/jpcap/packet/IPPacket.java:269: error: bad use of '>'
  [javadoc] 	 * Format(IPv6): src_ip->dst_ip protocol(protocol) priority(priority)
  [javadoc] 	                        ^
  [javadoc] /usr/src/RPM/BUILD/jpcap-0.7/src/java/jpcap/packet/TCPPacket.java:97: error: bad use of '>'
  [javadoc]    * Format: src_port > dst_port seq(sequence) win(window) [ack ack_num] [S][F][P]
  [javadoc]                       ^
  [javadoc] /usr/src/RPM/BUILD/jpcap-0.7/src/java/jpcap/packet/UDPPacket.java:32: error: bad use of '>'
  [javadoc]          * Format: src_port > dst_port
  [javadoc]                             ^
  [javadoc] Building index for all the packages and classes...
  [javadoc] Building index for all classes...
  [javadoc] Generating /usr/src/RPM/BUILD/jpcap-0.7/doc/javadoc/help-doc.html...
  [javadoc] 10 errors
  [javadoc] 7 warnings

BUILD SUCCESSFUL
Total time: 3 seconds
+ exit 0
Executing(%install): /bin/sh -e /usr/src/tmp/rpm-tmp.94253
+ umask 022
+ /bin/mkdir -p /usr/src/RPM/BUILD
+ cd /usr/src/RPM/BUILD
+ /bin/chmod -Rf u+rwX -- /usr/src/tmp/jpcap-buildroot
+ :
+ /bin/rm -rf -- /usr/src/tmp/jpcap-buildroot
+ cd jpcap-0.7
+ install -d /usr/src/tmp/jpcap-buildroot
+ install -pD -m 644 lib/jpcap.jar /usr/src/tmp/jpcap-buildroot/usr/share/java/jpcap-0.7.jar
+ ln -sf jpcap-0.7.jar /usr/src/tmp/jpcap-buildroot/usr/share/java/jpcap.jar
+ install -pD -m 644 src/c/libjpcap.so /usr/src/tmp/jpcap-buildroot/usr/lib64/libjpcap.so.0.7
+ ln -sf libjpcap.so.0.7 /usr/src/tmp/jpcap-buildroot/usr/lib64/libjpcap.so
+ install -d /usr/src/tmp/jpcap-buildroot/usr/share/javadoc/jpcap-0.7/
+ cp -pr doc/javadoc /usr/src/tmp/jpcap-buildroot/usr/share/javadoc/jpcap-0.7/
+ /usr/lib/rpm/brp-alt
Cleaning files in /usr/src/tmp/jpcap-buildroot (auto)
Verifying and fixing files in /usr/src/tmp/jpcap-buildroot (binconfig,pkgconfig,libtool,desktop)
Checking contents of files in /usr/src/tmp/jpcap-buildroot/ (default)
Compressing files in /usr/src/tmp/jpcap-buildroot (auto)
Adjusting library links in /usr/src/tmp/jpcap-buildroot
./usr/lib64:
	libjpcap.so.0.7 -> libjpcap.so.0.7
Verifying ELF objects in /usr/src/tmp/jpcap-buildroot (arch=normal,fhs=normal,lfs=relaxed,lint=relaxed,rpath=normal,stack=normal,textrel=normal,unresolved=normal)
Hardlinking identical .pyc and .opt-?.pyc files
Hardlinking identical .pyc and .pyo files
Processing files: jpcap-0.7-alt4
Executing(%doc): /bin/sh -e /usr/src/tmp/rpm-tmp.4213
+ umask 022
+ /bin/mkdir -p /usr/src/RPM/BUILD
+ cd /usr/src/RPM/BUILD
+ cd jpcap-0.7
+ DOCDIR=/usr/src/tmp/jpcap-buildroot/usr/share/doc/jpcap-0.7
+ export DOCDIR
+ rm -rf /usr/src/tmp/jpcap-buildroot/usr/share/doc/jpcap-0.7
+ /bin/mkdir -p /usr/src/tmp/jpcap-buildroot/usr/share/doc/jpcap-0.7
+ cp -prL README COPYING ChangeLog /usr/src/tmp/jpcap-buildroot/usr/share/doc/jpcap-0.7
+ chmod -R go-w /usr/src/tmp/jpcap-buildroot/usr/share/doc/jpcap-0.7
+ chmod -R a+rX /usr/src/tmp/jpcap-buildroot/usr/share/doc/jpcap-0.7
+ exit 0
Finding Provides (using /usr/lib/rpm/find-provides)
Executing: /bin/sh -e /usr/src/tmp/rpm-tmp.kZE3GR
find-provides: running scripts (alternatives,debuginfo,lib,maven,osgi-fc,pam,perl,pkgconfig,python,python3,shell)
[INFO osgi.prov] input: ['/usr/src/tmp/jpcap-buildroot/usr/share/java/jpcap-0.7.jar', '/usr/src/tmp/jpcap-buildroot/usr/share/java/jpcap.jar']
Finding Requires (using /usr/lib/rpm/find-requires)
Executing: /bin/sh -e /usr/src/tmp/rpm-tmp.xLWOFK
find-requires: running scripts (cpp,debuginfo,files,javadoc,lib,maven,osgi-fc,pam,perl,pkgconfig,pkgconfiglib,python,python3,rpmlib,shebang,shell,static,symlinks)
[INFO osgi.req] input: ['/usr/src/tmp/jpcap-buildroot/usr/share/java/jpcap-0.7.jar', '/usr/src/tmp/jpcap-buildroot/usr/share/java/jpcap.jar']
Provides: libjpcap.so.0.7()(64bit) = set:kd9F2jHVKawn74Hqaf8uMpB1iHrdV0vAJo4Cv3Z6LqUoXsQbFC5PsRuo5VzNolBAR5il5TAidMKV8otBW0tAAX4XoHANj9TdKTfvYmzJFdN90TACigZLb8nywh7VBsXzBZAHdfX6nyxnfkOC2KqPEzklAYPJFAXQpwu3nWi141RUSTYnCncZcJgsJxYEpqK8cYFrKxIUkkaOzd0OfZ0Qm0
Requires: java >= 1.6, libpcap0.8 >= 0.9, libc.so.6(GLIBC_2.2.5)(64bit), libc.so.6(GLIBC_2.4)(64bit), libpcap.so.0.8()(64bit) >= set:kfqoCuiuPPCOexi2dZI4t6osjxe7Z2zojMaNE7mKtvHJsnJFFCnqBqck3h0, rtld(GNU_HASH)
Requires(rpmlib): rpmlib(SetVersions)
Finding debuginfo files (using /usr/lib/rpm/find-debuginfo-files)
Executing: /bin/sh -e /usr/src/tmp/rpm-tmp.6ww5bL
Creating jpcap-debuginfo package
Processing files: jpcap-javadoc-0.7-alt4
Finding Provides (using /usr/lib/rpm/find-provides)
Executing: /bin/sh -e /usr/src/tmp/rpm-tmp.de7czQ
find-provides: running scripts (alternatives,debuginfo,lib,maven,osgi-fc,pam,perl,pkgconfig,python,python3,shell)
Finding Requires (using /usr/lib/rpm/find-requires)
Executing: /bin/sh -e /usr/src/tmp/rpm-tmp.UlUuz0
find-requires: running scripts (cpp,debuginfo,files,javadoc,lib,maven,osgi-fc,pam,perl,pkgconfig,pkgconfiglib,python,python3,rpmlib,shebang,shell,static,symlinks)
Requires: java-common
Processing files: jpcap-debuginfo-0.7-alt4
Finding Provides (using /usr/lib/rpm/find-provides)
Executing: /bin/sh -e /usr/src/tmp/rpm-tmp.vgUxOf
find-provides: running scripts (debuginfo)
Finding Requires (using /usr/lib/rpm/find-requires)
Executing: /bin/sh -e /usr/src/tmp/rpm-tmp.YGAf8z
find-requires: running scripts (debuginfo)
Provides: debug64(libjpcap.so.0.7)
Requires: jpcap = 0.7-alt4, debug64(libc.so.6), debug64(libpcap.so.0.8)
Wrote: /usr/src/RPM/RPMS/x86_64/jpcap-0.7-alt4.x86_64.rpm
Wrote: /usr/src/RPM/RPMS/noarch/jpcap-javadoc-0.7-alt4.noarch.rpm
Wrote: /usr/src/RPM/RPMS/x86_64/jpcap-debuginfo-0.7-alt4.x86_64.rpm
12.28user 0.92system 0:25.65elapsed 51%CPU (0avgtext+0avgdata 136956maxresident)k
0inputs+0outputs (0major+405718minor)pagefaults 0swaps
30.56user 3.85system 0:58.88elapsed 58%CPU (0avgtext+0avgdata 136956maxresident)k
0inputs+0outputs (0major+1019054minor)pagefaults 0swaps
--- jpcap-debuginfo-0.7-alt4.x86_64.rpm.repo	2011-02-07 16:32:05.000000000 +0000
+++ jpcap-debuginfo-0.7-alt4.x86_64.rpm.hasher	2018-12-19 02:16:27.889903860 +0000
@@ -4,2 +4,3 @@
 Requires: debug64(libc.so.6)  
+Requires: debug64(libpcap.so.0.8)  
 Requires: rpmlib(PayloadIsLzma)  
--- jpcap-javadoc-0.7-alt4.noarch.rpm.repo	2011-02-07 16:32:00.000000000 +0000
+++ jpcap-javadoc-0.7-alt4.noarch.rpm.hasher	2018-12-19 02:16:27.923903820 +0000
@@ -53,2 +53,3 @@
 /usr/share/javadoc/jpcap-0.7/javadoc/resources/inherit.gif	100644	
+/usr/share/javadoc/jpcap-0.7/javadoc/script.js	100644	
 /usr/share/javadoc/jpcap-0.7/javadoc/serialized-form.html	100644