<86>Nov 16 02:25:41 userdel[60837]: delete user 'rooter'
<86>Nov 16 02:25:41 groupadd[60853]: group added to /etc/group: name=rooter, GID=582
<86>Nov 16 02:25:41 groupadd[60853]: group added to /etc/gshadow: name=rooter
<86>Nov 16 02:25:41 groupadd[60853]: new group: name=rooter, GID=582
<86>Nov 16 02:25:41 useradd[60908]: new user: name=rooter, UID=582, GID=582, home=/root, shell=/bin/bash
<86>Nov 16 02:25:41 userdel[60956]: delete user 'builder'
<86>Nov 16 02:25:41 userdel[60956]: removed group 'builder' owned by 'builder'
<86>Nov 16 02:25:41 userdel[60956]: removed shadow group 'builder' owned by 'builder'
<86>Nov 16 02:25:41 groupadd[60985]: group added to /etc/group: name=builder, GID=583
<86>Nov 16 02:25:41 groupadd[60985]: group added to /etc/gshadow: name=builder
<86>Nov 16 02:25:41 groupadd[60985]: new group: name=builder, GID=583
<86>Nov 16 02:25:41 useradd[61007]: new user: name=builder, UID=583, GID=583, home=/usr/src, shell=/bin/bash
warning: Macro %cmake not found
warning: Macro %cmake_build not found
warning: Macro %cmakeinstall_std not found
warning: Macro %cmake_build not found
<13>Nov 16 02:25:44 rpmi: libuv-1.20.3-alt1 1526915431 installed
<13>Nov 16 02:25:44 rpmi: libjsoncpp19-1.8.4-alt2.S1 1518769512 installed
<13>Nov 16 02:25:44 rpmi: libexpat-2.2.4-alt1 1503305341 installed
<13>Nov 16 02:25:44 rpmi: libidn2-2.0.5-alt1 1526923871 installed
<13>Nov 16 02:25:44 rpmi: gcc-c++-common-1.4.22-alt1 1519183788 installed
<13>Nov 16 02:25:45 rpmi: libstdc++7-devel-7.3.1-alt5 1531512602 installed
<13>Nov 16 02:25:45 rpmi: gcc7-c++-7.3.1-alt5 1531512602 installed
<13>Nov 16 02:25:45 rpmi: librhash-1.3.5-alt2 1505156277 installed
<13>Nov 16 02:25:45 rpmi: publicsuffix-list-dafsa-20181106-alt1 sisyphus.216228.100 1541611754 installed
<13>Nov 16 02:25:45 rpmi: libpsl-0.20.2-alt2 sisyphus.216228.200 1541611883 installed
<13>Nov 16 02:25:45 rpmi: libnghttp2-1.34.0-alt1 sisyphus.214524.100 1539249616 installed
<13>Nov 16 02:25:45 rpmi: libverto-0.3.0-alt1_5 1525957716 installed
<13>Nov 16 02:25:45 rpmi: libkeyutils-1.5.10-alt1 1489994069 installed
<13>Nov 16 02:25:45 rpmi: libcom_err-1.44.3-alt1 1532134713 installed
<13>Nov 16 02:25:45 rpmi: libbrotlicommon-1.0.7-alt1 sisyphus.215491.100 1540428591 installed
<13>Nov 16 02:25:45 rpmi: libbrotlidec-1.0.7-alt1 sisyphus.215491.100 1540428591 installed
<13>Nov 16 02:25:45 rpmi: libnettle6-3.4-alt1 1511790158 installed
<13>Nov 16 02:25:45 rpmi: libarchive13-3.3.1-alt1.S1 1488799499 installed
<13>Nov 16 02:25:45 rpmi: rpm-macros-cmake-3.11.2-alt2 1532003375 installed
<13>Nov 16 02:25:45 rpmi: cmake-modules-3.11.2-alt2 1532003375 installed
<13>Nov 16 02:25:45 rpmi: libtasn1-4.13-alt2 1521133848 installed
<13>Nov 16 02:25:45 rpmi: libp11-kit-0.23.9-alt5 1525798241 installed
<13>Nov 16 02:25:45 rpmi: rpm-macros-alternatives-0.4.5-alt1.1 1404382149 installed
<13>Nov 16 02:25:45 rpmi: alternatives-0.4.5-alt1.1 1404382149 installed
<13>Nov 16 02:25:45 rpmi: ca-certificates-2018.11.12-alt1 sisyphus.216395.300 1542114035 installed
<13>Nov 16 02:25:45 rpmi: ca-trust-0.1.1-alt2 1515595785 installed
<13>Nov 16 02:25:45 rpmi: p11-kit-trust-0.23.9-alt5 1525798241 installed
<13>Nov 16 02:25:45 rpmi: libcrypto1.1-1.1.0i-alt1 1535471288 installed
<13>Nov 16 02:25:45 rpmi: libssl1.1-1.1.0i-alt1 1535471288 installed
<86>Nov 16 02:25:45 groupadd[84524]: group added to /etc/group: name=_keytab, GID=499
<86>Nov 16 02:25:45 groupadd[84524]: group added to /etc/gshadow: name=_keytab
<86>Nov 16 02:25:45 groupadd[84524]: new group: name=_keytab, GID=499
<13>Nov 16 02:25:46 rpmi: libkrb5-1.16.2-alt1 sisyphus.216047.100 1541159108 installed
<86>Nov 16 02:25:46 groupadd[84646]: group added to /etc/group: name=sasl, GID=498
<86>Nov 16 02:25:46 groupadd[84646]: group added to /etc/gshadow: name=sasl
<86>Nov 16 02:25:46 groupadd[84646]: new group: name=sasl, GID=498
<13>Nov 16 02:25:46 rpmi: libsasl2-3-2.1.27-alt0.2 1535660692 installed
<13>Nov 16 02:25:46 rpmi: libldap-2.4.46-alt1 1535562096 installed
<13>Nov 16 02:25:46 rpmi: libcurl-7.62.0-alt3 sisyphus.216461.100 1542191615 installed
<13>Nov 16 02:25:46 rpmi: cmake-3.11.2-alt2 1532003375 installed
<13>Nov 16 02:25:46 rpmi: ctest-3.11.2-alt2 1532003375 installed
<13>Nov 16 02:25:46 rpmi: gcc-c++-7-alt6 1528289185 installed
Building target platforms: x86_64
Building for target x86_64
Wrote: /usr/src/in/nosrpm/spdlog-1.1.0-alt1.nosrc.rpm
Installing spdlog-1.1.0-alt1.src.rpm
Building target platforms: x86_64
Building for target x86_64
Executing(%prep): /bin/sh -e /usr/src/tmp/rpm-tmp.84921
+ umask 022
+ /bin/mkdir -p /usr/src/RPM/BUILD
+ cd /usr/src/RPM/BUILD
+ cd /usr/src/RPM/BUILD
+ rm -rf spdlog-1.1.0
+ echo 'Source #0 (spdlog-1.1.0.tar):'
Source #0 (spdlog-1.1.0.tar):
+ /bin/tar -xf /usr/src/RPM/SOURCES/spdlog-1.1.0.tar
+ cd spdlog-1.1.0
+ /bin/chmod -c -Rf u+rwX,go-w .
+ /usr/bin/subst 's|CHAR_WIDTH|SPDLOG_CHAR_WIDTH|g' include/spdlog/fmt/bundled/format.h
+ exit 0
Executing(%build): /bin/sh -e /usr/src/tmp/rpm-tmp.84921
+ umask 022
+ /bin/mkdir -p /usr/src/RPM/BUILD
+ cd /usr/src/RPM/BUILD
+ cd spdlog-1.1.0
+ mkdir -p BUILD
+ __cmake
+ pushd BUILD
~/RPM/BUILD/spdlog-1.1.0/BUILD ~/RPM/BUILD/spdlog-1.1.0
+ cmake .. -DCMAKE_SKIP_RPATH:BOOL=ON -DCMAKE_SKIP_INSTALL_RPATH:BOOL=yes '-DCMAKE_C_FLAGS:STRING=-pipe -frecord-gcc-switches -Wall -g -O2' '-DCMAKE_CXX_FLAGS:STRING=-pipe -frecord-gcc-switches -Wall -g -O2' '-DCMAKE_Fortran_FLAGS:STRING=-pipe -frecord-gcc-switches -Wall -g -O2' -DCMAKE_INSTALL_PREFIX=/usr -DINCLUDE_INSTALL_DIR:PATH=/usr/include -DLIB_INSTALL_DIR:PATH=/usr/lib64 -DSYSCONF_INSTALL_DIR:PATH=/etc -DSHARE_INSTALL_PREFIX:PATH=/usr/share -DLIB_DESTINATION=lib64 -DLIB_SUFFIX=64
-- The CXX compiler identification is GNU 7.3.1
-- Check for working CXX compiler: /usr/bin/c++
-- Check for working CXX compiler: /usr/bin/c++ -- works
-- Detecting CXX compiler ABI info
-- Detecting CXX compiler ABI info - done
-- Detecting CXX compile features
-- Detecting CXX compile features - done
-- Build type: Release
-- Looking for C++ include pthread.h
-- Looking for C++ include pthread.h - found
-- Looking for pthread_create
-- Looking for pthread_create - not found
-- Looking for pthread_create in pthreads
-- Looking for pthread_create in pthreads - not found
-- Looking for pthread_create in pthread
-- Looking for pthread_create in pthread - found
-- Found Threads: TRUE  
-- Configuring done
-- Generating done
CMake Warning:
  Manually-specified variables were not used by the project:

    CMAKE_C_FLAGS
    CMAKE_Fortran_FLAGS
    CMAKE_SKIP_INSTALL_RPATH
    INCLUDE_INSTALL_DIR
    LIB_DESTINATION
    LIB_INSTALL_DIR
    LIB_SUFFIX
    SHARE_INSTALL_PREFIX
    SYSCONF_INSTALL_DIR


-- Build files have been written to: /usr/src/RPM/BUILD/spdlog-1.1.0/BUILD
+ popd
~/RPM/BUILD/spdlog-1.1.0
+ make -j8 -C BUILD
make[2]: Entering directory '/usr/src/RPM/BUILD/spdlog-1.1.0/BUILD'
Scanning dependencies of target multisink
make[2]: Leaving directory '/usr/src/RPM/BUILD/spdlog-1.1.0/BUILD'
make[2]: Entering directory '/usr/src/RPM/BUILD/spdlog-1.1.0/BUILD'
Scanning dependencies of target example
make[2]: Leaving directory '/usr/src/RPM/BUILD/spdlog-1.1.0/BUILD'
make[2]: Entering directory '/usr/src/RPM/BUILD/spdlog-1.1.0/BUILD'
Scanning dependencies of target spdlog-utests
make[2]: Leaving directory '/usr/src/RPM/BUILD/spdlog-1.1.0/BUILD'
make[2]: Entering directory '/usr/src/RPM/BUILD/spdlog-1.1.0/BUILD'
Scanning dependencies of target async_bench
make[2]: Leaving directory '/usr/src/RPM/BUILD/spdlog-1.1.0/BUILD'
make[2]: Entering directory '/usr/src/RPM/BUILD/spdlog-1.1.0/BUILD'
Scanning dependencies of target bench
make[2]: Leaving directory '/usr/src/RPM/BUILD/spdlog-1.1.0/BUILD'
make[2]: Entering directory '/usr/src/RPM/BUILD/spdlog-1.1.0/BUILD'
Scanning dependencies of target latency
make[2]: Leaving directory '/usr/src/RPM/BUILD/spdlog-1.1.0/BUILD'
make[2]: Entering directory '/usr/src/RPM/BUILD/spdlog-1.1.0/BUILD'
[ 31%] Building CXX object tests/CMakeFiles/spdlog-utests.dir/file_helper.cpp.o
make[2]: Leaving directory '/usr/src/RPM/BUILD/spdlog-1.1.0/BUILD'
make[2]: Entering directory '/usr/src/RPM/BUILD/spdlog-1.1.0/BUILD'
[  4%] Building CXX object example/CMakeFiles/multisink.dir/multisink.cpp.o
make[2]: Leaving directory '/usr/src/RPM/BUILD/spdlog-1.1.0/BUILD'
make[2]: Entering directory '/usr/src/RPM/BUILD/spdlog-1.1.0/BUILD'
[ 45%] Linking CXX executable multisink
make[2]: Leaving directory '/usr/src/RPM/BUILD/spdlog-1.1.0/BUILD'
make[1]: Entering directory '/usr/src/RPM/BUILD/spdlog-1.1.0/BUILD'
[ 45%] Built target multisink
make[1]: Leaving directory '/usr/src/RPM/BUILD/spdlog-1.1.0/BUILD'
make[2]: Entering directory '/usr/src/RPM/BUILD/spdlog-1.1.0/BUILD'
[ 22%] Building CXX object tests/CMakeFiles/spdlog-utests.dir/errors.cpp.o
make[2]: Leaving directory '/usr/src/RPM/BUILD/spdlog-1.1.0/BUILD'
make[2]: Entering directory '/usr/src/RPM/BUILD/spdlog-1.1.0/BUILD'
[ 13%] Building CXX object bench/CMakeFiles/async_bench.dir/async_bench.cpp.o
make[2]: Leaving directory '/usr/src/RPM/BUILD/spdlog-1.1.0/BUILD'
make[2]: Entering directory '/usr/src/RPM/BUILD/spdlog-1.1.0/BUILD'
[ 59%] Linking CXX executable async_bench
make[2]: Leaving directory '/usr/src/RPM/BUILD/spdlog-1.1.0/BUILD'
make[1]: Entering directory '/usr/src/RPM/BUILD/spdlog-1.1.0/BUILD'
[ 59%] Built target async_bench
make[1]: Leaving directory '/usr/src/RPM/BUILD/spdlog-1.1.0/BUILD'
make[2]: Entering directory '/usr/src/RPM/BUILD/spdlog-1.1.0/BUILD'
[ 27%] Building CXX object bench/CMakeFiles/latency.dir/latency.cpp.o
make[2]: Leaving directory '/usr/src/RPM/BUILD/spdlog-1.1.0/BUILD'
make[2]: Entering directory '/usr/src/RPM/BUILD/spdlog-1.1.0/BUILD'
[ 68%] Linking CXX executable latency
make[2]: Leaving directory '/usr/src/RPM/BUILD/spdlog-1.1.0/BUILD'
make[1]: Entering directory '/usr/src/RPM/BUILD/spdlog-1.1.0/BUILD'
[ 68%] Built target latency
make[1]: Leaving directory '/usr/src/RPM/BUILD/spdlog-1.1.0/BUILD'
make[2]: Entering directory '/usr/src/RPM/BUILD/spdlog-1.1.0/BUILD'
[  9%] Building CXX object example/CMakeFiles/example.dir/example.cpp.o
make[2]: Leaving directory '/usr/src/RPM/BUILD/spdlog-1.1.0/BUILD'
make[2]: Entering directory '/usr/src/RPM/BUILD/spdlog-1.1.0/BUILD'
[ 77%] Linking CXX executable example
make[2]: Leaving directory '/usr/src/RPM/BUILD/spdlog-1.1.0/BUILD'
make[1]: Entering directory '/usr/src/RPM/BUILD/spdlog-1.1.0/BUILD'
[ 77%] Built target example
make[1]: Leaving directory '/usr/src/RPM/BUILD/spdlog-1.1.0/BUILD'
make[2]: Entering directory '/usr/src/RPM/BUILD/spdlog-1.1.0/BUILD'
[ 18%] Building CXX object bench/CMakeFiles/bench.dir/bench.cpp.o
make[2]: Leaving directory '/usr/src/RPM/BUILD/spdlog-1.1.0/BUILD'
make[2]: Entering directory '/usr/src/RPM/BUILD/spdlog-1.1.0/BUILD'
[ 86%] Linking CXX executable bench
make[2]: Leaving directory '/usr/src/RPM/BUILD/spdlog-1.1.0/BUILD'
make[1]: Entering directory '/usr/src/RPM/BUILD/spdlog-1.1.0/BUILD'
[ 86%] Built target bench
make[1]: Leaving directory '/usr/src/RPM/BUILD/spdlog-1.1.0/BUILD'
make[2]: Entering directory '/usr/src/RPM/BUILD/spdlog-1.1.0/BUILD'
[ 40%] Building CXX object tests/CMakeFiles/spdlog-utests.dir/test_misc.cpp.o
make[2]: Leaving directory '/usr/src/RPM/BUILD/spdlog-1.1.0/BUILD'
make[2]: Entering directory '/usr/src/RPM/BUILD/spdlog-1.1.0/BUILD'
[ 36%] Building CXX object tests/CMakeFiles/spdlog-utests.dir/file_log.cpp.o
make[2]: Leaving directory '/usr/src/RPM/BUILD/spdlog-1.1.0/BUILD'
make[2]: Entering directory '/usr/src/RPM/BUILD/spdlog-1.1.0/BUILD'
[ 50%] Building CXX object tests/CMakeFiles/spdlog-utests.dir/test_pattern_formatter.cpp.o
make[2]: Leaving directory '/usr/src/RPM/BUILD/spdlog-1.1.0/BUILD'
make[2]: Entering directory '/usr/src/RPM/BUILD/spdlog-1.1.0/BUILD'
[ 72%] Building CXX object tests/CMakeFiles/spdlog-utests.dir/test_macros.cpp.o
make[2]: Leaving directory '/usr/src/RPM/BUILD/spdlog-1.1.0/BUILD'
make[2]: Entering directory '/usr/src/RPM/BUILD/spdlog-1.1.0/BUILD'
[ 54%] Building CXX object tests/CMakeFiles/spdlog-utests.dir/test_async.cpp.o
make[2]: Leaving directory '/usr/src/RPM/BUILD/spdlog-1.1.0/BUILD'
make[2]: Entering directory '/usr/src/RPM/BUILD/spdlog-1.1.0/BUILD'
[ 63%] Building CXX object tests/CMakeFiles/spdlog-utests.dir/registry.cpp.o
make[2]: Leaving directory '/usr/src/RPM/BUILD/spdlog-1.1.0/BUILD'
make[2]: Entering directory '/usr/src/RPM/BUILD/spdlog-1.1.0/BUILD'
[ 81%] Building CXX object tests/CMakeFiles/spdlog-utests.dir/utils.cpp.o
make[2]: Leaving directory '/usr/src/RPM/BUILD/spdlog-1.1.0/BUILD'
make[2]: Entering directory '/usr/src/RPM/BUILD/spdlog-1.1.0/BUILD'
[ 95%] Building CXX object tests/CMakeFiles/spdlog-utests.dir/test_mpmc_q.cpp.o
make[2]: Leaving directory '/usr/src/RPM/BUILD/spdlog-1.1.0/BUILD'
make[2]: Entering directory '/usr/src/RPM/BUILD/spdlog-1.1.0/BUILD'
[ 90%] Building CXX object tests/CMakeFiles/spdlog-utests.dir/main.cpp.o
make[2]: Leaving directory '/usr/src/RPM/BUILD/spdlog-1.1.0/BUILD'
make[2]: Entering directory '/usr/src/RPM/BUILD/spdlog-1.1.0/BUILD'
[100%] Linking CXX executable spdlog-utests
make[2]: Leaving directory '/usr/src/RPM/BUILD/spdlog-1.1.0/BUILD'
make[1]: Entering directory '/usr/src/RPM/BUILD/spdlog-1.1.0/BUILD'
[100%] Built target spdlog-utests
make[1]: Leaving directory '/usr/src/RPM/BUILD/spdlog-1.1.0/BUILD'
+ exit 0
Executing(%install): /bin/sh -e /usr/src/tmp/rpm-tmp.37534
+ umask 022
+ /bin/mkdir -p /usr/src/RPM/BUILD
+ cd /usr/src/RPM/BUILD
+ /bin/chmod -Rf u+rwX -- /usr/src/tmp/spdlog-buildroot
+ :
+ /bin/rm -rf -- /usr/src/tmp/spdlog-buildroot
+ cd spdlog-1.1.0
+ make 'INSTALL=/bin/install -p' install DESTDIR=/usr/src/tmp/spdlog-buildroot -C BUILD
make: Entering directory '/usr/src/RPM/BUILD/spdlog-1.1.0/BUILD'
make[1]: Entering directory '/usr/src/RPM/BUILD/spdlog-1.1.0/BUILD'
make[2]: Entering directory '/usr/src/RPM/BUILD/spdlog-1.1.0/BUILD'
make[2]: Leaving directory '/usr/src/RPM/BUILD/spdlog-1.1.0/BUILD'
[  9%] Built target multisink
make[2]: Entering directory '/usr/src/RPM/BUILD/spdlog-1.1.0/BUILD'
make[2]: Leaving directory '/usr/src/RPM/BUILD/spdlog-1.1.0/BUILD'
[ 18%] Built target example
make[2]: Entering directory '/usr/src/RPM/BUILD/spdlog-1.1.0/BUILD'
make[2]: Leaving directory '/usr/src/RPM/BUILD/spdlog-1.1.0/BUILD'
[ 72%] Built target spdlog-utests
make[2]: Entering directory '/usr/src/RPM/BUILD/spdlog-1.1.0/BUILD'
make[2]: Leaving directory '/usr/src/RPM/BUILD/spdlog-1.1.0/BUILD'
[ 81%] Built target async_bench
make[2]: Entering directory '/usr/src/RPM/BUILD/spdlog-1.1.0/BUILD'
make[2]: Leaving directory '/usr/src/RPM/BUILD/spdlog-1.1.0/BUILD'
[ 90%] Built target bench
make[2]: Entering directory '/usr/src/RPM/BUILD/spdlog-1.1.0/BUILD'
make[2]: Leaving directory '/usr/src/RPM/BUILD/spdlog-1.1.0/BUILD'
[100%] Built target latency
make[1]: Leaving directory '/usr/src/RPM/BUILD/spdlog-1.1.0/BUILD'
Install the project...
-- Install configuration: "Release"
-- Installing: /usr/src/tmp/spdlog-buildroot/usr/include/spdlog
-- Installing: /usr/src/tmp/spdlog-buildroot/usr/include/spdlog/version.h
-- Installing: /usr/src/tmp/spdlog-buildroot/usr/include/spdlog/tweakme.h
-- Installing: /usr/src/tmp/spdlog-buildroot/usr/include/spdlog/spdlog.h
-- Installing: /usr/src/tmp/spdlog-buildroot/usr/include/spdlog/sinks
-- Installing: /usr/src/tmp/spdlog-buildroot/usr/include/spdlog/sinks/wincolor_sink.h
-- Installing: /usr/src/tmp/spdlog-buildroot/usr/include/spdlog/sinks/syslog_sink.h
-- Installing: /usr/src/tmp/spdlog-buildroot/usr/include/spdlog/sinks/stdout_sinks.h
-- Installing: /usr/src/tmp/spdlog-buildroot/usr/include/spdlog/sinks/stdout_color_sinks.h
-- Installing: /usr/src/tmp/spdlog-buildroot/usr/include/spdlog/sinks/sink.h
-- Installing: /usr/src/tmp/spdlog-buildroot/usr/include/spdlog/sinks/rotating_file_sink.h
-- Installing: /usr/src/tmp/spdlog-buildroot/usr/include/spdlog/sinks/ostream_sink.h
-- Installing: /usr/src/tmp/spdlog-buildroot/usr/include/spdlog/sinks/null_sink.h
-- Installing: /usr/src/tmp/spdlog-buildroot/usr/include/spdlog/sinks/msvc_sink.h
-- Installing: /usr/src/tmp/spdlog-buildroot/usr/include/spdlog/sinks/dist_sink.h
-- Installing: /usr/src/tmp/spdlog-buildroot/usr/include/spdlog/sinks/daily_file_sink.h
-- Installing: /usr/src/tmp/spdlog-buildroot/usr/include/spdlog/sinks/basic_file_sink.h
-- Installing: /usr/src/tmp/spdlog-buildroot/usr/include/spdlog/sinks/base_sink.h
-- Installing: /usr/src/tmp/spdlog-buildroot/usr/include/spdlog/sinks/ansicolor_sink.h
-- Installing: /usr/src/tmp/spdlog-buildroot/usr/include/spdlog/sinks/android_sink.h
-- Installing: /usr/src/tmp/spdlog-buildroot/usr/include/spdlog/logger.h
-- Installing: /usr/src/tmp/spdlog-buildroot/usr/include/spdlog/formatter.h
-- Installing: /usr/src/tmp/spdlog-buildroot/usr/include/spdlog/fmt
-- Installing: /usr/src/tmp/spdlog-buildroot/usr/include/spdlog/fmt/ostr.h
-- Installing: /usr/src/tmp/spdlog-buildroot/usr/include/spdlog/fmt/fmt.h
-- Installing: /usr/src/tmp/spdlog-buildroot/usr/include/spdlog/fmt/bundled
-- Installing: /usr/src/tmp/spdlog-buildroot/usr/include/spdlog/fmt/bundled/format.h
-- Installing: /usr/src/tmp/spdlog-buildroot/usr/include/spdlog/fmt/bundled/time.h
-- Installing: /usr/src/tmp/spdlog-buildroot/usr/include/spdlog/fmt/bundled/ranges.h
-- Installing: /usr/src/tmp/spdlog-buildroot/usr/include/spdlog/fmt/bundled/printf.h
-- Installing: /usr/src/tmp/spdlog-buildroot/usr/include/spdlog/fmt/bundled/posix.h
-- Installing: /usr/src/tmp/spdlog-buildroot/usr/include/spdlog/fmt/bundled/ostream.h
-- Installing: /usr/src/tmp/spdlog-buildroot/usr/include/spdlog/fmt/bundled/locale.h
-- Installing: /usr/src/tmp/spdlog-buildroot/usr/include/spdlog/fmt/bundled/format-inl.h
-- Installing: /usr/src/tmp/spdlog-buildroot/usr/include/spdlog/fmt/bundled/core.h
-- Installing: /usr/src/tmp/spdlog-buildroot/usr/include/spdlog/fmt/bundled/colors.h
-- Installing: /usr/src/tmp/spdlog-buildroot/usr/include/spdlog/fmt/bundled/LICENSE.rst
-- Installing: /usr/src/tmp/spdlog-buildroot/usr/include/spdlog/details
-- Installing: /usr/src/tmp/spdlog-buildroot/usr/include/spdlog/details/thread_pool.h
-- Installing: /usr/src/tmp/spdlog-buildroot/usr/include/spdlog/details/registry.h
-- Installing: /usr/src/tmp/spdlog-buildroot/usr/include/spdlog/details/periodic_worker.h
-- Installing: /usr/src/tmp/spdlog-buildroot/usr/include/spdlog/details/pattern_formatter.h
-- Installing: /usr/src/tmp/spdlog-buildroot/usr/include/spdlog/details/os.h
-- Installing: /usr/src/tmp/spdlog-buildroot/usr/include/spdlog/details/null_mutex.h
-- Installing: /usr/src/tmp/spdlog-buildroot/usr/include/spdlog/details/mpmc_blocking_q.h
-- Installing: /usr/src/tmp/spdlog-buildroot/usr/include/spdlog/details/logger_impl.h
-- Installing: /usr/src/tmp/spdlog-buildroot/usr/include/spdlog/details/log_msg.h
-- Installing: /usr/src/tmp/spdlog-buildroot/usr/include/spdlog/details/fmt_helper.h
-- Installing: /usr/src/tmp/spdlog-buildroot/usr/include/spdlog/details/file_helper.h
-- Installing: /usr/src/tmp/spdlog-buildroot/usr/include/spdlog/details/console_globals.h
-- Installing: /usr/src/tmp/spdlog-buildroot/usr/include/spdlog/details/circular_q.h
-- Installing: /usr/src/tmp/spdlog-buildroot/usr/include/spdlog/details/async_logger_impl.h
-- Installing: /usr/src/tmp/spdlog-buildroot/usr/include/spdlog/contrib
-- Installing: /usr/src/tmp/spdlog-buildroot/usr/include/spdlog/contrib/sinks
-- Installing: /usr/src/tmp/spdlog-buildroot/usr/include/spdlog/contrib/sinks/step_file_sink.h
-- Installing: /usr/src/tmp/spdlog-buildroot/usr/include/spdlog/common.h
-- Installing: /usr/src/tmp/spdlog-buildroot/usr/include/spdlog/async_logger.h
-- Installing: /usr/src/tmp/spdlog-buildroot/usr/include/spdlog/async.h
-- Installing: /usr/src/tmp/spdlog-buildroot/usr/lib64/cmake/spdlog/spdlogConfigVersion.cmake
-- Installing: /usr/src/tmp/spdlog-buildroot/usr/lib64/pkgconfig/spdlog.pc
-- Installing: /usr/src/tmp/spdlog-buildroot/usr/lib64/cmake/spdlog/spdlogConfig.cmake
make: Leaving directory '/usr/src/RPM/BUILD/spdlog-1.1.0/BUILD'
+ /usr/lib/rpm/brp-alt
Cleaning files in /usr/src/tmp/spdlog-buildroot (auto)
Verifying and fixing files in /usr/src/tmp/spdlog-buildroot (binconfig,pkgconfig,libtool,desktop)
Checking contents of files in /usr/src/tmp/spdlog-buildroot/ (default)
Compressing files in /usr/src/tmp/spdlog-buildroot (auto)
Adjusting library links in /usr/src/tmp/spdlog-buildroot
./usr/lib64:
Verifying ELF objects in /usr/src/tmp/spdlog-buildroot (arch=normal,fhs=normal,lfs=relaxed,lint=relaxed,rpath=normal,stack=normal,textrel=normal,unresolved=normal)
Hardlinking identical .pyc and .pyo files
Executing(%check): /bin/sh -e /usr/src/tmp/rpm-tmp.37534
+ umask 022
+ /bin/mkdir -p /usr/src/RPM/BUILD
+ cd /usr/src/RPM/BUILD
+ cd spdlog-1.1.0
+ make -j8 -C BUILD test
make: Entering directory '/usr/src/RPM/BUILD/spdlog-1.1.0/BUILD'
Running tests...
Test project /usr/src/RPM/BUILD/spdlog-1.1.0/BUILD
    Start 1: example
1/2 Test #1: example ..........................   Passed    0.00 sec
    Start 2: spdlog-utests
2/2 Test #2: spdlog-utests ....................   Passed    3.09 sec

100% tests passed, 0 tests failed out of 2

Total Test time (real) =   3.10 sec
make: Leaving directory '/usr/src/RPM/BUILD/spdlog-1.1.0/BUILD'
+ exit 0
Processing files: libspdlog-devel-1.1.0-alt1
Executing(%doc): /bin/sh -e /usr/src/tmp/rpm-tmp.24466
+ umask 022
+ /bin/mkdir -p /usr/src/RPM/BUILD
+ cd /usr/src/RPM/BUILD
+ cd spdlog-1.1.0
+ DOCDIR=/usr/src/tmp/spdlog-buildroot/usr/share/doc/libspdlog-devel-1.1.0
+ export DOCDIR
+ rm -rf /usr/src/tmp/spdlog-buildroot/usr/share/doc/libspdlog-devel-1.1.0
+ /bin/mkdir -p /usr/src/tmp/spdlog-buildroot/usr/share/doc/libspdlog-devel-1.1.0
+ cp -prL README.md example/ /usr/src/tmp/spdlog-buildroot/usr/share/doc/libspdlog-devel-1.1.0
+ chmod -R go-w /usr/src/tmp/spdlog-buildroot/usr/share/doc/libspdlog-devel-1.1.0
+ chmod -R a+rX /usr/src/tmp/spdlog-buildroot/usr/share/doc/libspdlog-devel-1.1.0
+ cp -prL LICENSE /usr/src/tmp/spdlog-buildroot/usr/share/doc/libspdlog-devel-1.1.0
+ chmod -R go-w /usr/src/tmp/spdlog-buildroot/usr/share/doc/libspdlog-devel-1.1.0
+ chmod -R a+rX /usr/src/tmp/spdlog-buildroot/usr/share/doc/libspdlog-devel-1.1.0
+ exit 0
Finding Provides (using /usr/lib/rpm/find-provides)
Executing: /bin/sh -e /usr/src/tmp/rpm-tmp.mzs6gI
find-provides: running scripts (alternatives,debuginfo,lib,pam,perl,pkgconfig,python,shell)
Finding Requires (using /usr/lib/rpm/find-requires)
Executing: /bin/sh -e /usr/src/tmp/rpm-tmp.X5y4gG
find-requires: running scripts (cpp,debuginfo,files,lib,pam,perl,pkgconfig,pkgconfiglib,python,rpmlib,shebang,shell,static,symlinks)
In file included from /usr/src/tmp/spdlog-buildroot/usr/include/spdlog/async_logger.h:22:0,
                 from /usr/src/tmp/spdlog-buildroot/usr/include/spdlog/async.h:20:
/usr/src/tmp/spdlog-buildroot/usr/include/spdlog/common.h:10:10: fatal error: atomic: No such file or directory
 #include <atomic>
          ^~~~~~~~
compilation terminated.
cpp.req: /usr/src/tmp/spdlog-buildroot/usr/include/spdlog/async.h: cpp failed, trying c++ mode
/usr/src/tmp/spdlog-buildroot/usr/include/spdlog/sinks/android_sink.h:13:10: fatal error: android/log.h: No such file or directory
 #include <android/log.h>
          ^~~~~~~~~~~~~~~
compilation terminated.
cpp.req: WARNING: /usr/src/tmp/spdlog-buildroot/usr/include/spdlog/sinks/android_sink.h: cpp failed
/usr/src/tmp/spdlog-buildroot/usr/include/spdlog/sinks/wincolor_sink.h:17:10: fatal error: wincon.h: No such file or directory
 #include <wincon.h>
          ^~~~~~~~~~
compilation terminated.
cpp.req: WARNING: /usr/src/tmp/spdlog-buildroot/usr/include/spdlog/sinks/wincolor_sink.h: cpp failed
Provides: pkgconfig(spdlog) = 1.1.0
Requires: /usr/lib64/pkgconfig
Finding debuginfo files (using /usr/lib/rpm/find-debuginfo-files)
Executing: /bin/sh -e /usr/src/tmp/rpm-tmp.OSTmUR
Wrote: /usr/src/RPM/RPMS/x86_64/libspdlog-devel-1.1.0-alt1.x86_64.rpm
132.74user 5.36system 1:04.62elapsed 213%CPU (0avgtext+0avgdata 450600maxresident)k
0inputs+0outputs (0major+2321140minor)pagefaults 0swaps
142.76user 8.06system 1:18.92elapsed 191%CPU (0avgtext+0avgdata 450600maxresident)k
0inputs+0outputs (0major+2731704minor)pagefaults 0swaps