<86>May 11 07:33:47 userdel[1582499]: delete user 'rooter'
<86>May 11 07:33:47 userdel[1582499]: removed group 'rooter' owned by 'rooter'
<86>May 11 07:33:47 userdel[1582499]: removed shadow group 'rooter' owned by 'rooter'
<86>May 11 07:33:47 groupadd[1582506]: group added to /etc/group: name=rooter, GID=1277
<86>May 11 07:33:47 groupadd[1582506]: group added to /etc/gshadow: name=rooter
<86>May 11 07:33:47 groupadd[1582506]: new group: name=rooter, GID=1277
<86>May 11 07:33:47 useradd[1582512]: new user: name=rooter, UID=1277, GID=1277, home=/root, shell=/bin/bash, from=none
<86>May 11 07:33:47 userdel[1582522]: delete user 'builder'
<86>May 11 07:33:47 userdel[1582522]: removed group 'builder' owned by 'builder'
<86>May 11 07:33:47 userdel[1582522]: removed shadow group 'builder' owned by 'builder'
<86>May 11 07:33:47 groupadd[1582529]: group added to /etc/group: name=builder, GID=1278
<86>May 11 07:33:47 groupadd[1582529]: group added to /etc/gshadow: name=builder
<86>May 11 07:33:47 groupadd[1582529]: new group: name=builder, GID=1278
<86>May 11 07:33:47 useradd[1582535]: new user: name=builder, UID=1278, GID=1278, home=/usr/src, shell=/bin/bash, from=none
<13>May 11 07:33:51 rpmi: rpm-macros-ninja-build-1:1.11.1-alt3 sisyphus+345786.300.4.1 1714124414 installed
<13>May 11 07:33:51 rpmi: ninja-build-1:1.11.1-alt3 sisyphus+345786.300.4.1 1714124415 installed
<13>May 11 07:33:51 rpmi: rpm-build-ninja-1:1.11.1-alt3 sisyphus+345786.300.4.1 1714124414 installed
<13>May 11 07:33:51 rpmi: rpm-macros-qt6-6.6.2-alt3 sisyphus+341417.100.1.1 1708934500 installed
warning: Macro %cmake not found
warning: Macro %_cmake__builddir not found
warning: Macro %cmake_install not found
<13>May 11 07:33:54 rpmi: libxkbcommon-1.7.0-alt1.1 sisyphus+343672.100.1.1 1711490815 installed
<13>May 11 07:33:54 rpmi: libpng16-1.6.42-alt2 sisyphus+339555.100.1.1 1706781690 installed
<13>May 11 07:33:54 rpmi: libexpat-2.5.0-alt1 sisyphus+309227.100.1.1 1667075766 installed
<13>May 11 07:33:54 rpmi: libjpeg-2:3.0.2-alt2.1 sisyphus+340135.100.1.1 1707449053 installed
<13>May 11 07:33:54 rpmi: xorg-proto-devel-2024.1-alt1 sisyphus+343583.40.1.1 1711440649 installed
<13>May 11 07:33:54 rpmi: vapi-common-0.56.17-alt1 sisyphus+345617.100.1.1 1713782341 installed
<13>May 11 07:33:54 rpmi: libsqlite3-3.44.2-alt1 sisyphus+335409.100.3.3 1701347861 installed
<13>May 11 07:33:54 rpmi: liblcms2-2.16-alt1 sisyphus+335676.100.1.1 1701682605 installed
<13>May 11 07:33:55 rpmi: libglvnd-7:1.7.0-alt1 sisyphus+330949.100.1.1 1696424894 installed
<13>May 11 07:33:55 rpmi: libOpenGL-7:1.7.0-alt1 sisyphus+330949.100.1.1 1696424894 installed
<13>May 11 07:33:55 rpmi: libwayland-client-1.22.0-alt1.1 sisyphus+318010.100.1.1 1680606300 installed
<13>May 11 07:33:55 rpmi: perl-HTTP-Date-6.06-alt1 sisyphus+324527.100.1.1 1688834564 installed
<13>May 11 07:33:55 rpmi: perl-XML-NamespaceSupport-1.12-alt1 1491296348 installed
<13>May 11 07:33:55 rpmi: libicu74-1:7.4.2-alt1 sisyphus+336372.200.1.1 1702422879 installed
<13>May 11 07:33:55 rpmi: libidn2-2.3.7-alt1 sisyphus+339505.100.1.2 1706718975 installed
<13>May 11 07:33:55 rpmi: libnettle8-3.9.1-alt1 sisyphus+322548.100.1.2 1686176897 installed
<13>May 11 07:33:55 rpmi: vulkan-filesystem-1.3.277-alt1 sisyphus+342474.300.2.1 1710160423 installed
<13>May 11 07:33:55 rpmi: libts0-1.22-alt3 sisyphus+278442.100.1.2 1626216683 installed
<13>May 11 07:33:55 rpmi: libmtdev-1.1.6-alt1 sisyphus+278361.100.1.1 1626091636 installed
<13>May 11 07:33:55 rpmi: libgudev-1:238-alt1 sisyphus+324364.100.1.1 1688646145 installed
<13>May 11 07:33:56 rpmi: libfribidi-1.0.14-alt1 sisyphus+345841.100.1.1 1714055921 installed
<13>May 11 07:33:56 rpmi: libgomp1-13.2.1-alt3 sisyphus+339335.100.1.1 1706563095 installed
<13>May 11 07:33:56 rpmi: libraw-0.21.2-alt1 sisyphus+336806.100.1.1 1703007433 installed
<13>May 11 07:33:56 rpmi: libimath29-3.1.6-alt4 sisyphus+340273.100.1.2 1707542785 installed
<13>May 11 07:33:56 rpmi: libiex30-3.1.5-alt2.2 sisyphus+324124.100.1.1 1688379856 installed
<13>May 11 07:33:56 rpmi: libevdev-1.13.1-alt1 sisyphus+319955.100.1.1 1683290015 installed
<13>May 11 07:33:56 rpmi: libdav1d_7-1.4.1-alt1 sisyphus+344157.100.2.1 1711988264 installed
<13>May 11 07:33:56 rpmi: libICE-1.1.1-alt1 sisyphus+311428.500.1.1 1670577559 installed
<13>May 11 07:33:56 rpmi: libwayland-server-1.22.0-alt1.1 sisyphus+318010.100.1.1 1680606300 installed
<13>May 11 07:33:56 rpmi: perl-LWP-MediaTypes-6.04-alt1 sisyphus+225468.100.1.1 1553186684 installed
<13>May 11 07:33:56 rpmi: perl-Compress-Raw-Zlib-2.206-alt1 sisyphus+335067.600.1.1 1700901614 installed
<13>May 11 07:33:56 rpmi: perl-libnet-1:3.15-alt1 sisyphus+317310.100.1.1 1679580208 installed
<13>May 11 07:33:56 rpmi: perl-XML-SAX-Base-1.09-alt1 1494364363 installed
<13>May 11 07:33:56 rpmi: libwebp7-1.4.0-alt1 sisyphus+345159.200.1.1 1713168690 installed
<13>May 11 07:33:56 rpmi: libgraphite2-1.3.14-alt2.1 sisyphus+279571.100.1.2 1626605157 installed
<13>May 11 07:33:56 rpmi: zlib-devel-1.3.1-alt1 sisyphus+342532.100.1.1 1710232285 installed
<13>May 11 07:33:56 rpmi: xml-utils-1:2.12.6-alt1 sisyphus+347327.100.1.1 1714660890 installed
<13>May 11 07:33:56 rpmi: libfmt10-1:10.2.1-alt1 sisyphus+337712.100.1.1 1704440055 installed
<13>May 11 07:33:56 rpmi: libdouble-conversion3-3.3.0-alt1 sisyphus+333410.100.1.1 1698928792 installed
<13>May 11 07:33:56 rpmi: libb2-0.98.1-alt1_1 sisyphus+291614.100.1.1 1638962878 installed
<13>May 11 07:33:56 rpmi: libnghttp2-1.61.0-alt1 sisyphus+344450.100.1.1 1712304122 installed
<13>May 11 07:33:56 rpmi: libp11-kit-1:0.25.3-alt2 sisyphus+336533.100.1.1 1702645575 installed
<13>May 11 07:33:56 rpmi: libtasn1-4.19.0-alt3 sisyphus+327816.100.1.1 1692802618 installed
<13>May 11 07:33:56 rpmi: libatk-2.52.0-alt1 sisyphus+342903.100.1.1 1710606495 installed
<13>May 11 07:33:56 rpmi: libXau-1.0.11-alt1 sisyphus+311428.100.1.1 1670577440 installed
<13>May 11 07:33:56 rpmi: libXau-devel-1.0.11-alt1 sisyphus+311428.100.1.1 1670577440 installed
<13>May 11 07:33:56 rpmi: libdouble-conversion-devel-3.3.0-alt1 sisyphus+333410.100.1.1 1698928792 installed
<13>May 11 07:33:56 rpmi: libspdlog1.13-1.13.0-alt1 sisyphus+342917.20.3.1 1710638847 installed
<13>May 11 07:33:56 rpmi: rpm-build-gir-0.7.3-alt3.1 sisyphus+319393.100.1.1 1682538783 installed
<13>May 11 07:33:56 rpmi: libpng-devel-1.6.42-alt2 sisyphus+339555.100.1.1 1706781690 installed
<13>May 11 07:33:56 rpmi: libgraphite2-devel-1.3.14-alt2.1 sisyphus+279571.100.1.2 1626605157 installed
<13>May 11 07:33:56 rpmi: libSM-1.2.4-alt1 sisyphus+312057.200.1.1 1671526918 installed
<13>May 11 07:33:56 rpmi: libdav1d-devel-1.4.1-alt1 sisyphus+344157.100.2.1 1711988264 installed
<13>May 11 07:33:56 rpmi: libilmthread30-3.1.5-alt2.2 sisyphus+324124.100.1.1 1688379856 installed
<13>May 11 07:33:56 rpmi: libopenexr30-3.1.5-alt2.2 sisyphus+324124.100.1.1 1688379856 installed
<13>May 11 07:33:56 rpmi: libgomp13-devel-13.2.1-alt3 sisyphus+339335.100.1.1 1706563095 installed
<13>May 11 07:33:56 rpmi: libvulkan1-1.3.277-alt1 sisyphus+342474.300.2.1 1710160455 installed
<13>May 11 07:33:56 rpmi: libhogweed6-3.9.1-alt1 sisyphus+322548.100.1.2 1686176897 installed
<13>May 11 07:33:56 rpmi: libgnutls30-3.8.4-alt1 sisyphus+343729.100.2.1 1711570650 installed
<13>May 11 07:33:56 rpmi: libngtcp2.16-1.4.0-alt1 sisyphus+343912.100.1.1 1711714686 installed
<13>May 11 07:33:56 rpmi: libngtcp2_crypto_gnutls8-1.4.0-alt1 sisyphus+343912.100.1.1 1711714686 installed
<13>May 11 07:33:56 rpmi: icu-utils-1:7.4.2-alt1 sisyphus+336372.200.1.1 1702422879 installed
<13>May 11 07:33:56 rpmi: libicu-devel-1:7.4.2-alt1 sisyphus+336372.200.1.1 1702422879 installed
<13>May 11 07:33:56 rpmi: perl-File-Listing-6.16-alt1 sisyphus+325783.100.1.1 1690559356 installed
<13>May 11 07:33:56 rpmi: libwayland-cursor-1.22.0-alt1.1 sisyphus+318010.100.1.1 1680606300 installed
<13>May 11 07:33:56 rpmi: libwayland-egl-4:18.1.0-alt1.1 sisyphus+318010.100.1.1 1680606300 installed
<13>May 11 07:33:56 rpmi: libGLES-7:1.7.0-alt1 sisyphus+330949.100.1.1 1696424894 installed
<13>May 11 07:33:56 rpmi: liblcms2-devel-2.16-alt1 sisyphus+335676.100.1.1 1701682605 installed
<13>May 11 07:33:56 rpmi: libxkbcommon-devel-1.7.0-alt1.1 sisyphus+343672.100.1.1 1711490815 installed
<13>May 11 07:33:56 rpmi: xxd-4:9.1.0050-alt3 sisyphus+345223.100.1.1 1713226643 installed
<13>May 11 07:33:56 rpmi: vulkan-headers-1.3.277-alt1 sisyphus+342281.100.1.1 1709847574 installed
<13>May 11 07:33:56 rpmi: rpm-build-vala-0.3-alt1 sisyphus+277005.100.1.2 1625345329 installed
<13>May 11 07:33:56 rpmi: libxml2-devel-1:2.12.6-alt1 sisyphus+347327.100.1.1 1714660890 installed
<13>May 11 07:33:56 rpmi: libwacom-data-2.11.0-alt1 sisyphus+345166.100.1.1 1713171407 installed
<13>May 11 07:33:56 rpmi: libopenjpeg2.0-2.5.2-alt1 sisyphus+341637.100.1.1 1709150019 installed
<13>May 11 07:33:56 rpmi: libjxr-1.1-alt1 sisyphus+276245.100.1.2 1624925648 installed
<13>May 11 07:33:56 rpmi: libepoxy-1.5.10-alt1 sisyphus+296853.200.2.1 1647631868 installed
<13>May 11 07:33:56 rpmi: libdatrie-0.2.13-alt1_7 sisyphus+328221.100.1.1 1693336967 installed
<13>May 11 07:33:56 rpmi: libthai-0.1.29-alt1_6 sisyphus+328230.100.1.2 1693348044 installed
<13>May 11 07:33:56 rpmi: libusb-1.0.27-alt1 sisyphus+347412.100.1.1 1714739652 installed
<13>May 11 07:33:56 rpmi: libSDL2-2.30.3-alt1 sisyphus+347373.100.1.1 1714720173 installed
<13>May 11 07:33:56 rpmi: tslib-1.22-alt3 sisyphus+278442.100.1.2 1626216683 installed
<13>May 11 07:33:56 rpmi: libxshmfence-1.3.2-alt1 sisyphus+311428.400.1.1 1670577529 installed
<13>May 11 07:33:56 rpmi: libpciaccess-1:0.18.1-alt1 sisyphus+343583.300.1.1 1711440792 installed
<13>May 11 07:33:56 rpmi: libdrm-1:2.4.120-alt1 sisyphus+338137.100.1.2 1705653180 installed
<13>May 11 07:33:56 rpmi: perl-Try-Tiny-0.31-alt1 sisyphus+290597.100.1.1 1637915507 installed
<13>May 11 07:33:56 rpmi: perl-IO-Socket-IP-0.42-alt1 sisyphus+325815.100.1.2 1690571193 installed
<13>May 11 07:33:56 rpmi: perl-Module-Load-0.36-alt1 sisyphus+258992.100.1.1 1601543407 installed
<13>May 11 07:33:56 rpmi: perl-Compress-Raw-Bzip2-2.210-alt1 sisyphus+343108.100.1.3 1710881036 installed
<13>May 11 07:33:57 rpmi: perl-IO-Compress-Brotli-2:0.004001-alt3 sisyphus+335067.1200.1.1 1700901700 installed
<13>May 11 07:33:57 rpmi: perl-Clone-0.46-alt1 sisyphus+335067.1100.1.1 1700901674 installed
<13>May 11 07:33:57 rpmi: perl-HTML-Tagset-3.24-alt1 sisyphus+343117.100.1.3 1710883587 installed
<13>May 11 07:33:57 rpmi: perl-Term-ANSIColor-5.01-alt1 sisyphus+244783.100.1.2 1579747505 installed
<13>May 11 07:33:57 rpmi: perl-Data-Dump-1.25-alt1 sisyphus+276551.100.1.1 1625126880 installed
<13>May 11 07:33:57 rpmi: perl-Filter-1.64-alt1 sisyphus+335067.400.1.1 1700901530 installed
<13>May 11 07:33:57 rpmi: perl-Encode-3.21-alt1 sisyphus+343095.100.1.1 1710875480 installed
<13>May 11 07:33:57 rpmi: perl-URI-5.27-alt1 sisyphus+340901.100.1.1 1708180683 installed
<13>May 11 07:33:57 rpmi: perl-IO-Compress-2.206-alt1 sisyphus+325819.100.1.1 1690563199 installed
<13>May 11 07:33:57 rpmi: perl-Net-HTTP-6.23-alt1 sisyphus+323470.100.1.1 1687422469 installed
<13>May 11 07:33:57 rpmi: perl-HTML-Parser-3.82-alt1 sisyphus+343116.100.1.3 1710883258 installed
<13>May 11 07:33:57 rpmi: perl-WWW-RobotRules-6.02-alt1 1329756211 installed
<13>May 11 07:33:57 rpmi: perl-Encode-Locale-1.05-alt1 1444608613 installed
<13>May 11 07:33:57 rpmi: perl-IO-HTML-1.004-alt1 sisyphus+258983.100.1.1 1601542619 installed
<13>May 11 07:33:57 rpmi: perl-HTTP-Message-6.45-alt1 sisyphus+330728.100.1.1 1696162276 installed
<13>May 11 07:33:57 rpmi: perl-HTTP-Negotiate-6.01-alt1 1329760563 installed
<13>May 11 07:33:57 rpmi: perl-libwww-6.77-alt1 sisyphus+343120.100.1.2 1710884405 installed
<13>May 11 07:33:57 rpmi: perl-XML-LibXML-2.0210-alt5 sisyphus+347351.100.1.1 1714672301 installed
<13>May 11 07:33:57 rpmi: perl-XML-SAX-1.02-alt1 sisyphus+232322.100.1.1 1560758406 installed
<13>May 11 07:33:57 rpmi: perl-XML-Simple-2.25-alt2 sisyphus+257498.100.1.1 1599324034 installed
<13>May 11 07:33:57 rpmi: icon-naming-utils-0.8.90-alt1 sisyphus+276851.100.1.1 1625243947 installed
<13>May 11 07:33:57 rpmi: icon-theme-adwaita-46.0-alt1 sisyphus+343025.200.4.2 1710847162 installed
<13>May 11 07:33:57 rpmi: usbids-20240206-alt1 sisyphus+339943.100.1.1 1707270512 installed
<13>May 11 07:33:57 rpmi: pciids-20240429-alt1 sisyphus+347144.100.1.1 1714367867 installed
<13>May 11 07:33:57 rpmi: hwdata-0.374-alt1 sisyphus+329322.100.1.1 1694450297 installed
<13>May 11 07:33:57 rpmi: libdeflate-1.20-alt1 sisyphus+343488.100.1.1 1711323986 installed
<13>May 11 07:33:57 rpmi: libtiff5-4.4.0-alt4 sisyphus+322581.100.1.2 1686180093 installed
<13>May 11 07:33:57 rpmi: libfreeimage-3.18.0-alt9 sisyphus+314571.300.5.1 1693995363 installed
<13>May 11 07:33:57 rpmi: libgdk-pixbuf-locales-2.42.11-alt1 sisyphus+345586.100.1.1 1713719119 installed
<13>May 11 07:33:57 rpmi: gtk+3-themes-incompatible-3.20-alt3 1461944560 installed
<13>May 11 07:33:57 rpmi: gcc-c++-common-1.4.27-alt1 sisyphus+278099.1300.1.1 1626028636 installed
<13>May 11 07:33:57 rpmi: libstdc++13-devel-13.2.1-alt3 sisyphus+339335.100.1.1 1706563095 installed
<13>May 11 07:33:59 rpmi: gcc13-c++-13.2.1-alt3 sisyphus+339335.100.1.1 1706563095 installed
<13>May 11 07:33:59 rpmi: gcc-c++-13-alt1 sisyphus+323337.300.1.1 1687268227 installed
<13>May 11 07:33:59 rpmi: libpixman-3:0.43.4-alt2 sisyphus+344164.100.1.1 1711987947 installed
<13>May 11 07:33:59 rpmi: libmpdec3-2.5.1-alt3 sisyphus+314490.500.5.1 1675432033 installed
<13>May 11 07:33:59 rpmi: libgdbm-1.8.3-alt10 sisyphus+278100.1600.1.1 1626059138 installed
<13>May 11 07:33:59 rpmi: qt6-base-common-6.6.2-alt3 sisyphus+341417.100.1.1 1708934579 installed
<13>May 11 07:33:59 rpmi: libdevmapper-1.02.196-alt1 sisyphus+328928.400.3.1 1694103939 installed
<13>May 11 07:33:59 rpmi: mount-2.39.2-alt1 sisyphus+327286.4500.14.1 1711486360 installed
<13>May 11 07:33:59 rpmi: losetup-2.39.2-alt1 sisyphus+327286.4500.14.1 1711486360 installed
<13>May 11 07:33:59 rpmi: lsblk-2.39.2-alt1 sisyphus+327286.4500.14.1 1711486360 installed
<13>May 11 07:33:59 rpmi: dconf-profile-0.1-alt1 sisyphus+325633.340.3.1 1690415358 installed
<13>May 11 07:33:59 rpmi: cmake-modules-3.29.1-alt1 sisyphus+344518.200.3.1 1712379665 installed
<13>May 11 07:33:59 rpmi: libuv-1.48.0-alt1 sisyphus+340945.100.1.1 1708265067 installed
<13>May 11 07:33:59 rpmi: librhash-1.3.5-alt3 sisyphus+286141.40.2.1 1632982456 installed
<13>May 11 07:33:59 rpmi: libjsoncpp24-1.9.4-alt2 sisyphus+286441.100.1.1 1633444234 installed
<13>May 11 07:33:59 rpmi: publicsuffix-list-dafsa-20240415-alt1 sisyphus+345249.100.1.1 1713270235 installed
<13>May 11 07:33:59 rpmi: libpsl-0.21.5-alt1 sisyphus+338474.100.1.1 1705684771 installed
<13>May 11 07:33:59 rpmi: libnghttp3.9-1.2.0-alt1 sisyphus+343912.200.1.1 1711714731 installed
<13>May 11 07:33:59 rpmi: openldap-common-2.6.7-alt2 sisyphus+347731.100.1.1 1715194911 installed
<13>May 11 07:33:59 rpmi: libntlm-1.5-alt1 sisyphus+278100.3300.1.1 1626059663 installed
<13>May 11 07:33:59 rpmi: libidn-1.37-alt2 sisyphus+300849.100.1.1 1653769693 installed
<13>May 11 07:33:59 rpmi: libverto-0.3.2-alt1_1 sisyphus+321176.2200.10.2 1684806164 installed
<13>May 11 07:33:59 rpmi: liblmdb-0.9.32-alt1 sisyphus+342426.100.1.1 1710124284 installed
<13>May 11 07:33:59 rpmi: libkeyutils-1.6.3-alt1 sisyphus+266061.100.1.1 1612919567 installed
<13>May 11 07:33:59 rpmi: libcom_err-1.46.4.0.5.4cda-alt1 sisyphus+283826.100.1.1 1629975361 installed
<13>May 11 07:33:59 rpmi: libbrotlicommon-1.1.0-alt1 sisyphus+328501.100.1.1 1693598420 installed
<13>May 11 07:33:59 rpmi: libbrotlidec-1.1.0-alt1 sisyphus+328501.100.1.1 1693598420 installed
<13>May 11 07:33:59 rpmi: libharfbuzz-8.4.0-alt1 sisyphus+344161.100.1.1 1711987969 installed
<13>May 11 07:33:59 rpmi: libfreetype-2.13.2-alt1 sisyphus+328677.100.1.1 1693834346 installed
<13>May 11 07:33:59 rpmi: libfontconfig1-2.14.2-alt8 sisyphus+328444.100.1.1 1693553407 installed
<13>May 11 07:33:59 rpmi: fontconfig-2.14.2-alt8 sisyphus+328444.100.1.1 1693553407 installed
Updating fonts cache: <29>May 11 07:34:00 fontconfig: Updating fonts cache: succeeded
[ DONE ]
<13>May 11 07:34:00 rpmi: libharfbuzz-icu-8.4.0-alt1 sisyphus+344161.100.1.1 1711987969 installed
<13>May 11 07:34:00 rpmi: libharfbuzz-gobject-8.4.0-alt1 sisyphus+344161.100.1.1 1711987969 installed
<13>May 11 07:34:00 rpmi: rpm-macros-cmake-3.29.1-alt1 sisyphus+344518.300.3.1 1712379787 installed
<13>May 11 07:34:00 rpmi: desktop-file-utils-0.26-alt6 sisyphus+331944.100.1.3 1697550035 installed
<13>May 11 07:34:00 rpmi: shared-mime-info-2.4-alt1 sisyphus+334259.100.1.1 1699787317 installed
<13>May 11 07:34:00 rpmi: gsettings-desktop-schemas-data-46.0-alt1 sisyphus+343025.100.4.2 1710847127 installed
<13>May 11 07:34:00 rpmi: libgio-2.80.2-alt1 sisyphus+347748.200.2.1 1715237858 installed
<13>May 11 07:34:00 rpmi: gsettings-desktop-schemas-46.0-alt1 sisyphus+343025.100.4.2 1710847126 installed
<13>May 11 07:34:00 rpmi: libgdk-pixbuf-2.42.11-alt1 sisyphus+345586.100.1.1 1713719121 installed
<13>May 11 07:34:00 rpmi: gtk4-update-icon-cache-4.14.4-alt1 sisyphus+347397.300.1.1 1714734176 installed
<13>May 11 07:34:00 rpmi: libdconf-0.40.0-alt3 sisyphus+325650.100.1.1 1690417204 installed
<13>May 11 07:34:00 rpmi: libjson-glib-1.8.0-alt1 sisyphus+325066.600.6.2 1695204016 installed
<13>May 11 07:34:00 rpmi: libgusb-0.4.9-alt1 sisyphus+345693.100.1.1 1713857462 installed
<13>May 11 07:34:00 rpmi: libcolord-1.4.7-alt1.1 sisyphus+338793.100.1.1 1706039037 installed
<13>May 11 07:34:00 rpmi: systemd-modules-common-1:254.10-alt2 sisyphus+345302.400.3.1 1713818564 installed
<13>May 11 07:34:00 rpmi: systemd-sysctl-common-1:254.10-alt2 sisyphus+345302.400.3.1 1713818601 installed
<13>May 11 07:34:00 rpmi: systemd-tmpfiles-common-1:254.10-alt2 sisyphus+345302.400.3.1 1713818564 installed
<13>May 11 07:34:00 rpmi: systemd-utils-filetriggers-1:254.10-alt2 sisyphus+345302.400.3.1 1713818564 installed
<13>May 11 07:34:00 rpmi: libfdisk-2.39.2-alt1 sisyphus+327286.4500.14.1 1711486360 installed
<13>May 11 07:34:00 rpmi: libX11-locales-3:1.8.8-alt1 sisyphus+343583.100.1.1 1711440719 installed
<13>May 11 07:34:00 rpmi: libXdmcp-1.1.5-alt1 sisyphus+343583.700.1.1 1711441073 installed
<13>May 11 07:34:00 rpmi: libxcb-1.17.0-alt1 sisyphus+345308.200.1.1 1713342009 installed
<13>May 11 07:34:00 rpmi: libX11-3:1.8.8-alt1 sisyphus+343583.100.1.1 1711440722 installed
<13>May 11 07:34:00 rpmi: libXext-1.3.6-alt1 sisyphus+343583.1000.1.1 1711441114 installed
<13>May 11 07:34:00 rpmi: libXrender-0.9.11-alt1 sisyphus+308841.100.1.1 1666436131 installed
<13>May 11 07:34:01 rpmi: libcairo-1:1.18.0-alt1 sisyphus+330227.100.1.1 1695539082 installed
<13>May 11 07:34:01 rpmi: libcairo-gobject-1:1.18.0-alt1 sisyphus+330227.100.1.1 1695539082 installed
<13>May 11 07:34:01 rpmi: libXfixes-6.0.1-alt1 sisyphus+331490.300.1.1 1697023235 installed
<13>May 11 07:34:02 rpmi: libxcb-devel-1.17.0-alt1 sisyphus+345308.200.1.1 1713342009 installed
<13>May 11 07:34:02 rpmi: libX11-devel-3:1.8.8-alt1 sisyphus+343583.100.1.1 1711440722 installed
<13>May 11 07:34:02 rpmi: libXrender-devel-0.9.11-alt1 sisyphus+308841.100.1.1 1666436131 installed
<13>May 11 07:34:02 rpmi: libXft-2.3.8-alt1 sisyphus+331490.400.1.1 1697023273 installed
<13>May 11 07:34:02 rpmi: libpango-1.52.2-alt1 sisyphus+344075.100.1.1 1711911780 installed
<13>May 11 07:34:02 rpmi: libXi-1.8-alt1 sisyphus+285490.200.1.1 1632124180 installed
<13>May 11 07:34:02 rpmi: libgbm-4:24.0.6-alt1 sisyphus+345881.100.1.1 1714144957 installed
<13>May 11 07:34:02 rpmi: libxcb-render-util-0.3.9-alt3 sisyphus+276916.100.1.2 1625275237 installed
<13>May 11 07:34:03 rpmi: librsvg-1:2.58.91-alt1 sisyphus+345985.100.1.1 1714236707 installed
<13>May 11 07:34:03 rpmi: libXext-devel-1.3.6-alt1 sisyphus+343583.1000.1.1 1711441114 installed
<13>May 11 07:34:03 rpmi: libXcursor-1.2.2-alt1 sisyphus+343583.600.1.1 1711441036 installed
<13>May 11 07:34:03 rpmi: libharfbuzz-cairo-8.4.0-alt1 sisyphus+344161.100.1.1 1711987969 installed
<13>May 11 07:34:03 rpmi: libXrandr-1.5.4-alt1 sisyphus+330992.100.1.1 1696485401 installed
<13>May 11 07:34:03 rpmi: libXtst-1.2.4-alt1 sisyphus+308663.1300.1.1 1666168504 installed
<13>May 11 07:34:03 rpmi: libXxf86vm-1.1.5-alt1 sisyphus+308663.1400.1.1 1666168534 installed
<13>May 11 07:34:03 rpmi: libGLX-mesa-4:24.0.6-alt1 sisyphus+345881.100.1.1 1714144957 installed
<13>May 11 07:34:03 rpmi: libGLX-7:1.7.0-alt1 sisyphus+330949.100.1.1 1696424894 installed
<13>May 11 07:34:03 rpmi: libGL-7:1.7.0-alt1 sisyphus+330949.100.1.1 1696424894 installed
<13>May 11 07:34:03 rpmi: libEGL-mesa-4:24.0.6-alt1 sisyphus+345881.100.1.1 1714144957 installed
<13>May 11 07:34:03 rpmi: libEGL-7:1.7.0-alt1 sisyphus+330949.100.1.1 1696424894 installed
<13>May 11 07:34:04 rpmi: libglvnd-devel-7:1.7.0-alt1 sisyphus+330949.100.1.1 1696424894 installed
<13>May 11 07:34:04 rpmi: libXinerama-1.1.5-alt1 sisyphus+309287.100.1.1 1667213209 installed
<13>May 11 07:34:04 rpmi: xprop-1.2.5-alt1 sisyphus+279025.100.1.1 1626354193 installed
<13>May 11 07:34:04 rpmi: libXcomposite-0.4.6-alt1 sisyphus+311188.200.1.1 1670233684 installed
<13>May 11 07:34:04 rpmi: libXdamage-1.1.6-alt1 sisyphus+311188.300.1.1 1670233713 installed
<13>May 11 07:34:04 rpmi: libxcbutil-1:0.4.1-alt1 sisyphus+312057.100.1.1 1671526889 installed
<13>May 11 07:34:04 rpmi: libxcbutil-image-0.4.0-alt1 sisyphus+275413.100.1.3 1624505806 installed
<13>May 11 07:34:04 rpmi: libxcbutil-cursor-0.1.3-alt2 sisyphus+278274.100.1.2 1626148618 installed
<13>May 11 07:34:04 rpmi: libxcbutil-icccm-0.4.1-alt2 sisyphus+278275.100.1.2 1626148617 installed
<13>May 11 07:34:04 rpmi: libxcbutil-keysyms-0.4.0-alt1 sisyphus+278187.100.1.1 1626075950 installed
<13>May 11 07:34:04 rpmi: libxkbcommon-x11-1.7.0-alt1.1 sisyphus+343672.100.1.1 1711490815 installed
<13>May 11 07:34:04 rpmi: liblz4-1:1.9.4-alt1 sisyphus+309416.100.1.1 1667413000 installed
<13>May 11 07:34:04 rpmi: libsystemd-1:254.10-alt2 sisyphus+345302.400.3.1 1713818601 installed
<13>May 11 07:34:04 rpmi: libdbus-1.14.10-alt1 sisyphus+327286.5700.14.1 1711487513 installed
<13>May 11 07:34:04 rpmi: libat-spi2-core-2.52.0-alt1 sisyphus+342903.100.1.1 1710606495 installed
<13>May 11 07:34:04 rpmi: at-spi2-atk-2.52.0-alt1 sisyphus+342903.100.1.1 1710606495 installed
<13>May 11 07:34:04 rpmi: dbus-tools-1.14.10-alt1 sisyphus+327286.5700.14.1 1711487513 installed
<86>May 11 07:34:04 groupadd[1599636]: group added to /etc/group: name=messagebus, GID=999
<86>May 11 07:34:04 groupadd[1599636]: group added to /etc/gshadow: name=messagebus
<86>May 11 07:34:04 groupadd[1599636]: new group: name=messagebus, GID=999
<86>May 11 07:34:04 useradd[1599657]: new user: name=messagebus, UID=999, GID=999, home=/run/dbus, shell=/dev/null, from=none
<13>May 11 07:34:04 rpmi: dbus-1.14.10-alt1 sisyphus+327286.5700.14.1 1711487513 installed
<13>May 11 07:34:04 rpmi: dbus-tools-gui-1.14.10-alt1 sisyphus+327286.5700.14.1 1711487513 installed
<13>May 11 07:34:04 rpmi: dconf-0.40.0-alt3 sisyphus+325650.100.1.1 1690417204 installed
<13>May 11 07:34:04 rpmi: libgtk+3-schemas-3.24.41-alt1.1 sisyphus+343530.100.1.1 1711365587 installed
<13>May 11 07:34:04 rpmi: libavahi-0.8-alt4 sisyphus+344258.100.1.1 1712133862 installed
<13>May 11 07:34:04 rpmi: libpolkit-124-alt1 sisyphus+340067.100.1.1 1707374992 installed
<13>May 11 07:34:04 rpmi: rpm-macros-alternatives-0.5.2-alt2 sisyphus+315270.200.2.1 1676457367 installed
<13>May 11 07:34:04 rpmi: alternatives-0.5.2-alt2 sisyphus+315270.200.2.1 1676457367 installed
<13>May 11 07:34:04 rpmi: ca-certificates-2024.02.24-alt1 sisyphus+341362.100.1.1 1708791001 installed
<13>May 11 07:34:04 rpmi: ca-trust-0.2.0-alt1 sisyphus+344843.100.1.1 1712743326 installed
<13>May 11 07:34:04 rpmi: p11-kit-trust-1:0.25.3-alt2 sisyphus+336533.100.1.1 1702645575 installed
<13>May 11 07:34:04 rpmi: libcrypto3-3.1.5-alt2 sisyphus+343320.140.3.1 1711982452 installed
<13>May 11 07:34:04 rpmi: libqt6-core-6.6.2-alt3 sisyphus+341417.100.1.1 1708934579 installed
<13>May 11 07:34:04 rpmi: libssl3-3.1.5-alt2 sisyphus+343320.140.3.1 1711982452 installed
<13>May 11 07:34:04 rpmi: python3-3.12.2-alt1 sisyphus+341702.200.1.1 1709232959 installed
<13>May 11 07:34:06 rpmi: python3-base-3.12.2-alt1 sisyphus+341702.200.1.1 1709232959 installed
<86>May 11 07:34:06 groupadd[1603722]: group added to /etc/group: name=_keytab, GID=998
<86>May 11 07:34:06 groupadd[1603722]: group added to /etc/gshadow: name=_keytab
<86>May 11 07:34:06 groupadd[1603722]: new group: name=_keytab, GID=998
<13>May 11 07:34:06 rpmi: libkrb5-1.21.2-alt2 sisyphus+338902.100.2.1 1706700985 installed
<13>May 11 07:34:06 rpmi: libqt6-dbus-6.6.2-alt3 sisyphus+341417.100.1.1 1708934579 installed
<13>May 11 07:34:06 rpmi: libqt6-xml-6.6.2-alt3 sisyphus+341417.100.1.1 1708934579 installed
<13>May 11 07:34:06 rpmi: libkmod-31-alt1 sisyphus+330699.100.1.1 1696072426 installed
<13>May 11 07:34:06 rpmi: libcups-2.4.8-alt1 sisyphus+347633.100.1.1 1715081275 installed
<13>May 11 07:34:06 rpmi: systemd-utils-standalone-1:254.10-alt2 sisyphus+345302.400.3.1 1713818601 installed
<13>May 11 07:34:06 rpmi: at-spi2-core-2.52.0-alt1 sisyphus+342903.100.1.1 1710606495 installed
<13>May 11 07:34:06 rpmi: kmod-31-alt1 sisyphus+330699.100.1.1 1696072426 installed
<13>May 11 07:34:06 rpmi: dmsetup-1.02.196-alt1 sisyphus+328928.400.3.1 1694103939 installed
<86>May 11 07:34:06 groupadd[1604201]: group added to /etc/group: name=tape, GID=997
<86>May 11 07:34:06 groupadd[1604201]: group added to /etc/gshadow: name=tape
<86>May 11 07:34:06 groupadd[1604201]: new group: name=tape, GID=997
<86>May 11 07:34:06 groupadd[1604213]: group added to /etc/group: name=dialout, GID=996
<86>May 11 07:34:06 groupadd[1604213]: group added to /etc/gshadow: name=dialout
<86>May 11 07:34:06 groupadd[1604213]: new group: name=dialout, GID=996
<86>May 11 07:34:06 groupadd[1604225]: group added to /etc/group: name=input, GID=995
<86>May 11 07:34:06 groupadd[1604225]: group added to /etc/gshadow: name=input
<86>May 11 07:34:06 groupadd[1604225]: new group: name=input, GID=995
<86>May 11 07:34:06 groupadd[1604237]: group added to /etc/group: name=video, GID=994
<86>May 11 07:34:06 groupadd[1604237]: group added to /etc/gshadow: name=video
<86>May 11 07:34:06 groupadd[1604237]: new group: name=video, GID=994
<86>May 11 07:34:06 groupadd[1604251]: group added to /etc/group: name=render, GID=993
<86>May 11 07:34:06 groupadd[1604251]: group added to /etc/gshadow: name=render
<86>May 11 07:34:06 groupadd[1604251]: new group: name=render, GID=993
<86>May 11 07:34:06 groupadd[1604264]: group added to /etc/group: name=sgx, GID=992
<86>May 11 07:34:06 groupadd[1604264]: group added to /etc/gshadow: name=sgx
<86>May 11 07:34:06 groupadd[1604264]: new group: name=sgx, GID=992
<13>May 11 07:34:06 rpmi: udev-1:254.10-alt2 sisyphus+345302.400.3.1 1713818601 installed
<86>May 11 07:34:07 groupadd[1605717]: group added to /etc/group: name=colord, GID=991
<86>May 11 07:34:07 groupadd[1605717]: group added to /etc/gshadow: name=colord
<86>May 11 07:34:07 groupadd[1605717]: new group: name=colord, GID=991
<86>May 11 07:34:07 useradd[1605728]: new user: name=colord, UID=998, GID=991, home=/var/colord, shell=/dev/null, from=none
<13>May 11 07:34:07 rpmi: colord-1.4.7-alt1.1 sisyphus+338793.100.1.1 1706039037 installed
<13>May 11 07:34:08 rpmi: libgtk+3-3.24.41-alt1.1 sisyphus+343530.100.1.1 1711365614 installed
<13>May 11 07:34:08 rpmi: libdtk6core6-6.0.11-alt1 sisyphus+345618.40.1.1 1713787641 installed
<13>May 11 07:34:08 rpmi: dtk6core-6.0.11-alt1 sisyphus+345618.40.1.1 1713787641 installed
<13>May 11 07:34:08 rpmi: libgsasl-2.2.0-alt1 sisyphus+333173.100.1.1 1698696961 installed
<86>May 11 07:34:08 groupadd[1608446]: group added to /etc/group: name=sasl, GID=990
<86>May 11 07:34:08 groupadd[1608446]: group added to /etc/gshadow: name=sasl
<86>May 11 07:34:08 groupadd[1608446]: new group: name=sasl, GID=990
<13>May 11 07:34:09 rpmi: libsasl2-3-2.1.28-alt2 sisyphus+343335.100.1.1 1711112524 installed
<13>May 11 07:34:09 rpmi: libldap2-2.6.7-alt2 sisyphus+347731.100.1.1 1715194925 installed
<13>May 11 07:34:09 rpmi: python3-module-packaging-24.0-alt1 sisyphus+342487.100.2.1 1710407438 installed
<13>May 11 07:34:09 rpmi: glib2-devel-2.80.2-alt1 sisyphus+347748.200.2.1 1715237858 installed
<13>May 11 07:34:09 rpmi: libgio-devel-2.80.2-alt1 sisyphus+347748.200.2.1 1715237858 installed
<13>May 11 07:34:09 rpmi: libcairo-devel-1:1.18.0-alt1 sisyphus+330227.100.1.1 1695539082 installed
<13>May 11 07:34:09 rpmi: fontconfig-devel-2.14.2-alt8 sisyphus+328444.100.1.1 1693553407 installed
<13>May 11 07:34:09 rpmi: libfreetype-devel-2.13.2-alt1 sisyphus+328677.100.1.1 1693834346 installed
<13>May 11 07:34:09 rpmi: libharfbuzz-devel-8.4.0-alt1 sisyphus+344161.100.1.1 1711987969 installed
<13>May 11 07:34:09 rpmi: libXft-devel-2.3.8-alt1 sisyphus+331490.400.1.1 1697023273 installed
<13>May 11 07:34:09 rpmi: libpango-devel-1.52.2-alt1 sisyphus+344075.100.1.1 1711911780 installed
<13>May 11 07:34:09 rpmi: libcairo-gobject-devel-1:1.18.0-alt1 sisyphus+330227.100.1.1 1695539082 installed
<13>May 11 07:34:09 rpmi: libgdk-pixbuf-devel-2.42.11-alt1 sisyphus+345586.100.1.1 1713719121 installed
<13>May 11 07:34:09 rpmi: python3-module-pyudev-0.24.1-alt2 sisyphus+344474.100.1.1 1712313224 installed
<13>May 11 07:34:09 rpmi: python3-module-libevdev-0.11-alt1 sisyphus+300877.100.1.1 1653893962 installed
<13>May 11 07:34:09 rpmi: libwacom-2.11.0-alt1 sisyphus+345166.100.1.1 1713171407 installed
<13>May 11 07:34:09 rpmi: libinput-1.25.0-alt1.1 sisyphus+340565.100.1.1 1707817201 installed
<13>May 11 07:34:09 rpmi: python3-module-markupsafe-1:2.1.5-alt1 sisyphus+339663.100.1.1 1706899589 installed
<13>May 11 07:34:09 rpmi: python3-module-jinja2-3.1.3-alt1 sisyphus+338371.3500.8.1 1706006785 installed
<13>May 11 07:34:09 rpmi: python3-module-railroad-diagrams-1.1.1-alt1 sisyphus+294587.100.1.1 1643813088 installed
<13>May 11 07:34:09 rpmi: python3-module-pyparsing-3.1.2-alt1 sisyphus+342155.100.2.1 1709806916 installed
<13>May 11 07:34:09 rpmi: vulkan-registry-1.3.277-alt1 sisyphus+342281.100.1.1 1709847574 installed
<13>May 11 07:34:09 rpmi: libvulkan-devel-1.3.277-alt1 sisyphus+342474.300.2.1 1710160455 installed
<13>May 11 07:34:09 rpmi: libssl-devel-3.1.5-alt2 sisyphus+343320.140.3.1 1711982452 installed
<13>May 11 07:34:09 rpmi: libqt6-concurrent-6.6.2-alt3 sisyphus+341417.100.1.1 1708934579 installed
<13>May 11 07:34:10 rpmi: libqt6-sql-6.6.2-alt3 sisyphus+341417.100.1.1 1708934579 installed
<13>May 11 07:34:10 rpmi: libqt6-test-6.6.2-alt3 sisyphus+341417.100.1.1 1708934579 installed
<13>May 11 07:34:10 rpmi: libarchive13-3.6.1-alt2 sisyphus+324359.1300.6.1 1689326414 installed
<13>May 11 07:34:10 rpmi: libssh2-1.11.0-alt2 sisyphus+339356.100.1.1 1706593140 installed
<13>May 11 07:34:10 rpmi: libcurl-8.7.1-alt2 sisyphus+345773.100.1.1 1713974756 installed
<13>May 11 07:34:10 rpmi: libproxy-0.5.3-alt1.2 sisyphus+335980.100.1.1 1701900058 installed
<13>May 11 07:34:10 rpmi: glib-networking-2.80.0-alt1 sisyphus+342825.100.1.1 1710537083 installed
<13>May 11 07:34:10 rpmi: libqt6-network-6.6.2-alt3 sisyphus+341417.100.1.1 1708934579 installed
<13>May 11 07:34:10 rpmi: libqt6-opengl-6.6.2-alt3 sisyphus+341417.100.1.1 1708934579 installed
<13>May 11 07:34:10 rpmi: libqt6-xcbqpa-6.6.2-alt3 sisyphus+341417.100.1.1 1708934579 installed
<13>May 11 07:34:10 rpmi: libqt6-eglfskmssupport-6.6.2-alt3 sisyphus+341417.100.1.1 1708934579 installed
<13>May 11 07:34:10 rpmi: libqt6-eglfskmsgbmsupport-6.6.2-alt3 sisyphus+341417.100.1.1 1708934579 installed
<13>May 11 07:34:10 rpmi: libqt6-eglfsdeviceintegration-6.6.2-alt3 sisyphus+341417.100.1.1 1708934579 installed
<13>May 11 07:34:10 rpmi: libqt6-gui-6.6.2-alt3 sisyphus+341417.100.1.1 1708934579 installed
<13>May 11 07:34:10 rpmi: libqt6-widgets-6.6.2-alt3 sisyphus+341417.100.1.1 1708934579 installed
<13>May 11 07:34:10 rpmi: libqt6-openglwidgets-6.6.2-alt3 sisyphus+341417.100.1.1 1708934579 installed
<13>May 11 07:34:11 rpmi: libqt6-printsupport-6.6.2-alt3 sisyphus+341417.100.1.1 1708934579 installed
<13>May 11 07:34:11 rpmi: libsoup-2.74.3-alt1.1 sisyphus+318260.100.1.1 1680994690 installed
<13>May 11 07:34:11 rpmi: libsoup3.0-3.4.4-alt1 sisyphus+332857.100.1.1 1698395617 installed
<13>May 11 07:34:11 rpmi: libsoup-devel-2.74.3-alt1.1 sisyphus+318260.100.1.1 1680994690 installed
<13>May 11 07:34:11 rpmi: vala-0.56.17-alt1 sisyphus+345617.100.1.1 1713782402 installed
<13>May 11 07:34:11 rpmi: libsoup3.0-devel-3.4.4-alt1 sisyphus+332857.100.1.1 1698395617 installed
<13>May 11 07:34:11 rpmi: librsvg-devel-1:2.58.91-alt1 sisyphus+345985.100.1.1 1714236707 installed
<13>May 11 07:34:13 rpmi: qt6-base-devel-6.6.2-alt3 sisyphus+341417.100.1.1 1708934579 installed
<13>May 11 07:34:14 rpmi: cmake-3.29.1-alt1 sisyphus+344518.200.3.1 1712379679 installed
<13>May 11 07:34:14 rpmi: libdtk6core-devel-6.0.11-alt1 sisyphus+345618.40.1.1 1713787641 installed
<13>May 11 07:34:14 rpmi: libfreeimage-devel-3.18.0-alt9 sisyphus+314571.300.5.1 1693995363 installed
<13>May 11 07:34:14 rpmi: libraw-devel-0.21.2-alt1 sisyphus+336806.100.1.1 1703007433 installed
<13>May 11 07:34:14 rpmi: libgomp-devel-13-alt1 sisyphus+323337.300.1.1 1687267966 installed
<13>May 11 07:34:14 rpmi: dtk6-common-devel-5.6.26-alt1 sisyphus+343920.40.2.1 1711733363 installed
warning: File /usr/src/in/source/dtk6gui-6.0.11-alt1.patch is smaller than 8 bytes
Building target platforms: i586
Building for target i586
Wrote: /usr/src/in/nosrpm/dtk6gui-6.0.11-alt1.nosrc.rpm (w1.gzdio)
warning: File /usr/src/RPM/SOURCES/dtk6gui-6.0.11-alt1.patch is smaller than 8 bytes
Installing dtk6gui-6.0.11-alt1.src.rpm
Building target platforms: i586
Building for target i586
Executing(%prep): /bin/sh -e /usr/src/tmp/rpm-tmp.67553
+ umask 022
+ /bin/mkdir -p /usr/src/RPM/BUILD
+ cd /usr/src/RPM/BUILD
+ cd /usr/src/RPM/BUILD
+ rm -rf dtk6gui-6.0.11
+ echo 'Source #0 (dtk6gui-6.0.11.tar.gz):'
Source #0 (dtk6gui-6.0.11.tar.gz):
+ /bin/gzip -dc /usr/src/RPM/SOURCES/dtk6gui-6.0.11.tar.gz
+ /bin/tar -xf -
+ cd dtk6gui-6.0.11
+ /bin/chmod -c -Rf u+rwX,go-w .
+ echo 'Patch #0 (dtk6gui-6.0.11-alt1.patch):'
Patch #0 (dtk6gui-6.0.11-alt1.patch):
+ /usr/bin/patch -p1
+ exit 0
Executing(%build): /bin/sh -e /usr/src/tmp/rpm-tmp.67553
+ umask 022
+ /bin/mkdir -p /usr/src/RPM/BUILD
+ cd /usr/src/RPM/BUILD
+ cd dtk6gui-6.0.11
+ export PATH=/usr/share/qt6/bin:/usr/src/bin:/usr/bin:/bin:/usr/local/bin:/usr/games
+ PATH=/usr/share/qt6/bin:/usr/src/bin:/usr/bin:/bin:/usr/local/bin:/usr/games
+ mkdir -p i586-alt-linux
+ cmake -DCMAKE_SKIP_INSTALL_RPATH:BOOL=yes '-DCMAKE_C_FLAGS:STRING=-pipe -frecord-gcc-switches -Wall -g -O2 -flto=auto -march=i586 -mtune=generic -I/usr/lib/gcc/i586-alt-linux/13/include' '-DCMAKE_CXX_FLAGS:STRING=-pipe -frecord-gcc-switches -Wall -g -O2 -flto=auto -march=i586 -mtune=generic -I/usr/lib/gcc/i586-alt-linux/13/include' '-DCMAKE_Fortran_FLAGS:STRING=-pipe -frecord-gcc-switches -Wall -g -O2 -flto=auto -march=i586 -mtune=generic -I/usr/lib/gcc/i586-alt-linux/13/include' -DCMAKE_INSTALL_PREFIX=/usr -DINCLUDE_INSTALL_DIR:PATH=/usr/include -DLIB_INSTALL_DIR:PATH=/usr/lib -DSYSCONF_INSTALL_DIR:PATH=/etc -DSHARE_INSTALL_PREFIX:PATH=/usr/share -DLIB_DESTINATION=lib -DLIB_SUFFIX= -S . -B i586-alt-linux -GNinja -DCMAKE_BUILD_TYPE=RelWithDebInfo -DMKSPECS_INSTALL_DIR=/usr/lib/qt6/mkspecs/modules/ -DPACKAGE_TOOL_INSTALL_DIR=libexec/dtk6/DGui/bin -DCMAKE_INSTALL_LIBDIR=lib -DLIB_INSTALL_DIR=/usr/lib -DLIBRARY_INSTALL_DIR=lib -DDTK_VERSION=6.0.11 -DBUILD_DOCS=OFF
-- The CXX compiler identification is GNU 13.2.1
-- The C compiler identification is GNU 13.2.1
-- Detecting CXX compiler ABI info
-- Detecting CXX compiler ABI info - done
-- Check for working CXX compiler: /usr/bin/c++ - skipped
-- Detecting CXX compile features
-- Detecting CXX compile features - done
-- Detecting C compiler ABI info
-- Detecting C compiler ABI info - done
-- Check for working C compiler: /usr/bin/cc - skipped
-- Detecting C compile features
-- Detecting C compile features - done
-- Current Qt Version: 6
CMake Warning at dtkgui.cmake:21 (find_package):
  By not providing "FindQt6XdgIconLoader.cmake" in CMAKE_MODULE_PATH this
  project has asked CMake to find a package configuration file provided by
  "Qt6XdgIconLoader", but CMake did not find one.

  Could not find a package configuration file provided by "Qt6XdgIconLoader"
  with any of the following names:

    Qt6XdgIconLoaderConfig.cmake
    qt6xdgiconloader-config.cmake

  Add the installation prefix of "Qt6XdgIconLoader" to CMAKE_PREFIX_PATH or
  set "Qt6XdgIconLoader_DIR" to a directory containing one of the above
  files.  If "Qt6XdgIconLoader" provides a separate development package or
  SDK, be sure it has been installed.
Call Stack (most recent call first):
  CMakeLists.txt:20 (include)


CMake Warning at dtkgui.cmake:23 (message):
   XdgIconLoader Not Found, DISABLE LIBXDG !
Call Stack (most recent call first):
  CMakeLists.txt:20 (include)


-- Performing Test CMAKE_HAVE_LIBC_PTHREAD
-- Performing Test CMAKE_HAVE_LIBC_PTHREAD - Success
-- Found Threads: TRUE
-- Found OpenGL: /usr/lib/libOpenGL.so
-- Found WrapOpenGL: TRUE
-- Found XKB: /usr/lib/libxkbcommon.so (found suitable version "1.7.0", minimum required is "0.5.0")
-- Found WrapVulkanHeaders: /usr/include
-- Performing Test HAVE_STDATOMIC
-- Performing Test HAVE_STDATOMIC - Success
-- Found WrapAtomic: TRUE
-- Found PkgConfig: /usr/bin/pkg-config (found version "0.29.2")
-- Checking for module 'librsvg-2.0'
--   Found librsvg-2.0, version 2.58.91
Package bzip2 was not found in the pkg-config search path.
Perhaps you should add the directory containing `bzip2.pc'
to the PKG_CONFIG_PATH environment variable
Package 'bzip2', required by 'freetype2', not found
Package bzip2 was not found in the pkg-config search path.
Perhaps you should add the directory containing `bzip2.pc'
to the PKG_CONFIG_PATH environment variable
Package 'bzip2', required by 'freetype2', not found
Package bzip2 was not found in the pkg-config search path.
Perhaps you should add the directory containing `bzip2.pc'
to the PKG_CONFIG_PATH environment variable
Package 'bzip2', required by 'freetype2', not found
Package bzip2 was not found in the pkg-config search path.
Perhaps you should add the directory containing `bzip2.pc'
to the PKG_CONFIG_PATH environment variable
Package 'bzip2', required by 'freetype2', not found
-- Found FreeImage: /usr/lib/libfreeimage.so
-- Checking for module 'libraw'
--   Found libraw, version 0.21.2
Disable libxdg!
Support extended image format!
Enable librsvg!
-- Checking for module 'x11'
--   Found x11, version 1.8.8
Package xdmcp was not found in the pkg-config search path.
Perhaps you should add the directory containing `xdmcp.pc'
to the PKG_CONFIG_PATH environment variable
Package 'xdmcp', required by 'xcb', not found
Package xdmcp was not found in the pkg-config search path.
Perhaps you should add the directory containing `xdmcp.pc'
to the PKG_CONFIG_PATH environment variable
Package 'xdmcp', required by 'xcb', not found
Package xdmcp was not found in the pkg-config search path.
Perhaps you should add the directory containing `xdmcp.pc'
to the PKG_CONFIG_PATH environment variable
Package 'xdmcp', required by 'xcb', not found
Package xdmcp was not found in the pkg-config search path.
Perhaps you should add the directory containing `xdmcp.pc'
to the PKG_CONFIG_PATH environment variable
Package 'xdmcp', required by 'xcb', not found
-- Configuring done (1.5s)
-- Generating done (0.0s)
CMake Warning:
  Manually-specified variables were not used by the project:

    CMAKE_Fortran_FLAGS
    LIB_DESTINATION
    LIB_SUFFIX
    SHARE_INSTALL_PREFIX
    SYSCONF_INSTALL_DIR


-- Build files have been written to: /usr/src/RPM/BUILD/dtk6gui-6.0.11/i586-alt-linux
+ cmake --build i586-alt-linux -j8
[1/68] Automatic MOC for target dde-kwin-bug6
[2/68] Automatic MOC for target dci-image-converter6
[3/68] Building CXX object tools/dde-kwin-debug/CMakeFiles/dde-kwin-bug6.dir/dde-kwin-bug6_autogen/mocs_compilation.cpp.o
[4/68] Building CXX object tools/dci-image-converter/CMakeFiles/dci-image-converter6.dir/dci-image-converter6_autogen/mocs_compilation.cpp.o
[5/68] Automatic MOC for target dtk6gui
[6/68] Building CXX object tools/dde-kwin-debug/CMakeFiles/dde-kwin-bug6.dir/main.cpp.o
/usr/src/RPM/BUILD/dtk6gui-6.0.11/tools/dde-kwin-debug/main.cpp: In function 'int exec(const char*)':
/usr/src/RPM/BUILD/dtk6gui-6.0.11/tools/dde-kwin-debug/main.cpp:73:49: warning: format '%lu' expects argument of type 'long unsigned int', but argument 3 has type 'long long unsigned int' [-Wformat=]
   73 |     sprintf(env, "D_KWIN_DEBUG_APP_START_TIME=%lu", time);
      |                                               ~~^   ~~~~
      |                                                 |   |
      |                                                 |   long long unsigned int
      |                                                 long unsigned int
      |                                               %llu
/usr/src/RPM/BUILD/dtk6gui-6.0.11/tools/dde-kwin-debug/main.cpp: In function 'int main(int, char**)':
/usr/src/RPM/BUILD/dtk6gui-6.0.11/tools/dde-kwin-debug/main.cpp:382:29: warning: format '%ld' expects argument of type 'long int*', but argument 3 has type 'int64_t*' {aka 'long long int*'} [-Wformat=]
  382 |         sscanf(time_env, "%ld", &kwin_start_time);
      |                           ~~^   ~~~~~~~~~~~~~~~~
      |                             |   |
      |                             |   int64_t* {aka long long int*}
      |                             long int*
      |                           %lld
/usr/src/RPM/BUILD/dtk6gui-6.0.11/tools/dde-kwin-debug/main.cpp: In function 'int exec(const char*)':
/usr/src/RPM/BUILD/dtk6gui-6.0.11/tools/dde-kwin-debug/main.cpp:95:13: warning: ignoring return value of 'int system(const char*)' declared with attribute 'warn_unused_result' [-Wunused-result]
   95 |       system(clearCache.c_str());
      |       ~~~~~~^~~~~~~~~~~~~~~~~~~~
/usr/src/RPM/BUILD/dtk6gui-6.0.11/tools/dde-kwin-debug/main.cpp: In function 'bool checkPid(__pid_t)':
/usr/src/RPM/BUILD/dtk6gui-6.0.11/tools/dde-kwin-debug/main.cpp:119:17: warning: ignoring return value of 'ssize_t readlink(const char*, char*, size_t)' declared with attribute 'warn_unused_result' [-Wunused-result]
  119 |         readlink(status, exe_path, 100);
      |         ~~~~~~~~^~~~~~~~~~~~~~~~~~~~~~~
/usr/src/RPM/BUILD/dtk6gui-6.0.11/tools/dde-kwin-debug/main.cpp:132:14: warning: ignoring return value of 'size_t fread(void*, size_t, size_t, FILE*)' declared with attribute 'warn_unused_result' [-Wunused-result]
  132 |         fread(data, sizeof(char), 1024, file);
      |         ~~~~~^~~~~~~~~~~~~~~~~~~~~~~~~~~~~~~~
/usr/src/RPM/BUILD/dtk6gui-6.0.11/tools/dde-kwin-debug/main.cpp: In function 'void processXEvent()':
/usr/src/RPM/BUILD/dtk6gui-6.0.11/tools/dde-kwin-debug/main.cpp:287:31: warning: ignoring return value of 'int system(const char*)' declared with attribute 'warn_unused_result' [-Wunused-result]
  287 |                         system(command);
      |                         ~~~~~~^~~~~~~~~
[7/68] Automatic RCC for util/icons/deepin-theme-plugin-icons.qrc
[8/68] Linking CXX executable tools/dde-kwin-debug/dde-kwin-bug
[9/68] Building CXX object src/CMakeFiles/dtk6gui.dir/filedrag/dfiledrag.cpp.o
[10/68] Building CXX object tools/dci-image-converter/CMakeFiles/dci-image-converter6.dir/main.cpp.o
[11/68] Building CXX object src/CMakeFiles/dtk6gui.dir/filedrag/dfiledragclient.cpp.o
[12/68] Building CXX object src/CMakeFiles/dtk6gui.dir/filedrag/dfiledragserver.cpp.o
[13/68] Building CXX object src/CMakeFiles/dtk6gui.dir/kernel/dforeignwindow.cpp.o
[14/68] Building CXX object src/CMakeFiles/dtk6gui.dir/dbus/xeventmonitor_interface.cpp.o
[15/68] Building CXX object src/CMakeFiles/dtk6gui.dir/kernel/dnativesettings.cpp.o
[16/68] Building CXX object src/CMakeFiles/dtk6gui.dir/kernel/dpalette.cpp.o
[17/68] Building CXX object src/CMakeFiles/dtk6gui.dir/kernel/dguiapplicationhelper.cpp.o
/usr/src/RPM/BUILD/dtk6gui-6.0.11/src/kernel/dguiapplicationhelper.cpp: In member function 'void Dtk::Gui::DGuiApplicationHelperPrivate::initApplication(QGuiApplication*)':
/usr/src/RPM/BUILD/dtk6gui-6.0.11/src/kernel/dguiapplicationhelper.cpp:271:39: warning: 'void QGuiApplication::paletteChanged(const QPalette&)' is deprecated: Handle QEvent::ApplicationPaletteChange instead [-Wdeprecated-declarations]
  271 |     q->connect(app, &QGuiApplication::paletteChanged, q, [this] {
      |                                       ^~~~~~~~~~~~~~
In file included from /usr/include/qt6/QtGui/QGuiApplication:1,
                 from /usr/src/RPM/BUILD/dtk6gui-6.0.11/include/kernel/dguiapplicationhelper.h:12,
                 from /usr/src/RPM/BUILD/dtk6gui-6.0.11/src/kernel/dguiapplicationhelper.cpp:5:
/usr/include/qt6/QtGui/qguiapplication.h:161:89: note: declared here
  161 |     QT_DEPRECATED_VERSION_X_6_0("Handle QEvent::ApplicationPaletteChange instead") void paletteChanged(const QPalette &pal);
      |                                                                                         ^~~~~~~~~~~~~~
/usr/src/RPM/BUILD/dtk6gui-6.0.11/src/kernel/dguiapplicationhelper.cpp: In static member function 'static bool Dtk::Gui::DGuiApplicationHelper::loadTranslator(const QString&, const QList<QString>&, const QList<QLocale>&)':
/usr/src/RPM/BUILD/dtk6gui-6.0.11/src/kernel/dguiapplicationhelper.cpp:1639:37: warning: ignoring return value of 'bool QTranslator::load(const QString&, const QString&, const QString&, const QString&)', declared with attribute 'nodiscard' [-Wunused-result]
 1639 |                     translator->load(translatePath);
      |                     ~~~~~~~~~~~~~~~~^~~~~~~~~~~~~~~
In file included from /usr/include/qt6/QtCore/6.6.2/QtCore/private/qcoreapplication_p.h:23,
                 from /usr/include/qt6/QtGui/6.6.2/QtGui/private/qguiapplication_p.h:24,
                 from /usr/src/RPM/BUILD/dtk6gui-6.0.11/src/kernel/dguiapplicationhelper.cpp:54:
/usr/include/qt6/QtCore/qtranslator.h:33:24: note: declared here
   33 |     [[nodiscard]] bool load(const QString & filename,
      |                        ^~~~
[18/68] Building CXX object src/CMakeFiles/dtk6gui.dir/kernel/dplatformhandle.cpp.o
[19/68] Building CXX object src/CMakeFiles/dtk6gui.dir/dtk6gui_autogen/mocs_compilation.cpp.o
[20/68] Building CXX object src/CMakeFiles/dtk6gui.dir/kernel/dplatformtheme.cpp.o
/usr/src/RPM/BUILD/dtk6gui-6.0.11/src/kernel/dplatformtheme.cpp: In member function 'void Dtk::Gui::DPlatformTheme::setPalette(const Dtk::Gui::DPalette&)':
/usr/src/RPM/BUILD/dtk6gui-6.0.11/src/kernel/dplatformtheme.cpp:299:49: warning: unused parameter 'palette' [-Wunused-parameter]
  299 | void DPlatformTheme::setPalette(const DPalette &palette)
      |                                 ~~~~~~~~~~~~~~~~^~~~~~~
[21/68] Building CXX object src/CMakeFiles/dtk6gui.dir/kernel/dwindowmanagerhelper.cpp.o
[22/68] Building CXX object src/CMakeFiles/dtk6gui.dir/kernel/dregionmonitor.cpp.o
[23/68] Building CXX object src/CMakeFiles/dtk6gui.dir/kernel/dwindowgroupleader.cpp.o
[24/68] Building CXX object src/CMakeFiles/dtk6gui.dir/util/ddciiconpalette.cpp.o
[25/68] Building CXX object src/CMakeFiles/dtk6gui.dir/util/dfontmanager.cpp.o
[26/68] Building CXX object src/CMakeFiles/dtk6gui.dir/util/ddciiconplayer.cpp.o
/usr/src/RPM/BUILD/dtk6gui-6.0.11/src/util/ddciiconplayer.cpp: In member function 'bool Dtk::Gui::DDciIconImagePlayer::setPalette(const Dtk::Gui::DDciIconPalette&)':
/usr/src/RPM/BUILD/dtk6gui-6.0.11/src/util/ddciiconplayer.cpp:210:34: warning: 'constexpr typename std::add_const<_Tp>::type& qAsConst(T&) [with T = QList<Dtk::Gui::DDciIconImage>; typename std::add_const<_Tp>::type = const QList<Dtk::Gui::DDciIconImage>]' is deprecated: Use std::as_const() instead. [-Wdeprecated-declarations]
  210 |     for (const auto &i : qAsConst(d->images))
      |                          ~~~~~~~~^~~~~~~~~~~
In file included from /usr/include/qt6/QtCore/qforeach.h:11,
                 from /usr/include/qt6/QtCore/qglobal.h:57,
                 from /usr/include/dtk6/DCore/dtkcore_global.h:7,
                 from /usr/src/RPM/BUILD/dtk6gui-6.0.11/include/global/dtkgui_global.h:10,
                 from /usr/src/RPM/BUILD/dtk6gui-6.0.11/include/util/ddciiconplayer.h:6,
                 from /usr/src/RPM/BUILD/dtk6gui-6.0.11/src/util/ddciiconplayer.cpp:5:
/usr/include/qt6/QtCore/qttypetraits.h:33:45: note: declared here
   33 | constexpr typename std::add_const<T>::type &qAsConst(T &t) noexcept { return t; }
      |                                             ^~~~~~~~
[27/68] Building CXX object src/CMakeFiles/dtk6gui.dir/util/ddesktopservices_linux.cpp.o
[28/68] Building CXX object src/CMakeFiles/dtk6gui.dir/util/dicon.cpp.o
[29/68] Building CXX object src/CMakeFiles/dtk6gui.dir/util/dimagehandler.cpp.o
[30/68] Building CXX object src/CMakeFiles/dtk6gui.dir/util/dimagehandlerlibs.cpp.o
[31/68] Building CXX object src/CMakeFiles/dtk6gui.dir/util/dicontheme.cpp.o
/usr/src/RPM/BUILD/dtk6gui-6.0.11/src/util/dicontheme.cpp: In function 'bool Dtk::Gui::DIconTheme::isXdgIcon(const QIcon&)':
/usr/src/RPM/BUILD/dtk6gui-6.0.11/src/util/dicontheme.cpp:126:41: warning: unused parameter 'icon' [-Wunused-parameter]
  126 | bool DIconTheme::isXdgIcon(const QIcon &icon)
      |                            ~~~~~~~~~~~~~^~~~
[32/68] Building CXX object src/CMakeFiles/dtk6gui.dir/util/ddciicon.cpp.o
/usr/src/RPM/BUILD/dtk6gui-6.0.11/src/util/ddciicon.cpp: In function 'const Dtk::Gui::DDciIconEntry::ScalableLayer& Dtk::Gui::findScalableLayer(const DDciIconEntry*, qreal)':
/usr/src/RPM/BUILD/dtk6gui-6.0.11/src/util/ddciicon.cpp:659:34: warning: 'constexpr typename std::add_const<_Tp>::type& qAsConst(T&) [with T = const QList<Dtk::Gui::DDciIconEntry::ScalableLayer>; typename std::add_const<_Tp>::type = const QList<Dtk::Gui::DDciIconEntry::ScalableLayer>]' is deprecated: Use std::as_const() instead. [-Wdeprecated-declarations]
  659 |     for (const auto &i : qAsConst(entry->scalableLayers)) {
      |                          ~~~~~~~~^~~~~~~~~~~~~~~~~~~~~~~
In file included from /usr/include/qt6/QtCore/qforeach.h:11,
                 from /usr/include/qt6/QtCore/qglobal.h:57,
                 from /usr/include/dtk6/DCore/dtkcore_global.h:7,
                 from /usr/src/RPM/BUILD/dtk6gui-6.0.11/include/global/dtkgui_global.h:10,
                 from /usr/src/RPM/BUILD/dtk6gui-6.0.11/include/util/ddciiconpalette.h:8,
                 from /usr/src/RPM/BUILD/dtk6gui-6.0.11/include/util/ddciicon.h:6,
                 from /usr/src/RPM/BUILD/dtk6gui-6.0.11/src/util/ddciicon.cpp:5:
/usr/include/qt6/QtCore/qttypetraits.h:33:45: note: declared here
   33 | constexpr typename std::add_const<T>::type &qAsConst(T &t) noexcept { return t; }
      |                                             ^~~~~~~~
/usr/src/RPM/BUILD/dtk6gui-6.0.11/src/util/ddciicon.cpp: In member function 'void Dtk::Gui::DDciIconImagePrivate::init()':
/usr/src/RPM/BUILD/dtk6gui-6.0.11/src/util/ddciicon.cpp:1138:38: warning: 'constexpr typename std::add_const<_Tp>::type& qAsConst(T&) [with T = const QList<Dtk::Gui::DDciIconEntry::ScalableLayer::Layer>; typename std::add_const<_Tp>::type = const QList<Dtk::Gui::DDciIconEntry::ScalableLayer::Layer>]' is deprecated: Use std::as_const() instead. [-Wdeprecated-declarations]
 1138 |     for (const auto &layer : qAsConst(layers)) {
      |                              ~~~~~~~~^~~~~~~~
/usr/include/qt6/QtCore/qttypetraits.h:33:45: note: declared here
   33 | constexpr typename std::add_const<T>::type &qAsConst(T &t) noexcept { return t; }
      |                                             ^~~~~~~~
[33/68] Building CXX object src/CMakeFiles/dtk6gui.dir/dtk6gui_autogen/J56SQPRNRA/qrc_deepin-theme-plugin-icons.cpp.o
[34/68] Linking CXX executable tools/dci-image-converter/dci-image-converter
[35/68] Building CXX object src/CMakeFiles/dtk6gui.dir/util/dtaskbarcontrol.cpp.o
[36/68] Building CXX object src/CMakeFiles/dtk6gui.dir/util/dsvgrenderer.cpp.o
[37/68] Building CXX object src/CMakeFiles/dtk6gui.dir/util/dthumbnailprovider.cpp.o
[38/68] Building CXX object src/CMakeFiles/dtk6gui.dir/util/private/dciiconengine.cpp.o
[39/68] Building CXX object src/CMakeFiles/dtk6gui.dir/util/private/dbuiltiniconengine.cpp.o
[40/68] Building CXX object src/CMakeFiles/dtk6gui.dir/util/private/diconproxyengine.cpp.o
[41/68] Linking CXX shared library src/libdtk6gui.so.6.0.11
/usr/src/RPM/BUILD/dtk6gui-6.0.11/src/private/dfiledragserver_p.h:20:7: warning: type 'struct DFileDragServerPrivate' violates the C++ One Definition Rule [-Wodr]
   20 | class DFileDragServerPrivate : public DCORE_NAMESPACE::DObjectPrivate
      |       ^
/usr/src/RPM/BUILD/dtk6gui-6.0.11/src/filedrag/dfiledragserver.cpp:27:7: note: a different type is defined in another translation unit
   27 | class DFileDragServerPrivate : public DCORE_NAMESPACE::DObjectPrivate
      |       ^
/usr/src/RPM/BUILD/dtk6gui-6.0.11/src/filedrag/dfiledragserver.cpp:37:41: note: the first difference of corresponding definitions is field 'dbusif'
   37 |     QSharedPointer<DDndSourceInterface> dbusif;
      |                                         ^
/usr/src/RPM/BUILD/dtk6gui-6.0.11/src/filedrag/dfiledragserver.cpp:27:7: note: a type with different number of fields is defined in another translation unit
   27 | class DFileDragServerPrivate : public DCORE_NAMESPACE::DObjectPrivate
      |       ^
/usr/src/RPM/BUILD/dtk6gui-6.0.11/src/private/dfiledragserver_p.h:28:10: warning: type of 'writeMimeData' does not match original declaration [-Wlto-type-mismatch]
   28 |     void writeMimeData(QMimeData *dest);
      |          ^
/usr/src/RPM/BUILD/dtk6gui-6.0.11/src/filedrag/dfiledragserver.cpp:171:6: note: 'writeMimeData' was previously declared here
  171 | void DFileDragServerPrivate::writeMimeData(QMimeData *dest)
      |      ^
[42/68] Creating library symlink src/libdtk6gui.so.6 src/libdtk6gui.so
[43/68] Automatic MOC for target dci-icon-theme6
[44/68] Automatic MOC for target deepin-gui-settings6
[45/68] Automatic MOC for target image-handler6
[46/68] Automatic MOC for target animation-dci6
[47/68] Building CXX object tools/dci-icon-theme/CMakeFiles/dci-icon-theme6.dir/dci-icon-theme6_autogen/mocs_compilation.cpp.o
[48/68] Building CXX object tools/deepin-gui-settings/CMakeFiles/deepin-gui-settings6.dir/deepin-gui-settings6_autogen/mocs_compilation.cpp.o
[49/68] Building CXX object tools/image-handler/CMakeFiles/image-handler6.dir/image-handler6_autogen/mocs_compilation.cpp.o
[50/68] Automatic RCC for test_dci_icon.qrc
[51/68] Building CXX object examples/animation-dci/CMakeFiles/animation-dci6.dir/animation-dci6_autogen/mocs_compilation.cpp.o
[52/68] Building CXX object examples/animation-dci/CMakeFiles/animation-dci6.dir/animation-dci6_autogen/EWIEGA46WW/qrc_test_dci_icon.cpp.o
[53/68] Automatic MOC for target dnd-test-client6
[54/68] Building CXX object examples/dnd-example/CMakeFiles/dnd-test-client6.dir/dnd-test-client6_autogen/mocs_compilation.cpp.o
[55/68] Automatic MOC for target dnd-test-server6
[56/68] Building CXX object examples/dnd-example/CMakeFiles/dnd-test-server6.dir/dnd-test-server6_autogen/mocs_compilation.cpp.o
[57/68] Building CXX object tools/deepin-gui-settings/CMakeFiles/deepin-gui-settings6.dir/main.cpp.o
[58/68] Building CXX object tools/image-handler/CMakeFiles/image-handler6.dir/main.cpp.o
[59/68] Building CXX object examples/animation-dci/CMakeFiles/animation-dci6.dir/main.cpp.o
[60/68] Building CXX object examples/dnd-example/CMakeFiles/dnd-test-client6.dir/dnd-test-client.cpp.o
[61/68] Building CXX object examples/dnd-example/CMakeFiles/dnd-test-server6.dir/dnd-test-server.cpp.o
[62/68] Building CXX object tools/dci-icon-theme/CMakeFiles/dci-icon-theme6.dir/main.cpp.o
/usr/src/RPM/BUILD/dtk6gui-6.0.11/tools/dci-icon-theme/main.cpp: In function 'int main(int, char**)':
/usr/src/RPM/BUILD/dtk6gui-6.0.11/tools/dci-icon-theme/main.cpp:333:35: warning: 'constexpr typename std::add_const<_Tp>::type& qAsConst(T&) [with T = const QList<QString>; typename std::add_const<_Tp>::type = const QList<QString>]' is deprecated: Use std::as_const() instead. [-Wdeprecated-declarations]
  333 |     for (const auto &sd : qAsConst(sourceDirectory)) {
      |                           ~~~~~~~~^~~~~~~~~~~~~~~~~
In file included from /usr/include/qt6/QtCore/qforeach.h:11,
                 from /usr/include/qt6/QtCore/qglobal.h:57,
                 from /usr/include/qt6/QtGui/qtguiglobal.h:7,
                 from /usr/include/qt6/QtGui/qguiapplication.h:7,
                 from /usr/include/qt6/QtGui/QGuiApplication:1,
                 from /usr/src/RPM/BUILD/dtk6gui-6.0.11/tools/dci-icon-theme/main.cpp:5:
/usr/include/qt6/QtCore/qttypetraits.h:33:45: note: declared here
   33 | constexpr typename std::add_const<T>::type &qAsConst(T &t) noexcept { return t; }
      |                                             ^~~~~~~~
[63/68] Linking CXX executable tools/deepin-gui-settings/deepin-gui-settings
[64/68] Linking CXX executable examples/animation-dci/animation-dci6
[65/68] Linking CXX executable examples/dnd-example/dnd-test-client
[66/68] Linking CXX executable tools/image-handler/image-handler
[67/68] Linking CXX executable examples/dnd-example/dnd-test-server
[68/68] Linking CXX executable tools/dci-icon-theme/dci-icon-theme
+ exit 0
Executing(%install): /bin/sh -e /usr/src/tmp/rpm-tmp.80944
+ umask 022
+ /bin/mkdir -p /usr/src/RPM/BUILD
+ cd /usr/src/RPM/BUILD
+ /bin/chmod -Rf u+rwX -- /usr/src/tmp/dtk6gui-buildroot
+ :
+ /bin/rm -rf -- /usr/src/tmp/dtk6gui-buildroot
+ PATH=/usr/libexec/rpm-build:/usr/src/bin:/usr/bin:/bin:/usr/local/bin:/usr/games
+ cd dtk6gui-6.0.11
+ DESTDIR=/usr/src/tmp/dtk6gui-buildroot
+ cmake --install i586-alt-linux --verbose
-- Install configuration: "RelWithDebInfo"
-- Installing: /usr/src/tmp/dtk6gui-buildroot/usr/lib/cmake/Dtk6Gui/Dtk6GuiConfig.cmake
-- Installing: /usr/src/tmp/dtk6gui-buildroot/usr/lib/cmake/Dtk6Gui/Dtk6GuiConfigVersion.cmake
-- Installing: /usr/src/tmp/dtk6gui-buildroot/usr/lib/pkgconfig/dtk6gui.pc
-- Installing: /usr/src/tmp/dtk6gui-buildroot/usr/lib/qt6/mkspecs/modules/qt_lib_dtkgui.pri
-- Installing: /usr/src/tmp/dtk6gui-buildroot/usr/include/dtk6/DGui/DtkGuis
-- Installing: /usr/src/tmp/dtk6gui-buildroot/usr/lib/libdtk6gui.so.6.0.11
-- Installing: /usr/src/tmp/dtk6gui-buildroot/usr/lib/libdtk6gui.so.6
-- Installing: /usr/src/tmp/dtk6gui-buildroot/usr/lib/libdtk6gui.so
-- Installing: /usr/src/tmp/dtk6gui-buildroot/usr/lib/cmake/Dtk6Gui/Dtk6GuiTargets.cmake
-- Installing: /usr/src/tmp/dtk6gui-buildroot/usr/lib/cmake/Dtk6Gui/Dtk6GuiTargets-relwithdebinfo.cmake
-- Up-to-date: /usr/src/tmp/dtk6gui-buildroot/usr/include/dtk6/DGui
-- Installing: /usr/src/tmp/dtk6gui-buildroot/usr/include/dtk6/DGui/dthumbnailprovider.h
-- Installing: /usr/src/tmp/dtk6gui-buildroot/usr/include/dtk6/DGui/dtaskbarcontrol.h
-- Installing: /usr/src/tmp/dtk6gui-buildroot/usr/include/dtk6/DGui/dsvgrenderer.h
-- Installing: /usr/src/tmp/dtk6gui-buildroot/usr/include/dtk6/DGui/dimagehandler.h
-- Installing: /usr/src/tmp/dtk6gui-buildroot/usr/include/dtk6/DGui/dicontheme.h
-- Installing: /usr/src/tmp/dtk6gui-buildroot/usr/include/dtk6/DGui/dicon.h
-- Installing: /usr/src/tmp/dtk6gui-buildroot/usr/include/dtk6/DGui/dfontmanager.h
-- Installing: /usr/src/tmp/dtk6gui-buildroot/usr/include/dtk6/DGui/ddesktopservices.h
-- Installing: /usr/src/tmp/dtk6gui-buildroot/usr/include/dtk6/DGui/ddciiconplayer.h
-- Installing: /usr/src/tmp/dtk6gui-buildroot/usr/include/dtk6/DGui/ddciiconpalette.h
-- Installing: /usr/src/tmp/dtk6gui-buildroot/usr/include/dtk6/DGui/ddciicon.h
-- Up-to-date: /usr/src/tmp/dtk6gui-buildroot/usr/include/dtk6/DGui
-- Installing: /usr/src/tmp/dtk6gui-buildroot/usr/include/dtk6/DGui/DWindowManagerHelper
-- Installing: /usr/src/tmp/dtk6gui-buildroot/usr/include/dtk6/DGui/DWindowGroupLeader
-- Installing: /usr/src/tmp/dtk6gui-buildroot/usr/include/dtk6/DGui/DThumbnailProvider
-- Installing: /usr/src/tmp/dtk6gui-buildroot/usr/include/dtk6/DGui/DTaskbarControl
-- Installing: /usr/src/tmp/dtk6gui-buildroot/usr/include/dtk6/DGui/DSvgRenderer
-- Installing: /usr/src/tmp/dtk6gui-buildroot/usr/include/dtk6/DGui/DRegionMonitor
-- Installing: /usr/src/tmp/dtk6gui-buildroot/usr/include/dtk6/DGui/DPlatformTheme
-- Installing: /usr/src/tmp/dtk6gui-buildroot/usr/include/dtk6/DGui/DPlatformHandle
-- Installing: /usr/src/tmp/dtk6gui-buildroot/usr/include/dtk6/DGui/DPalette
-- Installing: /usr/src/tmp/dtk6gui-buildroot/usr/include/dtk6/DGui/DNativeSettings
-- Installing: /usr/src/tmp/dtk6gui-buildroot/usr/include/dtk6/DGui/DImageHandler
-- Installing: /usr/src/tmp/dtk6gui-buildroot/usr/include/dtk6/DGui/DIconTheme
-- Installing: /usr/src/tmp/dtk6gui-buildroot/usr/include/dtk6/DGui/DIcon
-- Installing: /usr/src/tmp/dtk6gui-buildroot/usr/include/dtk6/DGui/DGuiApplicationHelper
-- Installing: /usr/src/tmp/dtk6gui-buildroot/usr/include/dtk6/DGui/DForeignWindow
-- Installing: /usr/src/tmp/dtk6gui-buildroot/usr/include/dtk6/DGui/DFontManager
-- Installing: /usr/src/tmp/dtk6gui-buildroot/usr/include/dtk6/DGui/DFileDragServer
-- Installing: /usr/src/tmp/dtk6gui-buildroot/usr/include/dtk6/DGui/DFileDragClient
-- Installing: /usr/src/tmp/dtk6gui-buildroot/usr/include/dtk6/DGui/DFileDrag
-- Installing: /usr/src/tmp/dtk6gui-buildroot/usr/include/dtk6/DGui/DDesktopServices
-- Installing: /usr/src/tmp/dtk6gui-buildroot/usr/include/dtk6/DGui/DDciIconPlayer
-- Installing: /usr/src/tmp/dtk6gui-buildroot/usr/include/dtk6/DGui/DDciIconPalette
-- Installing: /usr/src/tmp/dtk6gui-buildroot/usr/include/dtk6/DGui/DDciIconImagePlayer
-- Installing: /usr/src/tmp/dtk6gui-buildroot/usr/include/dtk6/DGui/DDciIcon
-- Up-to-date: /usr/src/tmp/dtk6gui-buildroot/usr/include/dtk6/DGui
-- Installing: /usr/src/tmp/dtk6gui-buildroot/usr/include/dtk6/DGui/dtkgui_config.h
-- Installing: /usr/src/tmp/dtk6gui-buildroot/usr/include/dtk6/DGui/dtkgui_global.h
-- Up-to-date: /usr/src/tmp/dtk6gui-buildroot/usr/include/dtk6/DGui
-- Installing: /usr/src/tmp/dtk6gui-buildroot/usr/include/dtk6/DGui/dwindowmanagerhelper.h
-- Installing: /usr/src/tmp/dtk6gui-buildroot/usr/include/dtk6/DGui/dwindowgroupleader.h
-- Installing: /usr/src/tmp/dtk6gui-buildroot/usr/include/dtk6/DGui/dregionmonitor.h
-- Installing: /usr/src/tmp/dtk6gui-buildroot/usr/include/dtk6/DGui/dplatformtheme.h
-- Installing: /usr/src/tmp/dtk6gui-buildroot/usr/include/dtk6/DGui/dplatformhandle.h
-- Installing: /usr/src/tmp/dtk6gui-buildroot/usr/include/dtk6/DGui/dpalette.h
-- Installing: /usr/src/tmp/dtk6gui-buildroot/usr/include/dtk6/DGui/dnativesettings.h
-- Installing: /usr/src/tmp/dtk6gui-buildroot/usr/include/dtk6/DGui/dguiapplicationhelper.h
-- Installing: /usr/src/tmp/dtk6gui-buildroot/usr/include/dtk6/DGui/dforeignwindow.h
-- Up-to-date: /usr/src/tmp/dtk6gui-buildroot/usr/include/dtk6/DGui
-- Installing: /usr/src/tmp/dtk6gui-buildroot/usr/include/dtk6/DGui/dfiledragserver.h
-- Installing: /usr/src/tmp/dtk6gui-buildroot/usr/include/dtk6/DGui/dfiledragcommon.h
-- Installing: /usr/src/tmp/dtk6gui-buildroot/usr/include/dtk6/DGui/dfiledragclient.h
-- Installing: /usr/src/tmp/dtk6gui-buildroot/usr/include/dtk6/DGui/dfiledrag.h
-- Installing: /usr/src/tmp/dtk6gui-buildroot/usr/libexec/dtk6/DGui/bin/deepin-gui-settings
-- Set non-toolchain portion of runtime path of "/usr/src/tmp/dtk6gui-buildroot/usr/libexec/dtk6/DGui/bin/deepin-gui-settings" to ""
-- Installing: /usr/src/tmp/dtk6gui-buildroot/usr/libexec/dtk6/DGui/bin/dci-icon-theme
-- Set non-toolchain portion of runtime path of "/usr/src/tmp/dtk6gui-buildroot/usr/libexec/dtk6/DGui/bin/dci-icon-theme" to ""
-- Installing: /usr/src/tmp/dtk6gui-buildroot/usr/libexec/dtk6/DGui/bin/dde-kwin-bug
-- Installing: /usr/src/tmp/dtk6gui-buildroot/usr/libexec/dtk6/DGui/bin/dnd-test-client
-- Set non-toolchain portion of runtime path of "/usr/src/tmp/dtk6gui-buildroot/usr/libexec/dtk6/DGui/bin/dnd-test-client" to ""
-- Installing: /usr/src/tmp/dtk6gui-buildroot/usr/libexec/dtk6/DGui/bin/dnd-test-server
-- Set non-toolchain portion of runtime path of "/usr/src/tmp/dtk6gui-buildroot/usr/libexec/dtk6/DGui/bin/dnd-test-server" to ""
+ /usr/lib/rpm/brp-alt
Cleaning files in /usr/src/tmp/dtk6gui-buildroot (auto)
mode of './usr/lib/libdtk6gui.so.6.0.11' changed from 0755 (rwxr-xr-x) to 0644 (rw-r--r--)
Verifying and fixing files in /usr/src/tmp/dtk6gui-buildroot (binconfig,pkgconfig,libtool,desktop,gnuconfig)
/usr/lib/pkgconfig/dtk6gui.pc: Libs: '-L${libdir} -ldtk6gui' --> '-ldtk6gui'
Checking contents of files in /usr/src/tmp/dtk6gui-buildroot/ (default)
Compressing files in /usr/src/tmp/dtk6gui-buildroot (auto)
Adjusting library links in /usr/src/tmp/dtk6gui-buildroot
./usr/lib: (from <cmdline>:0)
	libdtk6gui.so.6 -> libdtk6gui.so.6.0.11
Verifying ELF objects in /usr/src/tmp/dtk6gui-buildroot (arch=normal,fhs=normal,lfs=relaxed,lint=relaxed,rpath=normal,stack=normal,textrel=normal,unresolved=normal)
verify-elf: WARNING: ./usr/libexec/dtk6/DGui/bin/dde-kwin-bug: uses non-LFS functions: fopen
Splitting links to aliased files under /{,s}bin in /usr/src/tmp/dtk6gui-buildroot
Processing files: dtk6gui-6.0.11-alt1
Executing(%doc): /bin/sh -e /usr/src/tmp/rpm-tmp.95006
+ umask 022
+ /bin/mkdir -p /usr/src/RPM/BUILD
+ cd /usr/src/RPM/BUILD
+ cd dtk6gui-6.0.11
+ DOCDIR=/usr/src/tmp/dtk6gui-buildroot/usr/share/doc/dtk6gui-6.0.11
+ export DOCDIR
+ rm -rf /usr/src/tmp/dtk6gui-buildroot/usr/share/doc/dtk6gui-6.0.11
+ /bin/mkdir -p /usr/src/tmp/dtk6gui-buildroot/usr/share/doc/dtk6gui-6.0.11
+ cp -prL README.md LICENSE /usr/src/tmp/dtk6gui-buildroot/usr/share/doc/dtk6gui-6.0.11
+ chmod -R go-w /usr/src/tmp/dtk6gui-buildroot/usr/share/doc/dtk6gui-6.0.11
+ chmod -R a+rX /usr/src/tmp/dtk6gui-buildroot/usr/share/doc/dtk6gui-6.0.11
+ exit 0
Finding Provides (using /usr/lib/rpm/find-provides)
Executing: /bin/sh -e /usr/src/tmp/rpm-tmp.XAuhUi
find-provides: running scripts (alternatives,debuginfo,gir,lib,pam,perl,pkgconfig,python,python3,shell,typelib,vala)
Finding Requires (using /usr/lib/rpm/find-requires)
Executing: /bin/sh -e /usr/src/tmp/rpm-tmp.TbCtkV
find-requires: running scripts (cpp,debuginfo,files,gir-js,gir-python,gir,lib,pam,perl,pkgconfig,pkgconfiglib,python,python3,rpmlib,shebang,shell,static,symlinks,systemd-services,typelib,vala)
Requires: /lib/ld-linux.so.2, libQt6Core.so.6 >= set:qi2w6tymJ1hboz1X0IjZyO2nSgeQrVgQF3wpnWsWMpam52SjT3JMZDcPQyfS3tZmgDBVvpJGo1Zx13fOM0slFkxsZB3oWJiWzT1uSHKFNt1w4GAWQd0dkrkHKaBvNP77AfGdXubRqE2MMgLCyCGXbeQ8Z9xGSwIq7zbB1ugrXY4iL3JU1YtHu8esxsUjl4JTqmJWX1r7Ms9ZsHASI0NLBw53pempiop7U7OcHmHpmZ0HZHiwe05xncJXSlXVeVVmrOpLSkzM4qi6h9YwdzZqZ2EZBDLy63918ZDE4SkYblLslumUL66JmwVtnsQjmcjoGdiNJ3jEmZifz19ZIMdGvHI9fVsYkBdT3DqYoTu09EvIGNKAr3NZn3xmVEbkg31SB6BkA2kgiWNNCjW6F1nNAyplc0Zvl0, libQt6Core.so.6(Qt_6), libQt6Core.so.6(Qt_6.6), libQt6Gui.so.6 >= set:rmZJa8ahxMRN0UtlroZF2EaZJZmttRzOdWa6h9BwTePzDWGIFkSHLr1TPifn0, libQt6Gui.so.6(Qt_6), libQt6Widgets.so.6 >= set:rkMnhwqwKvLdnBqgzsxddIfZllvQa56mGJztR6vW7nohZKZDQ8ZykBsXJrD2zuJ56B43QRiS66lv7DSVMZ69OLQgom8BfyiB5YZogK8dHdgNa3upZxt7oeGFYBQCAfZlg5xUtLjF2sLXe7YYS2CY84nrfZcubZ29suT93kLhc6Y9O3g99DylO6uFu5ifC5yt1nRpCZ5TfXk6fZcKnydy3UHet1OjHs7fZJZ9cQhZAUyN8NiHVyC2aLmLZ9KZ8QLNRZ7fQGgoj9uZGll62dAJdDwN1A4a92PZu69ZqzgQyXzEDLtzV0QEIU1WYmSW2rpw1eFuC5M2a6Z8i5Z042, libQt6Widgets.so.6(Qt_6), libX11.so.6 >= set:okpS1lfrauFZoY9WMsCrA4C2tLaa2v33GBZeQCmZpJM, libc.so.6(GLIBC_2.0), libc.so.6(GLIBC_2.1), libc.so.6(GLIBC_2.1.3), libc.so.6(GLIBC_2.3.4), libc.so.6(GLIBC_2.34), libc.so.6(GLIBC_2.38), libc.so.6(GLIBC_2.4), libdtk6core.so.6 >= set:oklJeXX8485oHbxAUMQZ8WNHNhXOhAiEVyMn9AST1, libdtk6gui.so.6 >= set:oj42leLsjcVbdwx9FSVyxEcEnFAZxZK3bm0hVF5TVhf3OZCgxw8RKupZy2bKuA8NGq9Q3, libgcc_s.so.1(GCC_3.0), libgcc_s.so.1(GCC_3.3.1), libgcc_s.so.1(GLIBC_2.0), libstdc++.so.6(CXXABI_1.3), libstdc++.so.6(CXXABI_1.3.9), libstdc++.so.6(GLIBCXX_3.4), libstdc++.so.6(GLIBCXX_3.4.11), libstdc++.so.6(GLIBCXX_3.4.19), libstdc++.so.6(GLIBCXX_3.4.21), libstdc++.so.6(GLIBCXX_3.4.22), libstdc++.so.6(GLIBCXX_3.4.32), libstdc++.so.6(GLIBCXX_3.4.9), rtld(GNU_HASH)
Requires(rpmlib): rpmlib(SetVersions)
Finding debuginfo files (using /usr/lib/rpm/find-debuginfo-files)
Executing: /bin/sh -e /usr/src/tmp/rpm-tmp.C0jAzg
Creating dtk6gui-debuginfo package
Processing files: libdtk6gui6-6.0.11-alt1
Finding Provides (using /usr/lib/rpm/find-provides)
Executing: /bin/sh -e /usr/src/tmp/rpm-tmp.HfuQjz
find-provides: running scripts (alternatives,debuginfo,gir,lib,pam,perl,pkgconfig,python,python3,shell,typelib,vala)
lib.prov: /usr/src/tmp/dtk6gui-buildroot/usr/lib/libdtk6gui.so.6: 1483 symbols, 21 bpp
warning: hash collision: _ZN9QtPrivate16QMetaTypeForTypeIN3Dtk3Gui14DDciIconPlayerEE4nameE _ZZN9QtPrivate16QMetaTypeForTypeI5QListIjEE10getMoveCtrEvENUlPKNS_18QMetaTypeInterfaceEPvS7_E_4_FUNES6_S7_S7_
Finding Requires (using /usr/lib/rpm/find-requires)
Executing: /bin/sh -e /usr/src/tmp/rpm-tmp.zVtAAF
find-requires: running scripts (cpp,debuginfo,files,gir-js,gir-python,gir,lib,pam,perl,pkgconfig,pkgconfiglib,python,python3,rpmlib,shebang,shell,static,symlinks,systemd-services,typelib,vala)
Provides: libdtk6-gui = 6.0.11-alt1, libdtk6gui.so.6 = set:odFNed7KMIu5vA84212GAoYiJLN3EZj5EUezr8SiVo2JcM6Vy6cYbZauGMLCjZi0tozbTfVmFlmuCqg6hu42cSmPttWpZfGi0VBccALoPZfMVzGiiDVPdnhr78CwcSFE0fMWSZqrRUBZ48XHcOYEqGekEZj3QpC2NkUNQ6YUyJOFUx0qt26Q6Z0g3EvMpliFI53k3qbDYurQBk4Rfs4j9myqPqPdopYiEFDxToQp1tGKr104nCK8zQgXZ21HYgYa90LHZkZ6NStS9bM7dVnwrtX8FSwPTo5OGEuMHg8g7XvsFDbdOfNhpCtx00ZLVDwPFrQcF6VcJGKugdr0GyPrIgL1FizT0apJjLFi4x8ziZjZImN63xp41Qxeo9q7YDcjh8hZHoCvIh3pj7rxxlxmHos7Op6jUxRVWqyXyWoVE4tDihZDunVrmrt0hjxFsyWXr4IHvhyfFnfBGtHJ6Ux3yotcDIsXx8rXUeMnzOZLWPfiehzhbVVz9ZnZ6gKIzFqwNEM9qev0zCiI4hw9INGAbZi4y6gwS9Qt8LJmluQ5LhZnU8lHt4IDIhsbUYsmc1r3AZoFSPWdHuJqXCZ5Ctsve5TZolJpxuJCs7ocafyI6fjDRmzOPQMHCxsyN7iAokEhk1trqw0RBEyOoiWndAN3IxkFRodYAjfS03NuV8cLgbr5MQyuiaeGWYMbEn0qMMzg9POO1vr79eNAjKCoXevvFPRQjIAcHbxoBKE04NPiliRJIZ5vEnkmydZutrkaIkq3bRN95DVpkgrv8qlME4u9QoRNV9dmJegs0s6Z9avIZiQYZ0BDqB8vZbNJp42PpTEF7LfIjGg3T11yq1ZpBZdUFW8QVKK4jeM1t5ngv7RUb4Lp1wV35PyihL7hljWzzHZzDfw3TYSIZKwlw9siVvNIqEgYfeFHb0MX5JRx7TXQEz9DFoM6ywWo9gcO66H5MVq4FlfnvWzXRtlZF48VJ0eHheYo91lASsqrmyFyWdx88qQVL2oJOyHtthF06RrqTYjW9V8OdVB4qjPdPFQI4fwUZBNFHERRzvd3feIkAkZuBozWHFtZu2zLZo9yvBsZ3DLJOG817Do5hFCx3SINZiZvxOrDh6jd0iiLLMtg4HViRmbWQvZ8Sp5K5tDbVKLSYsfY3dMzUntxq3ztMSkWaFG5gEPkVq5QWgjmjCw7bZtdGIs43XVgDVHqWNYqNebIdGZoci8hWyAcwB9V5PJqY1syK6I172oPzAnwinqrHRC6bfhoFz5xQCTz7g2UpBrIo6snXViHm7hDmcWE8c2arm9fteAP25b9FxbFtrbwaIJCwCLhizxhz1H54KmIha3znIVMhG0Y9oN9AWQRqinpMVY3ZHTqCONjmV1TbcbNCsgiiQDeYIYK7pakiWg6k55MWEaMp5TGxiFNvrEdV6HDgSaimYIHYZ1SiTZvO1nL5VCgwBVm2DOpm4gZjv4VdPYF8FA2QovHQdBL7a4a4EzzTSOgnar7AMfuwqdfUlm74VJs3ZxPiVFy7E96ThkDS7KIPqTbDyjhJgzVud67tlWj7LNJmZ684WU07zcDJsZorAMTV9ZkR9QLePzA4u0VZb4pRkV9A7sA8DntHBsXYH2485G0W02wRHb3dD1mcxF3s3wKNzzhUr1ZjIU8HwKDWR8pPh7Qbgt1oQKKOpDM8bH323cqzjPD0tZrT1hXZ6EoNCAuruXzpFnNETThfn45x8wawFt93FLHAuI1wAifCXzFu41itUJ8PgzwjMc5eLYaOwYJK8SDDHC0QnUCXqAYWREUqvMxsb83t566tSXPhAxOcgordlHFDN4GmRVNKVBiOHJV1oscSyxo38RhNl5CjKOyr5J5s2AdWIj2sRMZ5mVEIAjaZ0jI9avyfVHCiWEdiO0rn1v1oSLvuk9f9XbBZ221M1qhMdGX57M3icgg92FYtHACGbb4uysHT2jYaxdUb7ERC3tNK9tfjpKOIhZhl8wDbLIQmLXvXZyw0LrMUPmjmjFcAF2QSsLQUKAvPigFw4oNiCxZFrwopKPDjTNx6jz9Oywmm1v5dFVFUSw1c6vI1g5MkLAgtJwMOInpURlEhXzAKACZhpKTWlrBbqaBzvjS8RGKxdiO8tgcacQj0nd93F6ZC8iYwsW8KVXUjtLVddWQCcLuTlzqSd8xV2ir6N3rI3Tw8uvK4kdZEdxvOlqDU9esqLHPUBMWmXjUoP8o6tXf2PzFj1ZxqpNpvvdYdcZ0w2Hz96ZqcXPZFaDlY26DcYVCVQCqyOoQY57XygkJtGZ4Qjj2qmw2wmlcQWERsZjDlqMZraAk1U4VKVsE7K2qEQrz0zqALuyn6lClM5uZANsZgiC68G2OcQWxdqsFtuEQYIi0pVY5qlUkBazKqMzPu3jSIPVgrzDtL252GwYzXWZybzAU8Vpnu87mITGp5WS6Zms3ggVD6HR3fOtcZgocU7Zf2n0vJDgz9AIQtEWmZs6SsAncjiGRTFOSAPEsuG3dSTd6xdz4Z14WoHm58oasT01W1QiMq8dBc9OW825F2Uy0t4hYAYlEJdDAxvKSK2sYyU6DgM24Z2wmflUbzRB4GvhQdXQHcVTCUhQa6pcGDLcwzYz151CnhNrgjUG9KFOONteuNebLBuSbietZ63KjxAJEogrUzdsUW0FRUrE92HBqM2YNcGNOMNe30UuQ0Ev9j6luBZcWs7fEHk9poGx30RVjNg2Vrue8KtfdEGv54R8LLZ4MN7VOa4ItrhSz2RUQmZLGC2jEaCG8aSMPKKUU7gBZyrEMpVMunJGpQdvZLVOH6nvZvJZ3mcRDg2ZbWT7w3qUriC8E9vMZqQlfa1uHMHVmh1nQKiKj017NZ6MJjMmeul8KS94t1VeaC8FkG6pvwxkGsycFaig1QajGUiNrnvdZ665icAIykU9UZljXWrJvoxVD0ZfscXaJhqwLMdOEgjF39TsZFZelcdAOJ4bCqI7pHD9f4LiH5ZlEIZH3L3VcAT0
Requires: libqt6-core = 6.6.2, libqt6-gui = 6.6.2, libQt6Core.so.6 >= set:qhwzmJMI49dZaXv1Z20cWYqdSw923BwbJxaZIvIPGZvSiZLwS1isKeLMejQmBolfmEw9xZgf79kxzvs55lwquuR2UzcRy0ka8GZz8aTtTIf5K2EQ6k5294WM5ZxR8Qnrsenz5sw0l8ZiFu7mxJZu9qsMF6sY1xJfg8vZb2nnZFixGDABfyHY8ygb2Mo05xEBE1bPsWF1fA8oGI68HneK9gD5zns6w3wALaklgLpZaHKsPAFXZ2e0aPsvSI39FC4jfMX0PBHogINu8ldDNUU8wAIF9Qch5kLFUxZJ65fwwYN9La1ZqFHmP9YrSvAbWzOcj4FU30pyMU84Hek7I90cTWC7Uj3dA9BcIcYxYCOo3qGpyGeOCeSMTiuRQMd6S3naxKBQHiIm7hKLwevhXTZo4ksh4mNvhdQSRWuUjmnsoOMlrqpu0NQeLjUIzeHHOWbgMLg7XZ1haz8DpxUbMCjsPi4caqDsepDJ0xhHQ47rWkWlD9F27cgrDWWIfZaJaE5cqA2Z1dLpohv5RzJx1fW2JRE2mZwUiSSkJNCF8yk9kumBjXFxeYR5TwCT80odZCs7ayxPJ5guiMSZe167eGdCsWVlZ0B44Ff6K38NCLiuYWOfmc3ipXouEvoeTcehRfDq6lWcRbAVgpVzGdNj3jsz3gxZcnSGdm6Ra9MYrEJudyCZ0krDnDrCSOYEBMQLb4ITKFyZbjX1H9B0qd80ZdnBAl9P5yBdZi7Zc1Li22TN3aDZKFBioIRtB1VM4LcVMQOPEnuI5RAR5lCYCe8z2JXFnnlSTcGGNvltIfglmQhKfjTCxFzwF0SMBpiKM7kiA8AMwvSFkLOeHQZdhzogILyNywiD4P5zsZsV68OpSdtylZ9x2qhtstOB6jz6q2fpCeGFZKV28B51Gg0ALZKiPXyJ0zo0jBGSrx3Gh7yaCvZrP8rG8zNDm5CiyJmDgT79MMJd8I7nmxaiZwFoRgCCLQZpQsbiKzCEJx9eblnPaQlXLaD8fZAl4wea0y9YUd1, libQt6Core.so.6(Qt_6), libQt6Core.so.6(Qt_6.6), libQt6Core.so.6(Qt_6.6_PRIVATE_API), libQt6DBus.so.6 >= set:ngg91uJ1tItNZ8UtZoEun0QdPu5GCmMjgdwZjtwBCE2mzukvzZ0RJqsLeiXwCYjiliGnkIWQf7giie4G4U2iYtEDN1uAkZ7yz79s36ZzkmZzIOKzlDd8aZcKWm4D0zgHB8GJ1NXIghdqyS1rMoqzr3FMuKJqlZsHIAtVwMZvo1AZl1, libQt6DBus.so.6(Qt_6), libQt6Gui.so.6 >= set:rifADTW28WeKhBZp14SMPU904VlGuZ2OZjizSiPnHzWI3XNGNQTwmkmj4FPYUziQ3AWWnZFKU9hfBlePvxNYaUQBu028ryPe1zpK80frag9kOaLee2HVerTIasgSKVwquVmqPMQIFdPo1vLRIr42Fzvzf8ITwHAkoKqrd261f1gcjdPcqJtNEZ9cS7EZbB2xnRvAlyHcbeAjnyFl9h7Gq7Z0o0YgbhqYrPIhnUQlrV0cWbHt3fXIwhJN5ZkyxEqn3hEJZxUp5wpWVc3lGZhcqZeHpUdxh4cfbrILLhRpXAHF4voi2CZ04EDHTPbgSc3jxNh7x2HbmwHujDolJszNXdG00Eoz5dYVp0Ilt3VhIysxnNxLzVy1x1Zoou4LNlQZbVppmKk8Iz1y01et6CK008y5ZJhxJBRwK0eVWi32xHqPOofPwpTj5ivmqjlrVYPcXGwrTw2KeQyo5sDiLzdJ7cj5tCJDaT4jQ3a8Jt2w2bGi0VyHqaWDaDaZChivFGRzZKJ7h9sVMCA0xh36cmyKv5P9lSvzTYXOHhQ8NsizkNww5G3rgZwBm38gKSV9R8QdfR7yEfzebrmw1YRFaZ6CSJSJVdmwkbTa332ybSTZKtCaPXyDKFDiHbs3oo3EslAyY7UWUahceg8M0cQ5Q46BrweIYGNsW8MfT2VWdFvmfpx75TkAV0PL4CdGu5RyjEciW0zWNQH4zEf2dbfxLjQT3CQRSIvE90r4QfxmEsqIh1dDkwwxK0gKggxyg3FYYLuSd0Md9q7kohbTSDf6U53QqjBHZ14bPDVLh1, libQt6Gui.so.6(Qt_6), libQt6Gui.so.6(Qt_6.6_PRIVATE_API), libQt6Network.so.6 >= set:okZxDZldgZven9gxZKQMpsoCsjTwVbOPf14Npxrl64bvIFCQZD5, libQt6Network.so.6(Qt_6), libc.so.6(GLIBC_2.0), libc.so.6(GLIBC_2.1.3), libc.so.6(GLIBC_2.3.4), libc.so.6(GLIBC_2.4), libdtk6core.so.6 >= set:ojreCtfkPqwtFJWD6wZmF6UuKvCE19Zqom9LFdukjvERnKg1evRABtCdndw4i6cueaxq1, libgcc_s.so.1(GCC_3.0), libgcc_s.so.1(GCC_3.3.1), libglib-2.0.so.0 >= set:onuSk8, libgomp.so.1 >= set:mknNKkFFQx53, libgomp.so.1(GOMP_4.0), libgomp.so.1(OMP_1.0), libm.so.6(GLIBC_2.0), libm.so.6(GLIBC_2.29), libstdc++.so.6(CXXABI_1.3), libstdc++.so.6(CXXABI_1.3.8), libstdc++.so.6(CXXABI_1.3.9), libstdc++.so.6(GLIBCXX_3.4), libstdc++.so.6(GLIBCXX_3.4.14), rtld(GNU_HASH)
Requires(rpmlib): rpmlib(SetVersions)
Obsoletes: libdtk6-gui < 6.0.11-alt1
Finding debuginfo files (using /usr/lib/rpm/find-debuginfo-files)
Executing: /bin/sh -e /usr/src/tmp/rpm-tmp.6fOvR5
Creating libdtk6gui6-debuginfo package
Processing files: libdtk6gui-devel-6.0.11-alt1
Finding Provides (using /usr/lib/rpm/find-provides)
Executing: /bin/sh -e /usr/src/tmp/rpm-tmp.QBmzni
find-provides: running scripts (alternatives,debuginfo,gir,lib,pam,perl,pkgconfig,python,python3,shell,typelib,vala)
Finding Requires (using /usr/lib/rpm/find-requires)
Executing: /bin/sh -e /usr/src/tmp/rpm-tmp.yzHpQv
find-requires: running scripts (cpp,debuginfo,files,gir-js,gir-python,gir,lib,pam,perl,pkgconfig,pkgconfiglib,python,python3,rpmlib,shebang,shell,static,symlinks,systemd-services,typelib,vala)
/usr/src/tmp/dtk6gui-buildroot/usr/include/dtk6/DGui/dicon.h:8:10: fatal error: QIcon: No such file or directory
    8 | #include <QIcon>
      |          ^~~~~~~
compilation terminated.
cpp.req: /usr/src/tmp/dtk6gui-buildroot/usr/include/dtk6/DGui/dicon.h: cpp failed, trying c++ mode
/usr/src/tmp/dtk6gui-buildroot/usr/include/dtk6/DGui/dicon.h:8:10: fatal error: QIcon: No such file or directory
    8 | #include <QIcon>
      |          ^~~~~~~
compilation terminated.
cpp.req: WARNING: /usr/src/tmp/dtk6gui-buildroot/usr/include/dtk6/DGui/dicon.h: cpp failed
In file included from /usr/src/tmp/dtk6gui-buildroot/usr/include/dtk6/DGui/dtkgui_global.h:10,
                 from /usr/src/tmp/dtk6gui-buildroot/usr/include/dtk6/DGui/ddciiconpalette.h:8,
                 from /usr/src/tmp/dtk6gui-buildroot/usr/include/dtk6/DGui/ddciicon.h:6:
/usr/include/dtk6/DCore/dtkcore_global.h:7:10: fatal error: QtCore/qglobal.h: No such file or directory
    7 | #include <QtCore/qglobal.h>
      |          ^~~~~~~~~~~~~~~~~~
compilation terminated.
cpp.req: /usr/src/tmp/dtk6gui-buildroot/usr/include/dtk6/DGui/ddciicon.h: cpp failed, trying c++ mode
In file included from /usr/src/tmp/dtk6gui-buildroot/usr/include/dtk6/DGui/dtkgui_global.h:10,
                 from /usr/src/tmp/dtk6gui-buildroot/usr/include/dtk6/DGui/ddciiconpalette.h:8,
                 from /usr/src/tmp/dtk6gui-buildroot/usr/include/dtk6/DGui/ddciicon.h:6:
/usr/include/dtk6/DCore/dtkcore_global.h:7:10: fatal error: QtCore/qglobal.h: No such file or directory
    7 | #include <QtCore/qglobal.h>
      |          ^~~~~~~~~~~~~~~~~~
compilation terminated.
cpp.req: WARNING: /usr/src/tmp/dtk6gui-buildroot/usr/include/dtk6/DGui/ddciicon.h: cpp failed
In file included from /usr/src/tmp/dtk6gui-buildroot/usr/include/dtk6/DGui/dtkgui_global.h:10,
                 from /usr/src/tmp/dtk6gui-buildroot/usr/include/dtk6/DGui/dpalette.h:8:
/usr/include/dtk6/DCore/dtkcore_global.h:7:10: fatal error: QtCore/qglobal.h: No such file or directory
    7 | #include <QtCore/qglobal.h>
      |          ^~~~~~~~~~~~~~~~~~
compilation terminated.
cpp.req: /usr/src/tmp/dtk6gui-buildroot/usr/include/dtk6/DGui/dpalette.h: cpp failed, trying c++ mode
In file included from /usr/src/tmp/dtk6gui-buildroot/usr/include/dtk6/DGui/dtkgui_global.h:10,
                 from /usr/src/tmp/dtk6gui-buildroot/usr/include/dtk6/DGui/dpalette.h:8:
/usr/include/dtk6/DCore/dtkcore_global.h:7:10: fatal error: QtCore/qglobal.h: No such file or directory
    7 | #include <QtCore/qglobal.h>
      |          ^~~~~~~~~~~~~~~~~~
compilation terminated.
cpp.req: WARNING: /usr/src/tmp/dtk6gui-buildroot/usr/include/dtk6/DGui/dpalette.h: cpp failed
In file included from /usr/src/tmp/dtk6gui-buildroot/usr/include/dtk6/DGui/dtkgui_global.h:10,
                 from /usr/src/tmp/dtk6gui-buildroot/usr/include/dtk6/DGui/dfiledrag.h:8:
/usr/include/dtk6/DCore/dtkcore_global.h:7:10: fatal error: QtCore/qglobal.h: No such file or directory
    7 | #include <QtCore/qglobal.h>
      |          ^~~~~~~~~~~~~~~~~~
compilation terminated.
cpp.req: /usr/src/tmp/dtk6gui-buildroot/usr/include/dtk6/DGui/dfiledrag.h: cpp failed, trying c++ mode
In file included from /usr/src/tmp/dtk6gui-buildroot/usr/include/dtk6/DGui/dtkgui_global.h:10,
                 from /usr/src/tmp/dtk6gui-buildroot/usr/include/dtk6/DGui/dfiledrag.h:8:
/usr/include/dtk6/DCore/dtkcore_global.h:7:10: fatal error: QtCore/qglobal.h: No such file or directory
    7 | #include <QtCore/qglobal.h>
      |          ^~~~~~~~~~~~~~~~~~
compilation terminated.
cpp.req: WARNING: /usr/src/tmp/dtk6gui-buildroot/usr/include/dtk6/DGui/dfiledrag.h: cpp failed
In file included from /usr/src/tmp/dtk6gui-buildroot/usr/include/dtk6/DGui/dtkgui_global.h:10,
                 from /usr/src/tmp/dtk6gui-buildroot/usr/include/dtk6/DGui/dicontheme.h:8:
/usr/include/dtk6/DCore/dtkcore_global.h:7:10: fatal error: QtCore/qglobal.h: No such file or directory
    7 | #include <QtCore/qglobal.h>
      |          ^~~~~~~~~~~~~~~~~~
compilation terminated.
cpp.req: /usr/src/tmp/dtk6gui-buildroot/usr/include/dtk6/DGui/dicontheme.h: cpp failed, trying c++ mode
In file included from /usr/src/tmp/dtk6gui-buildroot/usr/include/dtk6/DGui/dtkgui_global.h:10,
                 from /usr/src/tmp/dtk6gui-buildroot/usr/include/dtk6/DGui/dicontheme.h:8:
/usr/include/dtk6/DCore/dtkcore_global.h:7:10: fatal error: QtCore/qglobal.h: No such file or directory
    7 | #include <QtCore/qglobal.h>
      |          ^~~~~~~~~~~~~~~~~~
compilation terminated.
cpp.req: WARNING: /usr/src/tmp/dtk6gui-buildroot/usr/include/dtk6/DGui/dicontheme.h: cpp failed
In file included from /usr/include/dtk6/DCore/DObject:1,
                 from /usr/src/tmp/dtk6gui-buildroot/usr/include/dtk6/DGui/dfontmanager.h:7:
/usr/include/dtk6/DCore/dobject.h:8:10: fatal error: QScopedPointer: No such file or directory
    8 | #include <QScopedPointer>
      |          ^~~~~~~~~~~~~~~~
compilation terminated.
cpp.req: /usr/src/tmp/dtk6gui-buildroot/usr/include/dtk6/DGui/dfontmanager.h: cpp failed, trying c++ mode
In file included from /usr/include/dtk6/DCore/DObject:1,
                 from /usr/src/tmp/dtk6gui-buildroot/usr/include/dtk6/DGui/dfontmanager.h:7:
/usr/include/dtk6/DCore/dobject.h:8:10: fatal error: QScopedPointer: No such file or directory
    8 | #include <QScopedPointer>
      |          ^~~~~~~~~~~~~~~~
compilation terminated.
cpp.req: WARNING: /usr/src/tmp/dtk6gui-buildroot/usr/include/dtk6/DGui/dfontmanager.h: cpp failed
In file included from /usr/src/tmp/dtk6gui-buildroot/usr/include/dtk6/DGui/dtkgui_global.h:10,
                 from /usr/src/tmp/dtk6gui-buildroot/usr/include/dtk6/DGui/dsvgrenderer.h:8:
/usr/include/dtk6/DCore/dtkcore_global.h:7:10: fatal error: QtCore/qglobal.h: No such file or directory
    7 | #include <QtCore/qglobal.h>
      |          ^~~~~~~~~~~~~~~~~~
compilation terminated.
cpp.req: /usr/src/tmp/dtk6gui-buildroot/usr/include/dtk6/DGui/dsvgrenderer.h: cpp failed, trying c++ mode
In file included from /usr/src/tmp/dtk6gui-buildroot/usr/include/dtk6/DGui/dtkgui_global.h:10,
                 from /usr/src/tmp/dtk6gui-buildroot/usr/include/dtk6/DGui/dsvgrenderer.h:8:
/usr/include/dtk6/DCore/dtkcore_global.h:7:10: fatal error: QtCore/qglobal.h: No such file or directory
    7 | #include <QtCore/qglobal.h>
      |          ^~~~~~~~~~~~~~~~~~
compilation terminated.
cpp.req: WARNING: /usr/src/tmp/dtk6gui-buildroot/usr/include/dtk6/DGui/dsvgrenderer.h: cpp failed
In file included from /usr/src/tmp/dtk6gui-buildroot/usr/include/dtk6/DGui/dtkgui_global.h:10,
                 from /usr/src/tmp/dtk6gui-buildroot/usr/include/dtk6/DGui/dimagehandler.h:8:
/usr/include/dtk6/DCore/dtkcore_global.h:7:10: fatal error: QtCore/qglobal.h: No such file or directory
    7 | #include <QtCore/qglobal.h>
      |          ^~~~~~~~~~~~~~~~~~
compilation terminated.
cpp.req: /usr/src/tmp/dtk6gui-buildroot/usr/include/dtk6/DGui/dimagehandler.h: cpp failed, trying c++ mode
In file included from /usr/src/tmp/dtk6gui-buildroot/usr/include/dtk6/DGui/dtkgui_global.h:10,
                 from /usr/src/tmp/dtk6gui-buildroot/usr/include/dtk6/DGui/dimagehandler.h:8:
/usr/include/dtk6/DCore/dtkcore_global.h:7:10: fatal error: QtCore/qglobal.h: No such file or directory
    7 | #include <QtCore/qglobal.h>
      |          ^~~~~~~~~~~~~~~~~~
compilation terminated.
cpp.req: WARNING: /usr/src/tmp/dtk6gui-buildroot/usr/include/dtk6/DGui/dimagehandler.h: cpp failed
In file included from /usr/src/tmp/dtk6gui-buildroot/usr/include/dtk6/DGui/dtkgui_global.h:10:
/usr/include/dtk6/DCore/dtkcore_global.h:7:10: fatal error: QtCore/qglobal.h: No such file or directory
    7 | #include <QtCore/qglobal.h>
      |          ^~~~~~~~~~~~~~~~~~
compilation terminated.
cpp.req: /usr/src/tmp/dtk6gui-buildroot/usr/include/dtk6/DGui/dtkgui_global.h: cpp failed, trying c++ mode
In file included from /usr/src/tmp/dtk6gui-buildroot/usr/include/dtk6/DGui/dtkgui_global.h:10:
/usr/include/dtk6/DCore/dtkcore_global.h:7:10: fatal error: QtCore/qglobal.h: No such file or directory
    7 | #include <QtCore/qglobal.h>
      |          ^~~~~~~~~~~~~~~~~~
compilation terminated.
cpp.req: WARNING: /usr/src/tmp/dtk6gui-buildroot/usr/include/dtk6/DGui/dtkgui_global.h: cpp failed
In file included from /usr/src/tmp/dtk6gui-buildroot/usr/include/dtk6/DGui/dtkgui_global.h:10,
                 from /usr/src/tmp/dtk6gui-buildroot/usr/include/dtk6/DGui/ddciiconplayer.h:6:
/usr/include/dtk6/DCore/dtkcore_global.h:7:10: fatal error: QtCore/qglobal.h: No such file or directory
    7 | #include <QtCore/qglobal.h>
      |          ^~~~~~~~~~~~~~~~~~
compilation terminated.
cpp.req: /usr/src/tmp/dtk6gui-buildroot/usr/include/dtk6/DGui/ddciiconplayer.h: cpp failed, trying c++ mode
In file included from /usr/src/tmp/dtk6gui-buildroot/usr/include/dtk6/DGui/dtkgui_global.h:10,
                 from /usr/src/tmp/dtk6gui-buildroot/usr/include/dtk6/DGui/ddciiconplayer.h:6:
/usr/include/dtk6/DCore/dtkcore_global.h:7:10: fatal error: QtCore/qglobal.h: No such file or directory
    7 | #include <QtCore/qglobal.h>
      |          ^~~~~~~~~~~~~~~~~~
compilation terminated.
cpp.req: WARNING: /usr/src/tmp/dtk6gui-buildroot/usr/include/dtk6/DGui/ddciiconplayer.h: cpp failed
In file included from /usr/src/tmp/dtk6gui-buildroot/usr/include/dtk6/DGui/dtkgui_global.h:10,
                 from /usr/src/tmp/dtk6gui-buildroot/usr/include/dtk6/DGui/dforeignwindow.h:8:
/usr/include/dtk6/DCore/dtkcore_global.h:7:10: fatal error: QtCore/qglobal.h: No such file or directory
    7 | #include <QtCore/qglobal.h>
      |          ^~~~~~~~~~~~~~~~~~
compilation terminated.
cpp.req: /usr/src/tmp/dtk6gui-buildroot/usr/include/dtk6/DGui/dforeignwindow.h: cpp failed, trying c++ mode
In file included from /usr/src/tmp/dtk6gui-buildroot/usr/include/dtk6/DGui/dtkgui_global.h:10,
                 from /usr/src/tmp/dtk6gui-buildroot/usr/include/dtk6/DGui/dforeignwindow.h:8:
/usr/include/dtk6/DCore/dtkcore_global.h:7:10: fatal error: QtCore/qglobal.h: No such file or directory
    7 | #include <QtCore/qglobal.h>
      |          ^~~~~~~~~~~~~~~~~~
compilation terminated.
cpp.req: WARNING: /usr/src/tmp/dtk6gui-buildroot/usr/include/dtk6/DGui/dforeignwindow.h: cpp failed
In file included from /usr/src/tmp/dtk6gui-buildroot/usr/include/dtk6/DGui/dtkgui_global.h:10,
                 from /usr/src/tmp/dtk6gui-buildroot/usr/include/dtk6/DGui/dnativesettings.h:8,
                 from /usr/src/tmp/dtk6gui-buildroot/usr/include/dtk6/DGui/DNativeSettings:1,
                 from /usr/src/tmp/dtk6gui-buildroot/usr/include/dtk6/DGui/dplatformtheme.h:8:
/usr/include/dtk6/DCore/dtkcore_global.h:7:10: fatal error: QtCore/qglobal.h: No such file or directory
    7 | #include <QtCore/qglobal.h>
      |          ^~~~~~~~~~~~~~~~~~
compilation terminated.
cpp.req: /usr/src/tmp/dtk6gui-buildroot/usr/include/dtk6/DGui/dplatformtheme.h: cpp failed, trying c++ mode
In file included from /usr/src/tmp/dtk6gui-buildroot/usr/include/dtk6/DGui/dtkgui_global.h:10,
                 from /usr/src/tmp/dtk6gui-buildroot/usr/include/dtk6/DGui/dnativesettings.h:8,
                 from /usr/src/tmp/dtk6gui-buildroot/usr/include/dtk6/DGui/DNativeSettings:1,
                 from /usr/src/tmp/dtk6gui-buildroot/usr/include/dtk6/DGui/dplatformtheme.h:8:
/usr/include/dtk6/DCore/dtkcore_global.h:7:10: fatal error: QtCore/qglobal.h: No such file or directory
    7 | #include <QtCore/qglobal.h>
      |          ^~~~~~~~~~~~~~~~~~
compilation terminated.
cpp.req: WARNING: /usr/src/tmp/dtk6gui-buildroot/usr/include/dtk6/DGui/dplatformtheme.h: cpp failed
In file included from /usr/include/dtk6/DCore/DObject:1,
                 from /usr/src/tmp/dtk6gui-buildroot/usr/include/dtk6/DGui/dregionmonitor.h:8:
/usr/include/dtk6/DCore/dobject.h:8:10: fatal error: QScopedPointer: No such file or directory
    8 | #include <QScopedPointer>
      |          ^~~~~~~~~~~~~~~~
compilation terminated.
cpp.req: /usr/src/tmp/dtk6gui-buildroot/usr/include/dtk6/DGui/dregionmonitor.h: cpp failed, trying c++ mode
In file included from /usr/include/dtk6/DCore/DObject:1,
                 from /usr/src/tmp/dtk6gui-buildroot/usr/include/dtk6/DGui/dregionmonitor.h:8:
/usr/include/dtk6/DCore/dobject.h:8:10: fatal error: QScopedPointer: No such file or directory
    8 | #include <QScopedPointer>
      |          ^~~~~~~~~~~~~~~~
compilation terminated.
cpp.req: WARNING: /usr/src/tmp/dtk6gui-buildroot/usr/include/dtk6/DGui/dregionmonitor.h: cpp failed
In file included from /usr/src/tmp/dtk6gui-buildroot/usr/include/dtk6/DGui/dtkgui_global.h:10,
                 from /usr/src/tmp/dtk6gui-buildroot/usr/include/dtk6/DGui/ddciiconpalette.h:8:
/usr/include/dtk6/DCore/dtkcore_global.h:7:10: fatal error: QtCore/qglobal.h: No such file or directory
    7 | #include <QtCore/qglobal.h>
      |          ^~~~~~~~~~~~~~~~~~
compilation terminated.
cpp.req: /usr/src/tmp/dtk6gui-buildroot/usr/include/dtk6/DGui/ddciiconpalette.h: cpp failed, trying c++ mode
In file included from /usr/src/tmp/dtk6gui-buildroot/usr/include/dtk6/DGui/dtkgui_global.h:10,
                 from /usr/src/tmp/dtk6gui-buildroot/usr/include/dtk6/DGui/ddciiconpalette.h:8:
/usr/include/dtk6/DCore/dtkcore_global.h:7:10: fatal error: QtCore/qglobal.h: No such file or directory
    7 | #include <QtCore/qglobal.h>
      |          ^~~~~~~~~~~~~~~~~~
compilation terminated.
cpp.req: WARNING: /usr/src/tmp/dtk6gui-buildroot/usr/include/dtk6/DGui/ddciiconpalette.h: cpp failed
In file included from /usr/src/tmp/dtk6gui-buildroot/usr/include/dtk6/DGui/dtkgui_global.h:10,
                 from /usr/src/tmp/dtk6gui-buildroot/usr/include/dtk6/DGui/dfiledragcommon.h:8,
                 from /usr/src/tmp/dtk6gui-buildroot/usr/include/dtk6/DGui/dfiledragclient.h:8:
/usr/include/dtk6/DCore/dtkcore_global.h:7:10: fatal error: QtCore/qglobal.h: No such file or directory
    7 | #include <QtCore/qglobal.h>
      |          ^~~~~~~~~~~~~~~~~~
compilation terminated.
cpp.req: /usr/src/tmp/dtk6gui-buildroot/usr/include/dtk6/DGui/dfiledragclient.h: cpp failed, trying c++ mode
In file included from /usr/src/tmp/dtk6gui-buildroot/usr/include/dtk6/DGui/dtkgui_global.h:10,
                 from /usr/src/tmp/dtk6gui-buildroot/usr/include/dtk6/DGui/dfiledragcommon.h:8,
                 from /usr/src/tmp/dtk6gui-buildroot/usr/include/dtk6/DGui/dfiledragclient.h:8:
/usr/include/dtk6/DCore/dtkcore_global.h:7:10: fatal error: QtCore/qglobal.h: No such file or directory
    7 | #include <QtCore/qglobal.h>
      |          ^~~~~~~~~~~~~~~~~~
compilation terminated.
cpp.req: WARNING: /usr/src/tmp/dtk6gui-buildroot/usr/include/dtk6/DGui/dfiledragclient.h: cpp failed
In file included from /usr/src/tmp/dtk6gui-buildroot/usr/include/dtk6/DGui/dtkgui_global.h:10,
                 from /usr/src/tmp/dtk6gui-buildroot/usr/include/dtk6/DGui/dfiledragcommon.h:8:
/usr/include/dtk6/DCore/dtkcore_global.h:7:10: fatal error: QtCore/qglobal.h: No such file or directory
    7 | #include <QtCore/qglobal.h>
      |          ^~~~~~~~~~~~~~~~~~
compilation terminated.
cpp.req: /usr/src/tmp/dtk6gui-buildroot/usr/include/dtk6/DGui/dfiledragcommon.h: cpp failed, trying c++ mode
In file included from /usr/src/tmp/dtk6gui-buildroot/usr/include/dtk6/DGui/dtkgui_global.h:10,
                 from /usr/src/tmp/dtk6gui-buildroot/usr/include/dtk6/DGui/dfiledragcommon.h:8:
/usr/include/dtk6/DCore/dtkcore_global.h:7:10: fatal error: QtCore/qglobal.h: No such file or directory
    7 | #include <QtCore/qglobal.h>
      |          ^~~~~~~~~~~~~~~~~~
compilation terminated.
cpp.req: WARNING: /usr/src/tmp/dtk6gui-buildroot/usr/include/dtk6/DGui/dfiledragcommon.h: cpp failed
In file included from /usr/src/tmp/dtk6gui-buildroot/usr/include/dtk6/DGui/dtkgui_global.h:10,
                 from /usr/src/tmp/dtk6gui-buildroot/usr/include/dtk6/DGui/dfiledragcommon.h:8,
                 from /usr/src/tmp/dtk6gui-buildroot/usr/include/dtk6/DGui/dfiledragserver.h:8:
/usr/include/dtk6/DCore/dtkcore_global.h:7:10: fatal error: QtCore/qglobal.h: No such file or directory
    7 | #include <QtCore/qglobal.h>
      |          ^~~~~~~~~~~~~~~~~~
compilation terminated.
cpp.req: /usr/src/tmp/dtk6gui-buildroot/usr/include/dtk6/DGui/dfiledragserver.h: cpp failed, trying c++ mode
In file included from /usr/src/tmp/dtk6gui-buildroot/usr/include/dtk6/DGui/dtkgui_global.h:10,
                 from /usr/src/tmp/dtk6gui-buildroot/usr/include/dtk6/DGui/dfiledragcommon.h:8,
                 from /usr/src/tmp/dtk6gui-buildroot/usr/include/dtk6/DGui/dfiledragserver.h:8:
/usr/include/dtk6/DCore/dtkcore_global.h:7:10: fatal error: QtCore/qglobal.h: No such file or directory
    7 | #include <QtCore/qglobal.h>
      |          ^~~~~~~~~~~~~~~~~~
compilation terminated.
cpp.req: WARNING: /usr/src/tmp/dtk6gui-buildroot/usr/include/dtk6/DGui/dfiledragserver.h: cpp failed
In file included from /usr/src/tmp/dtk6gui-buildroot/usr/include/dtk6/DGui/dtkgui_global.h:10,
                 from /usr/src/tmp/dtk6gui-buildroot/usr/include/dtk6/DGui/dnativesettings.h:8:
/usr/include/dtk6/DCore/dtkcore_global.h:7:10: fatal error: QtCore/qglobal.h: No such file or directory
    7 | #include <QtCore/qglobal.h>
      |          ^~~~~~~~~~~~~~~~~~
compilation terminated.
cpp.req: /usr/src/tmp/dtk6gui-buildroot/usr/include/dtk6/DGui/dnativesettings.h: cpp failed, trying c++ mode
In file included from /usr/src/tmp/dtk6gui-buildroot/usr/include/dtk6/DGui/dtkgui_global.h:10,
                 from /usr/src/tmp/dtk6gui-buildroot/usr/include/dtk6/DGui/dnativesettings.h:8:
/usr/include/dtk6/DCore/dtkcore_global.h:7:10: fatal error: QtCore/qglobal.h: No such file or directory
    7 | #include <QtCore/qglobal.h>
      |          ^~~~~~~~~~~~~~~~~~
compilation terminated.
cpp.req: WARNING: /usr/src/tmp/dtk6gui-buildroot/usr/include/dtk6/DGui/dnativesettings.h: cpp failed
In file included from /usr/src/tmp/dtk6gui-buildroot/usr/include/dtk6/DGui/dtkgui_global.h:10,
                 from /usr/src/tmp/dtk6gui-buildroot/usr/include/dtk6/DGui/dplatformhandle.h:8:
/usr/include/dtk6/DCore/dtkcore_global.h:7:10: fatal error: QtCore/qglobal.h: No such file or directory
    7 | #include <QtCore/qglobal.h>
      |          ^~~~~~~~~~~~~~~~~~
compilation terminated.
cpp.req: /usr/src/tmp/dtk6gui-buildroot/usr/include/dtk6/DGui/dplatformhandle.h: cpp failed, trying c++ mode
In file included from /usr/src/tmp/dtk6gui-buildroot/usr/include/dtk6/DGui/dtkgui_global.h:10,
                 from /usr/src/tmp/dtk6gui-buildroot/usr/include/dtk6/DGui/dplatformhandle.h:8:
/usr/include/dtk6/DCore/dtkcore_global.h:7:10: fatal error: QtCore/qglobal.h: No such file or directory
    7 | #include <QtCore/qglobal.h>
      |          ^~~~~~~~~~~~~~~~~~
compilation terminated.
cpp.req: WARNING: /usr/src/tmp/dtk6gui-buildroot/usr/include/dtk6/DGui/dplatformhandle.h: cpp failed
In file included from /usr/src/tmp/dtk6gui-buildroot/usr/include/dtk6/DGui/dtkgui_global.h:10,
                 from /usr/src/tmp/dtk6gui-buildroot/usr/include/dtk6/DGui/dtaskbarcontrol.h:8:
/usr/include/dtk6/DCore/dtkcore_global.h:7:10: fatal error: QtCore/qglobal.h: No such file or directory
    7 | #include <QtCore/qglobal.h>
      |          ^~~~~~~~~~~~~~~~~~
compilation terminated.
cpp.req: /usr/src/tmp/dtk6gui-buildroot/usr/include/dtk6/DGui/dtaskbarcontrol.h: cpp failed, trying c++ mode
In file included from /usr/src/tmp/dtk6gui-buildroot/usr/include/dtk6/DGui/dtkgui_global.h:10,
                 from /usr/src/tmp/dtk6gui-buildroot/usr/include/dtk6/DGui/dtaskbarcontrol.h:8:
/usr/include/dtk6/DCore/dtkcore_global.h:7:10: fatal error: QtCore/qglobal.h: No such file or directory
    7 | #include <QtCore/qglobal.h>
      |          ^~~~~~~~~~~~~~~~~~
compilation terminated.
cpp.req: WARNING: /usr/src/tmp/dtk6gui-buildroot/usr/include/dtk6/DGui/dtaskbarcontrol.h: cpp failed
In file included from /usr/src/tmp/dtk6gui-buildroot/usr/include/dtk6/DGui/dtkgui_global.h:10,
                 from /usr/src/tmp/dtk6gui-buildroot/usr/include/dtk6/DGui/ddesktopservices.h:7:
/usr/include/dtk6/DCore/dtkcore_global.h:7:10: fatal error: QtCore/qglobal.h: No such file or directory
    7 | #include <QtCore/qglobal.h>
      |          ^~~~~~~~~~~~~~~~~~
compilation terminated.
cpp.req: /usr/src/tmp/dtk6gui-buildroot/usr/include/dtk6/DGui/ddesktopservices.h: cpp failed, trying c++ mode
In file included from /usr/src/tmp/dtk6gui-buildroot/usr/include/dtk6/DGui/dtkgui_global.h:10,
                 from /usr/src/tmp/dtk6gui-buildroot/usr/include/dtk6/DGui/ddesktopservices.h:7:
/usr/include/dtk6/DCore/dtkcore_global.h:7:10: fatal error: QtCore/qglobal.h: No such file or directory
    7 | #include <QtCore/qglobal.h>
      |          ^~~~~~~~~~~~~~~~~~
compilation terminated.
cpp.req: WARNING: /usr/src/tmp/dtk6gui-buildroot/usr/include/dtk6/DGui/ddesktopservices.h: cpp failed
In file included from /usr/src/tmp/dtk6gui-buildroot/usr/include/dtk6/DGui/dtkgui_global.h:10,
                 from /usr/src/tmp/dtk6gui-buildroot/usr/include/dtk6/DGui/dthumbnailprovider.h:8:
/usr/include/dtk6/DCore/dtkcore_global.h:7:10: fatal error: QtCore/qglobal.h: No such file or directory
    7 | #include <QtCore/qglobal.h>
      |          ^~~~~~~~~~~~~~~~~~
compilation terminated.
cpp.req: /usr/src/tmp/dtk6gui-buildroot/usr/include/dtk6/DGui/dthumbnailprovider.h: cpp failed, trying c++ mode
In file included from /usr/src/tmp/dtk6gui-buildroot/usr/include/dtk6/DGui/dtkgui_global.h:10,
                 from /usr/src/tmp/dtk6gui-buildroot/usr/include/dtk6/DGui/dthumbnailprovider.h:8:
/usr/include/dtk6/DCore/dtkcore_global.h:7:10: fatal error: QtCore/qglobal.h: No such file or directory
    7 | #include <QtCore/qglobal.h>
      |          ^~~~~~~~~~~~~~~~~~
compilation terminated.
cpp.req: WARNING: /usr/src/tmp/dtk6gui-buildroot/usr/include/dtk6/DGui/dthumbnailprovider.h: cpp failed
In file included from /usr/src/tmp/dtk6gui-buildroot/usr/include/dtk6/DGui/dtkgui_global.h:10,
                 from /usr/src/tmp/dtk6gui-buildroot/usr/include/dtk6/DGui/dwindowgroupleader.h:8:
/usr/include/dtk6/DCore/dtkcore_global.h:7:10: fatal error: QtCore/qglobal.h: No such file or directory
    7 | #include <QtCore/qglobal.h>
      |          ^~~~~~~~~~~~~~~~~~
compilation terminated.
cpp.req: /usr/src/tmp/dtk6gui-buildroot/usr/include/dtk6/DGui/dwindowgroupleader.h: cpp failed, trying c++ mode
In file included from /usr/src/tmp/dtk6gui-buildroot/usr/include/dtk6/DGui/dtkgui_global.h:10,
                 from /usr/src/tmp/dtk6gui-buildroot/usr/include/dtk6/DGui/dwindowgroupleader.h:8:
/usr/include/dtk6/DCore/dtkcore_global.h:7:10: fatal error: QtCore/qglobal.h: No such file or directory
    7 | #include <QtCore/qglobal.h>
      |          ^~~~~~~~~~~~~~~~~~
compilation terminated.
cpp.req: WARNING: /usr/src/tmp/dtk6gui-buildroot/usr/include/dtk6/DGui/dwindowgroupleader.h: cpp failed
In file included from /usr/src/tmp/dtk6gui-buildroot/usr/include/dtk6/DGui/dtkgui_global.h:10,
                 from /usr/src/tmp/dtk6gui-buildroot/usr/include/dtk6/DGui/dwindowmanagerhelper.h:8:
/usr/include/dtk6/DCore/dtkcore_global.h:7:10: fatal error: QtCore/qglobal.h: No such file or directory
    7 | #include <QtCore/qglobal.h>
      |          ^~~~~~~~~~~~~~~~~~
compilation terminated.
cpp.req: /usr/src/tmp/dtk6gui-buildroot/usr/include/dtk6/DGui/dwindowmanagerhelper.h: cpp failed, trying c++ mode
In file included from /usr/src/tmp/dtk6gui-buildroot/usr/include/dtk6/DGui/dtkgui_global.h:10,
                 from /usr/src/tmp/dtk6gui-buildroot/usr/include/dtk6/DGui/dwindowmanagerhelper.h:8:
/usr/include/dtk6/DCore/dtkcore_global.h:7:10: fatal error: QtCore/qglobal.h: No such file or directory
    7 | #include <QtCore/qglobal.h>
      |          ^~~~~~~~~~~~~~~~~~
compilation terminated.
cpp.req: WARNING: /usr/src/tmp/dtk6gui-buildroot/usr/include/dtk6/DGui/dwindowmanagerhelper.h: cpp failed
In file included from /usr/src/tmp/dtk6gui-buildroot/usr/include/dtk6/DGui/dtkgui_global.h:10,
                 from /usr/src/tmp/dtk6gui-buildroot/usr/include/dtk6/DGui/dguiapplicationhelper.h:8:
/usr/include/dtk6/DCore/dtkcore_global.h:7:10: fatal error: QtCore/qglobal.h: No such file or directory
    7 | #include <QtCore/qglobal.h>
      |          ^~~~~~~~~~~~~~~~~~
compilation terminated.
cpp.req: /usr/src/tmp/dtk6gui-buildroot/usr/include/dtk6/DGui/dguiapplicationhelper.h: cpp failed, trying c++ mode
In file included from /usr/src/tmp/dtk6gui-buildroot/usr/include/dtk6/DGui/dtkgui_global.h:10,
                 from /usr/src/tmp/dtk6gui-buildroot/usr/include/dtk6/DGui/dguiapplicationhelper.h:8:
/usr/include/dtk6/DCore/dtkcore_global.h:7:10: fatal error: QtCore/qglobal.h: No such file or directory
    7 | #include <QtCore/qglobal.h>
      |          ^~~~~~~~~~~~~~~~~~
compilation terminated.
cpp.req: WARNING: /usr/src/tmp/dtk6gui-buildroot/usr/include/dtk6/DGui/dguiapplicationhelper.h: cpp failed
Provides: dtk6-gui-devel = 6.0.11-alt1, pkgconfig(dtk6gui) = 6.0.11
Requires: /usr/lib/libdtk6gui.so.6, /usr/lib/pkgconfig, pkgconfig(dtk6core)
Obsoletes: dtk6-gui-devel < 6.0.11-alt1
Finding debuginfo files (using /usr/lib/rpm/find-debuginfo-files)
Executing: /bin/sh -e /usr/src/tmp/rpm-tmp.SYqjkZ
Processing files: dtk6gui-debuginfo-6.0.11-alt1
Finding Provides (using /usr/lib/rpm/find-provides)
Executing: /bin/sh -e /usr/src/tmp/rpm-tmp.UHNrIR
find-provides: running scripts (debuginfo)
Finding Requires (using /usr/lib/rpm/find-requires)
Executing: /bin/sh -e /usr/src/tmp/rpm-tmp.57VHCi
find-requires: running scripts (debuginfo)
Requires: dtk6gui = 6.0.11-alt1, /usr/lib/debug/lib/ld-linux.so.2.debug, debug(libQt6Core.so.6), debug(libQt6Gui.so.6), debug(libQt6Widgets.so.6), debug(libX11.so.6), debug(libc.so.6), debug(libdtk6core.so.6), debug(libdtk6gui.so.6), debug(libgcc_s.so.1), debug(libstdc++.so.6)
Processing files: libdtk6gui6-debuginfo-6.0.11-alt1
Finding Provides (using /usr/lib/rpm/find-provides)
Executing: /bin/sh -e /usr/src/tmp/rpm-tmp.G4OEZI
find-provides: running scripts (debuginfo)
Finding Requires (using /usr/lib/rpm/find-requires)
Executing: /bin/sh -e /usr/src/tmp/rpm-tmp.gzk0Wt
find-requires: running scripts (debuginfo)
Provides: debug(libdtk6gui.so.6)
Requires: libdtk6gui6 = 6.0.11-alt1, debug(libQt6Core.so.6), debug(libQt6DBus.so.6), debug(libQt6Gui.so.6), debug(libQt6Network.so.6), debug(libc.so.6), debug(libdtk6core.so.6), debug(libgcc_s.so.1), debug(libglib-2.0.so.0), debug(libgomp.so.1), debug(libm.so.6), debug(libstdc++.so.6)
Adding to dtk6gui-debuginfo a strict dependency on dtk6gui
Adding to libdtk6gui6-debuginfo a strict dependency on libdtk6gui6
Adding to dtk6gui a strict dependency on libdtk6gui6
Adding to libdtk6gui-devel a strict dependency on libdtk6gui6
Adding to dtk6gui-debuginfo a strict dependency on libdtk6gui6-debuginfo
Removing from dtk6gui-debuginfo 8 sources provided by libdtk6gui6-debuginfo
also prunning dir /usr/src/debug/dtk6gui-6.0.11/include/filedrag
also prunning dir /usr/src/debug/dtk6gui-6.0.11/include/kernel
also prunning dir /usr/src/debug/dtk6gui-6.0.11/include/util
also prunning dir /usr/src/debug/dtk6gui-6.0.11/include
Removing 1 extra deps from dtk6gui due to dependency on libdtk6gui6
Removing 1 extra deps from libdtk6gui-devel due to dependency on libdtk6gui6
Removing 1 extra deps from dtk6gui-debuginfo due to dependency on libdtk6gui6-debuginfo
Removing 14 extra deps from dtk6gui due to repentancy on libdtk6gui6
Removing 6 extra deps from dtk6gui-debuginfo due to repentancy on libdtk6gui6-debuginfo
Wrote: /usr/src/RPM/RPMS/i586/dtk6gui-6.0.11-alt1.i586.rpm (w2.lzdio)
Wrote: /usr/src/RPM/RPMS/i586/libdtk6gui6-6.0.11-alt1.i586.rpm (w2.lzdio)
Wrote: /usr/src/RPM/RPMS/i586/libdtk6gui-devel-6.0.11-alt1.i586.rpm (w2.lzdio)
Wrote: /usr/src/RPM/RPMS/i586/dtk6gui-debuginfo-6.0.11-alt1.i586.rpm (w2.lzdio)
Wrote: /usr/src/RPM/RPMS/i586/libdtk6gui6-debuginfo-6.0.11-alt1.i586.rpm (w2T8.xzdio)
154.89user 19.94system 1:00.59elapsed 288%CPU (0avgtext+0avgdata 327624maxresident)k
0inputs+0outputs (0major+4841079minor)pagefaults 0swaps
7.88user 2.56system 1:37.76elapsed 10%CPU (0avgtext+0avgdata 126808maxresident)k
3656inputs+0outputs (0major+356181minor)pagefaults 0swaps
--- dtk6gui-6.0.11-alt1.i586.rpm.repo	2024-04-22 12:08:47.000000000 +0000
+++ dtk6gui-6.0.11-alt1.i586.rpm.hasher	2024-05-11 07:35:22.490654348 +0000
@@ -34,7 +34,7 @@
 File: /usr/libexec/dtk6/DGui/bin	40755	root:root		
-File: /usr/libexec/dtk6/DGui/bin/dci-icon-theme	100755	root:root	b869fe84bf550001754173432b7a040d	
-File: /usr/libexec/dtk6/DGui/bin/dde-kwin-bug	100755	root:root	8451664704aad94972d99d526a44e7f0	
-File: /usr/libexec/dtk6/DGui/bin/deepin-gui-settings	100755	root:root	e898dcf322fa9caad4f345959afb8796	
-File: /usr/libexec/dtk6/DGui/bin/dnd-test-client	100755	root:root	a3e7b4eef80e118884690866c7a0e57c	
-File: /usr/libexec/dtk6/DGui/bin/dnd-test-server	100755	root:root	7138a9fa195b10e09063c01d3db61bf0	
+File: /usr/libexec/dtk6/DGui/bin/dci-icon-theme	100755	root:root	179be3f5de5a17d852369bb5fc068004	
+File: /usr/libexec/dtk6/DGui/bin/dde-kwin-bug	100755	root:root	c518ff71f1d197eb9d821d3282471890	
+File: /usr/libexec/dtk6/DGui/bin/deepin-gui-settings	100755	root:root	781bac87f7086a0d256ba19440bd8ec5	
+File: /usr/libexec/dtk6/DGui/bin/dnd-test-client	100755	root:root	e46f814facd318f52af557903201b064	
+File: /usr/libexec/dtk6/DGui/bin/dnd-test-server	100755	root:root	8d76aea56bc6b0fba1d6ed66e7d3e30f	
 File: /usr/share/doc/dtk6gui-6.0.11	40755	root:root		
@@ -42,2 +42,2 @@
 File: /usr/share/doc/dtk6gui-6.0.11/README.md	100644	root:root	b9e065a38a1c1173518bd4b7caf4ad17	
-RPMIdentity: 13c47e8a947ff37272139dc84b05fecfe684ac333c8e23b69d2d30428ee3a6e7efc8ad0dd2b3f0abdcf3e1ea3131211fbdfc5ee2f1df3166779d9741de049ff1
+RPMIdentity: b0092d2195cafd6cab780dc61a0a429efc697616681080cf8fd242a109b7edd5fc0143c7946b41c23d6c347f691eeeb6fdfc9a44192b0596f67d8d2230cd52e1
--- dtk6gui-debuginfo-6.0.11-alt1.i586.rpm.repo	2024-04-22 12:08:48.000000000 +0000
+++ dtk6gui-debuginfo-6.0.11-alt1.i586.rpm.hasher	2024-05-11 07:35:22.690653184 +0000
@@ -1,16 +1,16 @@
-/usr/lib/debug/.build-id/1c	40755	root:root	
-/usr/lib/debug/.build-id/1c/90f7fc2c3546ad778bf3f7337f8b6603ac174c	120777	root:root	../../../../libexec/dtk6/DGui/bin/dnd-test-client
-/usr/lib/debug/.build-id/1c/90f7fc2c3546ad778bf3f7337f8b6603ac174c.debug	120777	root:root	../../usr/libexec/dtk6/DGui/bin/dnd-test-client.debug
-/usr/lib/debug/.build-id/2c	40755	root:root	
-/usr/lib/debug/.build-id/2c/87620363519ba80c7323ae4c6e901e1048db26	120777	root:root	../../../../libexec/dtk6/DGui/bin/dci-icon-theme
-/usr/lib/debug/.build-id/2c/87620363519ba80c7323ae4c6e901e1048db26.debug	120777	root:root	../../usr/libexec/dtk6/DGui/bin/dci-icon-theme.debug
-/usr/lib/debug/.build-id/67	40755	root:root	
-/usr/lib/debug/.build-id/67/f9e535663acf090b121bc5c1121848c8b34941	120777	root:root	../../../../libexec/dtk6/DGui/bin/dde-kwin-bug
-/usr/lib/debug/.build-id/67/f9e535663acf090b121bc5c1121848c8b34941.debug	120777	root:root	../../usr/libexec/dtk6/DGui/bin/dde-kwin-bug.debug
-/usr/lib/debug/.build-id/99	40755	root:root	
-/usr/lib/debug/.build-id/99/b560ae932246be56ca8a2d844cac8b2c2983fa	120777	root:root	../../../../libexec/dtk6/DGui/bin/deepin-gui-settings
-/usr/lib/debug/.build-id/99/b560ae932246be56ca8a2d844cac8b2c2983fa.debug	120777	root:root	../../usr/libexec/dtk6/DGui/bin/deepin-gui-settings.debug
-/usr/lib/debug/.build-id/ba	40755	root:root	
-/usr/lib/debug/.build-id/ba/cc819afd28aabe8fa5b92addc74754f4d85c34	120777	root:root	../../../../libexec/dtk6/DGui/bin/dnd-test-server
-/usr/lib/debug/.build-id/ba/cc819afd28aabe8fa5b92addc74754f4d85c34.debug	120777	root:root	../../usr/libexec/dtk6/DGui/bin/dnd-test-server.debug
+/usr/lib/debug/.build-id/1a	40755	root:root	
+/usr/lib/debug/.build-id/1a/cfe89786a8821d94e11ff9670ad3e602857029	120777	root:root	../../../../libexec/dtk6/DGui/bin/dnd-test-client
+/usr/lib/debug/.build-id/1a/cfe89786a8821d94e11ff9670ad3e602857029.debug	120777	root:root	../../usr/libexec/dtk6/DGui/bin/dnd-test-client.debug
+/usr/lib/debug/.build-id/8b	40755	root:root	
+/usr/lib/debug/.build-id/8b/dce5c020c190dbfcf7a8d5b7f9c77bb8499b24	120777	root:root	../../../../libexec/dtk6/DGui/bin/dde-kwin-bug
+/usr/lib/debug/.build-id/8b/dce5c020c190dbfcf7a8d5b7f9c77bb8499b24.debug	120777	root:root	../../usr/libexec/dtk6/DGui/bin/dde-kwin-bug.debug
+/usr/lib/debug/.build-id/98	40755	root:root	
+/usr/lib/debug/.build-id/98/e354c790806ea27cbaaaca7172f2ff9613f46f	120777	root:root	../../../../libexec/dtk6/DGui/bin/deepin-gui-settings
+/usr/lib/debug/.build-id/98/e354c790806ea27cbaaaca7172f2ff9613f46f.debug	120777	root:root	../../usr/libexec/dtk6/DGui/bin/deepin-gui-settings.debug
+/usr/lib/debug/.build-id/af	40755	root:root	
+/usr/lib/debug/.build-id/af/63204eabec78c5b36b1ce9b2e31d5bc171d966	120777	root:root	../../../../libexec/dtk6/DGui/bin/dci-icon-theme
+/usr/lib/debug/.build-id/af/63204eabec78c5b36b1ce9b2e31d5bc171d966.debug	120777	root:root	../../usr/libexec/dtk6/DGui/bin/dci-icon-theme.debug
+/usr/lib/debug/.build-id/c2	40755	root:root	
+/usr/lib/debug/.build-id/c2/a945ca24e0a9e3ec52064046bc43675391d460	120777	root:root	../../../../libexec/dtk6/DGui/bin/dnd-test-server
+/usr/lib/debug/.build-id/c2/a945ca24e0a9e3ec52064046bc43675391d460.debug	120777	root:root	../../usr/libexec/dtk6/DGui/bin/dnd-test-server.debug
 /usr/lib/debug/usr/libexec/dtk6	40755	root:root	
@@ -63,17 +63,17 @@
 Provides: dtk6gui-debuginfo = 6.0.11-alt1:sisyphus+345618.140.1.1
-File: /usr/lib/debug/.build-id/1c	40755	root:root		
-File: /usr/lib/debug/.build-id/1c/90f7fc2c3546ad778bf3f7337f8b6603ac174c	120777	root:root		../../../../libexec/dtk6/DGui/bin/dnd-test-client
-File: /usr/lib/debug/.build-id/1c/90f7fc2c3546ad778bf3f7337f8b6603ac174c.debug	120777	root:root		../../usr/libexec/dtk6/DGui/bin/dnd-test-client.debug
-File: /usr/lib/debug/.build-id/2c	40755	root:root		
-File: /usr/lib/debug/.build-id/2c/87620363519ba80c7323ae4c6e901e1048db26	120777	root:root		../../../../libexec/dtk6/DGui/bin/dci-icon-theme
-File: /usr/lib/debug/.build-id/2c/87620363519ba80c7323ae4c6e901e1048db26.debug	120777	root:root		../../usr/libexec/dtk6/DGui/bin/dci-icon-theme.debug
-File: /usr/lib/debug/.build-id/67	40755	root:root		
-File: /usr/lib/debug/.build-id/67/f9e535663acf090b121bc5c1121848c8b34941	120777	root:root		../../../../libexec/dtk6/DGui/bin/dde-kwin-bug
-File: /usr/lib/debug/.build-id/67/f9e535663acf090b121bc5c1121848c8b34941.debug	120777	root:root		../../usr/libexec/dtk6/DGui/bin/dde-kwin-bug.debug
-File: /usr/lib/debug/.build-id/99	40755	root:root		
-File: /usr/lib/debug/.build-id/99/b560ae932246be56ca8a2d844cac8b2c2983fa	120777	root:root		../../../../libexec/dtk6/DGui/bin/deepin-gui-settings
-File: /usr/lib/debug/.build-id/99/b560ae932246be56ca8a2d844cac8b2c2983fa.debug	120777	root:root		../../usr/libexec/dtk6/DGui/bin/deepin-gui-settings.debug
-File: /usr/lib/debug/.build-id/ba	40755	root:root		
-File: /usr/lib/debug/.build-id/ba/cc819afd28aabe8fa5b92addc74754f4d85c34	120777	root:root		../../../../libexec/dtk6/DGui/bin/dnd-test-server
-File: /usr/lib/debug/.build-id/ba/cc819afd28aabe8fa5b92addc74754f4d85c34.debug	120777	root:root		../../usr/libexec/dtk6/DGui/bin/dnd-test-server.debug
+File: /usr/lib/debug/.build-id/1a	40755	root:root		
+File: /usr/lib/debug/.build-id/1a/cfe89786a8821d94e11ff9670ad3e602857029	120777	root:root		../../../../libexec/dtk6/DGui/bin/dnd-test-client
+File: /usr/lib/debug/.build-id/1a/cfe89786a8821d94e11ff9670ad3e602857029.debug	120777	root:root		../../usr/libexec/dtk6/DGui/bin/dnd-test-client.debug
+File: /usr/lib/debug/.build-id/8b	40755	root:root		
+File: /usr/lib/debug/.build-id/8b/dce5c020c190dbfcf7a8d5b7f9c77bb8499b24	120777	root:root		../../../../libexec/dtk6/DGui/bin/dde-kwin-bug
+File: /usr/lib/debug/.build-id/8b/dce5c020c190dbfcf7a8d5b7f9c77bb8499b24.debug	120777	root:root		../../usr/libexec/dtk6/DGui/bin/dde-kwin-bug.debug
+File: /usr/lib/debug/.build-id/98	40755	root:root		
+File: /usr/lib/debug/.build-id/98/e354c790806ea27cbaaaca7172f2ff9613f46f	120777	root:root		../../../../libexec/dtk6/DGui/bin/deepin-gui-settings
+File: /usr/lib/debug/.build-id/98/e354c790806ea27cbaaaca7172f2ff9613f46f.debug	120777	root:root		../../usr/libexec/dtk6/DGui/bin/deepin-gui-settings.debug
+File: /usr/lib/debug/.build-id/af	40755	root:root		
+File: /usr/lib/debug/.build-id/af/63204eabec78c5b36b1ce9b2e31d5bc171d966	120777	root:root		../../../../libexec/dtk6/DGui/bin/dci-icon-theme
+File: /usr/lib/debug/.build-id/af/63204eabec78c5b36b1ce9b2e31d5bc171d966.debug	120777	root:root		../../usr/libexec/dtk6/DGui/bin/dci-icon-theme.debug
+File: /usr/lib/debug/.build-id/c2	40755	root:root		
+File: /usr/lib/debug/.build-id/c2/a945ca24e0a9e3ec52064046bc43675391d460	120777	root:root		../../../../libexec/dtk6/DGui/bin/dnd-test-server
+File: /usr/lib/debug/.build-id/c2/a945ca24e0a9e3ec52064046bc43675391d460.debug	120777	root:root		../../usr/libexec/dtk6/DGui/bin/dnd-test-server.debug
 File: /usr/lib/debug/usr/libexec/dtk6	40755	root:root		
@@ -81,7 +81,7 @@
 File: /usr/lib/debug/usr/libexec/dtk6/DGui/bin	40755	root:root		
-File: /usr/lib/debug/usr/libexec/dtk6/DGui/bin/dci-icon-theme.debug	100644	root:root	09e171fb81f07e4403cd5a51f959b1f5	
-File: /usr/lib/debug/usr/libexec/dtk6/DGui/bin/dde-kwin-bug.debug	100644	root:root	ae7129d1e1a5642691715d5433f037fe	
-File: /usr/lib/debug/usr/libexec/dtk6/DGui/bin/deepin-gui-settings.debug	100644	root:root	d05c09b1d313ad3c8f799b051f490fb3	
-File: /usr/lib/debug/usr/libexec/dtk6/DGui/bin/dnd-test-client.debug	100644	root:root	d9b04f04a7caea84e4a16e0094325ed7	
-File: /usr/lib/debug/usr/libexec/dtk6/DGui/bin/dnd-test-server.debug	100644	root:root	10788b4c9b1afa914f8f1751f94a5c7b	
+File: /usr/lib/debug/usr/libexec/dtk6/DGui/bin/dci-icon-theme.debug	100644	root:root	51074197775b566c2243dd2a6e3bdbcf	
+File: /usr/lib/debug/usr/libexec/dtk6/DGui/bin/dde-kwin-bug.debug	100644	root:root	44eede1bb2110473d11c7182b0507cd2	
+File: /usr/lib/debug/usr/libexec/dtk6/DGui/bin/deepin-gui-settings.debug	100644	root:root	525b0ca984caaa1ce105d95936bc1503	
+File: /usr/lib/debug/usr/libexec/dtk6/DGui/bin/dnd-test-client.debug	100644	root:root	7ce60cb98fcb4c64a2347f0566902d3b	
+File: /usr/lib/debug/usr/libexec/dtk6/DGui/bin/dnd-test-server.debug	100644	root:root	2e4f2a587658f113e3acb25d17fa172a	
 File: /usr/src/debug/dtk6gui-6.0.11	40755	root:root		
@@ -119,2 +119,2 @@
 File: /usr/src/debug/dtk6gui-6.0.11/tools/deepin-gui-settings/main.cpp	100644	root:root	3d6f8a5ba9b7344555f21182766033c6	
-RPMIdentity: 35ef96377b729600b9b5d17ec1cf3278279c38dfac95b79ca6c9cfa6785661630ee43b55b5e46cb928270010aeba4b2616cb900d8889c691b84bd9fddfdfd375
+RPMIdentity: 2717e23d4050282ff6087dd689d0b6884b4125e4a4048054508bc742b3a0ff68ca84389e706d65f0c28d5d76e4b53404be3c981043f37b35bf4410f9ab3fcdfd
--- libdtk6gui6-6.0.11-alt1.i586.rpm.repo	2024-04-22 12:08:47.000000000 +0000
+++ libdtk6gui6-6.0.11-alt1.i586.rpm.hasher	2024-05-11 07:35:23.037651165 +0000
@@ -41,3 +41,3 @@
 File: /usr/lib/libdtk6gui.so.6	120777	root:root		libdtk6gui.so.6.0.11
-File: /usr/lib/libdtk6gui.so.6.0.11	100644	root:root	85c83165d306fa23f936b3fc42c77335	
-RPMIdentity: 4c41b99be66208f79298178c906112799be7a0a6d9b981f6c02f18291849ec44335d5bdb7aa113379661c82e80d50a14d3ae26216d0765897a306b3d28135dff
+File: /usr/lib/libdtk6gui.so.6.0.11	100644	root:root	b8eee09a9a34d598799252b2f8395037	
+RPMIdentity: 24a6b85550cbd027694e8fc6150a3b4d787eedbfcb1f7e4f7dba60625f54a36b4d5a8f8b7e755ddc12b6ba19820c7967ded7a8e6573807b5d637d3237046fd72
--- libdtk6gui6-debuginfo-6.0.11-alt1.i586.rpm.repo	2024-04-22 12:08:48.000000000 +0000
+++ libdtk6gui6-debuginfo-6.0.11-alt1.i586.rpm.hasher	2024-05-11 07:35:24.062645200 +0000
@@ -1,4 +1,4 @@
-/usr/lib/debug/.build-id/84	40755	root:root	
-/usr/lib/debug/.build-id/84/c564b1206f20617fc3df8a5a63376198e34dfa	120777	root:root	../../../libdtk6gui.so.6.0.11
-/usr/lib/debug/.build-id/84/c564b1206f20617fc3df8a5a63376198e34dfa.debug	120777	root:root	../../usr/lib/libdtk6gui.so.6.0.11.debug
+/usr/lib/debug/.build-id/ca	40755	root:root	
+/usr/lib/debug/.build-id/ca/96f5e70c65689d748729ae0f481cb7d5066e7d	120777	root:root	../../../libdtk6gui.so.6.0.11
+/usr/lib/debug/.build-id/ca/96f5e70c65689d748729ae0f481cb7d5066e7d.debug	120777	root:root	../../usr/lib/libdtk6gui.so.6.0.11.debug
 /usr/lib/debug/usr/lib/libdtk6gui.so.6.0.11.debug	100644	root:root	
@@ -128,6 +128,6 @@
 Provides: libdtk6gui6-debuginfo = 6.0.11-alt1:sisyphus+345618.140.1.1
-File: /usr/lib/debug/.build-id/84	40755	root:root		
-File: /usr/lib/debug/.build-id/84/c564b1206f20617fc3df8a5a63376198e34dfa	120777	root:root		../../../libdtk6gui.so.6.0.11
-File: /usr/lib/debug/.build-id/84/c564b1206f20617fc3df8a5a63376198e34dfa.debug	120777	root:root		../../usr/lib/libdtk6gui.so.6.0.11.debug
-File: /usr/lib/debug/usr/lib/libdtk6gui.so.6.0.11.debug	100644	root:root	d0a05c46a4bf6d3753e29daf00ab778e	
+File: /usr/lib/debug/.build-id/ca	40755	root:root		
+File: /usr/lib/debug/.build-id/ca/96f5e70c65689d748729ae0f481cb7d5066e7d	120777	root:root		../../../libdtk6gui.so.6.0.11
+File: /usr/lib/debug/.build-id/ca/96f5e70c65689d748729ae0f481cb7d5066e7d.debug	120777	root:root		../../usr/lib/libdtk6gui.so.6.0.11.debug
+File: /usr/lib/debug/usr/lib/libdtk6gui.so.6.0.11.debug	100644	root:root	655bc6452a2ae4311653939a9f23b5f4	
 File: /usr/lib/debug/usr/lib/libdtk6gui.so.6.debug	120777	root:root		libdtk6gui.so.6.0.11.debug
@@ -241,2 +241,2 @@
 File: /usr/src/debug/dtk6gui-6.0.11/src/util/private/xdgiconproxyengine_p.h	100644	root:root	f8ad2f5cdd54fcf9dc015826fedb151b	
-RPMIdentity: bdc6cbbd2b9e47b10798eb25d3b57213f4bcc3575e2e16757ea0b8db91562be38d6118b02e8a59f0eda337646cef80785776347621433eacb71caea0784deffc
+RPMIdentity: 31021575dde9634aac9816c1deae868e637d1eca60e6e263618eac4700b1a44f375224d9bd824171dd2ac829c294250bfb58a42cc4f327d9dec79dfeeacd4957