<86>Jun 17 06:29:50 userdel[1166786]: delete user 'rooter'
<86>Jun 17 06:29:50 userdel[1166786]: removed group 'rooter' owned by 'rooter'
<86>Jun 17 06:29:50 userdel[1166786]: removed shadow group 'rooter' owned by 'rooter'
<86>Jun 17 06:29:50 groupadd[1166795]: group added to /etc/group: name=rooter, GID=1790
<86>Jun 17 06:29:50 groupadd[1166795]: group added to /etc/gshadow: name=rooter
<86>Jun 17 06:29:50 groupadd[1166795]: new group: name=rooter, GID=1790
<86>Jun 17 06:29:50 useradd[1166801]: new user: name=rooter, UID=1790, GID=1790, home=/root, shell=/bin/bash, from=none
<86>Jun 17 06:29:50 userdel[1166820]: delete user 'builder'
<86>Jun 17 06:29:50 userdel[1166820]: removed group 'builder' owned by 'builder'
<86>Jun 17 06:29:50 userdel[1166820]: removed shadow group 'builder' owned by 'builder'
<86>Jun 17 06:29:50 groupadd[1166836]: group added to /etc/group: name=builder, GID=1791
<86>Jun 17 06:29:50 groupadd[1166836]: group added to /etc/gshadow: name=builder
<86>Jun 17 06:29:50 groupadd[1166836]: new group: name=builder, GID=1791
<86>Jun 17 06:29:50 useradd[1166849]: new user: name=builder, UID=1791, GID=1791, home=/usr/src, shell=/bin/bash, from=none
<13>Jun 17 06:29:52 rpmi: rpm-macros-ninja-build-1.11.1-alt1 sisyphus+306014.100.1.1 1661920837 installed
<13>Jun 17 06:29:52 rpmi: rpm-macros-cmake-3.23.2-alt3 sisyphus+318864.100.1.1 1681931990 installed
<13>Jun 17 06:29:53 rpmi: libidn2-2.3.4-alt1 sisyphus+309023.100.1.1 1666791089 installed
<13>Jun 17 06:29:53 rpmi: libnettle8-3.9.1-alt1 sisyphus+322548.100.1.2 1686176897 installed
<13>Jun 17 06:29:53 rpmi: gcc-c++-common-1.4.27-alt1 sisyphus+278099.1300.1.1 1626028636 installed
<13>Jun 17 06:29:53 rpmi: libexpat-2.5.0-alt1 sisyphus+309227.100.1.1 1667075766 installed
<13>Jun 17 06:29:53 rpmi: libp11-kit-0.24.1-alt1 sisyphus+293720.100.1.1 1642535281 installed
<13>Jun 17 06:29:53 rpmi: libtasn1-4.19.0-alt1 sisyphus+305700.100.1.1 1661359628 installed
<13>Jun 17 06:29:53 rpmi: zlib-devel-1.2.13-alt1 sisyphus+309409.200.2.1 1667402045 installed
<13>Jun 17 06:29:53 rpmi: libstdc++12-devel-12.2.1-alt3 sisyphus+322898.100.1.1 1686662557 installed
<13>Jun 17 06:29:54 rpmi: gcc12-c++-12.2.1-alt3 sisyphus+322898.100.1.1 1686662557 installed
<13>Jun 17 06:29:54 rpmi: libhogweed6-3.9.1-alt1 sisyphus+322548.100.1.2 1686176897 installed
<13>Jun 17 06:29:54 rpmi: libgnutls30-3.7.9-alt1 sisyphus+315353.100.1.1 1676639387 installed
<13>Jun 17 06:29:54 rpmi: libngtcp2-0.15.0-alt1 sisyphus+321126.100.1.1 1684414016 installed
<13>Jun 17 06:29:54 rpmi: libmpdec3-2.5.1-alt3 sisyphus+314490.500.5.1 1675432033 installed
<13>Jun 17 06:29:54 rpmi: libgdbm-1.8.3-alt10 sisyphus+278100.1600.1.1 1626059138 installed
<13>Jun 17 06:29:54 rpmi: libelf-devel-0.189-alt2 sisyphus+317844.200.3.1 1680278723 installed
<13>Jun 17 06:29:54 rpmi: libb2-0.98.1-alt1_1 sisyphus+291614.100.1.1 1638962878 installed
<13>Jun 17 06:29:54 rpmi: cmake-modules-3.23.2-alt3 sisyphus+318864.100.1.1 1681931983 installed
<13>Jun 17 06:29:54 rpmi: libuv-1.45.0-alt1 sisyphus+322120.40.2.1 1685405027 installed
<13>Jun 17 06:29:54 rpmi: librhash-1.3.5-alt3 sisyphus+286141.40.2.1 1632982456 installed
<13>Jun 17 06:29:54 rpmi: libjsoncpp24-1.9.4-alt2 sisyphus+286441.100.1.1 1633444234 installed
<13>Jun 17 06:29:54 rpmi: publicsuffix-list-dafsa-20230404-alt1 sisyphus+318117.100.1.1 1680769734 installed
<13>Jun 17 06:29:54 rpmi: libpsl-0.21.2-alt1 sisyphus+312536.100.1.1 1672131180 installed
<13>Jun 17 06:29:54 rpmi: libnghttp3-0.9.0-alt1 sisyphus+317166.100.1.1 1679409333 installed
<13>Jun 17 06:29:54 rpmi: libnghttp2-1.53.0-alt1 sisyphus+320325.100.1.1 1683872096 installed
<13>Jun 17 06:29:54 rpmi: openldap-common-2.6.4-alt1 sisyphus+321176.240.10.2 1684802269 installed
<13>Jun 17 06:29:54 rpmi: libntlm-1.5-alt1 sisyphus+278100.3300.1.1 1626059663 installed
<13>Jun 17 06:29:54 rpmi: libidn-1.37-alt2 sisyphus+300849.100.1.1 1653769693 installed
<13>Jun 17 06:29:54 rpmi: libverto-0.3.2-alt1_1 sisyphus+321176.2200.10.2 1684806164 installed
<13>Jun 17 06:29:54 rpmi: liblmdb-0.9.29-alt1.1 sisyphus+306630.100.1.1 1663072361 installed
<13>Jun 17 06:29:54 rpmi: libkeyutils-1.6.3-alt1 sisyphus+266061.100.1.1 1612919567 installed
<13>Jun 17 06:29:54 rpmi: libcom_err-1.46.4.0.5.4cda-alt1 sisyphus+283826.100.1.1 1629975361 installed
<13>Jun 17 06:29:54 rpmi: libbrotlicommon-1.0.9-alt2 sisyphus+278430.100.1.2 1626213212 installed
<13>Jun 17 06:29:54 rpmi: libbrotlidec-1.0.9-alt2 sisyphus+278430.100.1.2 1626213212 installed
<13>Jun 17 06:29:55 rpmi: glibc-devel-static-6:2.35.0.234.3f63f9dfe1-alt1 sisyphus+317055.200.3.2 1679475633 installed
<13>Jun 17 06:29:55 rpmi: zlib-devel-static-1.2.13-alt1 sisyphus+309409.200.2.1 1667402045 installed
<13>Jun 17 06:29:55 rpmi: bc-1:1.07.1-alt1 sisyphus+278100.400.1.1 1626056616 installed
<13>Jun 17 06:29:55 rpmi: rpm-macros-alternatives-0.5.2-alt2 sisyphus+315270.200.2.1 1676457367 installed
<13>Jun 17 06:29:55 rpmi: alternatives-0.5.2-alt2 sisyphus+315270.200.2.1 1676457367 installed
<13>Jun 17 06:29:55 rpmi: ca-certificates-2022.12.14-alt1 sisyphus+311754.200.1.1 1671046143 installed
<13>Jun 17 06:29:55 rpmi: ca-trust-0.1.4-alt1 sisyphus+308690.100.1.1 1666182992 installed
<13>Jun 17 06:29:55 rpmi: p11-kit-trust-0.24.1-alt1 sisyphus+293720.100.1.1 1642535281 installed
<13>Jun 17 06:29:55 rpmi: libcrypto1.1-1.1.1u-alt1 sisyphus+322200.100.1.1 1685474790 installed
<13>Jun 17 06:29:55 rpmi: libssl1.1-1.1.1u-alt1 sisyphus+322200.100.1.1 1685474790 installed
<86>Jun 17 06:29:55 groupadd[1177021]: group added to /etc/group: name=_keytab, GID=999
<86>Jun 17 06:29:55 groupadd[1177021]: group added to /etc/gshadow: name=_keytab
<86>Jun 17 06:29:55 groupadd[1177021]: new group: name=_keytab, GID=999
<13>Jun 17 06:29:55 rpmi: libkrb5-1.21-alt1 sisyphus+323024.100.1.1 1686749989 installed
<13>Jun 17 06:29:55 rpmi: libgsasl-1.8.0-alt3 sisyphus+275307.100.1.2 1624478553 installed
<86>Jun 17 06:29:55 groupadd[1177289]: group added to /etc/group: name=sasl, GID=998
<86>Jun 17 06:29:55 groupadd[1177289]: group added to /etc/gshadow: name=sasl
<86>Jun 17 06:29:55 groupadd[1177289]: new group: name=sasl, GID=998
<13>Jun 17 06:29:55 rpmi: libsasl2-3-2.1.27-alt2.2 sisyphus+306372.1000.8.1 1663097332 installed
<13>Jun 17 06:29:55 rpmi: libldap2-2.6.4-alt1 sisyphus+321176.240.10.2 1684803685 installed
<13>Jun 17 06:29:55 rpmi: python3-3.11.0-alt1 sisyphus+311250.40.175.1 1685626775 installed
<13>Jun 17 06:29:56 rpmi: python3-base-3.11.0-alt1 sisyphus+311250.40.175.1 1685626775 installed
<13>Jun 17 06:29:56 rpmi: libarchive13-3.6.1-alt2 sisyphus+311213.100.1.1 1670244624 installed
<13>Jun 17 06:29:56 rpmi: libssh2-1.10.0-alt1 sisyphus+289470.100.1.1 1636752294 installed
<13>Jun 17 06:29:56 rpmi: libcurl-8.1.2-alt1 sisyphus+322142.100.1.1 1685433996 installed
<13>Jun 17 06:29:56 rpmi: cmake-3.23.2-alt3 sisyphus+318864.100.1.1 1681931990 installed
<13>Jun 17 06:29:56 rpmi: libcurl-devel-8.1.2-alt1 sisyphus+322142.100.1.1 1685433996 installed
<13>Jun 17 06:29:56 rpmi: binutils-devel-1:2.38-alt1 sisyphus+302378.600.6.1 1659369946 installed
<13>Jun 17 06:29:56 rpmi: libdw-devel-0.189-alt2 sisyphus+317844.200.3.1 1680278723 installed
<13>Jun 17 06:29:56 rpmi: gcc-c++-12-alt1 sisyphus+300988.300.1.1 1654033914 installed
<13>Jun 17 06:29:56 rpmi: ninja-build-1.11.1-alt1 sisyphus+306014.100.1.1 1661920842 installed
Building target platforms: i586
Building for target i586
Wrote: /usr/src/in/nosrpm/kcov-38-alt3.nosrc.rpm (w1.gzdio)
Installing kcov-38-alt3.src.rpm
Building target platforms: i586
Building for target i586
Executing(%prep): /bin/sh -e /usr/src/tmp/rpm-tmp.5068
+ umask 022
+ /bin/mkdir -p /usr/src/RPM/BUILD
+ cd /usr/src/RPM/BUILD
+ cd /usr/src/RPM/BUILD
+ rm -rf kcov-38
+ echo 'Source #0 (kcov-38.tar):'
Source #0 (kcov-38.tar):
+ /bin/tar -xf /usr/src/RPM/SOURCES/kcov-38.tar
+ cd kcov-38
+ /bin/chmod -c -Rf u+rwX,go-w .
+ echo 'Patch #0 (kcov-38-alt-drop-fork-32-test.patch):'
Patch #0 (kcov-38-alt-drop-fork-32-test.patch):
+ /usr/bin/patch -p1
patching file tests/CMakeLists.txt
patching file tests/tools/compiled.py
+ rm -r external/
+ exit 0
Executing(%build): /bin/sh -e /usr/src/tmp/rpm-tmp.5068
+ umask 022
+ /bin/mkdir -p /usr/src/RPM/BUILD
+ cd /usr/src/RPM/BUILD
+ cd kcov-38
+ mkdir -p BUILD
+ cmake -DCMAKE_SKIP_INSTALL_RPATH:BOOL=yes '-DCMAKE_C_FLAGS:STRING=-pipe -frecord-gcc-switches -Wall -g -O2 -flto=auto -march=i586 -mtune=generic' '-DCMAKE_CXX_FLAGS:STRING=-pipe -frecord-gcc-switches -Wall -g -O2 -flto=auto -march=i586 -mtune=generic' '-DCMAKE_Fortran_FLAGS:STRING=-pipe -frecord-gcc-switches -Wall -g -O2 -flto=auto -march=i586 -mtune=generic' -DCMAKE_INSTALL_PREFIX=/usr -DINCLUDE_INSTALL_DIR:PATH=/usr/include -DLIB_INSTALL_DIR:PATH=/usr/lib -DSYSCONF_INSTALL_DIR:PATH=/etc -DSHARE_INSTALL_PREFIX:PATH=/usr/share -DLIB_DESTINATION=lib -DLIB_SUFFIX= -S . -B BUILD -G Ninja -DKCOV_INSTALL_DOCDIR:STRING=/usr/share/doc/kcov-38
CMake Deprecation Warning at CMakeLists.txt:1 (cmake_minimum_required):
  Compatibility with CMake < 2.8.12 will be removed from a future version of
  CMake.

  Update the VERSION argument <min> value or use a ...<max> suffix to tell
  CMake that the project does not need compatibility with older versions.


-- The C compiler identification is GNU 12.2.1
-- The CXX compiler identification is GNU 12.2.1
-- Detecting C compiler ABI info
-- Detecting C compiler ABI info - done
-- Check for working C compiler: /usr/bin/cc - skipped
-- Detecting C compile features
-- Detecting C compile features - done
-- Detecting CXX compiler ABI info
-- Detecting CXX compiler ABI info - done
-- Check for working CXX compiler: /usr/bin/c++ - skipped
-- Detecting CXX compile features
-- Detecting CXX compile features - done
-- Looking for pthread.h
-- Looking for pthread.h - found
-- Performing Test CMAKE_HAVE_LIBC_PTHREAD
-- Performing Test CMAKE_HAVE_LIBC_PTHREAD - Success
-- Found Threads: TRUE  
CMake Warning (dev) at /usr/share/cmake/Modules/FindPackageHandleStandardArgs.cmake:438 (message):
  The package name passed to `find_package_handle_standard_args` (LIBBFD)
  does not match the name of the calling package (Bfd).  This can lead to
  problems in calling code that expects `find_package` result variables
  (e.g., `_FOUND`) to follow a certain pattern.
Call Stack (most recent call first):
  cmake/FindBfd.cmake:79 (find_package_handle_standard_args)
  src/CMakeLists.txt:2 (find_package)
This warning is for project developers.  Use -Wno-dev to suppress it.

-- Found LIBBFD: /usr/lib/libbfd.so  
-- Target architectures: i386
-- Found ZLIB: /usr/lib/libz.so (found version "1.2.13") 
-- Found CURL: /usr/lib/libcurl.so (found version "8.1.2")  
-- Found DL: /usr/lib/libdl.a
-- Found M: /usr/lib/libm.so
Package libzstd was not found in the pkg-config search path.
Perhaps you should add the directory containing `libzstd.pc'
to the PKG_CONFIG_PATH environment variable
Package 'libzstd', required by 'libelf', not found
Package libzstd was not found in the pkg-config search path.
Perhaps you should add the directory containing `libzstd.pc'
to the PKG_CONFIG_PATH environment variable
Package 'libzstd', required by 'libelf', not found
Package libzstd was not found in the pkg-config search path.
Perhaps you should add the directory containing `libzstd.pc'
to the PKG_CONFIG_PATH environment variable
Package 'libzstd', required by 'libelf', not found
Package libzstd was not found in the pkg-config search path.
Perhaps you should add the directory containing `libzstd.pc'
to the PKG_CONFIG_PATH environment variable
Package 'libzstd', required by 'libelf', not found
-- Found LibElf: /usr/lib/libelf.so  
Package libzstd was not found in the pkg-config search path.
Perhaps you should add the directory containing `libzstd.pc'
to the PKG_CONFIG_PATH environment variable
Package 'libzstd', required by 'libelf', not found
Package libzstd was not found in the pkg-config search path.
Perhaps you should add the directory containing `libzstd.pc'
to the PKG_CONFIG_PATH environment variable
Package 'libzstd', required by 'libelf', not found
Package libzstd was not found in the pkg-config search path.
Perhaps you should add the directory containing `libzstd.pc'
to the PKG_CONFIG_PATH environment variable
Package 'libzstd', required by 'libelf', not found
Package libzstd was not found in the pkg-config search path.
Perhaps you should add the directory containing `libzstd.pc'
to the PKG_CONFIG_PATH environment variable
Package 'libzstd', required by 'libelf', not found
CMake Warning (dev) at /usr/share/cmake/Modules/FindPackageHandleStandardArgs.cmake:438 (message):
  The package name passed to `find_package_handle_standard_args` (ElfUtils)
  does not match the name of the calling package (Elfutils).  This can lead
  to problems in calling code that expects `find_package` result variables
  (e.g., `_FOUND`) to follow a certain pattern.
Call Stack (most recent call first):
  cmake/FindElfutils.cmake:70 (find_package_handle_standard_args)
  src/CMakeLists.txt:134 (find_package)
This warning is for project developers.  Use -Wno-dev to suppress it.

-- Found ElfUtils: /usr/lib/libdw.so  
-- Configuring done
-- Generating done
CMake Warning:
  Manually-specified variables were not used by the project:

    CMAKE_Fortran_FLAGS
    INCLUDE_INSTALL_DIR
    LIB_DESTINATION
    LIB_INSTALL_DIR
    LIB_SUFFIX
    SHARE_INSTALL_PREFIX
    SYSCONF_INSTALL_DIR


-- Build files have been written to: /usr/src/RPM/BUILD/kcov-38/BUILD
+ /usr/bin/ninja -j16 -C BUILD
ninja: Entering directory `BUILD'
[1/73] Generating version.c
[2/73] Building C object src/CMakeFiles/bash_execve_redirector.dir/engines/bash-execve-redirector.c.o
[3/73] Building C object src/CMakeFiles/kcov_sowrapper.dir/solib-parser/phdr_data.c.o
[4/73] Building C object src/CMakeFiles/kcov_sowrapper.dir/solib-parser/lib.c.o
[5/73] Linking C shared library src/libkcov_sowrapper.so
[6/73] Building CXX object src/CMakeFiles/kcov-system-daemon.dir/dummy-solib-handler.cc.o
[7/73] Linking C shared library src/libbash_execve_redirector.so
[8/73] Building C object src/CMakeFiles/kcov-system-daemon.dir/version.c.o
[9/73] Building CXX object src/CMakeFiles/kcov_system_lib.dir/system-mode/registration.cc.o
[10/73] Building CXX object src/CMakeFiles/kcov_system_lib.dir/engines/system-mode-binary-lib.cc.o
[11/73] Building CXX object src/CMakeFiles/kcov-system-daemon.dir/engines/system-mode-file-format.cc.o
[12/73] Building CXX object src/CMakeFiles/kcov-system-daemon.dir/engine-factory.cc.o
[13/73] Building CXX object src/CMakeFiles/kcov-system-daemon.dir/parser-manager.cc.o
[14/73] Building CXX object src/CMakeFiles/kcov-system-daemon.dir/engines/ptrace_linux.cc.o
[15/73] Building CXX object src/CMakeFiles/kcov-system-daemon.dir/system-mode/file-data.cc.o
[16/73] Building CXX object src/CMakeFiles/kcov-system-daemon.dir/filter.cc.o
[17/73] Building CXX object src/CMakeFiles/kcov-system-daemon.dir/system-mode/registration.cc.o
[18/73] Building CXX object src/CMakeFiles/kcov-system-daemon.dir/gcov.cc.o
[19/73] Building CXX object src/CMakeFiles/kcov-system-daemon.dir/engines/ptrace.cc.o
/usr/src/RPM/BUILD/kcov-38/src/engines/ptrace.cc: In member function 'const kcov::IEngine::Event Ptrace::waitEvent()':
/usr/src/RPM/BUILD/kcov-38/src/engines/ptrace.cc:217:83: warning: format '%zx' expects argument of type 'size_t', but argument 3 has type 'uint64_t' {aka 'long long unsigned int'} [-Wformat=]
  217 |                                 kcov_debug(ENGINE_MSG, "Looking for instruction %zx.\n", out.addr);
      |                                                                                 ~~^      ~~~~~~~~
      |                                                                                   |          |
      |                                                                                   |          uint64_t {aka long long unsigned int}
      |                                                                                   unsigned int
      |                                                                                 %llx
[20/73] Building CXX object src/CMakeFiles/kcov-system-daemon.dir/main-system-daemon.cc.o
[21/73] Building CXX object src/CMakeFiles/kcov_system_lib.dir/utils.cc.o
[22/73] Building CXX object src/CMakeFiles/kcov-system-daemon.dir/configuration.cc.o
[23/73] Building CXX object src/CMakeFiles/kcov-system-daemon.dir/utils.cc.o
[24/73] Linking CXX shared library src/libkcov_system_lib.so
[25/73] Generating bash-helper.cc
[26/73] Generating python-helper.cc
[27/73] Generating bash-redirector-library.cc
[28/73] Generating library.cc
[29/73] Generating html-data-files.cc
[30/73] Generating kcov-system-library.cc
[31/73] Building CXX object src/CMakeFiles/kcov.dir/engine-factory.cc.o
[32/73] Building CXX object src/CMakeFiles/kcov.dir/parser-manager.cc.o
[33/73] Building CXX object src/CMakeFiles/kcov.dir/filter.cc.o
[34/73] Building CXX object src/CMakeFiles/kcov.dir/engines/system-mode-engine.cc.o
[35/73] Building CXX object src/CMakeFiles/kcov.dir/engines/system-mode-file-format.cc.o
[36/73] Building CXX object src/CMakeFiles/kcov.dir/main.cc.o
[37/73] Building CXX object src/CMakeFiles/kcov.dir/capabilities.cc.o
[38/73] Building CXX object src/CMakeFiles/kcov.dir/output-handler.cc.o
[39/73] Building CXX object src/CMakeFiles/kcov.dir/collector.cc.o
[40/73] Building CXX object src/CMakeFiles/kcov.dir/gcov.cc.o
[41/73] Building CXX object src/CMakeFiles/kcov.dir/engines/python-engine.cc.o
[42/73] Building CXX object src/CMakeFiles/kcov.dir/source-file-cache.cc.o
[43/73] Building CXX object src/CMakeFiles/kcov.dir/parsers/bfd-disassembler.cc.o
[44/73] Building CXX object src/CMakeFiles/kcov.dir/configuration.cc.o
[45/73] Building CXX object src/CMakeFiles/kcov.dir/engines/bash-engine.cc.o
[46/73] Building CXX object src/CMakeFiles/kcov.dir/writers/json-writer.cc.o
[47/73] Building CXX object src/CMakeFiles/kcov.dir/writers/cobertura-writer.cc.o
[48/73] Building CXX object src/CMakeFiles/kcov.dir/utils.cc.o
[49/73] Building CXX object src/CMakeFiles/kcov.dir/writers/coveralls-writer.cc.o
/usr/src/RPM/BUILD/kcov-38/src/writers/coveralls-writer.cc: In member function 'bool CurlConnectionHandler::talk(const std::string&)':
/usr/src/RPM/BUILD/kcov-38/src/writers/coveralls-writer.cc:65:33: warning: 'CURLFORM_COPYNAME' is deprecated: since 7.56.0. Use curl_mime_name() [-Wdeprecated-declarations]
   65 |                                 CURLFORM_COPYNAME, "json_file",
      |                                 ^~~~~~~~~~~~~~~~~
In file included from /usr/src/RPM/BUILD/kcov-38/src/writers/coveralls-writer.cc:16:
/usr/include/curl/curl.h:2504:3: note: declared here
 2504 |   CURLFORM_COPYNAME        CURL_DEPRECATED(7.56.0, "Use curl_mime_name()"),
      |   ^~~~~~~~~~~~~~~~~
/usr/src/RPM/BUILD/kcov-38/src/writers/coveralls-writer.cc:66:33: warning: 'CURLFORM_FILE' is deprecated: since 7.56.0. Use curl_mime_filedata() [-Wdeprecated-declarations]
   66 |                                 CURLFORM_FILE, fileName.c_str(),
      |                                 ^~~~~~~~~~~~~
/usr/include/curl/curl.h:2513:3: note: declared here
 2513 |   CURLFORM_FILE            CURL_DEPRECATED(7.56.0, "Use curl_mime_filedata()"),
      |   ^~~~~~~~~~~~~
/usr/src/RPM/BUILD/kcov-38/src/writers/coveralls-writer.cc:63:29: warning: 'CURLFORMcode curl_formadd(curl_httppost**, curl_httppost**, ...)' is deprecated: since 7.56.0. Use curl_mime_init() [-Wdeprecated-declarations]
   63 |                 curl_formadd(&formpost,
      |                 ~~~~~~~~~~~~^~~~~~~~~~~
   64 |                                 &lastptr,
      |                                 ~~~~~~~~~
   65 |                                 CURLFORM_COPYNAME, "json_file",
      |                                 ~~~~~~~~~~~~~~~~~~~~~~~~~~~~~~~
   66 |                                 CURLFORM_FILE, fileName.c_str(),
      |                                 ~~~~~~~~~~~~~~~~~~~~~~~~~~~~~~~~
   67 |                                 CURLFORM_END);
      |                                 ~~~~~~~~~~~~~
/usr/include/curl/curl.h:2579:1: note: declared here
 2579 | curl_formadd(struct curl_httppost **httppost,
      | ^~~~~~~~~~~~
/usr/src/RPM/BUILD/kcov-38/src/writers/coveralls-writer.cc:69:42: warning: 'CURLOPT_HTTPPOST' is deprecated: since 7.56.0. Use CURLOPT_MIMEPOST [-Wdeprecated-declarations]
   69 |                 curl_easy_setopt(m_curl, CURLOPT_HTTPPOST, formpost);
      |                                          ^~~~~~~~~~~~~~~~
/usr/include/curl/curl.h:1199:3: note: declared here
 1199 |   CURLOPTDEPRECATED(CURLOPT_HTTPPOST, CURLOPTTYPE_OBJECTPOINT, 24,
      |   ^~~~~~~~~~~~~~~~~
/usr/src/RPM/BUILD/kcov-38/src/writers/coveralls-writer.cc:73:30: warning: 'void curl_formfree(curl_httppost*)' is deprecated: since 7.56.0. Use curl_mime_free() [-Wdeprecated-declarations]
   73 |                 curl_formfree(formpost);
      |                 ~~~~~~~~~~~~~^~~~~~~~~~
/usr/include/curl/curl.h:2615:1: note: declared here
 2615 | curl_formfree(struct curl_httppost *form);
      | ^~~~~~~~~~~~~
[50/73] Building CXX object src/CMakeFiles/kcov.dir/writers/writer-base.cc.o
[51/73] Building CXX object src/CMakeFiles/kcov.dir/writers/html-writer.cc.o
[52/73] Building CXX object src/CMakeFiles/kcov.dir/writers/sonarqube-xml-writer.cc.o
[53/73] Building CXX object src/CMakeFiles/kcov.dir/merge-file-parser.cc.o
[54/73] Building CXX object src/CMakeFiles/kcov.dir/engines/ptrace_linux.cc.o
[55/73] Building C object src/CMakeFiles/kcov.dir/solib-parser/phdr_data.c.o
[56/73] Building CXX object src/CMakeFiles/kcov.dir/python-helper.cc.o
[57/73] Building CXX object src/CMakeFiles/kcov.dir/bash-helper.cc.o
[58/73] Building CXX object src/CMakeFiles/kcov.dir/bash-redirector-library.cc.o
[59/73] Building C object src/CMakeFiles/kcov.dir/version.c.o
[60/73] Building CXX object src/CMakeFiles/kcov.dir/library.cc.o
[61/73] Building CXX object src/CMakeFiles/kcov.dir/engines/clang-coverage-engine.cc.o
[62/73] Building CXX object src/CMakeFiles/kcov.dir/reporter.cc.o
[63/73] Building CXX object src/CMakeFiles/kcov.dir/engines/kernel-engine.cc.o
[64/73] Building CXX object src/CMakeFiles/kcov.dir/parsers/dwarf.cc.o
[65/73] Building CXX object src/CMakeFiles/kcov.dir/parsers/elf.cc.o
[66/73] Building CXX object src/CMakeFiles/kcov.dir/engines/ptrace.cc.o
/usr/src/RPM/BUILD/kcov-38/src/engines/ptrace.cc: In member function 'const kcov::IEngine::Event Ptrace::waitEvent()':
/usr/src/RPM/BUILD/kcov-38/src/engines/ptrace.cc:217:83: warning: format '%zx' expects argument of type 'size_t', but argument 3 has type 'uint64_t' {aka 'long long unsigned int'} [-Wformat=]
  217 |                                 kcov_debug(ENGINE_MSG, "Looking for instruction %zx.\n", out.addr);
      |                                                                                 ~~^      ~~~~~~~~
      |                                                                                   |          |
      |                                                                                   |          uint64_t {aka long long unsigned int}
      |                                                                                   unsigned int
      |                                                                                 %llx
[67/73] Building CXX object src/CMakeFiles/kcov.dir/system-mode/file-data.cc.o
[68/73] Building CXX object src/CMakeFiles/kcov.dir/html-data-files.cc.o
[69/73] Building CXX object src/CMakeFiles/kcov.dir/solib-handler.cc.o
[70/73] Building CXX object src/CMakeFiles/kcov.dir/parsers/elf-parser.cc.o
[71/73] Linking CXX executable src/kcov-system-daemon
[72/73] Building CXX object src/CMakeFiles/kcov.dir/kcov-system-library.cc.o
[73/73] Linking CXX executable src/kcov
+ cmake -S tests -B build-tests -G Ninja
CMake Deprecation Warning at CMakeLists.txt:1 (cmake_minimum_required):
  Compatibility with CMake < 2.8.12 will be removed from a future version of
  CMake.

  Update the VERSION argument <min> value or use a ...<max> suffix to tell
  CMake that the project does not need compatibility with older versions.


-- The C compiler identification is GNU 12.2.1
-- The CXX compiler identification is GNU 12.2.1
-- Detecting C compiler ABI info
-- Detecting C compiler ABI info - done
-- Check for working C compiler: /usr/bin/cc - skipped
-- Detecting C compile features
-- Detecting C compile features - done
-- Detecting CXX compiler ABI info
-- Detecting CXX compiler ABI info - done
-- Check for working CXX compiler: /usr/bin/c++ - skipped
-- Detecting CXX compile features
-- Detecting CXX compile features - done
-- The ASM compiler identification is GNU
-- Found assembler: /usr/bin/cc
-- Looking for pthread.h
-- Looking for pthread.h - found
-- Performing Test CMAKE_HAVE_LIBC_PTHREAD
-- Performing Test CMAKE_HAVE_LIBC_PTHREAD - Success
-- Found Threads: TRUE  
-- Found ZLIB: /usr/lib/libz.so (found version "1.2.13") 
-- Found DL: /usr/lib/libdl.a
-- Found M: /usr/lib/libm.so
-- Configuring done
-- Generating done
-- Build files have been written to: /usr/src/RPM/BUILD/kcov-38/build-tests
+ /usr/bin/ninja -j16 -C build-tests
ninja: Entering directory `build-tests'
[1/56] Building ASM object CMakeFiles/shared_library.dir/shared-library/big-symbol.S.o
[2/56] Building C object CMakeFiles/multi_1.dir/merge-tests/file.c.o
[3/56] Building C object CMakeFiles/shared_library.dir/shared-library/solib.c.o
[4/56] Building C object CMakeFiles/main-tests.dir/subdir/file.c.o
[5/56] Building C object CMakeFiles/main-tests.dir/subdir2/file2.c.o
[6/56] Building C object CMakeFiles/shared_library_test.dir/shared-library/main.c.o
[7/56] Building C object CMakeFiles/argv_dependent.dir/argv-dependent.c.o
[8/56] Building CXX object CMakeFiles/main-tests.dir/main.cc.o
[9/56] Building C object CMakeFiles/multi_1.dir/merge-tests/main_1.c.o
[10/56] Building C object CMakeFiles/vfork.dir/fork/vfork.c.o
[11/56] Building C object CMakeFiles/test_popen.dir/popen/test-popen.c.o
[12/56] Building C object CMakeFiles/fork.dir/fork/fork.c.o
[13/56] Building C object CMakeFiles/fork_no_wait.dir/fork/fork-no-wait.c.o
[14/56] Building C object CMakeFiles/multi_2.dir/merge-tests/file.c.o
[15/56] Building C object CMakeFiles/multi_2.dir/merge-tests/main_2.c.o
[16/56] Linking C shared library libshared_library.so
[17/56] Building CXX object CMakeFiles/test_daemon.dir/daemon/test-daemon.cc.o
[18/56] Linking C executable argv_dependent
[19/56] Building C object CMakeFiles/signals.dir/signals/test-signals.c.o
[20/56] Linking C executable multi_1
[21/56] Linking C executable vfork
[22/56] Linking C executable test_popen
[23/56] Linking C executable fork
[24/56] Linking C executable multi_2
[25/56] Linking CXX executable main-tests
[26/56] Linking C executable fork_no_wait
[27/56] Linking C executable shared_library_test
[28/56] Building CXX object CMakeFiles/dlopen.dir/dlopen/dlopen.cc.o
[29/56] Building C object CMakeFiles/s.dir/short-file.c.o
[30/56] cd /usr/src/RPM/BUILD/kcov-38/build-tests && /usr/bin/strip -o tests-stripped main-tests
[31/56] Linking C executable signals
[32/56] Building C object CMakeFiles/pie.dir/pie.c.o
[33/56] cd /usr/src/RPM/BUILD/kcov-38/build-tests && /usr/bin/cc -nostdlib /usr/src/RPM/BUILD/kcov-38/tests/assembly/illegal-insn.S -o /usr/src/RPM/BUILD/kcov-38/build-tests/illegal-insn
[34/56] Building C object CMakeFiles/pie-test.dir/argv-dependent.c.o
[35/56] Generating multi-fork-generated.c
[36/56] Building C object CMakeFiles/fork+exec.dir/fork/fork+exec.c.o
[37/56] Building CXX object CMakeFiles/dlopen.dir/dlopen/dlopen-main.cc.o
[38/56] Linking CXX executable test_daemon
[39/56] Building C object CMakeFiles/thread-test.dir/threads/thread-main.c.o
[40/56] Linking C executable s
[41/56] Building CXX object CMakeFiles/recursive-ptrace.dir/recursive-ptrace/main.cc.o
[42/56] Linking C executable pie
[43/56] Linking C executable pie-test
[44/56] Linking C executable fork+exec
[45/56] Linking C executable thread-test
[46/56] Linking CXX executable dlopen
[47/56] Linking CXX executable recursive-ptrace
[48/56] Building CXX object CMakeFiles/global-constructors.dir/global-constructors/test-global-ctors.cc.o
[49/56] Linking CXX executable global-constructors
[50/56] Building CXX object CMakeFiles/setpgid-kill.dir/setpgid-kill/setpgid-kill-main.cc.o
[51/56] Building CXX object CMakeFiles/issue31.dir/daemon/test-issue31.cc.o
[52/56] Linking CXX executable issue31
[53/56] Building CXX object CMakeFiles/setpgid-kill.dir/usr/src/RPM/BUILD/kcov-38/src/utils.cc.o
[54/56] Linking CXX executable setpgid-kill
[55/56] Building C object CMakeFiles/multi_fork.dir/multi-fork/test-multi-fork.c.o
[56/56] Linking C executable multi_fork
+ cmake -S tools -B build-tools -G Ninja
CMake Deprecation Warning at CMakeLists.txt:1 (cmake_minimum_required):
  Compatibility with CMake < 2.8.12 will be removed from a future version of
  CMake.

  Update the VERSION argument <min> value or use a ...<max> suffix to tell
  CMake that the project does not need compatibility with older versions.


-- The C compiler identification is GNU 12.2.1
-- The CXX compiler identification is GNU 12.2.1
-- Detecting C compiler ABI info
-- Detecting C compiler ABI info - done
-- Check for working C compiler: /usr/bin/cc - skipped
-- Detecting C compile features
-- Detecting C compile features - done
-- Detecting CXX compiler ABI info
-- Detecting CXX compiler ABI info - done
-- Check for working CXX compiler: /usr/bin/c++ - skipped
-- Detecting CXX compile features
-- Detecting CXX compile features - done
Package libzstd was not found in the pkg-config search path.
Perhaps you should add the directory containing `libzstd.pc'
to the PKG_CONFIG_PATH environment variable
Package 'libzstd', required by 'libelf', not found
Package libzstd was not found in the pkg-config search path.
Perhaps you should add the directory containing `libzstd.pc'
to the PKG_CONFIG_PATH environment variable
Package 'libzstd', required by 'libelf', not found
Package libzstd was not found in the pkg-config search path.
Perhaps you should add the directory containing `libzstd.pc'
to the PKG_CONFIG_PATH environment variable
Package 'libzstd', required by 'libelf', not found
Package libzstd was not found in the pkg-config search path.
Perhaps you should add the directory containing `libzstd.pc'
to the PKG_CONFIG_PATH environment variable
Package 'libzstd', required by 'libelf', not found
-- Found LibElf: /usr/lib/libelf.so  
Package libzstd was not found in the pkg-config search path.
Perhaps you should add the directory containing `libzstd.pc'
to the PKG_CONFIG_PATH environment variable
Package 'libzstd', required by 'libelf', not found
Package libzstd was not found in the pkg-config search path.
Perhaps you should add the directory containing `libzstd.pc'
to the PKG_CONFIG_PATH environment variable
Package 'libzstd', required by 'libelf', not found
Package libzstd was not found in the pkg-config search path.
Perhaps you should add the directory containing `libzstd.pc'
to the PKG_CONFIG_PATH environment variable
Package 'libzstd', required by 'libelf', not found
Package libzstd was not found in the pkg-config search path.
Perhaps you should add the directory containing `libzstd.pc'
to the PKG_CONFIG_PATH environment variable
Package 'libzstd', required by 'libelf', not found
CMake Warning (dev) at /usr/share/cmake/Modules/FindPackageHandleStandardArgs.cmake:438 (message):
  The package name passed to `find_package_handle_standard_args` (ElfUtils)
  does not match the name of the calling package (Elfutils).  This can lead
  to problems in calling code that expects `find_package` result variables
  (e.g., `_FOUND`) to follow a certain pattern.
Call Stack (most recent call first):
  /usr/src/RPM/BUILD/kcov-38/cmake/FindElfutils.cmake:70 (find_package_handle_standard_args)
  CMakeLists.txt:14 (find_package)
This warning is for project developers.  Use -Wno-dev to suppress it.

-- Found ElfUtils: /usr/lib/libdw.so  
-- Found PkgConfig: /usr/bin/pkg-config (found version "0.29.2") 
-- Looking for pthread.h
-- Looking for pthread.h - found
-- Performing Test CMAKE_HAVE_LIBC_PTHREAD
-- Performing Test CMAKE_HAVE_LIBC_PTHREAD - Success
-- Found Threads: TRUE  
-- Found ZLIB: /usr/lib/libz.so (found version "1.2.13") 
-- Found DL: /usr/lib/libdl.a
-- Found M: /usr/lib/libm.so
-- Configuring done
-- Generating done
-- Build files have been written to: /usr/src/RPM/BUILD/kcov-38/build-tools
+ /usr/bin/ninja -j16 -C build-tools
ninja: Entering directory `build-tools'
[1/12] Building CXX object CMakeFiles/line2addr.dir/usr/src/RPM/BUILD/kcov-38/src/parsers/dummy-disassembler.cc.o
[2/12] Building CXX object CMakeFiles/line2addr.dir/usr/src/RPM/BUILD/kcov-38/src/parsers/dwarf.cc.o
[3/12] Building CXX object CMakeFiles/line2addr.dir/line2addr.cc.o
[4/12] Building CXX object CMakeFiles/line2addr.dir/usr/src/RPM/BUILD/kcov-38/src/parser-manager.cc.o
[5/12] Building CXX object CMakeFiles/line2addr.dir/usr/src/RPM/BUILD/kcov-38/src/filter.cc.o
[6/12] Building CXX object CMakeFiles/line2addr.dir/usr/src/RPM/BUILD/kcov-38/src/parsers/elf.cc.o
[7/12] Building CXX object CMakeFiles/line2addr.dir/usr/src/RPM/BUILD/kcov-38/src/capabilities.cc.o
[8/12] Building CXX object CMakeFiles/line2addr.dir/usr/src/RPM/BUILD/kcov-38/src/utils.cc.o
[9/12] Building CXX object CMakeFiles/line2addr.dir/usr/src/RPM/BUILD/kcov-38/src/gcov.cc.o
[10/12] Building CXX object CMakeFiles/line2addr.dir/usr/src/RPM/BUILD/kcov-38/src/parsers/elf-parser.cc.o
[11/12] Building CXX object CMakeFiles/line2addr.dir/usr/src/RPM/BUILD/kcov-38/src/configuration.cc.o
[12/12] Linking CXX executable line2addr
+ exit 0
Executing(%install): /bin/sh -e /usr/src/tmp/rpm-tmp.64200
+ umask 022
+ /bin/mkdir -p /usr/src/RPM/BUILD
+ cd /usr/src/RPM/BUILD
+ /bin/chmod -Rf u+rwX -- /usr/src/tmp/kcov-buildroot
+ :
+ /bin/rm -rf -- /usr/src/tmp/kcov-buildroot
+ PATH=/usr/libexec/rpm-build:/usr/src/bin:/bin:/usr/bin:/usr/X11R6/bin:/usr/games
+ cd kcov-38
+ DESTDIR=/usr/src/tmp/kcov-buildroot
+ /usr/bin/ninja -j16 install -C BUILD
ninja: Entering directory `BUILD'
[0/1] Install the project...
-- Install configuration: "Release"
-- Installing: /usr/src/tmp/kcov-buildroot/usr/share/doc/kcov-38/ChangeLog
-- Installing: /usr/src/tmp/kcov-buildroot/usr/share/doc/kcov-38/COPYING
-- Installing: /usr/src/tmp/kcov-buildroot/usr/share/doc/kcov-38/COPYING.externals
-- Installing: /usr/src/tmp/kcov-buildroot/usr/bin/kcov
-- Installing: /usr/src/tmp/kcov-buildroot/usr/bin/kcov-system-daemon
-- Installing: /usr/src/tmp/kcov-buildroot/usr/share/man/man1/kcov.1
+ /usr/lib/rpm/brp-alt
Cleaning files in /usr/src/tmp/kcov-buildroot (auto)
Verifying and fixing files in /usr/src/tmp/kcov-buildroot (binconfig,pkgconfig,libtool,desktop,gnuconfig)
Checking contents of files in /usr/src/tmp/kcov-buildroot/ (default)
Compressing files in /usr/src/tmp/kcov-buildroot (auto)
Verifying ELF objects in /usr/src/tmp/kcov-buildroot (arch=normal,fhs=normal,lfs=relaxed,lint=relaxed,rpath=normal,stack=normal,textrel=normal,unresolved=normal)
verify-elf: WARNING: ./usr/bin/kcov-system-daemon: uses non-LFS functions: fopen lstat mmap open readdir
verify-elf: WARNING: ./usr/bin/kcov: uses non-LFS functions: fopen getrlimit lstat mmap open readdir stat
Executing(%check): /bin/sh -e /usr/src/tmp/rpm-tmp.7931
+ umask 022
+ /bin/mkdir -p /usr/src/RPM/BUILD
+ cd /usr/src/RPM/BUILD
+ cd kcov-38
++ pwd
++ pwd
+ tests/tools/run-tests BUILD/src/kcov /tmp /usr/src/RPM/BUILD/kcov-38/build-tests /usr/src/RPM/BUILD/kcov-38 -v
runTest (basic.LookupBinaryInPath.runTest) ... expected failure
runTest (compiled.Pie.runTest) ... ok
runTest (basic.TooFewArguments.runTest) ... ok
runTest (basic.WrongArguments.runTest) ... ok
runTest (accumulate.accumulate_data.runTest) ... FAIL
runTest (compiled.address_sanitizer_coverage.runTest) ... expected failure
runTest (compiled.attach_process_with_threads.runTest) ... ERROR
runTest (compiled.attach_process_with_threads_creates_threads.runTest) ... ERROR
runTest (bash.bash_accumulate_changed_data.runTest) ... ok
runTest (bash.bash_accumulate_data.runTest) ... ok
runTest (bash.bash_can_find_non_executed_scripts.runTest) ... ok
runTest (bash.bash_can_find_non_executed_scripts_manually.runTest) ... ok
runTest (bash.bash_can_ignore_function_with_spaces.runTest) ... ok
runTest (bash.bash_can_ignore_non_executed_scripts.runTest) ... ok
runTest (bash.bash_coverage.runTest) ... ok
runTest (bash.bash_coverage_debug_trap.runTest) ... ok
runTest (bash.bash_coverage_tricky.runTest) ... ok
runTest (bash.bash_dollar_var_replacement.runTest) ... ok
runTest (bash.bash_done_eof.runTest) ... ok
runTest (bash.bash_eof_backtick.runTest) ... ok
runTest (bash.bash_exit_status.runTest) ... ok
runTest (bash.bash_handle_all_output.runTest) ... ok
runTest (bash.bash_heredoc_backslashes.runTest) ... ok
runTest (bash.bash_heredoc_special_cases_issue_44.runTest) ... ok
runTest (bash.bash_honor_signal.runTest) ... ok
runTest (bash.bash_ignore_uncovered.runTest) ... ok
runTest (bash.bash_issue_116_arithmetic_and_heredoc_issue_117_comment_within_string.runTest) ... ok
runTest (bash.bash_merge_data_issue_38.runTest) ... ok
runTest (bash.bash_multiline_backslashes.runTest) ... ok
runTest (bash.bash_multiline_quotes.runTest) ... ok
runTest (bash.bash_no_executed_lines.runTest) ... ok
runTest (bash.bash_non_empty_braces.runTest) ... ok
runTest (bash_linux_only.bash_sh_shebang.runTest) ... ok
runTest (bash.bash_short_file.runTest) ... ok
runTest (bash.bash_stderr_redirection.runTest) ... ok
runTest (bash.bash_subshell.runTest) ... ok
runTest (compiled.collect_and_report_only.runTest) ... FAIL
runTest (compiled.collect_no_source.runTest) ... expected failure
runTest (compiled.daemon_no_wait_for_last_child.runTest) ... expected failure
runTest (compiled.daemon_wait_for_last_child.runTest) ... ok
runTest (compiled.debuglink.runTest) ... ok
runTest (compiled.dlopen.runTest) ... expected failure
runTest (compiled.dlopen_in_ignored_source_file.runTest) ... expected failure
runTest (accumulate.dont_accumulate_data_with_clean.runTest) ... FAIL
runTest (compiled.fork_64.runTest) ... ok
runTest (compiled.fork_no_wait.runTest) ... ok
runTest (compiled.global_ctors.runTest) ... ok
runTest (compiled.illegal_insn.runTest) ... ok
runTest (filter.include_exclude_pattern.runTest) ... ok
runTest (filter.include_path.runTest) ... ok
runTest (filter.include_path_and_exclude_pattern.runTest) ... ok
runTest (compiled.main_test.runTest) ... FAIL
runTest (compiled.main_test_lldb_raw_breakpoints.runTest) ... FAIL
runTest (compiled.main_test_verify.runTest) ... ok
runTest (accumulate.merge_basic.runTest) ... ERROR
runTest (accumulate.merge_coveralls.runTest) ... FAIL
runTest (accumulate.merge_merged_output.runTest) ... FAIL
runTest (accumulate.merge_multiple_output_directories.runTest) ... FAIL
runTest (compiled.merge_same_file_in_multiple_binaries.runTest) ... ok
runTest (compiled.pie_accumulate.runTest) ... ok
runTest (compiled.pie_argv_basic.runTest) ... ok
runTest (compiled.popen_test.runTest) ... ok
runTest (python.python3_coverage.runTest) ... ok
runTest (python.python_accumulate_data.runTest) ... FAIL
runTest (python.python_can_set_illegal_parser.runTest) ... ok
runTest (python.python_can_set_legal_parser.runTest) ... ok
runTest (python.python_exit_status.runTest) ... ok
runTest (python.python_short_file.runTest) ... FAIL
runTest (python.python_tricky_single_dict_assignment.runTest) ... expected failure
runTest (python.python_tricky_single_line_string_assignment.runTest) ... FAIL
runTest (python.python_unittest.runTest) ... FAIL
runTest (compiled.setpgid_kill.runTest) ... ok
runTest (compiled.shared_library.runTest) ... ok
runTest (compiled.shared_library_accumulate.runTest) ... ok
runTest (compiled.shared_library_filter_out.runTest) ... ok
runTest (compiled.shared_library_skip.runTest) ... FAIL
runTest (compiled.short_filename.runTest) ... expected failure
runTest (compiled.signals.runTest) ... ok
runTest (compiled.signals_crash.runTest) ... ok
runTest (compiled.signals_self.runTest) ... ok
runTest (system_mode.system_mode_can_instrument_binary.runTest) ... ok
runTest (system_mode.system_mode_can_record_and_report_binary.runTest) ... skipped 'x86_64-only'
runTest (system_mode.system_mode_can_start_and_stop_daemon.runTest) ... ok
runTest (compiled.vfork.runTest) ... ok

======================================================================
ERROR: runTest (compiled.attach_process_with_threads.runTest)
----------------------------------------------------------------------
Traceback (most recent call last):
  File "/usr/src/RPM/BUILD/kcov-38/tests/tools/compiled.py", line 298, in runTest
    assert parse_cobertura.hitsPerLine(dom, "test-issue31.cc", 28) >= 1
           ^^^^^^^^^^^^^^^^^^^^^^^^^^^^^^^^^^^^^^^^^^^^^^^^^^^^^^^^^^^^
TypeError: '>=' not supported between instances of 'NoneType' and 'int'

======================================================================
ERROR: runTest (compiled.attach_process_with_threads_creates_threads.runTest)
----------------------------------------------------------------------
Traceback (most recent call last):
  File "/usr/src/RPM/BUILD/kcov-38/tests/tools/compiled.py", line 308, in runTest
    assert parse_cobertura.hitsPerLine(dom, "thread-main.c", 21) >= 1
           ^^^^^^^^^^^^^^^^^^^^^^^^^^^^^^^^^^^^^^^^^^^^^^^^^^^^^^^^^^
TypeError: '>=' not supported between instances of 'NoneType' and 'int'

======================================================================
ERROR: runTest (accumulate.merge_basic.runTest)
----------------------------------------------------------------------
Traceback (most recent call last):
  File "/usr/src/RPM/BUILD/kcov-38/tests/tools/accumulate.py", line 43, in runTest
    dom = parse_cobertura.parseFile(testbase.outbase + "/kcov/kcov-merged/cobertura.xml")
          ^^^^^^^^^^^^^^^^^^^^^^^^^^^^^^^^^^^^^^^^^^^^^^^^^^^^^^^^^^^^^^^^^^^^^^^^^^^^^^^
  File "/usr/src/RPM/BUILD/kcov-38/tests/tools/parse_cobertura.py", line 46, in parseFile
    dom = xml.dom.minidom.parseString(readFile(filename))
                                      ^^^^^^^^^^^^^^^^^^
  File "/usr/src/RPM/BUILD/kcov-38/tests/tools/parse_cobertura.py", line 9, in readFile
    f = open(name,'r')
        ^^^^^^^^^^^^^^
FileNotFoundError: [Errno 2] No such file or directory: '/tmp/kcov/kcov-merged/cobertura.xml'

======================================================================
FAIL: runTest (accumulate.accumulate_data.runTest)
----------------------------------------------------------------------
Traceback (most recent call last):
  File "/usr/src/RPM/BUILD/kcov-38/tests/tools/accumulate.py", line 11, in runTest
    assert parse_cobertura.hitsPerLine(dom, "main", 16) == 1
AssertionError

======================================================================
FAIL: runTest (compiled.collect_and_report_only.runTest)
----------------------------------------------------------------------
Traceback (most recent call last):
  File "/usr/src/RPM/BUILD/kcov-38/tests/tools/compiled.py", line 282, in runTest
    assert parse_cobertura.hitsPerLine(dom, "main.cc", 9) == 1
AssertionError

======================================================================
FAIL: runTest (accumulate.dont_accumulate_data_with_clean.runTest)
----------------------------------------------------------------------
Traceback (most recent call last):
  File "/usr/src/RPM/BUILD/kcov-38/tests/tools/accumulate.py", line 27, in runTest
    assert parse_cobertura.hitsPerLine(dom, "main", 16) == 1
AssertionError

======================================================================
FAIL: runTest (compiled.main_test.runTest)
----------------------------------------------------------------------
Traceback (most recent call last):
  File "/usr/src/RPM/BUILD/kcov-38/tests/tools/compiled.py", line 123, in runTest
    self.doTest("")
  File "/usr/src/RPM/BUILD/kcov-38/tests/tools/compiled.py", line 113, in doTest
    assert parse_cobertura.hitsPerLine(dom, "main.cc", 9) == 1
AssertionError

======================================================================
FAIL: runTest (compiled.main_test_lldb_raw_breakpoints.runTest)
----------------------------------------------------------------------
Traceback (most recent call last):
  File "/usr/src/RPM/BUILD/kcov-38/tests/tools/compiled.py", line 131, in runTest
    self.doTest("--configure=lldb-use-raw-breakpoint-writes=1")
  File "/usr/src/RPM/BUILD/kcov-38/tests/tools/compiled.py", line 113, in doTest
    assert parse_cobertura.hitsPerLine(dom, "main.cc", 9) == 1
AssertionError

======================================================================
FAIL: runTest (accumulate.merge_coveralls.runTest)
----------------------------------------------------------------------
Traceback (most recent call last):
  File "/usr/src/RPM/BUILD/kcov-38/tests/tools/accumulate.py", line 78, in runTest
    assert rv == 0
AssertionError

======================================================================
FAIL: runTest (accumulate.merge_merged_output.runTest)
----------------------------------------------------------------------
Traceback (most recent call last):
  File "/usr/src/RPM/BUILD/kcov-38/tests/tools/accumulate.py", line 67, in runTest
    assert parse_cobertura.hitsPerLine(dom, "main", 10) == 1
AssertionError

======================================================================
FAIL: runTest (accumulate.merge_multiple_output_directories.runTest)
----------------------------------------------------------------------
Traceback (most recent call last):
  File "/usr/src/RPM/BUILD/kcov-38/tests/tools/accumulate.py", line 54, in runTest
    assert parse_cobertura.hitsPerLine(dom, "main", 10) == 1
AssertionError

======================================================================
FAIL: runTest (python.python_accumulate_data.runTest)
----------------------------------------------------------------------
Traceback (most recent call last):
  File "/usr/src/RPM/BUILD/kcov-38/tests/tools/python.py", line 75, in runTest
    assert parse_cobertura.hitsPerLine(dom, "main", 16) == 0
AssertionError

======================================================================
FAIL: runTest (python.python_short_file.runTest)
----------------------------------------------------------------------
Traceback (most recent call last):
  File "/usr/src/RPM/BUILD/kcov-38/tests/tools/python.py", line 41, in runTest
    assert parse_cobertura.hitsPerLine(dom, "short-test.py", 6) == 1
AssertionError

======================================================================
FAIL: runTest (python.python_tricky_single_line_string_assignment.runTest)
----------------------------------------------------------------------
Traceback (most recent call last):
  File "/usr/src/RPM/BUILD/kcov-38/tests/tools/python.py", line 94, in runTest
    assert parse_cobertura.hitsPerLine(dom, "second.py", 34) == 2
AssertionError

======================================================================
FAIL: runTest (python.python_unittest.runTest)
----------------------------------------------------------------------
Traceback (most recent call last):
  File "/usr/src/RPM/BUILD/kcov-38/tests/tools/python.py", line 33, in runTest
    assert parse_cobertura.hitsPerLine(dom, "testdriver", 14) == 1
AssertionError

======================================================================
FAIL: runTest (compiled.shared_library_skip.runTest)
----------------------------------------------------------------------
Traceback (most recent call last):
  File "/usr/src/RPM/BUILD/kcov-38/tests/tools/compiled.py", line 76, in runTest
    assert parse_cobertura.hitsPerLine(dom, "main.c", 9) == 1
AssertionError

----------------------------------------------------------------------
Ran 84 tests in 115.414s

FAILED (failures=13, errors=3, skipped=1, expected failures=8)
Clang-only
+ :
+ exit 0
Processing files: kcov-38-alt3
Finding Provides (using /usr/lib/rpm/find-provides)
Executing: /bin/sh -e /usr/src/tmp/rpm-tmp.AZV713
find-provides: running scripts (alternatives,debuginfo,lib,pam,perl,pkgconfig,python,python3,shell)
Finding Requires (using /usr/lib/rpm/find-requires)
Executing: /bin/sh -e /usr/src/tmp/rpm-tmp.1GCiQn
find-requires: running scripts (cpp,debuginfo,files,lib,pam,perl,pkgconfig,pkgconfiglib,python,python3,rpmlib,shebang,shell,static,symlinks,systemd-services)
Requires: /lib/ld-linux.so.2, libc.so.6(GLIBC_2.0), libc.so.6(GLIBC_2.1), libc.so.6(GLIBC_2.1.3), libc.so.6(GLIBC_2.11), libc.so.6(GLIBC_2.15), libc.so.6(GLIBC_2.2), libc.so.6(GLIBC_2.2.3), libc.so.6(GLIBC_2.28), libc.so.6(GLIBC_2.3), libc.so.6(GLIBC_2.3.2), libc.so.6(GLIBC_2.3.4), libc.so.6(GLIBC_2.33), libc.so.6(GLIBC_2.34), libc.so.6(GLIBC_2.4), libc.so.6(GLIBC_2.6), libc.so.6(GLIBC_2.7), libc.so.6(GLIBC_2.8), libcurl.so.4 >= set:khyWzuBCbXlRpg2R2P390, libdw.so.1 >= set:lhSDBiikr6DXPR3vmQ2eW8SGXkYamiY4WtC9, libdw.so.1(ELFUTILS_0.122), libdw.so.1(ELFUTILS_0.127), libelf.so.1 >= set:kfYe1e3O4XaTj9o71uWqNZ14JnfWfV44Bg6uRLguk, libelf.so.1(ELFUTILS_1.0), libelf.so.1(ELFUTILS_1.5), libgcc_s.so.1(GCC_3.0), libgcc_s.so.1(GCC_3.3.1), libgcc_s.so.1(GLIBC_2.0), libstdc++.so.6(CXXABI_1.3), libstdc++.so.6(CXXABI_1.3.5), libstdc++.so.6(GLIBCXX_3.4), libstdc++.so.6(GLIBCXX_3.4.11), libstdc++.so.6(GLIBCXX_3.4.15), libstdc++.so.6(GLIBCXX_3.4.18), libstdc++.so.6(GLIBCXX_3.4.20), libstdc++.so.6(GLIBCXX_3.4.21), libstdc++.so.6(GLIBCXX_3.4.29), libstdc++.so.6(GLIBCXX_3.4.9), libz.so.1 >= set:khA48jieD52BZ9ROZmGZA0, libz.so.1(ZLIB_1.2.0), rtld(GNU_HASH)
Requires(rpmlib): rpmlib(SetVersions)
Finding debuginfo files (using /usr/lib/rpm/find-debuginfo-files)
Executing: /bin/sh -e /usr/src/tmp/rpm-tmp.MIwbZ0
Creating kcov-debuginfo package
Processing files: kcov-debuginfo-38-alt3
Finding Provides (using /usr/lib/rpm/find-provides)
Executing: /bin/sh -e /usr/src/tmp/rpm-tmp.s5RI0N
find-provides: running scripts (debuginfo)
Finding Requires (using /usr/lib/rpm/find-requires)
Executing: /bin/sh -e /usr/src/tmp/rpm-tmp.A1lh2j
find-requires: running scripts (debuginfo)
Requires: kcov = 38-alt3, /usr/lib/debug/lib/ld-linux.so.2.debug, debug(libc.so.6), debug(libcurl.so.4), debug(libdw.so.1), debug(libelf.so.1), debug(libgcc_s.so.1), debug(libstdc++.so.6), debug(libz.so.1)
Adding to kcov-debuginfo a strict dependency on kcov
Wrote: /usr/src/RPM/RPMS/i586/kcov-38-alt3.i586.rpm (w2.lzdio)
Wrote: /usr/src/RPM/RPMS/i586/kcov-debuginfo-38-alt3.i586.rpm (w2T16.xzdio)
99.68user 35.27system 2:14.02elapsed 100%CPU (0avgtext+0avgdata 130800maxresident)k
0inputs+0outputs (0major+6406388minor)pagefaults 0swaps
2.30user 1.38system 2:23.90elapsed 2%CPU (0avgtext+0avgdata 109700maxresident)k
96inputs+0outputs (0major+283572minor)pagefaults 0swaps
--- kcov-38-alt3.i586.rpm.repo	2021-06-15 10:41:16.000000000 +0000
+++ kcov-38-alt3.i586.rpm.hasher	2023-06-17 06:32:13.193280570 +0000
@@ -17,3 +17,6 @@
 Requires: libc.so.6(GLIBC_2.3)  
+Requires: libc.so.6(GLIBC_2.3.2)  
 Requires: libc.so.6(GLIBC_2.3.4)  
+Requires: libc.so.6(GLIBC_2.33)  
+Requires: libc.so.6(GLIBC_2.34)  
 Requires: libc.so.6(GLIBC_2.4)  
@@ -24,4 +27,2 @@
 Requires: rpmlib(SetVersions)  
-Requires: libdl.so.2(GLIBC_2.0)  
-Requires: libdl.so.2(GLIBC_2.1)  
 Requires: libdw.so.1 >= set:lhSDBiikr6DXPR3vmQ2eW8SGXkYamiY4WtC9
@@ -33,8 +34,4 @@
 Requires: libgcc_s.so.1(GCC_3.0)  
+Requires: libgcc_s.so.1(GCC_3.3.1)  
 Requires: libgcc_s.so.1(GLIBC_2.0)  
-Requires: libpthread.so.0(GLIBC_2.0)  
-Requires: libpthread.so.0(GLIBC_2.1)  
-Requires: libpthread.so.0(GLIBC_2.1.1)  
-Requires: libpthread.so.0(GLIBC_2.2)  
-Requires: libpthread.so.0(GLIBC_2.3.2)  
 Requires: libstdc++.so.6(CXXABI_1.3)  
@@ -47,2 +44,3 @@
 Requires: libstdc++.so.6(GLIBCXX_3.4.21)  
+Requires: libstdc++.so.6(GLIBCXX_3.4.29)  
 Requires: libstdc++.so.6(GLIBCXX_3.4.9)  
@@ -51,7 +49,6 @@
 Requires: rtld(GNU_HASH)  
-Requires: rtld(GNU_UNIQUE)  
 Requires: rpmlib(PayloadIsLzma)  
 Provides: kcov = 38-alt3:sisyphus+274580.100.1.1
-File: /usr/bin/kcov	100755	root:root	e28fd950b60bc1deb145c4dbd259eb90	
-File: /usr/bin/kcov-system-daemon	100755	root:root	f710c0fec99ffec58ea8a3658358b90d	
+File: /usr/bin/kcov	100755	root:root	0242aa441ba3726dc4ae9506ccb57dac	
+File: /usr/bin/kcov-system-daemon	100755	root:root	5b9dd9918070ad4982c6255c8a0c8ab3	
 File: /usr/share/doc/kcov-38	40755	root:root		
@@ -61,2 +58,2 @@
 File: /usr/share/man/man1/kcov.1.xz	100644	root:root	4e2ee324aa05c9e813a43f14b5855525	
-RPMIdentity: 1ac2280d6f3fc4abc8b764380c65495daa59e469a44b867e40692e1c51670b30b7682b99950dd6d25d5f54214ae448cd0fe2d31af15bc03ce68967493219c49f
+RPMIdentity: 02a085d9af2db08256e47078319192c534322819a5e5eab5b1fa94a0807eebc28a6647ea14fbb319a225cbc81eaceae9dcc10061e5db3670252b88902a466ce5
--- kcov-debuginfo-38-alt3.i586.rpm.repo	2021-06-15 10:41:16.000000000 +0000
+++ kcov-debuginfo-38-alt3.i586.rpm.hasher	2023-06-17 06:32:13.247281240 +0000
@@ -1,7 +1,7 @@
-/usr/lib/debug/.build-id/1b	40755	root:root	
-/usr/lib/debug/.build-id/1b/4bf84cf68556b977267fab581dfa3293a593ec	120777	root:root	../../../../bin/kcov-system-daemon
-/usr/lib/debug/.build-id/1b/4bf84cf68556b977267fab581dfa3293a593ec.debug	120777	root:root	../../usr/bin/kcov-system-daemon.debug
-/usr/lib/debug/.build-id/4d	40755	root:root	
-/usr/lib/debug/.build-id/4d/01494a99674c2263c21f2bc124e846d402c6ec	120777	root:root	../../../../bin/kcov
-/usr/lib/debug/.build-id/4d/01494a99674c2263c21f2bc124e846d402c6ec.debug	120777	root:root	../../usr/bin/kcov.debug
+/usr/lib/debug/.build-id/66	40755	root:root	
+/usr/lib/debug/.build-id/66/7677f610f92e7e9d300c18710125cff4a45b55	120777	root:root	../../../../bin/kcov
+/usr/lib/debug/.build-id/66/7677f610f92e7e9d300c18710125cff4a45b55.debug	120777	root:root	../../usr/bin/kcov.debug
+/usr/lib/debug/.build-id/b6	40755	root:root	
+/usr/lib/debug/.build-id/b6/9034827b305be686de8eccf0c1f46f407fa15a	120777	root:root	../../../../bin/kcov-system-daemon
+/usr/lib/debug/.build-id/b6/9034827b305be686de8eccf0c1f46f407fa15a.debug	120777	root:root	../../usr/bin/kcov-system-daemon.debug
 /usr/lib/debug/usr/bin/kcov-system-daemon.debug	100644	root:root	
@@ -99,3 +99,2 @@
 Requires: debug(libcurl.so.4)  
-Requires: debug(libdl.so.2)  
 Requires: debug(libdw.so.1)  
@@ -103,3 +102,2 @@
 Requires: debug(libgcc_s.so.1)  
-Requires: debug(libpthread.so.0)  
 Requires: debug(libstdc++.so.6)  
@@ -109,10 +107,10 @@
 Provides: kcov-debuginfo = 38-alt3:sisyphus+274580.100.1.1
-File: /usr/lib/debug/.build-id/1b	40755	root:root		
-File: /usr/lib/debug/.build-id/1b/4bf84cf68556b977267fab581dfa3293a593ec	120777	root:root		../../../../bin/kcov-system-daemon
-File: /usr/lib/debug/.build-id/1b/4bf84cf68556b977267fab581dfa3293a593ec.debug	120777	root:root		../../usr/bin/kcov-system-daemon.debug
-File: /usr/lib/debug/.build-id/4d	40755	root:root		
-File: /usr/lib/debug/.build-id/4d/01494a99674c2263c21f2bc124e846d402c6ec	120777	root:root		../../../../bin/kcov
-File: /usr/lib/debug/.build-id/4d/01494a99674c2263c21f2bc124e846d402c6ec.debug	120777	root:root		../../usr/bin/kcov.debug
-File: /usr/lib/debug/usr/bin/kcov-system-daemon.debug	100644	root:root	7129eb42b9f6b607ccf0566a23159f52	
-File: /usr/lib/debug/usr/bin/kcov.debug	100644	root:root	dd3fdb0522089e8bc7d296a42bb76b51	
+File: /usr/lib/debug/.build-id/66	40755	root:root		
+File: /usr/lib/debug/.build-id/66/7677f610f92e7e9d300c18710125cff4a45b55	120777	root:root		../../../../bin/kcov
+File: /usr/lib/debug/.build-id/66/7677f610f92e7e9d300c18710125cff4a45b55.debug	120777	root:root		../../usr/bin/kcov.debug
+File: /usr/lib/debug/.build-id/b6	40755	root:root		
+File: /usr/lib/debug/.build-id/b6/9034827b305be686de8eccf0c1f46f407fa15a	120777	root:root		../../../../bin/kcov-system-daemon
+File: /usr/lib/debug/.build-id/b6/9034827b305be686de8eccf0c1f46f407fa15a.debug	120777	root:root		../../usr/bin/kcov-system-daemon.debug
+File: /usr/lib/debug/usr/bin/kcov-system-daemon.debug	100644	root:root	0e926dce2b7c307166f109369290abf9	
+File: /usr/lib/debug/usr/bin/kcov.debug	100644	root:root	aab0595e48dd548c064836a92c41d008	
 File: /usr/src/debug/kcov-38	40755	root:root		
@@ -121,6 +119,6 @@
 File: /usr/src/debug/kcov-38/BUILD/src/bash-helper.cc	100644	root:root	9f8bdb776ebf0d6422416773eecda0d1	
-File: /usr/src/debug/kcov-38/BUILD/src/bash-redirector-library.cc	100644	root:root	ee3e9814f2f7808b14e7781341c6b458	
+File: /usr/src/debug/kcov-38/BUILD/src/bash-redirector-library.cc	100644	root:root	77875e0e96c457de829183a798df5f73	
 File: /usr/src/debug/kcov-38/BUILD/src/html-data-files.cc	100644	root:root	6e30d5a448081be0600407b69305bdc1	
-File: /usr/src/debug/kcov-38/BUILD/src/kcov-system-library.cc	100644	root:root	0a2740a280af544335ca8b7ff32a284d	
-File: /usr/src/debug/kcov-38/BUILD/src/library.cc	100644	root:root	53a5bc13ba28d72972593cd4bc3133b4	
+File: /usr/src/debug/kcov-38/BUILD/src/kcov-system-library.cc	100644	root:root	372dadaa9507a98f8c4c0eb58fdf036f	
+File: /usr/src/debug/kcov-38/BUILD/src/library.cc	100644	root:root	fd1a12612933689f3310cf6d15de756b	
 File: /usr/src/debug/kcov-38/BUILD/src/python-helper.cc	100644	root:root	75def288a8ccb145849105578e137b55	
@@ -205,2 +203,2 @@
 File: /usr/src/debug/kcov-38/src/writers/writer-base.hh	100644	root:root	73f44de9ae18204b792ff988dd56e92a	
-RPMIdentity: 14f8f32ae489383ca75941f34e4c41dcb1de405b3a11db221f61ae1e6ad7c5a74a1c1fa5f37d0e0510ae74f3af1d37f8d1e75cdd89715558b5ebb8fd43b21404
+RPMIdentity: f89c718249d6bd7731fb8da9d3f9a5484e542188dcf34dd9d700e9c0e1bff07d00a97832a0510a5c9e4389b5bff2650c22fa327015d1ca7c6e7659c2824f63e9