<86>Jan 28 05:09:09 userdel[3188803]: delete user 'rooter'
<86>Jan 28 05:09:09 userdel[3188803]: removed group 'rooter' owned by 'rooter'
<86>Jan 28 05:09:09 userdel[3188803]: removed shadow group 'rooter' owned by 'rooter'
<86>Jan 28 05:09:09 groupadd[3188861]: group added to /etc/group: name=rooter, GID=1305
<86>Jan 28 05:09:09 groupadd[3188861]: group added to /etc/gshadow: name=rooter
<86>Jan 28 05:09:09 groupadd[3188861]: new group: name=rooter, GID=1305
<86>Jan 28 05:09:09 useradd[3188899]: new user: name=rooter, UID=1305, GID=1305, home=/root, shell=/bin/bash
<86>Jan 28 05:09:09 userdel[3188974]: delete user 'builder'
<86>Jan 28 05:09:09 userdel[3188974]: removed group 'builder' owned by 'builder'
<86>Jan 28 05:09:09 userdel[3188974]: removed shadow group 'builder' owned by 'builder'
<86>Jan 28 05:09:09 groupadd[3189033]: group added to /etc/group: name=builder, GID=1306
<86>Jan 28 05:09:09 groupadd[3189033]: group added to /etc/gshadow: name=builder
<86>Jan 28 05:09:09 groupadd[3189033]: new group: name=builder, GID=1306
<86>Jan 28 05:09:09 useradd[3189108]: new user: name=builder, UID=1306, GID=1306, home=/usr/src, shell=/bin/bash
<13>Jan 28 05:09:11 rpmi: libruby-3.1.2-alt1.1 sisyphus+309093.60.7.1 1667187597 installed
<13>Jan 28 05:09:11 rpmi: libgdbm-1.8.3-alt10 sisyphus+278100.1600.1.1 1626059138 installed
<13>Jan 28 05:09:11 rpmi: libyaml2-0.2.5-alt1 sisyphus+278391.100.1.1 1626094932 installed
<13>Jan 28 05:09:11 rpmi: libyaml-devel-0.2.5-alt1 sisyphus+278391.100.1.1 1626094932 installed
<13>Jan 28 05:09:11 rpmi: libgdbm-devel-1.8.3-alt10 sisyphus+278100.1600.1.1 1626059138 installed
<13>Jan 28 05:09:11 rpmi: rpm-macros-ruby-1:1.1.0-alt1.1 sisyphus+309093.60.7.1 1667187597 installed
<13>Jan 28 05:09:13 rpmi: valgrind-3.17.0-alt3 sisyphus+284325.100.1.1 1630488728 installed
<13>Jan 28 05:09:13 rpmi: valgrind-devel-3.17.0-alt3 sisyphus+284325.100.1.1 1630488728 installed
<13>Jan 28 05:09:13 rpmi: zlib-devel-1.2.13-alt1 sisyphus+309409.200.2.1 1667402045 installed
<13>Jan 28 05:09:13 rpmi: libreadline-devel-7.0.3-alt4 sisyphus+283725.100.1.2 1629849381 installed
<13>Jan 28 05:09:14 rpmi: groff-base-1.22.3-alt2 sisyphus+275306.100.2.1 1624538359 installed
<13>Jan 28 05:09:14 rpmi: libncurses-6.3.20220618-alt1 sisyphus+302449.100.1.1 1655835262 installed
<13>Jan 28 05:09:14 rpmi: libtinfo-devel-6.3.20220618-alt1 sisyphus+302449.100.1.1 1655835262 installed
<13>Jan 28 05:09:14 rpmi: libncurses-devel-6.3.20220618-alt1 sisyphus+302449.100.1.1 1655835262 installed
<13>Jan 28 05:09:14 rpmi: libncursesw-devel-6.3.20220618-alt1 sisyphus+302449.100.1.1 1655835262 installed
<13>Jan 28 05:09:14 rpmi: libffi-devel-1:3.4.2-alt2 sisyphus+287629.100.2.1 1634659534 installed
<13>Jan 28 05:09:14 rpmi: libdb4.7-devel-4.7.25-alt12 sisyphus+283793.100.2.1 1629966884 installed
<13>Jan 28 05:09:14 rpmi: doxygen-1:1.9.1-alt1 sisyphus+283348.100.1.1 1629370710 installed
<13>Jan 28 05:09:14 rpmi: chrpath-0.16-alt1 sisyphus+278100.500.1.1 1626056638 installed
<13>Jan 28 05:09:14 rpmi: libp11-kit-0.24.1-alt1 sisyphus+293720.100.1.1 1642535281 installed
<13>Jan 28 05:09:14 rpmi: libtasn1-4.19.0-alt1 sisyphus+305700.100.1.1 1661359628 installed
<13>Jan 28 05:09:14 rpmi: rpm-macros-alternatives-0.5.2-alt1 sisyphus+300869.100.1.1 1653844113 installed
<13>Jan 28 05:09:14 rpmi: alternatives-0.5.2-alt1 sisyphus+300869.100.1.1 1653844113 installed
<13>Jan 28 05:09:14 rpmi: ca-certificates-2022.12.14-alt1 sisyphus+311754.200.1.1 1671046143 installed
<13>Jan 28 05:09:14 rpmi: ca-trust-0.1.4-alt1 sisyphus+308690.100.1.1 1666182992 installed
<13>Jan 28 05:09:14 rpmi: p11-kit-trust-0.24.1-alt1 sisyphus+293720.100.1.1 1642535281 installed
<13>Jan 28 05:09:14 rpmi: libcrypto1.1-1.1.1q-alt1 sisyphus+303203.100.1.1 1657027052 installed
<13>Jan 28 05:09:14 rpmi: libssl1.1-1.1.1q-alt1 sisyphus+303203.100.1.1 1657027052 installed
<13>Jan 28 05:09:14 rpmi: gem-2:3.3.7-alt1.1 sisyphus+309093.60.7.1 1667187490 installed
<13>Jan 28 05:09:14 rpmi: gem-minitest-5.16.3-alt1 sisyphus+296741.13600.43.1 1666814669 installed
<13>Jan 28 05:09:14 rpmi: gem-net-telnet-0.2.0.1-alt0.1 sisyphus+238996.14500.5.1 1630597117 installed
<13>Jan 28 05:09:14 rpmi: gem-power-assert-2.0.1-alt1 sisyphus+296637.272.56.4 1654656448 installed
<13>Jan 28 05:09:14 rpmi: gem-rake-13.0.6-alt1 sisyphus+296637.11240.56.4 1654660010 installed
<13>Jan 28 05:09:14 rpmi: gem-test-unit-3.5.3-alt1 sisyphus+296703.16.105.2 1663319196 installed
<13>Jan 28 05:09:14 rpmi: gem-webrick-1.7.0-alt1 sisyphus+264413.200.1.1 1610122897 installed
<13>Jan 28 05:09:14 rpmi: gem-xmlrpc-0.3.2-alt1.1 sisyphus+296703.16100.105.2 1663323187 installed
<13>Jan 28 05:09:14 rpmi: ri-6.4.0.1-alt1 sisyphus+296703.306.105.2 1663320293 installed
<13>Jan 28 05:09:14 rpmi: gem-rdoc-6.4.0.1-alt1 sisyphus+296703.306.105.2 1663320293 installed
<13>Jan 28 05:09:14 rpmi: rdoc-6.4.0.1-alt1 sisyphus+296703.306.105.2 1663320293 installed
<13>Jan 28 05:09:14 rpmi: rake-13.0.6-alt1 sisyphus+296637.11240.56.4 1654660010 installed
<13>Jan 28 05:09:14 rpmi: erb-3.1.2-alt1.1 sisyphus+309093.60.7.1 1667187490 installed
<13>Jan 28 05:09:14 rpmi: irb-3.1.2-alt1.1 sisyphus+309093.60.7.1 1667187490 installed
<13>Jan 28 05:09:14 rpmi: bundle-2.2.19-alt1 sisyphus+263530.240.88.5 1629542341 installed
<13>Jan 28 05:09:15 rpmi: gem-bundler-2.2.19-alt1 sisyphus+263530.240.88.5 1629542341 installed
<13>Jan 28 05:09:15 rpmi: ruby-3.1.2-alt1.1 sisyphus+309093.60.7.1 1667187597 installed
<13>Jan 28 05:09:15 rpmi: ruby-stdlibs-3.1.2-alt1.1 sisyphus+309093.60.7.1 1667187597 installed
<13>Jan 28 05:09:15 rpmi: gem-setup-5.999.6-alt6 sisyphus+312032.20.2.1 1671497270 installed
<13>Jan 28 05:09:15 rpmi: setup-rb-5.999.6-alt6 sisyphus+312032.20.2.1 1671497270 installed
<13>Jan 28 05:09:15 rpmi: libssl-devel-1.1.1q-alt1 sisyphus+303203.100.1.1 1657027052 installed
<13>Jan 28 05:09:16 rpmi: libruby-devel-3.1.2-alt1.1 sisyphus+309093.60.7.1 1667187597 installed
<13>Jan 28 05:09:16 rpmi: rpm-build-ruby-1:1.1.0-alt1 sisyphus+296703.146.105.1 1663266216 installed
warning: Macro %pkgname not found
<13>Jan 28 05:09:18 rpmi: gem-debase-ruby-core-source-0.10.15-alt1 sisyphus+296637.21400.56.4 1654667325 installed
warning: Macro %pkgname not found
Building target platforms: i586
Building for target i586
Wrote: /usr/src/in/nosrpm/gem-debase-0.2.5.beta2-alt1.nosrc.rpm (w1.gzdio)
warning: Macro %pkgname not found
Installing gem-debase-0.2.5.beta2-alt1.src.rpm
Building target platforms: i586
Building for target i586
Executing(%prep): /bin/sh -e /usr/src/tmp/rpm-tmp.61667
+ umask 022
+ /bin/mkdir -p /usr/src/RPM/BUILD
+ cd /usr/src/RPM/BUILD
+ cd /usr/src/RPM/BUILD
+ rm -rf gem-debase-0.2.5.beta2
+ echo 'Source #0 (gem-debase-0.2.5.beta2.tar):'
Source #0 (gem-debase-0.2.5.beta2.tar):
+ /bin/tar -xf /usr/src/RPM/SOURCES/gem-debase-0.2.5.beta2.tar
+ cd gem-debase-0.2.5.beta2
+ /bin/chmod -c -Rf u+rwX,go-w .
+ exit 0
Executing(%build): /bin/sh -e /usr/src/tmp/rpm-tmp.61667
+ umask 022
+ /bin/mkdir -p /usr/src/RPM/BUILD
+ cd /usr/src/RPM/BUILD
+ cd gem-debase-0.2.5.beta2
+ rm -f Gemfile.lock
+ /usr/bin/ruby -rvendor-specific /usr/bin/setup.rb build --shebang=auto --prefixes=gem,ruby,rails-engine --gem-version-replace= --ignore-names= --regard-names= --alias=:: --use-gem-dependencies= --pre= --use-gem-version= --alias=%pkgname:debase --ignore-path-tokens=templates,example,examples,sample,samples,spec,test,features,fixtures,doc,docs,contrib,demo,acceptance,conformance,myapp,website,benchmarks,benchmark,gemfiles,misc,steer --debug-io=/usr/src/tmp/debug.log --verbose=debug
(ruby 3.1.2 i586-linux)
sh: git: command not found
sh: git: command not found
sh: git: command not found
sh: git: command not found
[setup.rb][INFO]> Source list are the following:
[setup.rb][INFO]> V *debase:0.2.5.beta2 [/usr/src/RPM/BUILD/gem-debase-0.2.5.beta2/debase.gemspec]
[setup.rb][INFO]> = *debase:0.2.5.beta2 [/usr/src/RPM/BUILD/gem-debase-0.2.5.beta2/Rakefile]
[setup.rb][INFO]> = *debase:0.2.5.beta2 [/usr/src/RPM/BUILD/gem-debase-0.2.5.beta2/Rakefile]

- - PRECONFIG - - - - - - - - - - - - - - - - - - - - - - - - - - - - 

SetupConfig was saved. Edit to customize configuration.

- - COMPILE - - - - - - - - - - - - - - - - - - - - - - - - - - - - - 

checking for vm_core.h... no
checking for vm_core.h... no
**************************************************************************
No source for ruby-3.1.2-p20 (revision a21a3b7d23704a01d34bd79d09dc37897e00922a) provided with
debase-ruby_core_source gem. Falling back to ruby-3.1.0-p0.
**************************************************************************
checking for vm_core.h... yes
checking for iseq.h... yes
checking for version.h... yes
creating Makefile
checking for vm_core.h... no
checking for vm_core.h... no
**************************************************************************
No source for ruby-3.1.2-p20 (revision a21a3b7d23704a01d34bd79d09dc37897e00922a) provided with
debase-ruby_core_source gem. Falling back to ruby-3.1.0-p0.
**************************************************************************
checking for vm_core.h... yes
checking for iseq.h... no
checking for iseq.h... yes
checking for version.h... yes
creating Makefile
checking for vm_core.h... no
checking for vm_core.h... no
**************************************************************************
No source for ruby-3.1.2-p20 (revision a21a3b7d23704a01d34bd79d09dc37897e00922a) provided with
debase-ruby_core_source gem. Falling back to ruby-3.1.0-p0.
**************************************************************************
checking for vm_core.h... yes
checking for iseq.h... yes
checking for version.h... yes
creating Makefile
make: Entering directory '/usr/src/RPM/BUILD/gem-debase-0.2.5.beta2/ext/attach'
compiling attach.c
linking shared-object attach.so
make: Leaving directory '/usr/src/RPM/BUILD/gem-debase-0.2.5.beta2/ext/attach'
make: Entering directory '/usr/src/RPM/BUILD/gem-debase-0.2.5.beta2/ext/attach'
/bin/install -c -m 0755 attach.so /usr/src/RPM/BUILD/gem-debase-0.2.5.beta2/.so.debase/usr/local/lib/ruby
make: Leaving directory '/usr/src/RPM/BUILD/gem-debase-0.2.5.beta2/ext/attach'
make: Entering directory '/usr/src/RPM/BUILD/gem-debase-0.2.5.beta2/ext'
compiling breakpoint.c
compiling context.c
compiling debase_internals.c
debase_internals.c: In function 'count_stack_size':
debase_internals.c:319:37: warning: initialization discards 'const' qualifier from pointer target type [-Wdiscarded-qualifiers]
  319 |     rb_control_frame_t *start_cfp = RUBY_VM_END_CONTROL_FRAME(TH_INFO(thread));
      |                                     ^~~~~~~~~~~~~~~~~~~~~~~~~
In file included from /usr/include/ruby/ruby/ruby.h:26,
                 from /usr/include/ruby/ruby.h:38,
                 from ./debase_internals.h:4,
                 from debase_internals.c:1:
debase_internals.c: In function 'Init_debase_internals':
/usr/include/ruby/ruby/internal/anyargs.h:337:142: warning: passing argument 3 of 'rb_define_module_function_01' from incompatible pointer type [-Wincompatible-pointer-types]
  337 | #define rb_define_module_function(mod, mid, func, arity)    RBIMPL_ANYARGS_DISPATCH_rb_define_module_function((arity), (func))((mod), (mid), (func), (arity))
      |                                                                                                                                              ^~~~~~
      |                                                                                                                                              |
      |                                                                                                                                              void (*)(VALUE,  VALUE) {aka void (*)(long unsigned int,  long unsigned int)}
debase_internals.c:770:3: note: in expansion of macro 'rb_define_module_function'
  770 |   rb_define_module_function(mDebase, "set_trace_flag_to_iseq", Debase_set_trace_flag_to_iseq, 1);
      |   ^~~~~~~~~~~~~~~~~~~~~~~~~
/usr/include/ruby/ruby/internal/anyargs.h:273:21: note: expected 'VALUE (*)(VALUE,  VALUE)' {aka 'long unsigned int (*)(long unsigned int,  long unsigned int)'} but argument is of type 'void (*)(VALUE,  VALUE)' {aka 'void (*)(long unsigned int,  long unsigned int)'}
  273 | RBIMPL_ANYARGS_DECL(rb_define_module_function, VALUE, const char *)
      |                     ^~~~~~~~~~~~~~~~~~~~~~~~~
/usr/include/ruby/ruby/internal/anyargs.h:255:41: note: in definition of macro 'RBIMPL_ANYARGS_DECL'
  255 | RBIMPL_ANYARGS_ATTRSET(sym) static void sym ## _01(__VA_ARGS__, VALUE(*)(VALUE, VALUE), int); \
      |                                         ^~~
/usr/include/ruby/ruby/internal/anyargs.h:337:142: warning: passing argument 3 of 'rb_define_module_function_01' from incompatible pointer type [-Wincompatible-pointer-types]
  337 | #define rb_define_module_function(mod, mid, func, arity)    RBIMPL_ANYARGS_DISPATCH_rb_define_module_function((arity), (func))((mod), (mid), (func), (arity))
      |                                                                                                                                              ^~~~~~
      |                                                                                                                                              |
      |                                                                                                                                              void (*)(VALUE,  VALUE) {aka void (*)(long unsigned int,  long unsigned int)}
debase_internals.c:773:3: note: in expansion of macro 'rb_define_module_function'
  773 |   rb_define_module_function(mDebase, "unset_iseq_flags", Debase_unset_trace_flags, 1);
      |   ^~~~~~~~~~~~~~~~~~~~~~~~~
/usr/include/ruby/ruby/internal/anyargs.h:273:21: note: expected 'VALUE (*)(VALUE,  VALUE)' {aka 'long unsigned int (*)(long unsigned int,  long unsigned int)'} but argument is of type 'void (*)(VALUE,  VALUE)' {aka 'void (*)(long unsigned int,  long unsigned int)'}
  273 | RBIMPL_ANYARGS_DECL(rb_define_module_function, VALUE, const char *)
      |                     ^~~~~~~~~~~~~~~~~~~~~~~~~
/usr/include/ruby/ruby/internal/anyargs.h:255:41: note: in definition of macro 'RBIMPL_ANYARGS_DECL'
  255 | RBIMPL_ANYARGS_ATTRSET(sym) static void sym ## _01(__VA_ARGS__, VALUE(*)(VALUE, VALUE), int); \
      |                                         ^~~
compiling locker.c
linking shared-object debase_internals.so
make: Leaving directory '/usr/src/RPM/BUILD/gem-debase-0.2.5.beta2/ext'
make: Entering directory '/usr/src/RPM/BUILD/gem-debase-0.2.5.beta2/ext'
/bin/install -c -m 0755 debase_internals.so /usr/src/RPM/BUILD/gem-debase-0.2.5.beta2/.so.debase/usr/local/lib/ruby
make: Leaving directory '/usr/src/RPM/BUILD/gem-debase-0.2.5.beta2/ext'
make: Entering directory '/usr/src/RPM/BUILD/gem-debase-0.2.5.beta2/ext/attach'
make: Nothing to be done for 'all'.
make: Leaving directory '/usr/src/RPM/BUILD/gem-debase-0.2.5.beta2/ext/attach'
make: Entering directory '/usr/src/RPM/BUILD/gem-debase-0.2.5.beta2/ext/attach'
/bin/install -c -m 0755 attach.so /usr/src/RPM/BUILD/gem-debase-0.2.5.beta2/.so.debase/usr/local/lib/ruby
make: Leaving directory '/usr/src/RPM/BUILD/gem-debase-0.2.5.beta2/ext/attach'

- - DOCUMENT- - - - - - - - - - - - - - - - - - - - - - - - - - - - - 


+ exit 0
Executing(%install): /bin/sh -e /usr/src/tmp/rpm-tmp.88333
+ umask 022
+ /bin/mkdir -p /usr/src/RPM/BUILD
+ cd /usr/src/RPM/BUILD
+ /bin/chmod -Rf u+rwX -- /usr/src/tmp/gem-debase-buildroot
+ :
+ /bin/rm -rf -- /usr/src/tmp/gem-debase-buildroot
+ PATH=/usr/libexec/rpm-build:/usr/src/bin:/bin:/usr/bin:/usr/X11R6/bin:/usr/games
+ cd gem-debase-0.2.5.beta2
+ /usr/bin/ruby -rvendor-specific /usr/bin/setup.rb install --install_prefix=/usr/src/tmp/gem-debase-buildroot --gem-version-replace=
(ruby 3.1.2 i586-linux)
[setup.rb][INFO]> Source list are the following:
[setup.rb][INFO]> V *debase:0.2.5.beta2 [/usr/src/RPM/BUILD/gem-debase-0.2.5.beta2/debase.gemspec]
[setup.rb][INFO]> = *debase:0.2.5.beta2 [/usr/src/RPM/BUILD/gem-debase-0.2.5.beta2/Rakefile]
[setup.rb][INFO]> = *debase:0.2.5.beta2 [/usr/src/RPM/BUILD/gem-debase-0.2.5.beta2/Rakefile]

- - INSTALL - - - - - - - - - - - - - - - - - - - - - - - - - - - - - 

sh: git: command not found
sh: git: command not found
* {exe} ->
* {lib} ->
  % debase < lib
    debase/context.rb => [/usr/src/tmp/gem-debase-buildroot]/usr/lib/ruby/gemie/gems/debase-0.2.5.beta2/lib/debase/context.rb
    debase/rbx/breakpoint.rb => [/usr/src/tmp/gem-debase-buildroot]/usr/lib/ruby/gemie/gems/debase-0.2.5.beta2/lib/debase/rbx/breakpoint.rb
    debase/rbx/context.rb => [/usr/src/tmp/gem-debase-buildroot]/usr/lib/ruby/gemie/gems/debase-0.2.5.beta2/lib/debase/rbx/context.rb
    debase/rbx/frame.rb => [/usr/src/tmp/gem-debase-buildroot]/usr/lib/ruby/gemie/gems/debase-0.2.5.beta2/lib/debase/rbx/frame.rb
    debase/rbx/monkey.rb => [/usr/src/tmp/gem-debase-buildroot]/usr/lib/ruby/gemie/gems/debase-0.2.5.beta2/lib/debase/rbx/monkey.rb
    debase/rbx.rb => [/usr/src/tmp/gem-debase-buildroot]/usr/lib/ruby/gemie/gems/debase-0.2.5.beta2/lib/debase/rbx.rb
    debase/version.rb => [/usr/src/tmp/gem-debase-buildroot]/usr/lib/ruby/gemie/gems/debase-0.2.5.beta2/lib/debase/version.rb
    debase.rb => [/usr/src/tmp/gem-debase-buildroot]/usr/lib/ruby/gemie/gems/debase-0.2.5.beta2/lib/debase.rb
* {man} ->
* {ri} ->
  % debase < .ri.debase
    Debase/Breakpoint/cdesc-Breakpoint.ri => [/usr/src/tmp/gem-debase-buildroot]/usr/share/ri/debase-0.2.5.beta2/Debase/Breakpoint/cdesc-Breakpoint.ri
    Debase/Breakpoint/delete%21-i.ri => [/usr/src/tmp/gem-debase-buildroot]/usr/share/ri/debase-0.2.5.beta2/Debase/Breakpoint/delete%21-i.ri
    Debase/Breakpoint/enabled-i.ri => [/usr/src/tmp/gem-debase-buildroot]/usr/share/ri/debase-0.2.5.beta2/Debase/Breakpoint/enabled-i.ri
    Debase/Breakpoint/expr-i.ri => [/usr/src/tmp/gem-debase-buildroot]/usr/share/ri/debase-0.2.5.beta2/Debase/Breakpoint/expr-i.ri
    Debase/Breakpoint/id-i.ri => [/usr/src/tmp/gem-debase-buildroot]/usr/share/ri/debase-0.2.5.beta2/Debase/Breakpoint/id-i.ri
    Debase/Breakpoint/new-c.ri => [/usr/src/tmp/gem-debase-buildroot]/usr/share/ri/debase-0.2.5.beta2/Debase/Breakpoint/new-c.ri
    Debase/Breakpoint/pos-i.ri => [/usr/src/tmp/gem-debase-buildroot]/usr/share/ri/debase-0.2.5.beta2/Debase/Breakpoint/pos-i.ri
    Debase/Breakpoint/remove-c.ri => [/usr/src/tmp/gem-debase-buildroot]/usr/share/ri/debase-0.2.5.beta2/Debase/Breakpoint/remove-c.ri
    Debase/Breakpoint/source-i.ri => [/usr/src/tmp/gem-debase-buildroot]/usr/share/ri/debase-0.2.5.beta2/Debase/Breakpoint/source-i.ri
    Debase/Context/at_breakpoint-i.ri => [/usr/src/tmp/gem-debase-buildroot]/usr/share/ri/debase-0.2.5.beta2/Debase/Context/at_breakpoint-i.ri
    Debase/Context/at_catchpoint-i.ri => [/usr/src/tmp/gem-debase-buildroot]/usr/share/ri/debase-0.2.5.beta2/Debase/Context/at_catchpoint-i.ri
    Debase/Context/at_line-i.ri => [/usr/src/tmp/gem-debase-buildroot]/usr/share/ri/debase-0.2.5.beta2/Debase/Context/at_line-i.ri
    Debase/Context/at_return-i.ri => [/usr/src/tmp/gem-debase-buildroot]/usr/share/ri/debase-0.2.5.beta2/Debase/Context/at_return-i.ri
    Debase/Context/at_tracing-i.ri => [/usr/src/tmp/gem-debase-buildroot]/usr/share/ri/debase-0.2.5.beta2/Debase/Context/at_tracing-i.ri
    Debase/Context/cdesc-Context.ri => [/usr/src/tmp/gem-debase-buildroot]/usr/share/ri/debase-0.2.5.beta2/Debase/Context/cdesc-Context.ri
    Debase/Context/clear_frame_info-i.ri => [/usr/src/tmp/gem-debase-buildroot]/usr/share/ri/debase-0.2.5.beta2/Debase/Context/clear_frame_info-i.ri
    Debase/Context/dead%3f-i.ri => [/usr/src/tmp/gem-debase-buildroot]/usr/share/ri/debase-0.2.5.beta2/Debase/Context/dead%3f-i.ri
    Debase/Context/fill_frame_info-i.ri => [/usr/src/tmp/gem-debase-buildroot]/usr/share/ri/debase-0.2.5.beta2/Debase/Context/fill_frame_info-i.ri
    Debase/Context/frame_args_info-i.ri => [/usr/src/tmp/gem-debase-buildroot]/usr/share/ri/debase-0.2.5.beta2/Debase/Context/frame_args_info-i.ri
    Debase/Context/frame_binding-i.ri => [/usr/src/tmp/gem-debase-buildroot]/usr/share/ri/debase-0.2.5.beta2/Debase/Context/frame_binding-i.ri
    Debase/Context/frame_class-i.ri => [/usr/src/tmp/gem-debase-buildroot]/usr/share/ri/debase-0.2.5.beta2/Debase/Context/frame_class-i.ri
    Debase/Context/frame_file-i.ri => [/usr/src/tmp/gem-debase-buildroot]/usr/share/ri/debase-0.2.5.beta2/Debase/Context/frame_file-i.ri
    Debase/Context/frame_line-i.ri => [/usr/src/tmp/gem-debase-buildroot]/usr/share/ri/debase-0.2.5.beta2/Debase/Context/frame_line-i.ri
    Debase/Context/frame_locals-i.ri => [/usr/src/tmp/gem-debase-buildroot]/usr/share/ri/debase-0.2.5.beta2/Debase/Context/frame_locals-i.ri
    Debase/Context/frame_self-i.ri => [/usr/src/tmp/gem-debase-buildroot]/usr/share/ri/debase-0.2.5.beta2/Debase/Context/frame_self-i.ri
    Debase/Context/handler-i.ri => [/usr/src/tmp/gem-debase-buildroot]/usr/share/ri/debase-0.2.5.beta2/Debase/Context/handler-i.ri
    Debase/Context/ignored%3f-i.ri => [/usr/src/tmp/gem-debase-buildroot]/usr/share/ri/debase-0.2.5.beta2/Debase/Context/ignored%3f-i.ri
    Debase/Context/new-c.ri => [/usr/src/tmp/gem-debase-buildroot]/usr/share/ri/debase-0.2.5.beta2/Debase/Context/new-c.ri
    Debase/Context/stack_size-i.ri => [/usr/src/tmp/gem-debase-buildroot]/usr/share/ri/debase-0.2.5.beta2/Debase/Context/stack_size-i.ri
    Debase/Context/stop_reason-i.ri => [/usr/src/tmp/gem-debase-buildroot]/usr/share/ri/debase-0.2.5.beta2/Debase/Context/stop_reason-i.ri
    Debase/Context/thnum-i.ri => [/usr/src/tmp/gem-debase-buildroot]/usr/share/ri/debase-0.2.5.beta2/Debase/Context/thnum-i.ri
    Debase/Context/thread-i.ri => [/usr/src/tmp/gem-debase-buildroot]/usr/share/ri/debase-0.2.5.beta2/Debase/Context/thread-i.ri
    Debase/DebugThread/cdesc-DebugThread.ri => [/usr/src/tmp/gem-debase-buildroot]/usr/share/ri/debase-0.2.5.beta2/Debase/DebugThread/cdesc-DebugThread.ri
    Debase/DebugThread/inherited-c.ri => [/usr/src/tmp/gem-debase-buildroot]/usr/share/ri/debase-0.2.5.beta2/Debase/DebugThread/inherited-c.ri
    Debase/DebugThread/set_debugger_thread-i.ri => [/usr/src/tmp/gem-debase-buildroot]/usr/share/ri/debase-0.2.5.beta2/Debase/DebugThread/set_debugger_thread-i.ri
    Debase/FileFilter/accept%3f-i.ri => [/usr/src/tmp/gem-debase-buildroot]/usr/share/ri/debase-0.2.5.beta2/Debase/FileFilter/accept%3f-i.ri
    Debase/FileFilter/cdesc-FileFilter.ri => [/usr/src/tmp/gem-debase-buildroot]/usr/share/ri/debase-0.2.5.beta2/Debase/FileFilter/cdesc-FileFilter.ri
    Debase/FileFilter/disable-i.ri => [/usr/src/tmp/gem-debase-buildroot]/usr/share/ri/debase-0.2.5.beta2/Debase/FileFilter/disable-i.ri
    Debase/FileFilter/enable-i.ri => [/usr/src/tmp/gem-debase-buildroot]/usr/share/ri/debase-0.2.5.beta2/Debase/FileFilter/enable-i.ri
    Debase/FileFilter/exclude-i.ri => [/usr/src/tmp/gem-debase-buildroot]/usr/share/ri/debase-0.2.5.beta2/Debase/FileFilter/exclude-i.ri
    Debase/FileFilter/include-i.ri => [/usr/src/tmp/gem-debase-buildroot]/usr/share/ri/debase-0.2.5.beta2/Debase/FileFilter/include-i.ri
    Debase/FileFilter/new-c.ri => [/usr/src/tmp/gem-debase-buildroot]/usr/share/ri/debase-0.2.5.beta2/Debase/FileFilter/new-c.ri
    Debase/Frame/binding-i.ri => [/usr/src/tmp/gem-debase-buildroot]/usr/share/ri/debase-0.2.5.beta2/Debase/Frame/binding-i.ri
    Debase/Frame/cdesc-Frame.ri => [/usr/src/tmp/gem-debase-buildroot]/usr/share/ri/debase-0.2.5.beta2/Debase/Frame/cdesc-Frame.ri
    Debase/Frame/file-i.ri => [/usr/src/tmp/gem-debase-buildroot]/usr/share/ri/debase-0.2.5.beta2/Debase/Frame/file-i.ri
    Debase/Frame/line-i.ri => [/usr/src/tmp/gem-debase-buildroot]/usr/share/ri/debase-0.2.5.beta2/Debase/Frame/line-i.ri
    Debase/Frame/new-c.ri => [/usr/src/tmp/gem-debase-buildroot]/usr/share/ri/debase-0.2.5.beta2/Debase/Frame/new-c.ri
    Debase/Frame/self-i.ri => [/usr/src/tmp/gem-debase-buildroot]/usr/share/ri/debase-0.2.5.beta2/Debase/Frame/self-i.ri
    Debase/InstructionSequenceMixin/cdesc-InstructionSequenceMixin.ri => [/usr/src/tmp/gem-debase-buildroot]/usr/share/ri/debase-0.2.5.beta2/Debase/InstructionSequenceMixin/cdesc-InstructionSequenceMixin.ri
    Debase/InstructionSequenceMixin/do_set_flags-i.ri => [/usr/src/tmp/gem-debase-buildroot]/usr/share/ri/debase-0.2.5.beta2/Debase/InstructionSequenceMixin/do_set_flags-i.ri
    Debase/InstructionSequenceMixin/load_iseq-i.ri => [/usr/src/tmp/gem-debase-buildroot]/usr/share/ri/debase-0.2.5.beta2/Debase/InstructionSequenceMixin/load_iseq-i.ri
    Debase/RubyVM/InstructionSequence/cdesc-InstructionSequence.ri => [/usr/src/tmp/gem-debase-buildroot]/usr/share/ri/debase-0.2.5.beta2/Debase/RubyVM/InstructionSequence/cdesc-InstructionSequence.ri
    Debase/RubyVM/InstructionSequence/prepend-c.ri => [/usr/src/tmp/gem-debase-buildroot]/usr/share/ri/debase-0.2.5.beta2/Debase/RubyVM/InstructionSequence/prepend-c.ri
    Debase/add_breakpoint-c.ri => [/usr/src/tmp/gem-debase-buildroot]/usr/share/ri/debase-0.2.5.beta2/Debase/add_breakpoint-c.ri
    Debase/add_catchpoint-c.ri => [/usr/src/tmp/gem-debase-buildroot]/usr/share/ri/debase-0.2.5.beta2/Debase/add_catchpoint-c.ri
    Debase/breakpoints-c.ri => [/usr/src/tmp/gem-debase-buildroot]/usr/share/ri/debase-0.2.5.beta2/Debase/breakpoints-c.ri
    Debase/cdesc-Debase.ri => [/usr/src/tmp/gem-debase-buildroot]/usr/share/ri/debase-0.2.5.beta2/Debase/cdesc-Debase.ri
    Debase/cleanup_contexts-c.ri => [/usr/src/tmp/gem-debase-buildroot]/usr/share/ri/debase-0.2.5.beta2/Debase/cleanup_contexts-c.ri
    Debase/clear_catchpoints-c.ri => [/usr/src/tmp/gem-debase-buildroot]/usr/share/ri/debase-0.2.5.beta2/Debase/clear_catchpoints-c.ri
    Debase/contexts-c.ri => [/usr/src/tmp/gem-debase-buildroot]/usr/share/ri/debase-0.2.5.beta2/Debase/contexts-c.ri
    Debase/current_context-c.ri => [/usr/src/tmp/gem-debase-buildroot]/usr/share/ri/debase-0.2.5.beta2/Debase/current_context-c.ri
    Debase/debug-c.ri => [/usr/src/tmp/gem-debase-buildroot]/usr/share/ri/debase-0.2.5.beta2/Debase/debug-c.ri
    Debase/debug_load-c.ri => [/usr/src/tmp/gem-debase-buildroot]/usr/share/ri/debase-0.2.5.beta2/Debase/debug_load-c.ri
    Debase/file_filter-c.ri => [/usr/src/tmp/gem-debase-buildroot]/usr/share/ri/debase-0.2.5.beta2/Debase/file_filter-c.ri
    Debase/handler-c.ri => [/usr/src/tmp/gem-debase-buildroot]/usr/share/ri/debase-0.2.5.beta2/Debase/handler-c.ri
    Debase/keep_frame_binding-c.ri => [/usr/src/tmp/gem-debase-buildroot]/usr/share/ri/debase-0.2.5.beta2/Debase/keep_frame_binding-c.ri
    Debase/last_context-c.ri => [/usr/src/tmp/gem-debase-buildroot]/usr/share/ri/debase-0.2.5.beta2/Debase/last_context-c.ri
    Debase/listen-c.ri => [/usr/src/tmp/gem-debase-buildroot]/usr/share/ri/debase-0.2.5.beta2/Debase/listen-c.ri
    Debase/monkey_patch_prepend-c.ri => [/usr/src/tmp/gem-debase-buildroot]/usr/share/ri/debase-0.2.5.beta2/Debase/monkey_patch_prepend-c.ri
    Debase/post_mortem%3f-c.ri => [/usr/src/tmp/gem-debase-buildroot]/usr/share/ri/debase-0.2.5.beta2/Debase/post_mortem%3f-c.ri
    Debase/prepare_context-c.ri => [/usr/src/tmp/gem-debase-buildroot]/usr/share/ri/debase-0.2.5.beta2/Debase/prepare_context-c.ri
    Debase/remove_breakpoint-c.ri => [/usr/src/tmp/gem-debase-buildroot]/usr/share/ri/debase-0.2.5.beta2/Debase/remove_breakpoint-c.ri
    Debase/remove_catchpoint-c.ri => [/usr/src/tmp/gem-debase-buildroot]/usr/share/ri/debase-0.2.5.beta2/Debase/remove_catchpoint-c.ri
    Debase/remove_tracepoints-c.ri => [/usr/src/tmp/gem-debase-buildroot]/usr/share/ri/debase-0.2.5.beta2/Debase/remove_tracepoints-c.ri
    Debase/setup_tracepoints-c.ri => [/usr/src/tmp/gem-debase-buildroot]/usr/share/ri/debase-0.2.5.beta2/Debase/setup_tracepoints-c.ri
    Debase/skip-c.ri => [/usr/src/tmp/gem-debase-buildroot]/usr/share/ri/debase-0.2.5.beta2/Debase/skip-c.ri
    Debase/source_reload-c.ri => [/usr/src/tmp/gem-debase-buildroot]/usr/share/ri/debase-0.2.5.beta2/Debase/source_reload-c.ri
    Debase/spinup_thread-c.ri => [/usr/src/tmp/gem-debase-buildroot]/usr/share/ri/debase-0.2.5.beta2/Debase/spinup_thread-c.ri
    Debase/start-c.ri => [/usr/src/tmp/gem-debase-buildroot]/usr/share/ri/debase-0.2.5.beta2/Debase/start-c.ri
    Debase/start_-c.ri => [/usr/src/tmp/gem-debase-buildroot]/usr/share/ri/debase-0.2.5.beta2/Debase/start_-c.ri
    Debase/started%3f-c.ri => [/usr/src/tmp/gem-debase-buildroot]/usr/share/ri/debase-0.2.5.beta2/Debase/started%3f-c.ri
    Debase/stop-c.ri => [/usr/src/tmp/gem-debase-buildroot]/usr/share/ri/debase-0.2.5.beta2/Debase/stop-c.ri
    Debase/tracing-c.ri => [/usr/src/tmp/gem-debase-buildroot]/usr/share/ri/debase-0.2.5.beta2/Debase/tracing-c.ri
    Debugger/add_breakpoint-c.ri => [/usr/src/tmp/gem-debase-buildroot]/usr/share/ri/debase-0.2.5.beta2/Debugger/add_breakpoint-c.ri
    Debugger/add_catchpoint-c.ri => [/usr/src/tmp/gem-debase-buildroot]/usr/share/ri/debase-0.2.5.beta2/Debugger/add_catchpoint-c.ri
    Debugger/breakpoints-c.ri => [/usr/src/tmp/gem-debase-buildroot]/usr/share/ri/debase-0.2.5.beta2/Debugger/breakpoints-c.ri
    Debugger/cdesc-Debugger.ri => [/usr/src/tmp/gem-debase-buildroot]/usr/share/ri/debase-0.2.5.beta2/Debugger/cdesc-Debugger.ri
    Debugger/cleanup_contexts-c.ri => [/usr/src/tmp/gem-debase-buildroot]/usr/share/ri/debase-0.2.5.beta2/Debugger/cleanup_contexts-c.ri
    Debugger/clear_catchpoints-c.ri => [/usr/src/tmp/gem-debase-buildroot]/usr/share/ri/debase-0.2.5.beta2/Debugger/clear_catchpoints-c.ri
    Debugger/contexts-c.ri => [/usr/src/tmp/gem-debase-buildroot]/usr/share/ri/debase-0.2.5.beta2/Debugger/contexts-c.ri
    Debugger/current_context-c.ri => [/usr/src/tmp/gem-debase-buildroot]/usr/share/ri/debase-0.2.5.beta2/Debugger/current_context-c.ri
    Debugger/debug-c.ri => [/usr/src/tmp/gem-debase-buildroot]/usr/share/ri/debase-0.2.5.beta2/Debugger/debug-c.ri
    Debugger/debug_load-c.ri => [/usr/src/tmp/gem-debase-buildroot]/usr/share/ri/debase-0.2.5.beta2/Debugger/debug_load-c.ri
    Debugger/file_filter-c.ri => [/usr/src/tmp/gem-debase-buildroot]/usr/share/ri/debase-0.2.5.beta2/Debugger/file_filter-c.ri
    Debugger/handler-c.ri => [/usr/src/tmp/gem-debase-buildroot]/usr/share/ri/debase-0.2.5.beta2/Debugger/handler-c.ri
    Debugger/keep_frame_binding-c.ri => [/usr/src/tmp/gem-debase-buildroot]/usr/share/ri/debase-0.2.5.beta2/Debugger/keep_frame_binding-c.ri
    Debugger/last_context-c.ri => [/usr/src/tmp/gem-debase-buildroot]/usr/share/ri/debase-0.2.5.beta2/Debugger/last_context-c.ri
    Debugger/listen-c.ri => [/usr/src/tmp/gem-debase-buildroot]/usr/share/ri/debase-0.2.5.beta2/Debugger/listen-c.ri
    Debugger/monkey_patch_prepend-c.ri => [/usr/src/tmp/gem-debase-buildroot]/usr/share/ri/debase-0.2.5.beta2/Debugger/monkey_patch_prepend-c.ri
    Debugger/post_mortem%3f-c.ri => [/usr/src/tmp/gem-debase-buildroot]/usr/share/ri/debase-0.2.5.beta2/Debugger/post_mortem%3f-c.ri
    Debugger/prepare_context-c.ri => [/usr/src/tmp/gem-debase-buildroot]/usr/share/ri/debase-0.2.5.beta2/Debugger/prepare_context-c.ri
    Debugger/remove_breakpoint-c.ri => [/usr/src/tmp/gem-debase-buildroot]/usr/share/ri/debase-0.2.5.beta2/Debugger/remove_breakpoint-c.ri
    Debugger/remove_catchpoint-c.ri => [/usr/src/tmp/gem-debase-buildroot]/usr/share/ri/debase-0.2.5.beta2/Debugger/remove_catchpoint-c.ri
    Debugger/remove_tracepoints-c.ri => [/usr/src/tmp/gem-debase-buildroot]/usr/share/ri/debase-0.2.5.beta2/Debugger/remove_tracepoints-c.ri
    Debugger/setup_tracepoints-c.ri => [/usr/src/tmp/gem-debase-buildroot]/usr/share/ri/debase-0.2.5.beta2/Debugger/setup_tracepoints-c.ri
    Debugger/skip-c.ri => [/usr/src/tmp/gem-debase-buildroot]/usr/share/ri/debase-0.2.5.beta2/Debugger/skip-c.ri
    Debugger/source_reload-c.ri => [/usr/src/tmp/gem-debase-buildroot]/usr/share/ri/debase-0.2.5.beta2/Debugger/source_reload-c.ri
    Debugger/spinup_thread-c.ri => [/usr/src/tmp/gem-debase-buildroot]/usr/share/ri/debase-0.2.5.beta2/Debugger/spinup_thread-c.ri
    Debugger/start-c.ri => [/usr/src/tmp/gem-debase-buildroot]/usr/share/ri/debase-0.2.5.beta2/Debugger/start-c.ri
    Debugger/start_-c.ri => [/usr/src/tmp/gem-debase-buildroot]/usr/share/ri/debase-0.2.5.beta2/Debugger/start_-c.ri
    Debugger/started%3f-c.ri => [/usr/src/tmp/gem-debase-buildroot]/usr/share/ri/debase-0.2.5.beta2/Debugger/started%3f-c.ri
    Debugger/stop-c.ri => [/usr/src/tmp/gem-debase-buildroot]/usr/share/ri/debase-0.2.5.beta2/Debugger/stop-c.ri
    Debugger/tracing-c.ri => [/usr/src/tmp/gem-debase-buildroot]/usr/share/ri/debase-0.2.5.beta2/Debugger/tracing-c.ri
    Object/cdesc-Object.ri => [/usr/src/tmp/gem-debase-buildroot]/usr/share/ri/debase-0.2.5.beta2/Object/cdesc-Object.ri
    Object/method_missing-i.ri => [/usr/src/tmp/gem-debase-buildroot]/usr/share/ri/debase-0.2.5.beta2/Object/method_missing-i.ri
    Rubinius/Location/cdesc-Location.ri => [/usr/src/tmp/gem-debase-buildroot]/usr/share/ri/debase-0.2.5.beta2/Rubinius/Location/cdesc-Location.ri
    Rubinius/Location/receiver-i.ri => [/usr/src/tmp/gem-debase-buildroot]/usr/share/ri/debase-0.2.5.beta2/Rubinius/Location/receiver-i.ri
    Rubinius/cdesc-Rubinius.ri => [/usr/src/tmp/gem-debase-buildroot]/usr/share/ri/debase-0.2.5.beta2/Rubinius/cdesc-Rubinius.ri
    cache.ri => [/usr/src/tmp/gem-debase-buildroot]/usr/share/ri/debase-0.2.5.beta2/cache.ri
* {inc} ->
  % debase < ext
    attach/attach.h => [/usr/src/tmp/gem-debase-buildroot]/usr/include/attach/attach.h
    debase_internals.h => [/usr/src/tmp/gem-debase-buildroot]/usr/include/debase_internals.h
    hacks.h => [/usr/src/tmp/gem-debase-buildroot]/usr/include/hacks.h
    /usr/include -> [/usr/src/tmp/gem-debase-buildroot]/usr/lib/ruby/gemie/gems/debase-0.2.5.beta2/ext
* {app} ->
* {log} ->
* {state} ->
* {test} ->
  % debase < test
    example/a/example.rb => [/usr/src/tmp/gem-debase-buildroot]/usr/lib/ruby/gemie/gems/debase-0.2.5.beta2/test/example/a/example.rb
    example/at-exit.rb => [/usr/src/tmp/gem-debase-buildroot]/usr/lib/ruby/gemie/gems/debase-0.2.5.beta2/test/example/at-exit.rb
    example/b/example.rb => [/usr/src/tmp/gem-debase-buildroot]/usr/lib/ruby/gemie/gems/debase-0.2.5.beta2/test/example/b/example.rb
    example/bootsnap/a.rb => [/usr/src/tmp/gem-debase-buildroot]/usr/lib/ruby/gemie/gems/debase-0.2.5.beta2/test/example/bootsnap/a.rb
    example/bootsnap/bootsnap.rb => [/usr/src/tmp/gem-debase-buildroot]/usr/lib/ruby/gemie/gems/debase-0.2.5.beta2/test/example/bootsnap/bootsnap.rb
    example/bp_loop_issue.rb => [/usr/src/tmp/gem-debase-buildroot]/usr/lib/ruby/gemie/gems/debase-0.2.5.beta2/test/example/bp_loop_issue.rb
    example/breakpoints-basename.rb => [/usr/src/tmp/gem-debase-buildroot]/usr/lib/ruby/gemie/gems/debase-0.2.5.beta2/test/example/breakpoints-basename.rb
    example/brkpt-class-bug.rb => [/usr/src/tmp/gem-debase-buildroot]/usr/lib/ruby/gemie/gems/debase-0.2.5.beta2/test/example/brkpt-class-bug.rb
    example/classes.rb => [/usr/src/tmp/gem-debase-buildroot]/usr/lib/ruby/gemie/gems/debase-0.2.5.beta2/test/example/classes.rb
    example/dollar-0.rb => [/usr/src/tmp/gem-debase-buildroot]/usr/lib/ruby/gemie/gems/debase-0.2.5.beta2/test/example/dollar-0.rb
    example/except-bug1.rb => [/usr/src/tmp/gem-debase-buildroot]/usr/lib/ruby/gemie/gems/debase-0.2.5.beta2/test/example/except-bug1.rb
    example/file with space.rb => [/usr/src/tmp/gem-debase-buildroot]/usr/lib/ruby/gemie/gems/debase-0.2.5.beta2/test/example/file with space.rb
    example/gcd.rb => [/usr/src/tmp/gem-debase-buildroot]/usr/lib/ruby/gemie/gems/debase-0.2.5.beta2/test/example/gcd.rb
    example/info-var-bug.rb => [/usr/src/tmp/gem-debase-buildroot]/usr/lib/ruby/gemie/gems/debase-0.2.5.beta2/test/example/info-var-bug.rb
    example/info-var-bug2.rb => [/usr/src/tmp/gem-debase-buildroot]/usr/lib/ruby/gemie/gems/debase-0.2.5.beta2/test/example/info-var-bug2.rb
    example/null.rb => [/usr/src/tmp/gem-debase-buildroot]/usr/lib/ruby/gemie/gems/debase-0.2.5.beta2/test/example/null.rb
    example/output.rb => [/usr/src/tmp/gem-debase-buildroot]/usr/lib/ruby/gemie/gems/debase-0.2.5.beta2/test/example/output.rb
    example/pm-bug.rb => [/usr/src/tmp/gem-debase-buildroot]/usr/lib/ruby/gemie/gems/debase-0.2.5.beta2/test/example/pm-bug.rb
    example/pm.rb => [/usr/src/tmp/gem-debase-buildroot]/usr/lib/ruby/gemie/gems/debase-0.2.5.beta2/test/example/pm.rb
    example/raise.rb => [/usr/src/tmp/gem-debase-buildroot]/usr/lib/ruby/gemie/gems/debase-0.2.5.beta2/test/example/raise.rb
    helper.rb => [/usr/src/tmp/gem-debase-buildroot]/usr/lib/ruby/gemie/gems/debase-0.2.5.beta2/test/helper.rb
    test_base.rb => [/usr/src/tmp/gem-debase-buildroot]/usr/lib/ruby/gemie/gems/debase-0.2.5.beta2/test/test_base.rb
    test_breakpoints.rb => [/usr/src/tmp/gem-debase-buildroot]/usr/lib/ruby/gemie/gems/debase-0.2.5.beta2/test/test_breakpoints.rb
    test_catchpoint.rb => [/usr/src/tmp/gem-debase-buildroot]/usr/lib/ruby/gemie/gems/debase-0.2.5.beta2/test/test_catchpoint.rb
    test_load.rb => [/usr/src/tmp/gem-debase-buildroot]/usr/lib/ruby/gemie/gems/debase-0.2.5.beta2/test/test_load.rb
    test_reload_bug.rb => [/usr/src/tmp/gem-debase-buildroot]/usr/lib/ruby/gemie/gems/debase-0.2.5.beta2/test/test_reload_bug.rb
* {sup} ->
* {conf} ->
* {data} ->
  % debase < .
    .gitignore => [/usr/src/tmp/gem-debase-buildroot]/usr/lib/ruby/gemie/gems/debase-0.2.5.beta2/.gitignore
    .travis.yml => [/usr/src/tmp/gem-debase-buildroot]/usr/lib/ruby/gemie/gems/debase-0.2.5.beta2/.travis.yml
    Gemfile => [/usr/src/tmp/gem-debase-buildroot]/usr/lib/ruby/gemie/gems/debase-0.2.5.beta2/Gemfile
    LICENSE => [/usr/src/tmp/gem-debase-buildroot]/usr/lib/ruby/gemie/gems/debase-0.2.5.beta2/LICENSE
    MIT_LICENSE => [/usr/src/tmp/gem-debase-buildroot]/usr/lib/ruby/gemie/gems/debase-0.2.5.beta2/MIT_LICENSE
    README.md => [/usr/src/tmp/gem-debase-buildroot]/usr/lib/ruby/gemie/gems/debase-0.2.5.beta2/README.md
    Rakefile => [/usr/src/tmp/gem-debase-buildroot]/usr/lib/ruby/gemie/gems/debase-0.2.5.beta2/Rakefile
    debase.gemspec => [/usr/src/tmp/gem-debase-buildroot]/usr/lib/ruby/gemie/gems/debase-0.2.5.beta2/debase.gemspec
* {.gemspec} ->
  %debase
    /usr/src/tmp/gemspec.20230128-3277459-h7q8x8 => [/usr/src/tmp/gem-debase-buildroot]/usr/lib/ruby/gemie/specifications/debase-0.2.5.beta2.gemspec
* {gemfile} ->
  %debase
    /usr/src/tmp/Gemfile.20230128-3277459-8pzgtb => [/usr/src/tmp/gem-debase-buildroot]/usr/lib/ruby/gemie/gems/debase-0.2.5.beta2/Gemfile
* scheme
{debase}
  /usr/src/RPM/BUILD/gem-debase-0.2.5.beta2/.so.debase/usr/local/lib/ruby/attach.so => /usr/src/tmp/gem-debase-buildroot/usr/lib/ruby/gemie/extensions/debase-0.2.5.beta2/attach.so
  /usr/lib/ruby/gemie/extensions/debase-0.2.5.beta2/attach.so -> /usr/src/tmp/gem-debase-buildroot/usr/lib/ruby/gemie/gems/debase-0.2.5.beta2/lib/attach.so
  >> /usr/src/tmp/gem-debase-buildroot/usr/lib/ruby/gemie/extensions/debase-0.2.5.beta2/gem.build_complete
  /usr/src/RPM/BUILD/gem-debase-0.2.5.beta2/.so.debase/usr/local/lib/ruby/debase_internals.so => /usr/src/tmp/gem-debase-buildroot/usr/lib/ruby/gemie/extensions/debase-0.2.5.beta2/debase_internals.so
  /usr/lib/ruby/gemie/extensions/debase-0.2.5.beta2/debase_internals.so -> /usr/src/tmp/gem-debase-buildroot/usr/lib/ruby/gemie/gems/debase-0.2.5.beta2/lib/debase_internals.so
  >> /usr/src/tmp/gem-debase-buildroot/usr/lib/ruby/gemie/extensions/debase-0.2.5.beta2/gem.build_complete

+ /usr/lib/rpm/brp-alt
Cleaning files in /usr/src/tmp/gem-debase-buildroot (auto)
removed './usr/lib/ruby/gemie/gems/debase-0.2.5.beta2/.gitignore'
mode of './usr/lib/ruby/gemie/extensions/debase-0.2.5.beta2/debase_internals.so' changed from 0755 (rwxr-xr-x) to 0644 (rw-r--r--)
mode of './usr/lib/ruby/gemie/extensions/debase-0.2.5.beta2/attach.so' changed from 0755 (rwxr-xr-x) to 0644 (rw-r--r--)
Verifying and fixing files in /usr/src/tmp/gem-debase-buildroot (binconfig,pkgconfig,libtool,desktop,gnuconfig)
Checking contents of files in /usr/src/tmp/gem-debase-buildroot/ (default)
Compressing files in /usr/src/tmp/gem-debase-buildroot (auto)
Adjusting library links in /usr/src/tmp/gem-debase-buildroot
./usr/lib: (from <cmdline>:0)
./usr/lib/ruby/gemie/gems/debase-0.2.5.beta2/lib: (from <cmdline>:0)
debugedit: ./usr/lib/ruby/gemie/extensions/debase-0.2.5.beta2/debase_internals.so: DWARF version 63148 unhandled
debugedit: ./usr/lib/ruby/gemie/extensions/debase-0.2.5.beta2/attach.so: DWARF version 596 unhandled
[27] .debug_aranges NOT compressed, wouldn't be smaller
Verifying ELF objects in /usr/src/tmp/gem-debase-buildroot (arch=normal,fhs=normal,lfs=relaxed,lint=relaxed,rpath=normal,stack=normal,textrel=normal,unresolved=normal)
Executing(%check): /bin/sh -e /usr/src/tmp/rpm-tmp.11477
+ umask 022
+ /bin/mkdir -p /usr/src/RPM/BUILD
+ cd /usr/src/RPM/BUILD
+ cd gem-debase-0.2.5.beta2
+ /usr/bin/ruby -rvendor-specific /usr/bin/setup.rb test
(ruby 3.1.2 i586-linux)
[setup.rb][INFO]> Source list are the following:
[setup.rb][INFO]> V *debase:0.2.5.beta2 [/usr/src/RPM/BUILD/gem-debase-0.2.5.beta2/debase.gemspec]
[setup.rb][INFO]> = *debase:0.2.5.beta2 [/usr/src/RPM/BUILD/gem-debase-0.2.5.beta2/Rakefile]
[setup.rb][INFO]> = *debase:0.2.5.beta2 [/usr/src/RPM/BUILD/gem-debase-0.2.5.beta2/Rakefile]
sh: git: command not found
sh: git: command not found

+ exit 0
Processing files: gem-debase-0.2.5.beta2-alt1
Executing(%doc): /bin/sh -e /usr/src/tmp/rpm-tmp.11477
+ umask 022
+ /bin/mkdir -p /usr/src/RPM/BUILD
+ cd /usr/src/RPM/BUILD
+ cd gem-debase-0.2.5.beta2
+ DOCDIR=/usr/src/tmp/gem-debase-buildroot/usr/share/doc/gem-debase-0.2.5.beta2
+ export DOCDIR
+ rm -rf /usr/src/tmp/gem-debase-buildroot/usr/share/doc/gem-debase-0.2.5.beta2
+ /bin/mkdir -p /usr/src/tmp/gem-debase-buildroot/usr/share/doc/gem-debase-0.2.5.beta2
+ cp -prL README.md /usr/src/tmp/gem-debase-buildroot/usr/share/doc/gem-debase-0.2.5.beta2
+ chmod -R go-w /usr/src/tmp/gem-debase-buildroot/usr/share/doc/gem-debase-0.2.5.beta2
+ chmod -R a+rX /usr/src/tmp/gem-debase-buildroot/usr/share/doc/gem-debase-0.2.5.beta2
+ exit 0
warning: absolute symlink: /usr/src/tmp/gem-debase-buildroot/usr/lib/ruby/gemie/gems/debase-0.2.5.beta2/ext -> /usr/include
warning: absolute symlink: /usr/src/tmp/gem-debase-buildroot/usr/lib/ruby/gemie/gems/debase-0.2.5.beta2/lib/attach.so -> /usr/lib/ruby/gemie/extensions/debase-0.2.5.beta2/attach.so
warning: absolute symlink: /usr/src/tmp/gem-debase-buildroot/usr/lib/ruby/gemie/gems/debase-0.2.5.beta2/lib/debase_internals.so -> /usr/lib/ruby/gemie/extensions/debase-0.2.5.beta2/debase_internals.so
Finding Provides (using /usr/lib/rpm/find-provides)
Executing: /bin/sh -e /usr/src/tmp/rpm-tmp.jOswEc
find-provides: running scripts (alternatives,debuginfo,lib,pam,perl,pkgconfig,python,python3,ruby,shell)
ruby.prov: detecting ruby provides for gem-debase...
ruby.prov: project file is '/usr/src/RPM/BUILD/gem-debase-0.2.5.beta2/SetupConfig'
ruby.prov: setup.rb provides --install_prefix=/usr/src/tmp/gem-debase-buildroot --package=gem-debase -q
(ruby 3.1.2 i586-linux)
sh: git: command not found
sh: git: command not found
* provs ->
  - [debase]
    [lib]:
      gem(debase) = 0.2.5.beta2
      ruby-gem(debase) = 0.2.5.beta2
      rubygem(debase) = 0.2.5.beta2
Finding Requires (using /usr/lib/rpm/find-requires)
Executing: /bin/sh -e /usr/src/tmp/rpm-tmp.Ei4SfM
find-requires: running scripts (cpp,debuginfo,files,lib,pam,perl,pkgconfig,pkgconfiglib,python,python3,rpmlib,ruby,shebang,shell,static,symlinks,systemd-services)
lib.req: WARNING: /usr/src/tmp/gem-debase-buildroot/usr/lib/ruby/gemie/extensions/debase-0.2.5.beta2/attach.so: overlinked libraries: /lib/libm.so.6
lib.req: WARNING: /usr/src/tmp/gem-debase-buildroot/usr/lib/ruby/gemie/extensions/debase-0.2.5.beta2/debase_internals.so: overlinked libraries: /lib/libm.so.6
ruby.req: detecting ruby requires for gem-debase...
ruby.req: ruby project file is '/usr/src/RPM/BUILD/gem-debase-0.2.5.beta2/SetupConfig'
ruby.req: setup.rb requires --install_prefix=/usr/src/tmp/gem-debase-buildroot --package=gem-debase -q
(ruby 3.1.2 i586-linux)
sh: git: command not found
sh: git: command not found
* reqs ->
  - [debase]
    [lib]:
      
      gem(debase-ruby_core_source) >= 0.10.12
      ruby >= 0
      rubygems >= 0
Provides: gem(debase) = 0.2.5.beta2, ruby-gem(debase) = 0.2.5.beta2, rubygem(debase) = 0.2.5.beta2
Requires: gem(debase-ruby_core_source) >= 0.10.12, libc.so.6(GLIBC_2.0), libc.so.6(GLIBC_2.1.3), libc.so.6(GLIBC_2.3.4), libc.so.6(GLIBC_2.4), libm.so.6, libruby.so.3.1 >= set:ohoq0Dy1LSWZ73QCH9ZqKp0HY4xJgZniMl0uZk3tlmBdIEiZJm4PCRRjMwsEPcpkQpt0xPxzdzvytN8YsaycwQI2hWX5h5ud7WjWwIDiB7Imi1Xg0aZEp9gSscfUU3a6r1tW73q8Of8i5gZkrMCUcHoJKtI90Lv4w2IGTZkr2dcXjoWjBw3lAWdhoFRPt1pZq8DX, rtld(GNU_HASH), ruby >= 0, rubygems >= 0
Requires(rpmlib): rpmlib(SetVersions)
Finding debuginfo files (using /usr/lib/rpm/find-debuginfo-files)
Executing: /bin/sh -e /usr/src/tmp/rpm-tmp.7hBIZe
Creating gem-debase-debuginfo package
Processing files: gem-debase-doc-0.2.5.beta2-alt1
Executing(%doc): /bin/sh -e /usr/src/tmp/rpm-tmp.59463
+ umask 022
+ /bin/mkdir -p /usr/src/RPM/BUILD
+ cd /usr/src/RPM/BUILD
+ cd gem-debase-0.2.5.beta2
+ DOCDIR=/usr/src/tmp/gem-debase-buildroot/usr/share/doc/gem-debase-doc-0.2.5.beta2
+ export DOCDIR
+ rm -rf /usr/src/tmp/gem-debase-buildroot/usr/share/doc/gem-debase-doc-0.2.5.beta2
+ /bin/mkdir -p /usr/src/tmp/gem-debase-buildroot/usr/share/doc/gem-debase-doc-0.2.5.beta2
+ cp -prL README.md /usr/src/tmp/gem-debase-buildroot/usr/share/doc/gem-debase-doc-0.2.5.beta2
+ chmod -R go-w /usr/src/tmp/gem-debase-buildroot/usr/share/doc/gem-debase-doc-0.2.5.beta2
+ chmod -R a+rX /usr/src/tmp/gem-debase-buildroot/usr/share/doc/gem-debase-doc-0.2.5.beta2
+ exit 0
Finding Provides (using /usr/lib/rpm/find-provides)
Executing: /bin/sh -e /usr/src/tmp/rpm-tmp.9TUYYL
find-provides: running scripts (alternatives,debuginfo,lib,pam,perl,pkgconfig,python,python3,ruby,shell)
ruby.prov: detecting ruby provides for gem-debase-doc...
ruby.prov: project file is '/usr/src/RPM/BUILD/gem-debase-0.2.5.beta2/SetupConfig'
ruby.prov: setup.rb provides --install_prefix=/usr/src/tmp/gem-debase-buildroot --package=gem-debase-doc -q
(ruby 3.1.2 i586-linux)
sh: git: command not found
sh: git: command not found
* provs ->
  - [debase]
Finding Requires (using /usr/lib/rpm/find-requires)
Executing: /bin/sh -e /usr/src/tmp/rpm-tmp.HpWIvC
find-requires: running scripts (cpp,debuginfo,files,lib,pam,perl,pkgconfig,pkgconfiglib,python,python3,rpmlib,ruby,shebang,shell,static,symlinks,systemd-services)
ruby.req: detecting ruby requires for gem-debase-doc...
ruby.req: ruby project file is '/usr/src/RPM/BUILD/gem-debase-0.2.5.beta2/SetupConfig'
ruby.req: setup.rb requires --install_prefix=/usr/src/tmp/gem-debase-buildroot --package=gem-debase-doc -q
(ruby 3.1.2 i586-linux)
sh: git: command not found
sh: git: command not found
* reqs ->
  - [debase]
    [doc]:
      gem(debase) = 0.2.5.beta2
Requires: gem(debase) = 0.2.5.beta2
Processing files: gem-debase-devel-0.2.5.beta2-alt1
Executing(%doc): /bin/sh -e /usr/src/tmp/rpm-tmp.86697
+ umask 022
+ /bin/mkdir -p /usr/src/RPM/BUILD
+ cd /usr/src/RPM/BUILD
+ cd gem-debase-0.2.5.beta2
+ DOCDIR=/usr/src/tmp/gem-debase-buildroot/usr/share/doc/gem-debase-devel-0.2.5.beta2
+ export DOCDIR
+ rm -rf /usr/src/tmp/gem-debase-buildroot/usr/share/doc/gem-debase-devel-0.2.5.beta2
+ /bin/mkdir -p /usr/src/tmp/gem-debase-buildroot/usr/share/doc/gem-debase-devel-0.2.5.beta2
+ cp -prL README.md /usr/src/tmp/gem-debase-buildroot/usr/share/doc/gem-debase-devel-0.2.5.beta2
+ chmod -R go-w /usr/src/tmp/gem-debase-buildroot/usr/share/doc/gem-debase-devel-0.2.5.beta2
+ chmod -R a+rX /usr/src/tmp/gem-debase-buildroot/usr/share/doc/gem-debase-devel-0.2.5.beta2
+ exit 0
Finding Provides (using /usr/lib/rpm/find-provides)
Executing: /bin/sh -e /usr/src/tmp/rpm-tmp.1MqYlY
find-provides: running scripts (alternatives,debuginfo,lib,pam,perl,pkgconfig,python,python3,ruby,shell)
ruby.prov: detecting ruby provides for gem-debase-devel...
ruby.prov: project file is '/usr/src/RPM/BUILD/gem-debase-0.2.5.beta2/SetupConfig'
ruby.prov: setup.rb provides --install_prefix=/usr/src/tmp/gem-debase-buildroot --package=gem-debase-devel -q
(ruby 3.1.2 i586-linux)
sh: git: command not found
sh: git: command not found
* provs ->
  - [debase]
Finding Requires (using /usr/lib/rpm/find-requires)
Executing: /bin/sh -e /usr/src/tmp/rpm-tmp.0PPmr1
find-requires: running scripts (cpp,debuginfo,files,lib,pam,perl,pkgconfig,pkgconfiglib,python,python3,rpmlib,ruby,shebang,shell,static,symlinks,systemd-services)
/usr/src/tmp/gem-debase-buildroot/usr/include/hacks.h:1:10: fatal error: vm_core.h: No such file or directory
    1 | #include <vm_core.h>
      |          ^~~~~~~~~~~
compilation terminated.
cpp.req: /usr/src/tmp/gem-debase-buildroot/usr/include/hacks.h: cpp failed, trying c++ mode
i586-alt-linux-cpp: fatal error: cannot execute 'cc1plus': execvp: No such file or directory
compilation terminated.
cpp.req: WARNING: /usr/src/tmp/gem-debase-buildroot/usr/include/hacks.h: cpp failed
/usr/src/tmp/gem-debase-buildroot/usr/include/debase_internals.h:4:10: fatal error: ruby.h: No such file or directory
    4 | #include "ruby.h"
      |          ^~~~~~~~
compilation terminated.
cpp.req: WARNING: /usr/src/tmp/gem-debase-buildroot/usr/include/debase_internals.h: cpp failed
/usr/src/tmp/gem-debase-buildroot/usr/include/attach/attach.h:4:10: fatal error: ruby.h: No such file or directory
    4 | #include <ruby.h>
      |          ^~~~~~~~
compilation terminated.
cpp.req: WARNING: /usr/src/tmp/gem-debase-buildroot/usr/include/attach/attach.h: cpp failed
ruby.req: detecting ruby requires for gem-debase-devel...
ruby.req: ruby project file is '/usr/src/RPM/BUILD/gem-debase-0.2.5.beta2/SetupConfig'
ruby.req: setup.rb requires --install_prefix=/usr/src/tmp/gem-debase-buildroot --package=gem-debase-devel -q
(ruby 3.1.2 i586-linux)
sh: git: command not found
sh: git: command not found
* reqs ->
  - [debase]
    [devel]:
      gem(test-unit) >= 0
      gem(rake) >= 0
Requires: gem(debase) = 0.2.5.beta2, gem(test-unit) >= 0, gem(rake) >= 0
Processing files: gem-debase-debuginfo-0.2.5.beta2-alt1
Finding Provides (using /usr/lib/rpm/find-provides)
Executing: /bin/sh -e /usr/src/tmp/rpm-tmp.o6XEZc
find-provides: running scripts (debuginfo)
Finding Requires (using /usr/lib/rpm/find-requires)
Executing: /bin/sh -e /usr/src/tmp/rpm-tmp.GldzmI
find-requires: running scripts (debuginfo)
objdump: '/usr/src/tmp/gem-debase-buildroot/usr/lib/ruby/gemie/gems/debase-0.2.5.beta2/lib/attach.so': No such file
debuginfo.req: WARNING: /usr/src/tmp/gem-debase-buildroot/usr/lib/ruby/gemie/gems/debase-0.2.5.beta2/lib/attach.so: objdump failed
objdump: '/usr/src/tmp/gem-debase-buildroot/usr/lib/ruby/gemie/gems/debase-0.2.5.beta2/lib/debase_internals.so': No such file
debuginfo.req: WARNING: /usr/src/tmp/gem-debase-buildroot/usr/lib/ruby/gemie/gems/debase-0.2.5.beta2/lib/debase_internals.so: objdump failed
Requires: gem-debase = 0.2.5.beta2-alt1, debug(libc.so.6), debug(libm.so.6), debug(libruby.so.3.1)
Adding to gem-debase-debuginfo a strict dependency on gem-debase
warning: gem-debase-doc: non-strict dependency on gem-debase
warning: gem-debase-devel: non-strict dependency on gem-debase
Wrote: /usr/src/RPM/RPMS/i586/gem-debase-0.2.5.beta2-alt1.i586.rpm (w2.lzdio)
Wrote: /usr/src/RPM/RPMS/noarch/gem-debase-doc-0.2.5.beta2-alt1.noarch.rpm (w2.lzdio)
Wrote: /usr/src/RPM/RPMS/noarch/gem-debase-devel-0.2.5.beta2-alt1.noarch.rpm (w2.lzdio)
Wrote: /usr/src/RPM/RPMS/i586/gem-debase-debuginfo-0.2.5.beta2-alt1.i586.rpm (w2.lzdio)
5.71user 1.54system 0:13.45elapsed 53%CPU (0avgtext+0avgdata 43244maxresident)k
0inputs+0outputs (0major+482337minor)pagefaults 0swaps
2.84user 1.66system 0:25.91elapsed 17%CPU (0avgtext+0avgdata 108060maxresident)k
1128inputs+0outputs (48141major+254277minor)pagefaults 0swaps
--- gem-debase-0.2.5.beta2-alt1.i586.rpm.repo	2022-09-16 10:29:26.000000000 +0000
+++ gem-debase-0.2.5.beta2-alt1.i586.rpm.hasher	2023-01-28 05:09:33.789550582 +0000
@@ -77,4 +77,4 @@
 File: /usr/lib/ruby/gemie/extensions/debase-0.2.5.beta2	40755	root:root		
-File: /usr/lib/ruby/gemie/extensions/debase-0.2.5.beta2/attach.so	100644	root:root	52732cf1190c2e04e22348b9f05e4f47	
-File: /usr/lib/ruby/gemie/extensions/debase-0.2.5.beta2/debase_internals.so	100644	root:root	89d7b33802a20d23a150d565635a6770	
+File: /usr/lib/ruby/gemie/extensions/debase-0.2.5.beta2/attach.so	100644	root:root	f13b183c242cf6142f6a28c1f7c10f37	
+File: /usr/lib/ruby/gemie/extensions/debase-0.2.5.beta2/debase_internals.so	100644	root:root	9a1fe49eb61d95534faf587f7f89439d	
 File: /usr/lib/ruby/gemie/extensions/debase-0.2.5.beta2/gem.build_complete	100644	root:root		
@@ -133,5 +133,5 @@
 File: /usr/lib/ruby/gemie/gems/debase-0.2.5.beta2/test/test_reload_bug.rb	100755	root:root	14e83f8302d958eb54293ce725993906	
-File: /usr/lib/ruby/gemie/specifications/debase-0.2.5.beta2.gemspec	100644	root:root	8b9706abcf515c20d072116e81d57d77	
+File: /usr/lib/ruby/gemie/specifications/debase-0.2.5.beta2.gemspec	100644	root:root	f5a50b90e14a5d164ccdd39eec769073	
 File: /usr/share/doc/gem-debase-0.2.5.beta2	40755	root:root		
 File: /usr/share/doc/gem-debase-0.2.5.beta2/README.md	100644	root:root	cc2c9679351b233027233a1716bf6a03	
-RPMIdentity: 1c1eb2316169c25414fdf255a581726eb6abc597ae5315972f9535dfbdd5863101cc92b4f037ac2bdfe87c603a9ff7627101da886f9b375984c7766da8fbd171
+RPMIdentity: 5b944ef5b5c11a6bee416825cd6e88e249a35989d9d19f1a0d48568f6f1df8471d7043d01e9f9c663d9aff73d0e478572fc6fed424c1af7383e5da4d04684bba
--- gem-debase-debuginfo-0.2.5.beta2-alt1.i586.rpm.repo	2022-09-16 10:29:26.000000000 +0000
+++ gem-debase-debuginfo-0.2.5.beta2-alt1.i586.rpm.hasher	2023-01-28 05:09:33.871551954 +0000
@@ -1,7 +1,7 @@
-/usr/lib/debug/.build-id/e4	40755	root:root	
-/usr/lib/debug/.build-id/e4/20c634a012705c852c82fe40257b90192dfe34	120777	root:root	../../../ruby/gemie/extensions/debase-0.2.5.beta2/attach.so
-/usr/lib/debug/.build-id/e4/20c634a012705c852c82fe40257b90192dfe34.debug	120777	root:root	../../usr/lib/ruby/gemie/extensions/debase-0.2.5.beta2/attach.so.debug
-/usr/lib/debug/.build-id/f8	40755	root:root	
-/usr/lib/debug/.build-id/f8/f70043be3e4f2b429b64d66c808d5d0afc10cb	120777	root:root	../../../ruby/gemie/extensions/debase-0.2.5.beta2/debase_internals.so
-/usr/lib/debug/.build-id/f8/f70043be3e4f2b429b64d66c808d5d0afc10cb.debug	120777	root:root	../../usr/lib/ruby/gemie/extensions/debase-0.2.5.beta2/debase_internals.so.debug
+/usr/lib/debug/.build-id/32	40755	root:root	
+/usr/lib/debug/.build-id/32/32c4e6529485a377acbb862c559cdd3f257a04	120777	root:root	../../../ruby/gemie/extensions/debase-0.2.5.beta2/attach.so
+/usr/lib/debug/.build-id/32/32c4e6529485a377acbb862c559cdd3f257a04.debug	120777	root:root	../../usr/lib/ruby/gemie/extensions/debase-0.2.5.beta2/attach.so.debug
+/usr/lib/debug/.build-id/ab	40755	root:root	
+/usr/lib/debug/.build-id/ab/d1a32e78bbdf2e433bb658a9603734bbbbac4b	120777	root:root	../../../ruby/gemie/extensions/debase-0.2.5.beta2/debase_internals.so
+/usr/lib/debug/.build-id/ab/d1a32e78bbdf2e433bb658a9603734bbbbac4b.debug	120777	root:root	../../usr/lib/ruby/gemie/extensions/debase-0.2.5.beta2/debase_internals.so.debug
 /usr/lib/debug/usr/lib/ruby	40755	root:root	
@@ -33,8 +33,8 @@
 Provides: gem-debase-debuginfo = 0.2.5.beta2-alt1:sisyphus+296703.17700.105.2
-File: /usr/lib/debug/.build-id/e4	40755	root:root		
-File: /usr/lib/debug/.build-id/e4/20c634a012705c852c82fe40257b90192dfe34	120777	root:root		../../../ruby/gemie/extensions/debase-0.2.5.beta2/attach.so
-File: /usr/lib/debug/.build-id/e4/20c634a012705c852c82fe40257b90192dfe34.debug	120777	root:root		../../usr/lib/ruby/gemie/extensions/debase-0.2.5.beta2/attach.so.debug
-File: /usr/lib/debug/.build-id/f8	40755	root:root		
-File: /usr/lib/debug/.build-id/f8/f70043be3e4f2b429b64d66c808d5d0afc10cb	120777	root:root		../../../ruby/gemie/extensions/debase-0.2.5.beta2/debase_internals.so
-File: /usr/lib/debug/.build-id/f8/f70043be3e4f2b429b64d66c808d5d0afc10cb.debug	120777	root:root		../../usr/lib/ruby/gemie/extensions/debase-0.2.5.beta2/debase_internals.so.debug
+File: /usr/lib/debug/.build-id/32	40755	root:root		
+File: /usr/lib/debug/.build-id/32/32c4e6529485a377acbb862c559cdd3f257a04	120777	root:root		../../../ruby/gemie/extensions/debase-0.2.5.beta2/attach.so
+File: /usr/lib/debug/.build-id/32/32c4e6529485a377acbb862c559cdd3f257a04.debug	120777	root:root		../../usr/lib/ruby/gemie/extensions/debase-0.2.5.beta2/attach.so.debug
+File: /usr/lib/debug/.build-id/ab	40755	root:root		
+File: /usr/lib/debug/.build-id/ab/d1a32e78bbdf2e433bb658a9603734bbbbac4b	120777	root:root		../../../ruby/gemie/extensions/debase-0.2.5.beta2/debase_internals.so
+File: /usr/lib/debug/.build-id/ab/d1a32e78bbdf2e433bb658a9603734bbbbac4b.debug	120777	root:root		../../usr/lib/ruby/gemie/extensions/debase-0.2.5.beta2/debase_internals.so.debug
 File: /usr/lib/debug/usr/lib/ruby	40755	root:root		
@@ -43,4 +43,4 @@
 File: /usr/lib/debug/usr/lib/ruby/gemie/extensions/debase-0.2.5.beta2	40755	root:root		
-File: /usr/lib/debug/usr/lib/ruby/gemie/extensions/debase-0.2.5.beta2/attach.so.debug	100644	root:root	03e0354fa37cd99174cbe4338d9c9475	
-File: /usr/lib/debug/usr/lib/ruby/gemie/extensions/debase-0.2.5.beta2/debase_internals.so.debug	100644	root:root	8848711b8dfa8e95f28e6d7282006ac1	
+File: /usr/lib/debug/usr/lib/ruby/gemie/extensions/debase-0.2.5.beta2/attach.so.debug	100644	root:root	b0ec2a91ba163fa3c4794b87de296591	
+File: /usr/lib/debug/usr/lib/ruby/gemie/extensions/debase-0.2.5.beta2/debase_internals.so.debug	100644	root:root	225ecb22c7b9686ed4799347f4c935e7	
 File: /usr/lib/debug/usr/lib/ruby/gemie/gems	40755	root:root		
@@ -60,2 +60,2 @@
 File: /usr/src/debug/gem-debase-0.2.5.beta2/ext/locker.c	100644	root:root	dc479888ec8717ddaa30fcc05676ccc9	
-RPMIdentity: 2a5f4546aa2094cfea1220ba5ef767ce19615392f9d0f29546071256a8e70f2cde8dbe4f9fdd10dce2b74802a3c2177b7aabbd036580b61b2ee2a8507b8eab3b
+RPMIdentity: 3fd5452fc112eba16f80d10c0f23c01db7bbf333bf86ac46efaeeaf57be5f490fb15faf8c7e025e3aff98577bb1b2f7018ad5260a96968b509925bd70303e6aa