<86>Oct 29 09:06:32 userdel[346714]: delete user 'rooter'
<86>Oct 29 09:06:32 userdel[346714]: removed group 'rooter' owned by 'rooter'
<86>Oct 29 09:06:32 userdel[346714]: removed shadow group 'rooter' owned by 'rooter'
<86>Oct 29 09:06:32 groupadd[346719]: group added to /etc/group: name=rooter, GID=555
<86>Oct 29 09:06:32 groupadd[346719]: group added to /etc/gshadow: name=rooter
<86>Oct 29 09:06:32 groupadd[346719]: new group: name=rooter, GID=555
<86>Oct 29 09:06:32 useradd[346723]: new user: name=rooter, UID=555, GID=555, home=/root, shell=/bin/bash
<86>Oct 29 09:06:32 userdel[346730]: delete user 'builder'
<86>Oct 29 09:06:32 userdel[346730]: removed group 'builder' owned by 'builder'
<86>Oct 29 09:06:32 userdel[346730]: removed shadow group 'builder' owned by 'builder'
<86>Oct 29 09:06:32 groupadd[346735]: group added to /etc/group: name=builder, GID=556
<86>Oct 29 09:06:32 groupadd[346735]: group added to /etc/gshadow: name=builder
<86>Oct 29 09:06:32 groupadd[346735]: new group: name=builder, GID=556
<86>Oct 29 09:06:32 useradd[346739]: new user: name=builder, UID=556, GID=556, home=/usr/src, shell=/bin/bash
warning: Macro %meson not found
warning: Macro %meson_build not found
warning: Macro %meson_install not found
warning: Macro %_typelibdir not found
warning: Macro %_girdir not found
<13>Oct 29 09:06:35 rpmi: sgml-common-0.6.3-alt15 1423664786 installed
<13>Oct 29 09:06:35 rpmi: xml-utils-1:2.9.10-alt3 sisyphus+245000.16400.79.1 1583230501 installed
<13>Oct 29 09:06:35 rpmi: docbook-dtds-4.5-alt1 1223476557 installed
<13>Oct 29 09:06:35 rpmi: rpm-build-gir-0.7.3-alt3 sisyphus+242150.100.1.1 1575312005 installed
<13>Oct 29 09:06:35 rpmi: libnspr-1:4.29-alt1 sisyphus+260224.100.2.1 1603548999 installed
<13>Oct 29 09:06:35 rpmi: libgdbm-1.8.3-alt10 1454943334 installed
<13>Oct 29 09:06:35 rpmi: libexpat-2.2.10-alt1 sisyphus+259966.100.1.1 1602824518 installed
<13>Oct 29 09:06:36 rpmi: docbook-style-xsl-1.79.1-alt4 sisyphus+232871.100.1.1 1561238010 installed
<13>Oct 29 09:06:36 rpmi: ninja-build-1.10.1-alt1 sisyphus+256480.100.1.1 1597849681 installed
<13>Oct 29 09:06:36 rpmi: liblz4-1:1.9.2-alt1 sisyphus+238585.100.2.2 1570066927 installed
<13>Oct 29 09:06:36 rpmi: libOpenSP-1.5.2-alt3.qa1 1365943435 installed
<13>Oct 29 09:06:36 rpmi: openjade-1.3.2-alt15 sisyphus+219815.100.1.1 1548167857 installed
<13>Oct 29 09:06:36 rpmi: docbook-style-dsssl-1.79-alt3 1324062818 installed
<13>Oct 29 09:06:36 rpmi: python-modules-curses-2.7.18-alt1 sisyphus+255741.100.1.1 1596450480 installed
<13>Oct 29 09:06:36 rpmi: libverto-0.3.0-alt1_7 sisyphus+225932.100.1.1 1553994919 installed
<13>Oct 29 09:06:36 rpmi: liblmdb-0.9.23-alt1 sisyphus+225277.100.2.1 1553001679 installed
<13>Oct 29 09:06:36 rpmi: libkeyutils-1.6.1-alt1 sisyphus+256015.100.1.1 1596820124 installed
<13>Oct 29 09:06:36 rpmi: libcom_err-1.44.6-alt1 sisyphus+224154.100.1.1 1552091678 installed
<13>Oct 29 09:06:36 rpmi: python-sphinx-objects.inv-1:2.3.10.20201024-alt1 sisyphus+260387.100.1.1 1603669144 installed
<13>Oct 29 09:06:36 rpmi: libgpg-error-1.36-alt1 sisyphus+225621.300.1.1 1553521082 installed
<13>Oct 29 09:06:36 rpmi: libgcrypt20-1.8.5-alt3 sisyphus+239622.100.1.1 1571746654 installed
<13>Oct 29 09:06:36 rpmi: libsystemd-1:246.6-alt4 sisyphus+258064.640.8.1 1603822624 installed
<13>Oct 29 09:06:36 rpmi: libxslt-1.1.34-alt2 sisyphus+248264.100.1.1 1584829770 installed
<13>Oct 29 09:06:36 rpmi: xsltproc-1.1.34-alt2 sisyphus+248264.100.1.1 1584829770 installed
<13>Oct 29 09:06:36 rpmi: libdbus-1.12.18-alt1 sisyphus+252758.100.1.1 1591203693 installed
<13>Oct 29 09:06:36 rpmi: libsqlite3-3.33.0-alt1 sisyphus+256344.100.1.1 1597522272 installed
<13>Oct 29 09:06:36 rpmi: libffi-devel-1:3.3-alt1 sisyphus+251953.40.2.1 1589891229 installed
<13>Oct 29 09:06:36 rpmi: shared-mime-info-2.0-alt1 sisyphus+251302.100.1.1 1588847607 installed
<13>Oct 29 09:06:36 rpmi: gsettings-desktop-schemas-data-3.38.0-alt1 sisyphus+258314.500.14.2 1600843028 installed
<13>Oct 29 09:06:36 rpmi: libgio-2.66.2-alt1 sisyphus+260251.100.1.1 1603457334 installed
<13>Oct 29 09:06:36 rpmi: gsettings-desktop-schemas-3.38.0-alt1 sisyphus+258314.500.14.2 1600843530 installed
<13>Oct 29 09:06:36 rpmi: gobject-introspection-1.66.1-alt1 sisyphus+260448.100.1.1 1603724205 installed
<13>Oct 29 09:06:36 rpmi: gobject-introspection-x11-1.66.1-alt1 sisyphus+260448.100.1.1 1603724205 installed
<13>Oct 29 09:06:36 rpmi: libpolkit-0.118-alt1 sisyphus+257894.100.1.1 1599828367 installed
<13>Oct 29 09:06:36 rpmi: libp11-kit-0.23.15-alt2 sisyphus+252784.100.2.2 1591274901 installed
<13>Oct 29 09:06:36 rpmi: libtasn1-4.16.0-alt1 sisyphus+245480.100.1.1 1580825062 installed
<13>Oct 29 09:06:36 rpmi: rpm-macros-alternatives-0.5.1-alt1 sisyphus+226946.100.1.1 1554830426 installed
<13>Oct 29 09:06:36 rpmi: alternatives-0.5.1-alt1 sisyphus+226946.100.1.1 1554830426 installed
<13>Oct 29 09:06:36 rpmi: ca-certificates-2020.10.22-alt1 sisyphus+260224.300.2.1 1603549301 installed
<13>Oct 29 09:06:36 rpmi: ca-trust-0.1.2-alt1 sisyphus+233348.100.1.1 1561653823 installed
<13>Oct 29 09:06:36 rpmi: p11-kit-trust-0.23.15-alt2 sisyphus+252784.100.2.2 1591274901 installed
<13>Oct 29 09:06:37 rpmi: libcrypto1.1-1.1.1g-alt1 sisyphus+249982.60.8.1 1587743711 installed
<13>Oct 29 09:06:37 rpmi: libssl1.1-1.1.1g-alt1 sisyphus+249982.60.8.1 1587743711 installed
<13>Oct 29 09:06:37 rpmi: libpython3-3.8.6-alt1 sisyphus+259085.100.2.1 1601904174 installed
<13>Oct 29 09:06:37 rpmi: python3-3.8.6-alt1 sisyphus+259085.100.2.1 1601904174 installed
<13>Oct 29 09:06:37 rpmi: python3-base-3.8.6-alt1 sisyphus+259085.100.2.1 1601904174 installed
<13>Oct 29 09:06:37 rpmi: python3-module-pkg_resources-1:46.1.3-alt2 sisyphus+260458.600.6.1 1603876498 installed
<13>Oct 29 09:06:37 rpmi: python3-module-six-1.15.0-alt1 sisyphus+255738.100.2.1 1596527214 installed
<13>Oct 29 09:06:37 rpmi: glib2-devel-2.66.2-alt1 sisyphus+260251.100.1.1 1603457334 installed
<13>Oct 29 09:06:38 rpmi: libgio-devel-2.66.2-alt1 sisyphus+260251.100.1.1 1603457334 installed
<13>Oct 29 09:06:38 rpmi: python3-module-anytree-2.8.0-alt1 sisyphus+244447.100.1.1 1579262422 installed
<13>Oct 29 09:06:38 rpmi: python3-module-ntlm-1.1.0-alt1.2 sisyphus+228512.100.1.1 1556654575 installed
<13>Oct 29 09:06:38 rpmi: python3-module-pycparser-2.19-alt2 sisyphus+245734.100.1.1 1581192421 installed
<13>Oct 29 09:06:38 rpmi: python3-module-cffi-1.14.0-alt1 sisyphus+255743.100.1.1 1596453449 installed
<13>Oct 29 09:06:38 rpmi: python3-module-cryptography-3.2.1-alt1 sisyphus+260557.100.1.1 1603890570 installed
<13>Oct 29 09:06:38 rpmi: python3-module-OpenSSL-19.0.0-alt1 sisyphus+238757.100.1.1 1570339901 installed
<13>Oct 29 09:06:38 rpmi: python3-module-pytz-1:2020.1-alt1 sisyphus+254576.100.1.1 1594046074 installed
<13>Oct 29 09:06:38 rpmi: python3-module-babel-1:2.6.0-alt1.1 sisyphus+260198.100.1.1 1603329654 installed
<13>Oct 29 09:06:38 rpmi: python3-module-zope.interface-5.1.0-alt2 sisyphus+257632.4200.5.1 1599657270 installed
<13>Oct 29 09:06:38 rpmi: python3-module-chameleon.core-3.8.1-alt1 sisyphus+257108.100.1.1 1598978997 installed
<13>Oct 29 09:06:38 rpmi: python3-module-polib-1.0.5-alt1.1.2 sisyphus+227468.1200.2.2 1555756059 installed
<13>Oct 29 09:06:38 rpmi: python3-module-lingua-4.13-alt3 sisyphus+257106.300.1.1 1598975446 installed
<13>Oct 29 09:06:38 rpmi: python3-module-genshi-0.7.3-alt1 sisyphus+258174.100.1.1 1600287033 installed
<13>Oct 29 09:06:38 rpmi: python3-module-webencodings-0.5.1-alt2 sisyphus+245915.200.1.1 1581496105 installed
<13>Oct 29 09:06:38 rpmi: python3-module-cssselect-0.9.1-alt2 sisyphus+250566.2300.6.1 1588188959 installed
<13>Oct 29 09:06:38 rpmi: python3-module-html5lib-1:1.0.1-alt1 sisyphus+238807.100.2.1 1570465973 installed
<13>Oct 29 09:06:38 rpmi: python3-module-lxml-4.5.0-alt2 sisyphus+250566.2700.6.1 1588189778 installed
<13>Oct 29 09:06:39 rpmi: python3-module-docutils-0.16.0-alt1 sisyphus+250087.100.1.1 1587043829 installed
<13>Oct 29 09:06:39 rpmi: python3-module-chardet-3.0.4-alt1 sisyphus+227476.1700.1.2 1555756717 installed
<13>Oct 29 09:06:39 rpmi: python3-module-idna-2.10-alt1 sisyphus+255040.200.1.1 1594995891 installed
<13>Oct 29 09:06:39 rpmi: python3-module-ndg-0.4.2-alt1.qa1 sisyphus+227504.1300.1.2 1555853234 installed
<13>Oct 29 09:06:39 rpmi: python3-module-ndg-httpsclient-0.4.2-alt1.qa1 sisyphus+227504.1300.1.2 1555853234 installed
<13>Oct 29 09:06:39 rpmi: python3-module-urllib3-2:1.25.10-alt1 sisyphus+255342.100.1.1 1595592746 installed
<13>Oct 29 09:06:39 rpmi: python3-module-requests-2.24.0-alt1 sisyphus+254580.100.1.1 1594048060 installed
<13>Oct 29 09:06:39 rpmi: python3-module-imagesize-1.1.0-alt1 sisyphus+229015.100.2.1 1557233756 installed
<13>Oct 29 09:06:39 rpmi: python3-module-markupsafe-1.1.1-alt1 sisyphus+248369.100.1.1 1585046136 installed
<13>Oct 29 09:06:39 rpmi: python3-module-jinja2-2.11.2-alt1 sisyphus+254573.100.1.1 1594043344 installed
<13>Oct 29 09:06:39 rpmi: python3-module-pyparsing-2.4.2-alt1 sisyphus+236061.100.3.1 1565853577 installed
<13>Oct 29 09:06:39 rpmi: python3-module-packaging-19.0-alt2 sisyphus+235493.3500.8.1 1565461874 installed
<13>Oct 29 09:06:39 rpmi: python3-module-snowballstemmer-1.2.0-alt2.1 1457859319 installed
<13>Oct 29 09:06:39 rpmi: python3-module-sphinxcontrib-applehelp-1.0.2-alt1 sisyphus+252614.200.1.1 1590949678 installed
<13>Oct 29 09:06:39 rpmi: python3-module-sphinxcontrib-devhelp-1.0.2-alt1 sisyphus+252614.300.1.1 1590949711 installed
<13>Oct 29 09:06:39 rpmi: python3-module-sphinxcontrib-htmlhelp-1.0.2-alt1 sisyphus+228401.100.1.1 1556572721 installed
<13>Oct 29 09:06:39 rpmi: python3-module-sphinxcontrib-jsmath-1.0.1-alt1 sisyphus+238085.500.1.1 1569313099 installed
<13>Oct 29 09:06:39 rpmi: python3-module-sphinxcontrib-qthelp-1.0.3-alt1 sisyphus+252614.400.1.1 1590949745 installed
<13>Oct 29 09:06:39 rpmi: python3-module-sphinxcontrib-serializinghtml-1.1.4-alt1 sisyphus+252614.100.1.1 1590949645 installed
<13>Oct 29 09:06:39 rpmi: python3-module-alabaster-0.7.6-alt3 sisyphus+228351.700.4.1 1556637370 installed
<13>Oct 29 09:06:39 rpmi: python3-module-Pygments-2.6.1-alt1 sisyphus+251222.200.1.1 1588756845 installed
<13>Oct 29 09:06:39 rpmi: python3-module-sphinx-1:2.4.4-alt1 sisyphus+254723.100.1.2 1594318607 installed
<13>Oct 29 09:06:39 rpmi: python3-module-markdown-3.2.2-alt1 sisyphus+251500.100.1.1 1589097595 installed
<86>Oct 29 09:06:39 groupadd[349364]: group added to /etc/group: name=_keytab, GID=499
<86>Oct 29 09:06:39 groupadd[349364]: group added to /etc/gshadow: name=_keytab
<86>Oct 29 09:06:39 groupadd[349364]: new group: name=_keytab, GID=499
<13>Oct 29 09:06:39 rpmi: libkrb5-1.18.2-alt2 sisyphus+254565.100.4.1 1594375666 installed
<13>Oct 29 09:06:39 rpmi: libtirpc-1.2.6-alt1 sisyphus+250076.100.1.1 1587038270 installed
<13>Oct 29 09:06:39 rpmi: libnsl2-1.1.0-alt1_1 1511548749 installed
<13>Oct 29 09:06:39 rpmi: python-modules-compiler-2.7.18-alt1 sisyphus+255741.100.1.1 1596450480 installed
<13>Oct 29 09:06:39 rpmi: python-modules-email-2.7.18-alt1 sisyphus+255741.100.1.1 1596450480 installed
<13>Oct 29 09:06:39 rpmi: python-modules-unittest-2.7.18-alt1 sisyphus+255741.100.1.1 1596450480 installed
<13>Oct 29 09:06:39 rpmi: python-modules-nis-2.7.18-alt1 sisyphus+255741.100.1.1 1596450480 installed
<13>Oct 29 09:06:39 rpmi: python-modules-encodings-2.7.18-alt1 sisyphus+255741.100.1.1 1596450480 installed
<13>Oct 29 09:06:40 rpmi: python-modules-2.7.18-alt1 sisyphus+255741.100.1.1 1596450480 installed
<13>Oct 29 09:06:40 rpmi: python-modules-xml-2.7.18-alt1 sisyphus+255741.100.1.1 1596450480 installed
<13>Oct 29 09:06:40 rpmi: python-modules-hotshot-2.7.18-alt1 sisyphus+255741.100.1.1 1596450480 installed
<13>Oct 29 09:06:40 rpmi: python-modules-bsddb-2.7.18-alt1 sisyphus+255741.100.1.1 1596450480 installed
<13>Oct 29 09:06:40 rpmi: python-modules-ctypes-2.7.18-alt1 sisyphus+255741.100.1.1 1596450480 installed
<13>Oct 29 09:06:40 rpmi: python-modules-multiprocessing-2.7.18-alt1 sisyphus+255741.100.1.1 1596450480 installed
<13>Oct 29 09:06:40 rpmi: python-modules-logging-2.7.18-alt1 sisyphus+255741.100.1.1 1596450480 installed
<13>Oct 29 09:06:40 rpmi: python-2.7.18-alt1 sisyphus+255741.100.1.1 1596450480 installed
<13>Oct 29 09:06:40 rpmi: libnss-3.58.0-alt1 sisyphus+260224.200.2.1 1603549222 installed
<13>Oct 29 09:06:40 rpmi: python3-module-nss-1.0.1-alt5 sisyphus+245000.5440.78.1 1583197855 installed
<13>Oct 29 09:06:40 rpmi: python3-module-beaker-1.10.1-alt1 sisyphus+229409.100.1.1 1557918115 installed
<13>Oct 29 09:06:40 rpmi: python3-module-mako-1.0.9-alt2 sisyphus+257106.200.1.1 1598975414 installed
<13>Oct 29 09:06:40 rpmi: gobject-introspection-devel-1.66.1-alt1 sisyphus+260448.100.1.1 1603724205 installed
<13>Oct 29 09:06:40 rpmi: gtk-doc-1.32.1-alt0.1 sisyphus+258314.140.10.1 1600723015 installed
<13>Oct 29 09:06:40 rpmi: libpolkit-devel-0.118-alt1 sisyphus+257894.100.1.1 1599828367 installed
<13>Oct 29 09:06:40 rpmi: meson-0.55.3-alt1 sisyphus+258314.100.10.1 1600722812 installed
<13>Oct 29 09:06:40 rpmi: libdbus-devel-1.12.18-alt1 sisyphus+252758.100.1.1 1591203693 installed
<13>Oct 29 09:06:40 rpmi: libsystemd-devel-1:246.6-alt4 sisyphus+258064.640.8.1 1603822624 installed
Building target platforms: i586
Building for target i586
Wrote: /usr/src/in/nosrpm/accountsservice-0.6.55-alt1.nosrc.rpm
Installing accountsservice-0.6.55-alt1.src.rpm
Building target platforms: i586
Building for target i586
Executing(%prep): /bin/sh -e /usr/src/tmp/rpm-tmp.65518
+ umask 022
+ /bin/mkdir -p /usr/src/RPM/BUILD
+ cd /usr/src/RPM/BUILD
+ cd /usr/src/RPM/BUILD
+ rm -rf accountsservice-0.6.55
+ echo 'Source #0 (accountsservice-0.6.55.tar):'
Source #0 (accountsservice-0.6.55.tar):
+ /bin/tar -xf /usr/src/RPM/SOURCES/accountsservice-0.6.55.tar
+ cd accountsservice-0.6.55
+ /bin/chmod -c -Rf u+rwX,go-w .
+ echo 'Patch #1 (accountsservice-0.6.55.patch):'
Patch #1 (accountsservice-0.6.55.patch):
+ /usr/bin/patch -p1
patching file data/org.freedesktop.Accounts.User.xml
patching file src/daemon.c
patching file src/user-classify.c
+ exit 0
Executing(%build): /bin/sh -e /usr/src/tmp/rpm-tmp.65518
+ umask 022
+ /bin/mkdir -p /usr/src/RPM/BUILD
+ cd /usr/src/RPM/BUILD
+ cd accountsservice-0.6.55
+ mkdir -p i586-alt-linux
+ CFLAGS='-pipe -frecord-gcc-switches -Wall -g -O2 -march=i586 -mtune=generic'
+ export CFLAGS
+ CXXFLAGS='-pipe -frecord-gcc-switches -Wall -g -O2 -march=i586 -mtune=generic'
+ export CXXFLAGS
+ FFLAGS='-pipe -frecord-gcc-switches -Wall -g -O2 -march=i586 -mtune=generic'
+ export FFLAGS
+ FCFLAGS='-pipe -frecord-gcc-switches -Wall -g -O2 -march=i586 -mtune=generic'
+ export FCFLAGS
+ /usr/bin/meson . i586-alt-linux --buildtype=plain --prefix=/usr --bindir=/usr/bin --sbindir=/usr/sbin --libexecdir=/usr/libexec --libdir=/usr/lib --localstatedir=/var --sharedstatedir=/var/lib --includedir=/usr/include --datadir=/usr/share --sysconfdir=/etc --mandir=/usr/share/man --infodir=/usr/share/info --localedir=/usr/share/locale --wrap-mode=nodownload -Dadmin_group=wheel -Duser_heuristics=true -Dminimum_uid=500 -Dsystemd=true -Dsystemdsystemunitdir=/lib/systemd/system
The Meson build system
Version: 0.55.3
Source dir: /usr/src/RPM/BUILD/accountsservice-0.6.55
Build dir: /usr/src/RPM/BUILD/accountsservice-0.6.55/i586-alt-linux
Build type: native build
Project name: accountsservice
Project version: 0.6.55
Using 'CFLAGS' from environment with value: '-pipe -frecord-gcc-switches -Wall -g -O2 -march=i586 -mtune=generic'
Using 'CFLAGS' from environment with value: '-pipe -frecord-gcc-switches -Wall -g -O2 -march=i586 -mtune=generic'
C compiler for the host machine: cc (gcc 9.3.1 "i586-alt-linux-gcc (GCC) 9.3.1 20200518 (ALT Sisyphus 9.3.1-alt1)")
C linker for the host machine: cc ld.bfd 2.32.0.20190906
Host machine cpu family: x86
Host machine cpu: i686
Has header "paths.h" : YES 
Has header "shadow.h" : YES 
Has header "utmpx.h" : YES 
Checking for function "getusershell" : YES 
Checking for function "setutxdb" : NO 
Checking for function "fgetpwent" : YES 
Header <utmpx.h> has symbol "WTMPX_FILENAME" : YES 
Message: whether optimization is enabled: false
Found pkg-config: /usr/bin/pkg-config (0.29.2)
Run-time dependency gio-2.0 found: YES 2.66.2
Run-time dependency gio-unix-2.0 found: YES 2.66.2
Run-time dependency glib-2.0 found: YES 2.66.2
Run-time dependency polkit-gobject-1 found: YES 0.118
Library crypt found: YES
Run-time dependency dbus-1 found: YES 1.12.18
Run-time dependency libsystemd found: YES 246
WARNING: Project targeting '>= 0.46.0' but tried to use feature introduced in '0.50.0': install arg in configure_file.
Configuring org.freedesktop.Accounts.service using configuration
Configuring accounts-daemon.service using configuration
Program gdbus-codegen found: YES
Found pkg-config: /usr/bin/pkg-config (0.29.2)
Program gdbus-codegen found: YES
Program glib-mkenums found: YES
Program gdbus-codegen found: YES
Program gdbus-codegen found: YES
Program gdbus-codegen found: YES
Compiler for C supports link arguments -Wl,--version-script,/usr/src/RPM/BUILD/accountsservice-0.6.55/src/libaccountsservice/symbol.map: YES 
Build-time dependency gobject-introspection-1.0 found: YES 1.66.1
Program g_ir_scanner found: YES (/usr/bin/g-ir-scanner)
Program g_ir_compiler found: YES (/usr/bin/g-ir-compiler)
Configuring config.h using configuration
Program meson_post_install.py found: YES (/usr/bin/python3 /usr/src/RPM/BUILD/accountsservice-0.6.55/meson_post_install.py)
Message: 
accountsservice was configured with the following options:
** DocBook documentation build: false
** Administrator group: wheel
** Extra administrator groups: 
** GDM configuration: /etc/gdm/custom.conf
Build targets in project: 21
WARNING: Project specifies a minimum meson_version '>= 0.46.0' but uses features which were added in newer versions:
 * 0.50.0: {'install arg in configure_file'}

Option buildtype is: plain [default: debugoptimized]
Found ninja-1.10.1 at /usr/bin/ninja
+ ninja-build -j8 -C i586-alt-linux
ninja: Entering directory `i586-alt-linux'
[1/33] Generating accounts-generated.c with a custom command
[2/33] Generating ck-manager-generated.c with a custom command
[3/33] Generating accounts-user-generated.c with a custom command
[4/33] Generating accounts-generated.h with a custom command
[5/33] Generating ck-seat-generated.c with a custom command
[6/33] Generating ck-manager-generated.h with a custom command
[7/33] Generating accounts-user-generated.h with a custom command
[8/33] Generating ck-seat-generated.h with a custom command
[9/33] Generating ck-session-generated.h with a custom command
[10/33] Generating ck-session-generated.c with a custom command
[11/33] Compiling C object src/accounts-daemon.p/extensions.c.o
[12/33] Compiling C object src/accounts-daemon.p/user-classify.c.o
[13/33] Compiling C object src/accounts-daemon.p/util.c.o
../src/util.c: In function ‘setup_loginuid’:
../src/util.c:217:9: warning: ignoring return value of ‘write’, declared with attribute warn_unused_result [-Wunused-result]
  217 |         write (fd, id, strlen (id));
      |         ^~~~~~~~~~~~~~~~~~~~~~~~~~~
In file included from /usr/include/string.h:508,
                 from ../src/util.c:24:
In function ‘strncpy’,
    inlined from ‘get_caller_loginuid’ at ../src/util.c:177:17,
    inlined from ‘spawn_with_login_uid’ at ../src/util.c:230:9:
/usr/include/bits/string_fortified.h:106:10: warning: ‘__builtin_strncpy’ specified bound 20 equals destination size [-Wstringop-truncation]
  106 |   return __builtin___strncpy_chk (__dest, __src, __len, __bos (__dest));
      |          ^~~~~~~~~~~~~~~~~~~~~~~~~~~~~~~~~~~~~~~~~~~~~~~~~~~~~~~~~~~~~~
[14/33] Compiling C object src/accounts-daemon.p/daemon.c.o
[15/33] Compiling C object src/accounts-daemon.p/main.c.o
[16/33] Generating org.freedesktop.accounts.policy_data_merge with a custom command
[17/33] Compiling C object src/libaccounts-generated.a.p/meson-generated_.._accounts-generated.c.o
[18/33] Compiling C object src/accounts-daemon.p/wtmp-helper.c.o
[19/33] Compiling C object src/accounts-daemon.p/user.c.o
[20/33] Generating act-user-enum-types.h with a meson_exe.py custom command
[21/33] Compiling C object src/libaccounts-generated.a.p/meson-generated_.._accounts-user-generated.c.o
[22/33] Linking static target src/libaccounts-generated.a
[23/33] Linking target src/accounts-daemon
[24/33] Compiling C object src/libaccountsservice/libaccountsservice.so.0.0.0.p/meson-generated_.._ck-manager-generated.c.o
[25/33] Generating act-user-enum-types.c with a meson_exe.py custom command
[26/33] Compiling C object src/libaccountsservice/libaccountsservice.so.0.0.0.p/meson-generated_.._ck-seat-generated.c.o
[27/33] Compiling C object src/libaccountsservice/libaccountsservice.so.0.0.0.p/meson-generated_.._act-user-enum-types.c.o
[28/33] Compiling C object src/libaccountsservice/libaccountsservice.so.0.0.0.p/act-user.c.o
[29/33] Compiling C object src/libaccountsservice/libaccountsservice.so.0.0.0.p/meson-generated_.._ck-session-generated.c.o
[30/33] Compiling C object src/libaccountsservice/libaccountsservice.so.0.0.0.p/act-user-manager.c.o
../src/libaccountsservice/act-user-manager.c: In function ‘_can_activate_systemd_sessions’:
../src/libaccountsservice/act-user-manager.c:489:9: warning: ‘sd_seat_can_multi_session’ is deprecated [-Wdeprecated-declarations]
  489 |         res = sd_seat_can_multi_session (priv->seat.id);
      |         ^~~
In file included from ../src/libaccountsservice/act-user-manager.c:45:
/usr/include/systemd/sd-login.h:186:5: note: declared here
  186 | int sd_seat_can_multi_session(const char *seat) _sd_deprecated_;
      |     ^~~~~~~~~~~~~~~~~~~~~~~~~
[31/33] Linking target src/libaccountsservice/libaccountsservice.so.0.0.0
[32/33] Generating AccountsService-1.0.gir with a custom command
g-ir-scanner: link: i586-alt-linux-gcc -pthread -o /usr/src/RPM/BUILD/accountsservice-0.6.55/i586-alt-linux/tmp-introspectjlpe1qe5/AccountsService-1.0 -pipe -frecord-gcc-switches -Wall -g -O2 -march=i586 -mtune=generic /usr/src/RPM/BUILD/accountsservice-0.6.55/i586-alt-linux/tmp-introspectjlpe1qe5/AccountsService-1.0.o -L. -Wl,-rpath,. -Wl,--no-as-needed -L/usr/src/RPM/BUILD/accountsservice-0.6.55/i586-alt-linux/src/libaccountsservice -Wl,-rpath,/usr/src/RPM/BUILD/accountsservice-0.6.55/i586-alt-linux/src/libaccountsservice -L/usr/src/RPM/BUILD/accountsservice-0.6.55/i586-alt-linux/src/libaccountsservice -Wl,-rpath,/usr/src/RPM/BUILD/accountsservice-0.6.55/i586-alt-linux/src/libaccountsservice -laccountsservice -laccountsservice -lcrypt -lgio-2.0 -lgobject-2.0 -lglib-2.0 -lsystemd -lgirepository-1.0 -lgio-2.0 -lgobject-2.0 -Wl,--export-dynamic -lgmodule-2.0 -pthread -lglib-2.0
/usr/lib/gcc/i586-alt-linux/9/include/stddef.h:424: syntax error, unexpected identifier in '  __float128 __max_align_f128 __attribute__((__aligned__(__alignof(__float128))));' at '__float128'
[33/33] Generating AccountsService-1.0.typelib with a custom command
+ exit 0
Executing(%install): /bin/sh -e /usr/src/tmp/rpm-tmp.65794
+ umask 022
+ /bin/mkdir -p /usr/src/RPM/BUILD
+ cd /usr/src/RPM/BUILD
+ /bin/chmod -Rf u+rwX -- /usr/src/tmp/accountsservice-buildroot
+ :
+ /bin/rm -rf -- /usr/src/tmp/accountsservice-buildroot
+ cd accountsservice-0.6.55
+ DESTDIR=/usr/src/tmp/accountsservice-buildroot
+ ninja-build -C i586-alt-linux install
ninja: Entering directory `i586-alt-linux'
[0/1] Installing files.
Installing /usr/src/RPM/BUILD/accountsservice-0.6.55/i586-alt-linux/po/af.gmo to /usr/src/tmp/accountsservice-buildroot/usr/share/locale/af/LC_MESSAGES/accounts-service.mo
Installing /usr/src/RPM/BUILD/accountsservice-0.6.55/i586-alt-linux/po/ar.gmo to /usr/src/tmp/accountsservice-buildroot/usr/share/locale/ar/LC_MESSAGES/accounts-service.mo
Installing /usr/src/RPM/BUILD/accountsservice-0.6.55/i586-alt-linux/po/as.gmo to /usr/src/tmp/accountsservice-buildroot/usr/share/locale/as/LC_MESSAGES/accounts-service.mo
Installing /usr/src/RPM/BUILD/accountsservice-0.6.55/i586-alt-linux/po/ast.gmo to /usr/src/tmp/accountsservice-buildroot/usr/share/locale/ast/LC_MESSAGES/accounts-service.mo
Installing /usr/src/RPM/BUILD/accountsservice-0.6.55/i586-alt-linux/po/az.gmo to /usr/src/tmp/accountsservice-buildroot/usr/share/locale/az/LC_MESSAGES/accounts-service.mo
Installing /usr/src/RPM/BUILD/accountsservice-0.6.55/i586-alt-linux/po/be.gmo to /usr/src/tmp/accountsservice-buildroot/usr/share/locale/be/LC_MESSAGES/accounts-service.mo
Installing /usr/src/RPM/BUILD/accountsservice-0.6.55/i586-alt-linux/po/bg.gmo to /usr/src/tmp/accountsservice-buildroot/usr/share/locale/bg/LC_MESSAGES/accounts-service.mo
Installing /usr/src/RPM/BUILD/accountsservice-0.6.55/i586-alt-linux/po/bn_IN.gmo to /usr/src/tmp/accountsservice-buildroot/usr/share/locale/bn_IN/LC_MESSAGES/accounts-service.mo
Installing /usr/src/RPM/BUILD/accountsservice-0.6.55/i586-alt-linux/po/ca.gmo to /usr/src/tmp/accountsservice-buildroot/usr/share/locale/ca/LC_MESSAGES/accounts-service.mo
Installing /usr/src/RPM/BUILD/accountsservice-0.6.55/i586-alt-linux/po/ca@valencia.gmo to /usr/src/tmp/accountsservice-buildroot/usr/share/locale/ca@valencia/LC_MESSAGES/accounts-service.mo
Installing /usr/src/RPM/BUILD/accountsservice-0.6.55/i586-alt-linux/po/cs.gmo to /usr/src/tmp/accountsservice-buildroot/usr/share/locale/cs/LC_MESSAGES/accounts-service.mo
Installing /usr/src/RPM/BUILD/accountsservice-0.6.55/i586-alt-linux/po/cy.gmo to /usr/src/tmp/accountsservice-buildroot/usr/share/locale/cy/LC_MESSAGES/accounts-service.mo
Installing /usr/src/RPM/BUILD/accountsservice-0.6.55/i586-alt-linux/po/da.gmo to /usr/src/tmp/accountsservice-buildroot/usr/share/locale/da/LC_MESSAGES/accounts-service.mo
Installing /usr/src/RPM/BUILD/accountsservice-0.6.55/i586-alt-linux/po/de.gmo to /usr/src/tmp/accountsservice-buildroot/usr/share/locale/de/LC_MESSAGES/accounts-service.mo
Installing /usr/src/RPM/BUILD/accountsservice-0.6.55/i586-alt-linux/po/el.gmo to /usr/src/tmp/accountsservice-buildroot/usr/share/locale/el/LC_MESSAGES/accounts-service.mo
Installing /usr/src/RPM/BUILD/accountsservice-0.6.55/i586-alt-linux/po/en_GB.gmo to /usr/src/tmp/accountsservice-buildroot/usr/share/locale/en_GB/LC_MESSAGES/accounts-service.mo
Installing /usr/src/RPM/BUILD/accountsservice-0.6.55/i586-alt-linux/po/en.gmo to /usr/src/tmp/accountsservice-buildroot/usr/share/locale/en/LC_MESSAGES/accounts-service.mo
Installing /usr/src/RPM/BUILD/accountsservice-0.6.55/i586-alt-linux/po/eo.gmo to /usr/src/tmp/accountsservice-buildroot/usr/share/locale/eo/LC_MESSAGES/accounts-service.mo
Installing /usr/src/RPM/BUILD/accountsservice-0.6.55/i586-alt-linux/po/es.gmo to /usr/src/tmp/accountsservice-buildroot/usr/share/locale/es/LC_MESSAGES/accounts-service.mo
Installing /usr/src/RPM/BUILD/accountsservice-0.6.55/i586-alt-linux/po/et.gmo to /usr/src/tmp/accountsservice-buildroot/usr/share/locale/et/LC_MESSAGES/accounts-service.mo
Installing /usr/src/RPM/BUILD/accountsservice-0.6.55/i586-alt-linux/po/eu.gmo to /usr/src/tmp/accountsservice-buildroot/usr/share/locale/eu/LC_MESSAGES/accounts-service.mo
Installing /usr/src/RPM/BUILD/accountsservice-0.6.55/i586-alt-linux/po/fa.gmo to /usr/src/tmp/accountsservice-buildroot/usr/share/locale/fa/LC_MESSAGES/accounts-service.mo
Installing /usr/src/RPM/BUILD/accountsservice-0.6.55/i586-alt-linux/po/fi.gmo to /usr/src/tmp/accountsservice-buildroot/usr/share/locale/fi/LC_MESSAGES/accounts-service.mo
Installing /usr/src/RPM/BUILD/accountsservice-0.6.55/i586-alt-linux/po/fo.gmo to /usr/src/tmp/accountsservice-buildroot/usr/share/locale/fo/LC_MESSAGES/accounts-service.mo
Installing /usr/src/RPM/BUILD/accountsservice-0.6.55/i586-alt-linux/po/fr.gmo to /usr/src/tmp/accountsservice-buildroot/usr/share/locale/fr/LC_MESSAGES/accounts-service.mo
Installing /usr/src/RPM/BUILD/accountsservice-0.6.55/i586-alt-linux/po/fur.gmo to /usr/src/tmp/accountsservice-buildroot/usr/share/locale/fur/LC_MESSAGES/accounts-service.mo
Installing /usr/src/RPM/BUILD/accountsservice-0.6.55/i586-alt-linux/po/ga.gmo to /usr/src/tmp/accountsservice-buildroot/usr/share/locale/ga/LC_MESSAGES/accounts-service.mo
Installing /usr/src/RPM/BUILD/accountsservice-0.6.55/i586-alt-linux/po/gl.gmo to /usr/src/tmp/accountsservice-buildroot/usr/share/locale/gl/LC_MESSAGES/accounts-service.mo
Installing /usr/src/RPM/BUILD/accountsservice-0.6.55/i586-alt-linux/po/gu.gmo to /usr/src/tmp/accountsservice-buildroot/usr/share/locale/gu/LC_MESSAGES/accounts-service.mo
Installing /usr/src/RPM/BUILD/accountsservice-0.6.55/i586-alt-linux/po/he.gmo to /usr/src/tmp/accountsservice-buildroot/usr/share/locale/he/LC_MESSAGES/accounts-service.mo
Installing /usr/src/RPM/BUILD/accountsservice-0.6.55/i586-alt-linux/po/hi.gmo to /usr/src/tmp/accountsservice-buildroot/usr/share/locale/hi/LC_MESSAGES/accounts-service.mo
Installing /usr/src/RPM/BUILD/accountsservice-0.6.55/i586-alt-linux/po/hr.gmo to /usr/src/tmp/accountsservice-buildroot/usr/share/locale/hr/LC_MESSAGES/accounts-service.mo
Installing /usr/src/RPM/BUILD/accountsservice-0.6.55/i586-alt-linux/po/hu.gmo to /usr/src/tmp/accountsservice-buildroot/usr/share/locale/hu/LC_MESSAGES/accounts-service.mo
Installing /usr/src/RPM/BUILD/accountsservice-0.6.55/i586-alt-linux/po/ia.gmo to /usr/src/tmp/accountsservice-buildroot/usr/share/locale/ia/LC_MESSAGES/accounts-service.mo
Installing /usr/src/RPM/BUILD/accountsservice-0.6.55/i586-alt-linux/po/id.gmo to /usr/src/tmp/accountsservice-buildroot/usr/share/locale/id/LC_MESSAGES/accounts-service.mo
Installing /usr/src/RPM/BUILD/accountsservice-0.6.55/i586-alt-linux/po/it.gmo to /usr/src/tmp/accountsservice-buildroot/usr/share/locale/it/LC_MESSAGES/accounts-service.mo
Installing /usr/src/RPM/BUILD/accountsservice-0.6.55/i586-alt-linux/po/ja.gmo to /usr/src/tmp/accountsservice-buildroot/usr/share/locale/ja/LC_MESSAGES/accounts-service.mo
Installing /usr/src/RPM/BUILD/accountsservice-0.6.55/i586-alt-linux/po/ka.gmo to /usr/src/tmp/accountsservice-buildroot/usr/share/locale/ka/LC_MESSAGES/accounts-service.mo
Installing /usr/src/RPM/BUILD/accountsservice-0.6.55/i586-alt-linux/po/kk.gmo to /usr/src/tmp/accountsservice-buildroot/usr/share/locale/kk/LC_MESSAGES/accounts-service.mo
Installing /usr/src/RPM/BUILD/accountsservice-0.6.55/i586-alt-linux/po/kn.gmo to /usr/src/tmp/accountsservice-buildroot/usr/share/locale/kn/LC_MESSAGES/accounts-service.mo
Installing /usr/src/RPM/BUILD/accountsservice-0.6.55/i586-alt-linux/po/ko.gmo to /usr/src/tmp/accountsservice-buildroot/usr/share/locale/ko/LC_MESSAGES/accounts-service.mo
Installing /usr/src/RPM/BUILD/accountsservice-0.6.55/i586-alt-linux/po/ky.gmo to /usr/src/tmp/accountsservice-buildroot/usr/share/locale/ky/LC_MESSAGES/accounts-service.mo
Installing /usr/src/RPM/BUILD/accountsservice-0.6.55/i586-alt-linux/po/lt.gmo to /usr/src/tmp/accountsservice-buildroot/usr/share/locale/lt/LC_MESSAGES/accounts-service.mo
Installing /usr/src/RPM/BUILD/accountsservice-0.6.55/i586-alt-linux/po/lv.gmo to /usr/src/tmp/accountsservice-buildroot/usr/share/locale/lv/LC_MESSAGES/accounts-service.mo
Installing /usr/src/RPM/BUILD/accountsservice-0.6.55/i586-alt-linux/po/ml.gmo to /usr/src/tmp/accountsservice-buildroot/usr/share/locale/ml/LC_MESSAGES/accounts-service.mo
Installing /usr/src/RPM/BUILD/accountsservice-0.6.55/i586-alt-linux/po/mr.gmo to /usr/src/tmp/accountsservice-buildroot/usr/share/locale/mr/LC_MESSAGES/accounts-service.mo
Installing /usr/src/RPM/BUILD/accountsservice-0.6.55/i586-alt-linux/po/ms.gmo to /usr/src/tmp/accountsservice-buildroot/usr/share/locale/ms/LC_MESSAGES/accounts-service.mo
Installing /usr/src/RPM/BUILD/accountsservice-0.6.55/i586-alt-linux/po/nb.gmo to /usr/src/tmp/accountsservice-buildroot/usr/share/locale/nb/LC_MESSAGES/accounts-service.mo
Installing /usr/src/RPM/BUILD/accountsservice-0.6.55/i586-alt-linux/po/nl.gmo to /usr/src/tmp/accountsservice-buildroot/usr/share/locale/nl/LC_MESSAGES/accounts-service.mo
Installing /usr/src/RPM/BUILD/accountsservice-0.6.55/i586-alt-linux/po/nn.gmo to /usr/src/tmp/accountsservice-buildroot/usr/share/locale/nn/LC_MESSAGES/accounts-service.mo
Installing /usr/src/RPM/BUILD/accountsservice-0.6.55/i586-alt-linux/po/oc.gmo to /usr/src/tmp/accountsservice-buildroot/usr/share/locale/oc/LC_MESSAGES/accounts-service.mo
Installing /usr/src/RPM/BUILD/accountsservice-0.6.55/i586-alt-linux/po/or.gmo to /usr/src/tmp/accountsservice-buildroot/usr/share/locale/or/LC_MESSAGES/accounts-service.mo
Installing /usr/src/RPM/BUILD/accountsservice-0.6.55/i586-alt-linux/po/pa.gmo to /usr/src/tmp/accountsservice-buildroot/usr/share/locale/pa/LC_MESSAGES/accounts-service.mo
Installing /usr/src/RPM/BUILD/accountsservice-0.6.55/i586-alt-linux/po/pl.gmo to /usr/src/tmp/accountsservice-buildroot/usr/share/locale/pl/LC_MESSAGES/accounts-service.mo
Installing /usr/src/RPM/BUILD/accountsservice-0.6.55/i586-alt-linux/po/pt_BR.gmo to /usr/src/tmp/accountsservice-buildroot/usr/share/locale/pt_BR/LC_MESSAGES/accounts-service.mo
Installing /usr/src/RPM/BUILD/accountsservice-0.6.55/i586-alt-linux/po/pt.gmo to /usr/src/tmp/accountsservice-buildroot/usr/share/locale/pt/LC_MESSAGES/accounts-service.mo
Installing /usr/src/RPM/BUILD/accountsservice-0.6.55/i586-alt-linux/po/ro.gmo to /usr/src/tmp/accountsservice-buildroot/usr/share/locale/ro/LC_MESSAGES/accounts-service.mo
Installing /usr/src/RPM/BUILD/accountsservice-0.6.55/i586-alt-linux/po/ru.gmo to /usr/src/tmp/accountsservice-buildroot/usr/share/locale/ru/LC_MESSAGES/accounts-service.mo
Installing /usr/src/RPM/BUILD/accountsservice-0.6.55/i586-alt-linux/po/sk.gmo to /usr/src/tmp/accountsservice-buildroot/usr/share/locale/sk/LC_MESSAGES/accounts-service.mo
Installing /usr/src/RPM/BUILD/accountsservice-0.6.55/i586-alt-linux/po/sl.gmo to /usr/src/tmp/accountsservice-buildroot/usr/share/locale/sl/LC_MESSAGES/accounts-service.mo
Installing /usr/src/RPM/BUILD/accountsservice-0.6.55/i586-alt-linux/po/sq.gmo to /usr/src/tmp/accountsservice-buildroot/usr/share/locale/sq/LC_MESSAGES/accounts-service.mo
Installing /usr/src/RPM/BUILD/accountsservice-0.6.55/i586-alt-linux/po/sr@latin.gmo to /usr/src/tmp/accountsservice-buildroot/usr/share/locale/sr@latin/LC_MESSAGES/accounts-service.mo
Installing /usr/src/RPM/BUILD/accountsservice-0.6.55/i586-alt-linux/po/sr.gmo to /usr/src/tmp/accountsservice-buildroot/usr/share/locale/sr/LC_MESSAGES/accounts-service.mo
Installing /usr/src/RPM/BUILD/accountsservice-0.6.55/i586-alt-linux/po/sv.gmo to /usr/src/tmp/accountsservice-buildroot/usr/share/locale/sv/LC_MESSAGES/accounts-service.mo
Installing /usr/src/RPM/BUILD/accountsservice-0.6.55/i586-alt-linux/po/ta.gmo to /usr/src/tmp/accountsservice-buildroot/usr/share/locale/ta/LC_MESSAGES/accounts-service.mo
Installing /usr/src/RPM/BUILD/accountsservice-0.6.55/i586-alt-linux/po/te.gmo to /usr/src/tmp/accountsservice-buildroot/usr/share/locale/te/LC_MESSAGES/accounts-service.mo
Installing /usr/src/RPM/BUILD/accountsservice-0.6.55/i586-alt-linux/po/th.gmo to /usr/src/tmp/accountsservice-buildroot/usr/share/locale/th/LC_MESSAGES/accounts-service.mo
Installing /usr/src/RPM/BUILD/accountsservice-0.6.55/i586-alt-linux/po/tr.gmo to /usr/src/tmp/accountsservice-buildroot/usr/share/locale/tr/LC_MESSAGES/accounts-service.mo
Installing /usr/src/RPM/BUILD/accountsservice-0.6.55/i586-alt-linux/po/uk.gmo to /usr/src/tmp/accountsservice-buildroot/usr/share/locale/uk/LC_MESSAGES/accounts-service.mo
Installing /usr/src/RPM/BUILD/accountsservice-0.6.55/i586-alt-linux/po/vi.gmo to /usr/src/tmp/accountsservice-buildroot/usr/share/locale/vi/LC_MESSAGES/accounts-service.mo
Installing /usr/src/RPM/BUILD/accountsservice-0.6.55/i586-alt-linux/po/wa.gmo to /usr/src/tmp/accountsservice-buildroot/usr/share/locale/wa/LC_MESSAGES/accounts-service.mo
Installing /usr/src/RPM/BUILD/accountsservice-0.6.55/i586-alt-linux/po/zh_CN.gmo to /usr/src/tmp/accountsservice-buildroot/usr/share/locale/zh_CN/LC_MESSAGES/accounts-service.mo
Installing /usr/src/RPM/BUILD/accountsservice-0.6.55/i586-alt-linux/po/zh_HK.gmo to /usr/src/tmp/accountsservice-buildroot/usr/share/locale/zh_HK/LC_MESSAGES/accounts-service.mo
Installing /usr/src/RPM/BUILD/accountsservice-0.6.55/i586-alt-linux/po/zh_TW.gmo to /usr/src/tmp/accountsservice-buildroot/usr/share/locale/zh_TW/LC_MESSAGES/accounts-service.mo
Installing data/org.freedesktop.accounts.policy to /usr/src/tmp/accountsservice-buildroot/usr/share/polkit-1/actions/
Installing src/accounts-daemon to /usr/src/tmp/accountsservice-buildroot/usr/libexec
Installing src/libaccountsservice/act-user-enum-types.h to /usr/src/tmp/accountsservice-buildroot/usr/include/accountsservice-1.0/act
Installing src/libaccountsservice/libaccountsservice.so.0.0.0 to /usr/src/tmp/accountsservice-buildroot/usr/lib
Installing src/libaccountsservice/AccountsService-1.0.gir to /usr/src/tmp/accountsservice-buildroot/usr/share/gir-1.0
Installing src/libaccountsservice/AccountsService-1.0.typelib to /usr/src/tmp/accountsservice-buildroot/usr/lib/girepository-1.0
Installing /usr/src/RPM/BUILD/accountsservice-0.6.55/src/libaccountsservice/act-user.h to /usr/src/tmp/accountsservice-buildroot/usr/include/accountsservice-1.0/act
Installing /usr/src/RPM/BUILD/accountsservice-0.6.55/src/libaccountsservice/act-user-manager.h to /usr/src/tmp/accountsservice-buildroot/usr/include/accountsservice-1.0/act
Installing /usr/src/RPM/BUILD/accountsservice-0.6.55/src/libaccountsservice/act.h to /usr/src/tmp/accountsservice-buildroot/usr/include/accountsservice-1.0/act
Installing /usr/src/RPM/BUILD/accountsservice-0.6.55/data/org.freedesktop.Accounts.xml to /usr/src/tmp/accountsservice-buildroot/usr/share/dbus-1/interfaces
Installing /usr/src/RPM/BUILD/accountsservice-0.6.55/data/org.freedesktop.Accounts.User.xml to /usr/src/tmp/accountsservice-buildroot/usr/share/dbus-1/interfaces
Installing /usr/src/RPM/BUILD/accountsservice-0.6.55/data/org.freedesktop.Accounts.conf to /usr/src/tmp/accountsservice-buildroot/etc/dbus-1/system.d
Installing /usr/src/RPM/BUILD/accountsservice-0.6.55/i586-alt-linux/data/org.freedesktop.Accounts.service to /usr/src/tmp/accountsservice-buildroot/usr/share/dbus-1/system-services
Installing /usr/src/RPM/BUILD/accountsservice-0.6.55/i586-alt-linux/data/accounts-daemon.service to /usr/src/tmp/accountsservice-buildroot/lib/systemd/system
Installing /usr/src/RPM/BUILD/accountsservice-0.6.55/i586-alt-linux/meson-private/accountsservice.pc to /usr/src/tmp/accountsservice-buildroot/usr/lib/pkgconfig
Running custom install script '/usr/bin/meson --internal gettext install --subdir=po --localedir=share/locale --pkgname=accounts-service'
Running custom install script '/usr/bin/python3 /usr/src/RPM/BUILD/accountsservice-0.6.55/meson_post_install.py /var'
+ /usr/lib/rpm/find-lang accounts-service
+ /usr/lib/rpm/brp-alt
Cleaning files in /usr/src/tmp/accountsservice-buildroot (auto)
mode of './usr/lib/libaccountsservice.so.0.0.0' changed from 0755 (rwxr-xr-x) to 0644 (rw-r--r--)
Verifying and fixing files in /usr/src/tmp/accountsservice-buildroot (binconfig,pkgconfig,libtool,desktop)
/usr/lib/pkgconfig/accountsservice.pc: Libs: '-L${libdir} -laccountsservice' --> '-laccountsservice'
Checking contents of files in /usr/src/tmp/accountsservice-buildroot/ (default)
Compressing files in /usr/src/tmp/accountsservice-buildroot (auto)
Adjusting library links in /usr/src/tmp/accountsservice-buildroot
./var/lib:
./lib:
./usr/lib:
	libaccountsservice.so.0 -> libaccountsservice.so.0.0.0
Verifying ELF objects in /usr/src/tmp/accountsservice-buildroot (arch=normal,fhs=normal,lfs=relaxed,lint=relaxed,rpath=normal,stack=normal,textrel=normal,unresolved=normal)
Hardlinking identical .pyc and .pyo files
Processing files: accountsservice-0.6.55-alt1
Executing(%doc): /bin/sh -e /usr/src/tmp/rpm-tmp.25879
+ umask 022
+ /bin/mkdir -p /usr/src/RPM/BUILD
+ cd /usr/src/RPM/BUILD
+ cd accountsservice-0.6.55
+ DOCDIR=/usr/src/tmp/accountsservice-buildroot/usr/share/doc/accountsservice-0.6.55
+ export DOCDIR
+ rm -rf /usr/src/tmp/accountsservice-buildroot/usr/share/doc/accountsservice-0.6.55
+ /bin/mkdir -p /usr/src/tmp/accountsservice-buildroot/usr/share/doc/accountsservice-0.6.55
+ cp -prL COPYING README.md AUTHORS NEWS /usr/src/tmp/accountsservice-buildroot/usr/share/doc/accountsservice-0.6.55
+ chmod -R go-w /usr/src/tmp/accountsservice-buildroot/usr/share/doc/accountsservice-0.6.55
+ chmod -R a+rX /usr/src/tmp/accountsservice-buildroot/usr/share/doc/accountsservice-0.6.55
+ exit 0
Finding Provides (using /usr/lib/rpm/find-provides)
Executing: /bin/sh -e /usr/src/tmp/rpm-tmp.WN8UST
find-provides: running scripts (alternatives,debuginfo,gir,lib,pam,perl,pkgconfig,python,shell,typelib)
Finding Requires (using /usr/lib/rpm/find-requires)
Executing: /bin/sh -e /usr/src/tmp/rpm-tmp.fhm1KS
find-requires: running scripts (cpp,debuginfo,files,gir-js,gir-python,gir,lib,pam,perl,pkgconfig,pkgconfiglib,python,rpmlib,shebang,shell,static,symlinks,systemd-services,typelib)
Requires: polkit, shadow-utils, libaccountsservice = 0.6.55-alt1, /lib/ld-linux.so.2, libc.so.6(GLIBC_2.0), libc.so.6(GLIBC_2.1), libc.so.6(GLIBC_2.2), libc.so.6(GLIBC_2.2.4), libc.so.6(GLIBC_2.4), libgio-2.0.so.0 >= set:oiFVNLZILDuNVrYyYKRhcsdk6kHq2k7zt4L8Vy6nOs6ktrvE0TnOIWB6dFMbA4irT1sEvXppKBTWMu5xQnlyDG2ZnwmoCB3WBGNPstxCtW4HlZ3LZCBX7WZhShJYJp21A9b4OwMMfmXlbKH80UQAOtMAF8VCKtKK8lngStu, libglib-2.0.so.0 >= set:og1iApFEKSxbcR60978NAFdB69JR1XGvOWzDP05QRZwbS6XFB4gAV5fxlFrITJWcbdwZG2fRP53MzyciadqsvZ6glsv2i2fkbpE4PhUnNC6uSNmvrpZuagc30Pygly5565WX6ubP394nzFyoqPlZoCp2pK8N7dkc9IazLwZ1eSi8WNZ8eA3a1k9Y4mIeTr3hZmtfxC7R7daloiOdbDQpOrmMRxIA2jU3lSMZ0kVhdzeH02YqBqJdBBVobwNfIgMBH0W6tGO9OZETeNFBgn54nI084dGTJIk3nFUHg0YLRbRILoq4ns8bvnANRM8tgTNmAEuD9uTHtpylWGeJu6Fjaubgv6y2TZjU92k8z3UBQxahsoAAKMZ8zOmp9PuyY25GK0pbZCfZdAwcwKuBrzMtLqaH6GDtN97e1, libgobject-2.0.so.0 >= set:mg2foJz1uAZ6JZmO4VJYLn1yUYerYIsyryrmdmZECd94lOp6f6PGb1Q0W2Cltohf2ooexm4G8LmQWhwBPCYYATlxOKutcEXGgwAgBf5YrWhd1n1FouQ03CJbuHLGUEZ7YkDezIJFCCevn7uLz2, libpolkit-gobject-1.so.0 >= set:liVcnQmoaKIi9BPaCUAG94, rtld(GNU_HASH)
Requires(rpmlib): rpmlib(SetVersions)
Finding debuginfo files (using /usr/lib/rpm/find-debuginfo-files)
Executing: /bin/sh -e /usr/src/tmp/rpm-tmp.AEqCxR
Creating accountsservice-debuginfo package
Processing files: libaccountsservice-0.6.55-alt1
Finding Provides (using /usr/lib/rpm/find-provides)
Executing: /bin/sh -e /usr/src/tmp/rpm-tmp.6YwQhT
find-provides: running scripts (alternatives,debuginfo,gir,lib,pam,perl,pkgconfig,python,shell,typelib)
lib.prov: /usr/src/tmp/accountsservice-buildroot/usr/lib/libaccountsservice.so.0: 507 symbols, 19 bpp
Finding Requires (using /usr/lib/rpm/find-requires)
Executing: /bin/sh -e /usr/src/tmp/rpm-tmp.OjZAkV
find-requires: running scripts (cpp,debuginfo,files,gir-js,gir-python,gir,lib,pam,perl,pkgconfig,pkgconfiglib,python,rpmlib,shebang,shell,static,symlinks,systemd-services,typelib)
Provides: libaccountsservice.so.0 = set:mdijdJptPaUnMFgQF8EsAXaajXy1OTEZfp8BpRlHqNLBZaRwS7FgqGcwtlmvryZFO7vCtOGdwIgZF4RSFxwBzkPcoGLQzZf4cBSm26ytZCm8pAjQJeOljgzddQooimrbPVZl0tcZjASHE68ie58yhD37xdojWA9a4aByteEEQsSQ1zTrdVGRQJ4gTomYlt2PhiF7jjilZ38pAUs9WCsxRCoUCzhXIFa7hMaJHF8viiNNZEhPQcqZ7SZyQ5wzhxeLBEO8KKK8jx0CwuQ5gYZHDxNaVBYaVER3Hp7TjMCWSvyXZf16bzM3UBojc5btuMfN2BvsgZodS01QlogOZqTnqD8ibRogDovbz6nTilzwtoeRc9ZfIZ86N0HTgFrE9elXBg638LmGFZ9auuJpC3PuS3H7O9XdC0zGF3ZmQ4XMzzRU14RWEkvPqYS51iA8ZsNnsrZbBtVbv4yxa7m2BH8UZ34TSiAHIvLqOZ70gjWP5Zzw2bCpwiZ9ZpxvRmA8P43ugItWdSIRwovAcbk8ipnmWTHFSZqVsLQtcHhosEk4QGlfxqitlPeeZ7IlNtfRZojBx2ReJzAiAVDNZEz3FA5ETUmKT8SLlsYjyqCJbPUMGghZ6nHyZpXA5FNLAU7hahxMocgjxfOkVkoPJCoVKfKpdBYP7hF06SDoGn1nEjkoYJZHZwZnqtMooyARCWtwKzfyDg4Zu6ZCngmAFsFbOLZBIpZyFvU7foTbccX4uxCjRyJCQNiKOMq183lh6KSlxHYF2wLy0A9P5ZHIQvife5rnk3K2UGh5979w4bq5cEAanfylM3qiBUH2zA3z2bDZ1YtwABEDnKi6kcZfp8MsGuZdVf7HJwvWnCSxhtXZ5S1Td1XMlMFov5hukCvPiDfnBO5DndiI75ditd7fqysX1Z4s6IBbFsUydq5oALDz4jXFZngp0HGi46ltr4aZBtG6F7CtOUaHlxiCIrMopAFZGpWxoD83qspaAeYe3PUm0
Requires: libc.so.6(GLIBC_2.0), libc.so.6(GLIBC_2.1.3), libc.so.6(GLIBC_2.4), libcrypt.so.1 >= set:ihuTa, libcrypt.so.1(XCRYPT_2.0), libgio-2.0.so.0 >= set:oiFVhSuna2yN2VtXh2805K6GLgJ4pBefutcIaSVcE0VqL0LLApRbdqixTP0SyX2AbqCxfoVfk1ZzgbcPOlwaEc1bKNsMaXQBsZ6QO2ADFeTjv12okD9rQLAsjTe7lWa, libglib-2.0.so.0 >= set:oh1iM8pCPUZj8qoFZd7id2ISkuZq5uVwL5T0ySAJ29ki0DjMjZd53wI6nfeFbBrQKyddYMJh6ZnRMVZxbIxkGmNREruThhABq3Ao4ZE6UJUv1TMEvn6sn76BniTQRyxaKexicmDaneUgSi0y5tkVxq6tmNjuywZjnN0HSKNzfi86QieXl1zbm04z6ZfZlhXYHMMZClAslEnn3jWwLzJ0I8unnXqajGPZxZ2Jre5LbgXc45KZfwFPAWZhu65SycRK0JyzDHDHEkeO43nsOxjBxf, libgobject-2.0.so.0 >= set:mf3sZdGRe3Y8XJmv9jOrZfu58wveAGBdubDMdNmVxU4HnQIAgk9fLdXawNIt90Q0OYzc4ltohfZfg1ZFjQyg5pP66UkfG530vedVhQZKoFnRWo0WK62A4GRFJ2ycIDefG5s5UZz2kqRRh3oMItNZ5gceGUQZjuGjDhO7euBCCevj7uLz0, libsystemd.so.0 >= set:njTbQTk21LKXvwJBCgdwYZJfPl7iIeJR4LDi1FkR2, libsystemd.so.0(LIBSYSTEMD_209), rtld(GNU_HASH)
Requires(rpmlib): rpmlib(SetVersions)
Finding debuginfo files (using /usr/lib/rpm/find-debuginfo-files)
Executing: /bin/sh -e /usr/src/tmp/rpm-tmp.WPbfPU
Creating libaccountsservice-debuginfo package
Processing files: libaccountsservice-devel-0.6.55-alt1
Finding Provides (using /usr/lib/rpm/find-provides)
Executing: /bin/sh -e /usr/src/tmp/rpm-tmp.Nja7jS
find-provides: running scripts (alternatives,debuginfo,gir,lib,pam,perl,pkgconfig,python,shell,typelib)
Finding Requires (using /usr/lib/rpm/find-requires)
Executing: /bin/sh -e /usr/src/tmp/rpm-tmp.UwpzaS
find-requires: running scripts (cpp,debuginfo,files,gir-js,gir-python,gir,lib,pam,perl,pkgconfig,pkgconfiglib,python,rpmlib,shebang,shell,static,symlinks,systemd-services,typelib)
In file included from /usr/src/tmp/accountsservice-buildroot/usr/include/accountsservice-1.0/act/act.h:24:
/usr/src/tmp/accountsservice-buildroot/usr/include/accountsservice-1.0/act/act-user-enum-types.h:7:10: fatal error: glib-object.h: No such file or directory
    7 | #include <glib-object.h>
      |          ^~~~~~~~~~~~~~~
compilation terminated.
cpp.req: /usr/src/tmp/accountsservice-buildroot/usr/include/accountsservice-1.0/act/act.h: cpp failed, trying c++ mode
i586-alt-linux-cpp: fatal error: cannot execute 'cc1plus': execvp: No such file or directory
compilation terminated.
cpp.req: WARNING: /usr/src/tmp/accountsservice-buildroot/usr/include/accountsservice-1.0/act/act.h: cpp failed
/usr/src/tmp/accountsservice-buildroot/usr/include/accountsservice-1.0/act/act-user.h:29:10: fatal error: glib.h: No such file or directory
   29 | #include <glib.h>
      |          ^~~~~~~~
compilation terminated.
cpp.req: WARNING: /usr/src/tmp/accountsservice-buildroot/usr/include/accountsservice-1.0/act/act-user.h: cpp failed
/usr/src/tmp/accountsservice-buildroot/usr/include/accountsservice-1.0/act/act-user-manager.h:24:10: fatal error: glib-object.h: No such file or directory
   24 | #include <glib-object.h>
      |          ^~~~~~~~~~~~~~~
compilation terminated.
cpp.req: WARNING: /usr/src/tmp/accountsservice-buildroot/usr/include/accountsservice-1.0/act/act-user-manager.h: cpp failed
/usr/src/tmp/accountsservice-buildroot/usr/include/accountsservice-1.0/act/act-user-enum-types.h:7:10: fatal error: glib-object.h: No such file or directory
    7 | #include <glib-object.h>
      |          ^~~~~~~~~~~~~~~
compilation terminated.
cpp.req: WARNING: /usr/src/tmp/accountsservice-buildroot/usr/include/accountsservice-1.0/act/act-user-enum-types.h: cpp failed
Provides: pkgconfig(accountsservice) = 0.6.55
Requires: libaccountsservice = 0.6.55-alt1, /usr/lib/libaccountsservice.so.0, /usr/lib/pkgconfig
Finding debuginfo files (using /usr/lib/rpm/find-debuginfo-files)
Executing: /bin/sh -e /usr/src/tmp/rpm-tmp.dYSkwV
Processing files: libaccountsservice-gir-0.6.55-alt1
Finding Provides (using /usr/lib/rpm/find-provides)
Executing: /bin/sh -e /usr/src/tmp/rpm-tmp.5wn0jR
find-provides: running scripts (alternatives,debuginfo,gir,lib,pam,perl,pkgconfig,python,shell,typelib)
Finding Requires (using /usr/lib/rpm/find-requires)
Executing: /bin/sh -e /usr/src/tmp/rpm-tmp.nF6bPR
find-requires: running scripts (cpp,debuginfo,files,gir-js,gir-python,gir,lib,pam,perl,pkgconfig,pkgconfiglib,python,rpmlib,shebang,shell,static,symlinks,systemd-services,typelib)
Provides: typelib(AccountsService) = 1.0
Requires: libaccountsservice = 0.6.55-alt1, typelib(GObject) = 2.0, typelib(Gio) = 2.0
Finding debuginfo files (using /usr/lib/rpm/find-debuginfo-files)
Executing: /bin/sh -e /usr/src/tmp/rpm-tmp.Eeg9JS
Processing files: libaccountsservice-gir-devel-0.6.55-alt1
Finding Provides (using /usr/lib/rpm/find-provides)
Executing: /bin/sh -e /usr/src/tmp/rpm-tmp.3EekAV
find-provides: running scripts (alternatives,debuginfo,gir,lib,pam,perl,pkgconfig,python,shell,typelib)
Finding Requires (using /usr/lib/rpm/find-requires)
Executing: /bin/sh -e /usr/src/tmp/rpm-tmp.aQ42RR
find-requires: running scripts (cpp,debuginfo,files,gir-js,gir-python,gir,lib,pam,perl,pkgconfig,pkgconfiglib,python,rpmlib,shebang,shell,static,symlinks,systemd-services,typelib)
Provides: gir(AccountsService) = 1.0
Requires: libaccountsservice-devel = 0.6.55-alt1, libaccountsservice-gir = 0.6.55-alt1, gir(GObject) = 2.0, gir(Gio) = 2.0
Processing files: accountsservice-debuginfo-0.6.55-alt1
Finding Provides (using /usr/lib/rpm/find-provides)
Executing: /bin/sh -e /usr/src/tmp/rpm-tmp.ehwWqV
find-provides: running scripts (debuginfo)
Finding Requires (using /usr/lib/rpm/find-requires)
Executing: /bin/sh -e /usr/src/tmp/rpm-tmp.T0DjOU
find-requires: running scripts (debuginfo)
Requires: accountsservice = 0.6.55-alt1, /usr/lib/debug/lib/ld-linux.so.2.debug, debug(libc.so.6), debug(libgio-2.0.so.0), debug(libglib-2.0.so.0), debug(libgobject-2.0.so.0), debug(libpolkit-gobject-1.so.0)
Processing files: libaccountsservice-debuginfo-0.6.55-alt1
Finding Provides (using /usr/lib/rpm/find-provides)
Executing: /bin/sh -e /usr/src/tmp/rpm-tmp.A0U79Q
find-provides: running scripts (debuginfo)
Finding Requires (using /usr/lib/rpm/find-requires)
Executing: /bin/sh -e /usr/src/tmp/rpm-tmp.RsHg7U
find-requires: running scripts (debuginfo)
Provides: debug(libaccountsservice.so.0)
Requires: libaccountsservice = 0.6.55-alt1, debug(libc.so.6), debug(libcrypt.so.1), debug(libgio-2.0.so.0), debug(libglib-2.0.so.0), debug(libgobject-2.0.so.0), debug(libsystemd.so.0)
Adding to accountsservice a strict dependency on libaccountsservice
Adding to accountsservice-debuginfo a strict dependency on accountsservice
Adding to libaccountsservice-devel a strict dependency on libaccountsservice
Adding to libaccountsservice-gir a strict dependency on libaccountsservice
Adding to libaccountsservice-debuginfo a strict dependency on libaccountsservice
Adding to libaccountsservice-gir-devel a strict dependency on libaccountsservice-devel
Adding to libaccountsservice-gir-devel a strict dependency on libaccountsservice-gir
Adding to accountsservice-debuginfo a strict dependency on libaccountsservice-debuginfo
Removing from accountsservice-debuginfo 4 sources provided by libaccountsservice-debuginfo
also prunning dir /usr/src/debug/accountsservice-0.6.55/i586-alt-linux/src
also prunning dir /usr/src/debug/accountsservice-0.6.55/i586-alt-linux
Removing 1 extra deps from libaccountsservice-devel due to dependency on libaccountsservice
Removing 4 extra deps from accountsservice due to repentancy on libaccountsservice
Removing 4 extra deps from accountsservice-debuginfo due to repentancy on libaccountsservice-debuginfo
Wrote: /usr/src/RPM/RPMS/i586/accountsservice-0.6.55-alt1.i586.rpm
Wrote: /usr/src/RPM/RPMS/i586/libaccountsservice-0.6.55-alt1.i586.rpm
Wrote: /usr/src/RPM/RPMS/i586/libaccountsservice-devel-0.6.55-alt1.i586.rpm
Wrote: /usr/src/RPM/RPMS/i586/libaccountsservice-gir-0.6.55-alt1.i586.rpm
Wrote: /usr/src/RPM/RPMS/noarch/libaccountsservice-gir-devel-0.6.55-alt1.noarch.rpm
Wrote: /usr/src/RPM/RPMS/i586/accountsservice-debuginfo-0.6.55-alt1.i586.rpm
Wrote: /usr/src/RPM/RPMS/i586/libaccountsservice-debuginfo-0.6.55-alt1.i586.rpm
22.93user 3.84system 0:33.25elapsed 80%CPU (0avgtext+0avgdata 50700maxresident)k
0inputs+0outputs (0major+976845minor)pagefaults 0swaps
34.46user 7.94system 0:48.57elapsed 87%CPU (0avgtext+0avgdata 109692maxresident)k
4520inputs+0outputs (0major+1515809minor)pagefaults 0swaps
--- libaccountsservice-0.6.55-alt1.i586.rpm.repo	2019-07-20 00:37:45.000000000 +0000
+++ libaccountsservice-0.6.55-alt1.i586.rpm.hasher	2020-10-29 09:07:19.503865893 +0000
@@ -9,3 +9,3 @@
 Requires: libgio-2.0.so.0 >= set:oiFVhSuna2yN2VtXh2805K6GLgJ4pBefutcIaSVcE0VqL0LLApRbdqixTP0SyX2AbqCxfoVfk1ZzgbcPOlwaEc1bKNsMaXQBsZ6QO2ADFeTjv12okD9rQLAsjTe7lWa
-Requires: libglib-2.0.so.0 >= set:oh1iM8pCPUZj8qoFZd7id2ISkuZq5uVwL5T0ySAJ25G4181Us2uGLb60pdKusinaTEt5rqUxrzcYLqUYZE5SgalHUqQdLXEEZya6NfqwTyZBMdcWTB1TRxhVBQdtJoEyHjE4zRFOB3eAJ4woh7luEChDlYAD8EZIlcMGJrYUz4y1JAPulMUy50NEhZHv5JPL23ZHlhOlxutdcF3Zuob0byTRRKCOAWYvQbJre5LbgXc45KZfwFPAWZhu65SycRK0JyzDHDHEkeO43nsOxjBxf
+Requires: libglib-2.0.so.0 >= set:oh1iM8pCPUZj8qoFZd7id2ISkuZq5uVwL5T0ySAJ29ki0DjMjZd53wI6nfeFbBrQKyddYMJh6ZnRMVZxbIxkGmNREruThhABq3Ao4ZE6UJUv1TMEvn6sn76BniTQRyxaKexicmDaneUgSi0y5tkVxq6tmNjuywZjnN0HSKNzfi86QieXl1zbm04z6ZfZlhXYHMMZClAslEnn3jWwLzJ0I8unnXqajGPZxZ2Jre5LbgXc45KZfwFPAWZhu65SycRK0JyzDHDHEkeO43nsOxjBxf
 Requires: libgobject-2.0.so.0 >= set:mf3sZdGRe3Y8XJmv9jOrZfu58wveAGBdubDMdNmVxU4HnQIAgk9fLdXawNIt90Q0OYzc4ltohfZfg1ZFjQyg5pP66UkfG530vedVhQZKoFnRWo0WK62A4GRFJ2ycIDefG5s5UZz2kqRRh3oMItNZ5gceGUQZjuGjDhO7euBCCevj7uLz0