<86>Jun 13 14:54:14 userdel[3657121]: delete user 'rooter'
<86>Jun 13 14:54:14 userdel[3657121]: removed group 'rooter' owned by 'rooter'
<86>Jun 13 14:54:14 userdel[3657121]: removed shadow group 'rooter' owned by 'rooter'
<86>Jun 13 14:54:14 groupadd[3657136]: group added to /etc/group: name=rooter, GID=663
<86>Jun 13 14:54:14 groupadd[3657136]: group added to /etc/gshadow: name=rooter
<86>Jun 13 14:54:14 groupadd[3657136]: new group: name=rooter, GID=663
<86>Jun 13 14:54:14 useradd[3657151]: new user: name=rooter, UID=663, GID=663, home=/root, shell=/bin/bash
<86>Jun 13 14:54:14 userdel[3657177]: delete user 'builder'
<86>Jun 13 14:54:14 userdel[3657177]: removed group 'builder' owned by 'builder'
<86>Jun 13 14:54:14 userdel[3657177]: removed shadow group 'builder' owned by 'builder'
<86>Jun 13 14:54:14 groupadd[3657268]: group added to /etc/group: name=builder, GID=664
<86>Jun 13 14:54:14 groupadd[3657268]: group added to /etc/gshadow: name=builder
<86>Jun 13 14:54:14 groupadd[3657268]: new group: name=builder, GID=664
<86>Jun 13 14:54:14 useradd[3657280]: new user: name=builder, UID=664, GID=664, home=/usr/src, shell=/bin/bash
<13>Jun 13 14:54:18 rpmi: rpm-macros-java-1:5.3.0-alt1_4jpp8 sisyphus+234467.100.1.1 1563037789 installed
<13>Jun 13 14:54:18 rpmi: libgdbm-1.8.3-alt10 1454943334 installed
<13>Jun 13 14:54:18 rpmi: libgpg-error-1.36-alt1 sisyphus+225621.300.1.1 1553521082 installed
<13>Jun 13 14:54:18 rpmi: libgcrypt20-1.8.5-alt3 sisyphus+239622.100.1.1 1571746654 installed
<13>Jun 13 14:54:18 rpmi: libxslt-1.1.34-alt2 sisyphus+248264.100.1.1 1584829770 installed
<13>Jun 13 14:54:18 rpmi: libffi6-1:3.2.1-alt4 sisyphus+251953.300.2.1 1589891360 installed
<13>Jun 13 14:54:18 rpmi: libexpat-2.2.9-alt1 sisyphus+252464.200.2.1 1590958865 installed
<13>Jun 13 14:54:18 rpmi: javapackages-filesystem-1:5.3.0-alt1_4jpp8 sisyphus+234467.100.1.1 1563037789 installed
<13>Jun 13 14:54:18 rpmi: javapackages-tools-1:5.3.0-alt1_4jpp8 sisyphus+234467.100.1.1 1563037789 installed
<13>Jun 13 14:54:18 rpmi: libp11-kit-0.23.15-alt2 sisyphus+252784.100.2.2 1591274901 installed
<13>Jun 13 14:54:18 rpmi: libtasn1-4.16.0-alt1 sisyphus+245480.100.1.1 1580825062 installed
<13>Jun 13 14:54:18 rpmi: rpm-macros-alternatives-0.5.1-alt1 sisyphus+226946.100.1.1 1554830426 installed
<13>Jun 13 14:54:18 rpmi: alternatives-0.5.1-alt1 sisyphus+226946.100.1.1 1554830426 installed
<13>Jun 13 14:54:18 rpmi: ca-certificates-2020.06.05-alt1 sisyphus+252902.200.1.1 1591391133 installed
<13>Jun 13 14:54:18 rpmi: ca-trust-0.1.2-alt1 sisyphus+233348.100.1.1 1561653823 installed
<13>Jun 13 14:54:18 rpmi: p11-kit-trust-0.23.15-alt2 sisyphus+252784.100.2.2 1591274901 installed
<13>Jun 13 14:54:18 rpmi: libcrypto1.1-1.1.1g-alt1 sisyphus+249982.60.8.1 1587743711 installed
<13>Jun 13 14:54:18 rpmi: libssl1.1-1.1.1g-alt1 sisyphus+249982.60.8.1 1587743711 installed
<13>Jun 13 14:54:18 rpmi: python3-3.8.2-alt1 sisyphus+244999.100.3.1 1585218480 installed
<13>Jun 13 14:54:19 rpmi: python3-base-3.8.2-alt1 sisyphus+244999.100.3.1 1585218480 installed
<13>Jun 13 14:54:19 rpmi: libpython3-3.8.2-alt1 sisyphus+244999.100.3.1 1585218480 installed
<13>Jun 13 14:54:19 rpmi: python3-module-six-1.14.0-alt1 sisyphus+251567.100.1.1 1589268039 installed
<13>Jun 13 14:54:19 rpmi: python3-module-genshi-0.7-alt2 sisyphus+229363.100.1.1 1557847335 installed
<13>Jun 13 14:54:19 rpmi: python3-module-webencodings-0.5.1-alt2 sisyphus+245915.200.1.1 1581496105 installed
<13>Jun 13 14:54:19 rpmi: python3-module-html5lib-1:1.0.1-alt1 sisyphus+238807.100.2.1 1570465973 installed
<13>Jun 13 14:54:19 rpmi: python3-module-lxml-4.5.0-alt2 sisyphus+250566.2700.6.1 1588189778 installed
<13>Jun 13 14:54:19 rpmi: python3-module-cssselect-0.9.1-alt2 sisyphus+250566.2300.6.1 1588188959 installed
<13>Jun 13 14:54:19 rpmi: python3-module-javapackages-1:5.3.0-alt1_4jpp8 sisyphus+234467.100.1.1 1563037789 installed
<13>Jun 13 14:54:19 rpmi: rpm-build-java-1:5.3.0-alt1_4jpp8 sisyphus+234467.100.1.1 1563037789 installed
<13>Jun 13 14:54:26 rpmi: plexus-utils-0:3.1.0-alt1_4jpp8 sisyphus+232632.100.1.1 1560946792 installed
<13>Jun 13 14:54:26 rpmi: apache-commons-io-1:2.6-alt1_8jpp8 sisyphus+246236.100.1.2 1581684285 installed
<13>Jun 13 14:54:26 rpmi: plexus-containers-component-annotations-0:1.7.1-alt1_9jpp8 sisyphus+230738.100.1.2 1559119352 installed
<13>Jun 13 14:54:26 rpmi: maven-shared-utils-3.2.1-alt1_0.5jpp8 sisyphus+246399.100.1.3 1581811963 installed
<13>Jun 13 14:54:26 rpmi: slf4j-0:1.7.25-alt1_6jpp8 sisyphus+234787.100.1.2 1563401783 installed
<13>Jun 13 14:54:26 rpmi: apache-commons-logging-0:1.2-alt1_17jpp8 sisyphus+230666.100.1.3 1559086314 installed
<13>Jun 13 14:54:26 rpmi: plexus-interpolation-0:1.22-alt1_11jpp8 sisyphus+230585.100.1.3 1559072693 installed
<13>Jun 13 14:54:26 rpmi: maven-wagon-provider-api-0:3.2.0-alt1_2jpp8 sisyphus+234500.100.1.1 1563092918 installed
<13>Jun 13 14:54:26 rpmi: libjpeg-2:2.0.2-alt1 sisyphus+226996.100.1.1 1554902907 installed
<13>Jun 13 14:54:26 rpmi: libpng16-1.6.37-alt1 sisyphus+236677.100.2.1 1566917998 installed
<13>Jun 13 14:54:27 rpmi: xml-commons-apis-1.4.01-alt3_29jpp8 sisyphus+246084.100.1.1 1581616535 installed
<13>Jun 13 14:54:27 rpmi: plexus-classworlds-0:2.5.2-alt2_11jpp8 sisyphus+230577.100.1.3 1559069608 installed
<13>Jun 13 14:54:27 rpmi: httpcomponents-core-4.4.10-alt1_5jpp8 sisyphus+234626.100.1.1 1563265825 installed
<13>Jun 13 14:54:27 rpmi: guava20-20.0-alt1_11jpp8 sisyphus+246194.100.1.2 1581647544 installed
<13>Jun 13 14:54:27 rpmi: liblcms2-2.10-alt1 sisyphus+252625.100.1.1 1590995075 installed
<13>Jun 13 14:54:27 rpmi: apache-commons-lang3-3.8.1-alt1_5jpp8 sisyphus+246238.100.1.3 1581684944 installed
<13>Jun 13 14:54:27 rpmi: apache-commons-codec-0:1.11-alt1_6jpp8 sisyphus+230657.100.1.3 1559083228 installed
<13>Jun 13 14:54:27 rpmi: maven-resolver-api-1:1.3.1-alt1_2jpp8 sisyphus+234217.100.1.1 1562753977 installed
<13>Jun 13 14:54:27 rpmi: maven-resolver-util-1:1.3.1-alt1_2jpp8 sisyphus+234217.100.1.1 1562753977 installed
<13>Jun 13 14:54:27 rpmi: maven-resolver-spi-1:1.3.1-alt1_2jpp8 sisyphus+234217.100.1.1 1562753977 installed
<13>Jun 13 14:54:27 rpmi: xmvn-core-3.0.0-alt1_23jpp8 sisyphus+234592.200.1.1 1563216657 installed
<13>Jun 13 14:54:27 rpmi: xmvn-api-3.0.0-alt1_23jpp8 sisyphus+234592.200.1.1 1563216657 installed
<13>Jun 13 14:54:27 rpmi: hawtjni-runtime-0:1.16-alt1_4jpp8 sisyphus+230701.100.1.2 1559102558 installed
<13>Jun 13 14:54:27 rpmi: atinject-0:1-alt7_32.20100611svn86jpp8 sisyphus+246479.100.1.1 1581862067 installed
<13>Jun 13 14:54:27 rpmi: jansi-native-0:1.7-alt1_8jpp8 sisyphus+230705.100.1.2 1559107008 installed
<13>Jun 13 14:54:27 rpmi: jansi-0:1.17.1-alt1_3jpp8 sisyphus+230098.100.1.1 1558798755 installed
<13>Jun 13 14:54:27 rpmi: jcl-over-slf4j-0:1.7.25-alt1_6jpp8 sisyphus+234787.100.1.2 1563401783 installed
<13>Jun 13 14:54:27 rpmi: maven-artifact-1:2.2.1-alt6_61jpp8 sisyphus+230725.100.1.2 1559113327 installed
<13>Jun 13 14:54:27 rpmi: maven-model-1:2.2.1-alt6_61jpp8 sisyphus+230725.100.1.2 1559113327 installed
<13>Jun 13 14:54:27 rpmi: qdox-1:2.0-alt1_4.M9jpp8 sisyphus+230741.100.1.3 1559121911 installed
<13>Jun 13 14:54:27 rpmi: plexus-cipher-1.7-alt3_18jpp8 sisyphus+246337.100.1.3 1581793897 installed
<13>Jun 13 14:54:27 rpmi: perl-HTTP-Date-6.04-alt1 sisyphus+241046.100.1.1 1574192946 installed
<13>Jun 13 14:54:27 rpmi: libwayland-client-1.18.0-alt1 sisyphus+245906.100.1.1 1581492503 installed
<13>Jun 13 14:54:27 rpmi: apache-commons-lang-0:2.6-alt5_24jpp8 sisyphus+230665.100.1.2 1559085370 installed
<13>Jun 13 14:54:27 rpmi: apache-commons-collections-0:3.2.2-alt1_12jpp8 sisyphus+230659.100.1.2 1559083601 installed
<13>Jun 13 14:54:27 rpmi: apache-commons-cli-0:1.4-alt1_8jpp8 sisyphus+246229.100.1.1 1581671949 installed
<13>Jun 13 14:54:27 rpmi: aopalliance-0:1.0-alt6_21jpp8 sisyphus+246474.100.1.1 1581861463 installed
<13>Jun 13 14:54:27 rpmi: google-guice-0:4.1-alt1_14jpp8 sisyphus+230697.100.1.3 1559104116 installed
<13>Jun 13 14:54:27 rpmi: velocity-1:1.7-alt3_27jpp8 sisyphus+246328.100.1.1 1581787500 installed
<13>Jun 13 14:54:27 rpmi: plexus-sec-dispatcher-1.4-alt4_29jpp8 sisyphus+246341.100.1.3 1581794923 installed
<13>Jun 13 14:54:27 rpmi: maven-resolver-connector-basic-1:1.3.1-alt1_2jpp8 sisyphus+234217.100.1.1 1562753977 installed
<13>Jun 13 14:54:27 rpmi: maven-resolver-impl-1:1.3.1-alt1_2jpp8 sisyphus+234217.100.1.1 1562753977 installed
<13>Jun 13 14:54:27 rpmi: maven-resolver-transport-wagon-1:1.3.1-alt1_2jpp8 sisyphus+234217.100.1.1 1562753977 installed
<13>Jun 13 14:54:27 rpmi: maven-wagon-file-0:3.2.0-alt1_2jpp8 sisyphus+234500.100.1.1 1563092918 installed
<13>Jun 13 14:54:27 rpmi: geronimo-annotation-1.0-alt4_27jpp8 sisyphus+246176.100.1.2 1581642137 installed
<13>Jun 13 14:54:27 rpmi: perl-XML-NamespaceSupport-1.12-alt1 1491296348 installed
<13>Jun 13 14:54:27 rpmi: libsqlite3-3.32.2-alt1 sisyphus+253006.200.2.1 1591627769 installed
<13>Jun 13 14:54:27 rpmi: libidn2-2.3.0-alt1 sisyphus+240846.100.1.2 1573870475 installed
<13>Jun 13 14:54:27 rpmi: beust-jcommander-1.71-alt1_6jpp8 sisyphus+230680.100.1.3 1559093321 installed
<13>Jun 13 14:54:27 rpmi: xmvn-connector-aether-3.0.0-alt1_23jpp8 sisyphus+234592.200.1.1 1563216657 installed
<13>Jun 13 14:54:27 rpmi: maven-dependency-tree-3.0-alt1_7jpp8 sisyphus+230483.100.1.2 1558992218 installed
<13>Jun 13 14:54:28 rpmi: xmlgraphics-commons-0:2.2-alt1_3jpp8 sisyphus+234789.100.1.3 1563402604 installed
<13>Jun 13 14:54:28 rpmi: liblksctp-1.0.17-alt2 1523113261 installed
<13>Jun 13 14:54:28 rpmi: libnettle8-3.6-alt1 sisyphus+251637.100.3.1 1590060253 installed
<13>Jun 13 14:54:28 rpmi: libusb-1.0.23-alt1 sisyphus+237317.100.1.1 1568059905 installed
<13>Jun 13 14:54:28 rpmi: perl-LWP-MediaTypes-6.04-alt1 sisyphus+225468.100.1.1 1553186684 installed
<13>Jun 13 14:54:28 rpmi: perl-Compress-Raw-Zlib-2.093-alt1 sisyphus+242766.100.1.1 1576089368 installed
<13>Jun 13 14:54:28 rpmi: perl-libnet-1:3.11-alt1 1511423541 installed
<13>Jun 13 14:54:28 rpmi: perl-XML-SAX-Base-1.09-alt1 1494364363 installed
<13>Jun 13 14:54:28 rpmi: libfribidi-1.0.9-alt1 sisyphus+247242.1500.7.1 1583840860 installed
<13>Jun 13 14:54:28 rpmi: libepoxy-1.5.4-alt1 sisyphus+242061.100.1.1 1575190160 installed
<13>Jun 13 14:54:28 rpmi: libpaper-1.1.26-alt1 sisyphus+221360.100.1.1 1549974197 installed
<13>Jun 13 14:54:28 rpmi: libopenjpeg2.0-2.3.1-alt1 sisyphus+226454.100.1.1 1554284337 installed
<13>Jun 13 14:54:28 rpmi: libnspr-1:4.25-alt1 sisyphus+247014.100.1.1 1582673206 installed
<13>Jun 13 14:54:28 rpmi: libnss-3.53.0-alt3 sisyphus+253111.100.1.1 1591786755 installed
<13>Jun 13 14:54:28 rpmi: libglvnd-7:1.3.1-alt2 sisyphus+252520.100.1.1 1590837007 installed
<13>Jun 13 14:54:28 rpmi: libwayland-server-1.18.0-alt1 sisyphus+245906.100.1.1 1581492503 installed
<13>Jun 13 14:54:28 rpmi: libICE-1.0.10-alt1 sisyphus+247690.100.1.1 1584000387 installed
<13>Jun 13 14:54:28 rpmi: apache-commons-compress-0:1.18-alt1_4jpp8 sisyphus+230079.100.1.3 1558794575 installed
<13>Jun 13 14:54:28 rpmi: python3-module-sugarbowl-0.52.1-alt1.git20141130.1.1 sisyphus+227470.1100.1.1 1555687657 installed
<13>Jun 13 14:54:28 rpmi: libSM-1.2.3-alt1 sisyphus+226734.100.2.1 1554586158 installed
<13>Jun 13 14:54:28 rpmi: libhogweed6-3.6-alt1 sisyphus+251637.100.3.1 1590060253 installed
<13>Jun 13 14:54:28 rpmi: libgnutls30-3.6.14-alt1 sisyphus+252951.100.1.1 1591438090 installed
<13>Jun 13 14:54:28 rpmi: lksctp-tools-1.0.17-alt2 1523113261 installed
<13>Jun 13 14:54:28 rpmi: apache-commons-configuration-0:1.10-alt1_15jpp8 sisyphus+246230.100.1.2 1581682006 installed
<13>Jun 13 14:54:28 rpmi: libwayland-cursor-1.18.0-alt1 sisyphus+245906.100.1.1 1581492503 installed
<13>Jun 13 14:54:28 rpmi: libwayland-egl-4:18.1.0-alt1 sisyphus+245906.100.1.1 1581492503 installed
<13>Jun 13 14:54:28 rpmi: perl-File-Listing-6.04-alt1 1329758996 installed
<13>Jun 13 14:54:28 rpmi: jline-0:2.14.6-alt1_6jpp8 sisyphus+246150.100.1.1 1581626775 installed
<13>Jun 13 14:54:28 rpmi: xmvn-mojo-3.0.0-alt1_23jpp8 sisyphus+234592.200.1.1 1563216657 installed
<13>Jun 13 14:54:28 rpmi: apache-commons-httpclient-1:3.1-alt6_33jpp8 sisyphus+246235.100.1.2 1581683324 installed
<13>Jun 13 14:54:28 rpmi: plexus-component-api-1.0-alt4_0.28.alpha15jpp8 sisyphus+246338.100.1.2 1581792678 installed
<13>Jun 13 14:54:28 rpmi: plexus-interactivity-api-0:1.0-alt6_0.29.alpha6jpp8 sisyphus+249035.100.1.3 1585686294 installed
<13>Jun 13 14:54:28 rpmi: libqpdf28-10.0.1-alt1 sisyphus+249852.100.1.1 1586771283 installed
<13>Jun 13 14:54:28 rpmi: libjasper-2.0.16-alt1 sisyphus+231386.100.1.1 1559568070 installed
<13>Jun 13 14:54:28 rpmi: bsf-1:2.4.0-alt3_32jpp8 sisyphus+230681.100.1.3 1559094820 installed
<13>Jun 13 14:54:28 rpmi: fontbox-0:2.0.9-alt1_5jpp8 sisyphus+232748.100.2.2 1561094391 installed
<13>Jun 13 14:54:28 rpmi: maven-invoker-2.2-alt1_9jpp8 sisyphus+230495.100.1.3 1559025269 installed
<13>Jun 13 14:54:28 rpmi: plexus-io-0:3.0.0-alt1_4jpp8 sisyphus+230586.100.1.2 1559073032 installed
<13>Jun 13 14:54:28 rpmi: plexus-compiler-0:2.8.2-alt1_4jpp8 sisyphus+230579.100.1.2 1559070334 installed
<13>Jun 13 14:54:28 rpmi: plexus-build-api-0:0.0.7-alt3_23jpp8 sisyphus+249033.100.1.1 1585685203 installed
<13>Jun 13 14:54:28 rpmi: sgml-common-0.6.3-alt15 1423664786 installed
<13>Jun 13 14:54:28 rpmi: xml-utils-1:2.9.10-alt3 sisyphus+245000.16400.79.1 1583230501 installed
<13>Jun 13 14:54:29 rpmi: log4j12-1.2.17-alt1_26jpp8 sisyphus+246374.100.1.2 1581803360 installed
<13>Jun 13 14:54:29 rpmi: xz-java-1.8-alt1_6jpp8 sisyphus+246078.100.1.1 1581610971 installed
<13>Jun 13 14:54:29 rpmi: maven-filesystem-0.01-alt2.1 1460115697 installed
<13>Jun 13 14:54:29 rpmi: jsoup-1.11.3-alt1_4jpp8 sisyphus+230720.100.1.2 1559110900 installed
<13>Jun 13 14:54:29 rpmi: jdom2-2.0.6-alt1_15jpp8 sisyphus+246132.100.1.1 1581625051 installed
<13>Jun 13 14:54:29 rpmi: xorg-proto-devel-2020.1-alt1 sisyphus+250406.100.1.1 1587554810 installed
<13>Jun 13 14:54:29 rpmi: publicsuffix-list-20200401-alt1 sisyphus+249161.100.1.1 1585815856 installed
<13>Jun 13 14:54:29 rpmi: httpcomponents-client-4.5.7-alt1_1jpp8 sisyphus+234750.100.1.1 1563380626 installed
<13>Jun 13 14:54:29 rpmi: maven-wagon-http-shared-0:3.2.0-alt1_2jpp8 sisyphus+234500.100.1.1 1563092918 installed
<13>Jun 13 14:54:29 rpmi: maven-wagon-http-0:3.2.0-alt1_2jpp8 sisyphus+234500.100.1.1 1563092918 installed
<13>Jun 13 14:54:29 rpmi: hamcrest-core-0:1.3-alt3_27jpp8 sisyphus+246429.100.1.1 1581833287 installed
<13>Jun 13 14:54:29 rpmi: junit-1:4.12-alt1_13jpp8 sisyphus+246172.100.1.2 1581640927 installed
<13>Jun 13 14:54:29 rpmi: maven-verifier-1.6-alt1_10jpp8 sisyphus+246402.100.1.2 1581812459 installed
<13>Jun 13 14:54:29 rpmi: multiverse-0.7.0-alt1_10jpp8 sisyphus+230533.100.1.2 1559038108 installed
<13>Jun 13 14:54:29 rpmi: jzlib-0:1.1.3-alt1_12jpp8 sisyphus+246197.100.1.2 1581650007 installed
<13>Jun 13 14:54:29 rpmi: netty3-3.10.6-alt2_6jpp8 sisyphus+234851.100.1.1 1563462247 installed
<13>Jun 13 14:54:29 rpmi: osgi-core-7.0.0-alt1_3jpp8 sisyphus+246369.100.1.3 1581802553 installed
<13>Jun 13 14:54:29 rpmi: jcsp-1.1-alt1_0.11.rc5jpp8 sisyphus+230869.100.1.1 1559221390 installed
<13>Jun 13 14:54:29 rpmi: xpp3-minimal-1:1.1.4-alt1_20.cjpp8 sisyphus+234613.100.1.1 1563228326 installed
<13>Jun 13 14:54:29 rpmi: xpp3-1:1.1.4-alt1_20.cjpp8 sisyphus+234613.100.1.1 1563228326 installed
<13>Jun 13 14:54:29 rpmi: xstream-0:1.4.11.1-alt1_2jpp8 sisyphus+232422.100.1.1 1560804121 installed
<13>Jun 13 14:54:29 rpmi: java-common-1.6.0-alt1 sisyphus+234020.100.1.1 1562437039 installed
<13>Jun 13 14:54:29 rpmi: printer-testpages-2.0-alt2 1148643941 installed
<13>Jun 13 14:54:29 rpmi: libpcsclite-1.8.26-alt1 sisyphus+243821.140.3.1 1578667511 installed
<13>Jun 13 14:54:29 rpmi: javazi-2020a-alt1 sisyphus+250575.200.1.1 1587740494 installed
<13>Jun 13 14:54:29 rpmi: libgif-4.1.6-alt3 1299634261 installed
<13>Jun 13 14:54:29 rpmi: libxkbcommon-0.10.0-alt1 sisyphus+244530.100.1.1 1579516274 installed
<13>Jun 13 14:54:29 rpmi: libproxy-0.4.15-alt3.1 sisyphus+249308.100.1.1 1585930360 installed
<13>Jun 13 14:54:29 rpmi: libgudev-1:233-alt1 sisyphus+235422.100.1.1 1564855273 installed
<13>Jun 13 14:54:29 rpmi: udev-rules-1:245.6-alt1 sisyphus+252793.100.1.1 1591265128 installed
<13>Jun 13 14:54:29 rpmi: gtk+3-themes-incompatible-3.20-alt3 1461944560 installed
<13>Jun 13 14:54:29 rpmi: perl-Try-Tiny-0.30-alt1 1514318058 installed
<13>Jun 13 14:54:29 rpmi: perl-IO-Socket-IP-0.39-alt1 1494508514 installed
<13>Jun 13 14:54:29 rpmi: perl-Compress-Raw-Bzip2-2.093-alt1 sisyphus+242765.100.1.1 1576089363 installed
<13>Jun 13 14:54:29 rpmi: perl-HTML-Tagset-3.20-alt2 1317725093 installed
<13>Jun 13 14:54:29 rpmi: perl-Term-ANSIColor-5.01-alt1 sisyphus+244783.100.1.2 1579747505 installed
<13>Jun 13 14:54:29 rpmi: perl-Data-Dump-1.23-alt1 1444601978 installed
<13>Jun 13 14:54:29 rpmi: perl-Filter-1.59-alt1.1 sisyphus+219907.400.1.1 1548343389 installed
<13>Jun 13 14:54:29 rpmi: perl-Encode-3.04-alt1 sisyphus+247835.100.1.1 1584190307 installed
<13>Jun 13 14:54:29 rpmi: perl-URI-1.76-alt1 sisyphus+220243.100.1.1 1548863244 installed
<13>Jun 13 14:54:29 rpmi: perl-IO-Compress-2.093-alt1 sisyphus+243543.100.1.1 1577294382 installed
<13>Jun 13 14:54:29 rpmi: perl-Net-HTTP-6.19-alt1 sisyphus+229756.100.1.1 1558454558 installed
<13>Jun 13 14:54:29 rpmi: perl-HTML-Parser-3.72-alt1.2 sisyphus+219907.600.1.1 1548343581 installed
<13>Jun 13 14:54:29 rpmi: perl-WWW-RobotRules-6.02-alt1 1329756211 installed
<13>Jun 13 14:54:29 rpmi: perl-Encode-Locale-1.05-alt1 1444608613 installed
<13>Jun 13 14:54:29 rpmi: perl-IO-HTML-1.001-alt1 1404821752 installed
<13>Jun 13 14:54:29 rpmi: perl-HTTP-Message-6.24-alt1 sisyphus+253069.100.1.1 1591724742 installed
<13>Jun 13 14:54:30 rpmi: perl-HTTP-Cookies-6.08-alt1 sisyphus+242242.100.1.1 1575454022 installed
<13>Jun 13 14:54:30 rpmi: perl-HTTP-Negotiate-6.01-alt1 1329760563 installed
<13>Jun 13 14:54:30 rpmi: perl-libwww-6.45-alt1 sisyphus+253073.100.1.1 1591725695 installed
<13>Jun 13 14:54:30 rpmi: perl-XML-LibXML-2.0202-alt1 sisyphus+246834.100.1.1 1582544040 installed
<13>Jun 13 14:54:30 rpmi: perl-XML-SAX-1.02-alt1 sisyphus+232322.100.1.1 1560758406 installed
<13>Jun 13 14:54:30 rpmi: perl-XML-Simple-2.25-alt1 1521437714 installed
<13>Jun 13 14:54:30 rpmi: icon-naming-utils-0.8.90-alt1 1236573102 installed
<13>Jun 13 14:54:30 rpmi: icon-theme-adwaita-3.36.1-alt1 sisyphus+250137.100.1.1 1587127395 installed
<13>Jun 13 14:54:30 rpmi: libdatrie-0.2.9-alt1_6 1511686676 installed
<13>Jun 13 14:54:30 rpmi: libthai-0.1.28-alt1_1 sisyphus+226107.100.1.1 1554123079 installed
<13>Jun 13 14:54:31 rpmi: libgdk-pixbuf-locales-2.40.0-alt1 sisyphus+238952.140.2.1 1570644607 installed
<13>Jun 13 14:54:31 rpmi: extra166y-1.7.0-alt1_11jpp8 sisyphus+230314.100.1.1 1558915133 installed
<13>Jun 13 14:54:31 rpmi: objenesis-0:2.6-alt1_6jpp8 sisyphus+246364.100.1.3 1581801599 installed
<13>Jun 13 14:54:31 rpmi: dain-snappy-0.4-alt1_9jpp8 sisyphus+246459.100.1.2 1581844027 installed
<13>Jun 13 14:54:31 rpmi: plexus-archiver-0:3.6.0-alt1_3jpp8 sisyphus+230573.100.1.2 1559064649 installed
<13>Jun 13 14:54:31 rpmi: maven-plugin-testing-harness-3.3.0-alt1_16jpp8 sisyphus+246388.100.1.2 1581807247 installed
<13>Jun 13 14:54:31 rpmi: libwebp7-1.1.0-alt1 sisyphus+243895.100.1.1 1578410873 installed
<13>Jun 13 14:54:31 rpmi: libjbig-2.1-alt1 1401380926 installed
<13>Jun 13 14:54:31 rpmi: libtiff5-4.1.0-alt1 sisyphus+240802.100.1.1 1573743635 installed
<13>Jun 13 14:54:31 rpmi: publicsuffix-list-dafsa-20200401-alt1 sisyphus+249161.100.1.1 1585815856 installed
<13>Jun 13 14:54:31 rpmi: libpsl-0.21.0-alt2 sisyphus+237083.100.1.1 1567531657 installed
<13>Jun 13 14:54:31 rpmi: libnghttp2-1.40.0-alt1 sisyphus+244416.100.1.1 1579241942 installed
<13>Jun 13 14:54:31 rpmi: libverto-0.3.0-alt1_7 sisyphus+225932.100.1.1 1553994919 installed
<13>Jun 13 14:54:31 rpmi: libkeyutils-1.6-alt2 sisyphus+226520.100.2.1 1554512089 installed
<13>Jun 13 14:54:31 rpmi: libcom_err-1.44.6-alt1 sisyphus+224154.100.1.1 1552091678 installed
<86>Jun 13 14:54:31 groupadd[3688273]: group added to /etc/group: name=_keytab, GID=499
<86>Jun 13 14:54:31 groupadd[3688273]: group added to /etc/gshadow: name=_keytab
<86>Jun 13 14:54:31 groupadd[3688273]: new group: name=_keytab, GID=499
<13>Jun 13 14:54:31 rpmi: libkrb5-1.17.1-alt1 sisyphus+242784.100.1.1 1576137330 installed
<86>Jun 13 14:54:31 groupadd[3688491]: group added to /etc/group: name=sasl, GID=498
<86>Jun 13 14:54:31 groupadd[3688491]: group added to /etc/gshadow: name=sasl
<86>Jun 13 14:54:31 groupadd[3688491]: new group: name=sasl, GID=498
<13>Jun 13 14:54:31 rpmi: libsasl2-3-2.1.27-alt2 sisyphus+228101.100.1.1 1556139863 installed
<13>Jun 13 14:54:31 rpmi: libldap-2.4.48-alt3 sisyphus+238816.100.1.1 1570449022 installed
<13>Jun 13 14:54:31 rpmi: poppler-data-0.4.9-alt1 sisyphus.216033.100 1541141723 installed
<13>Jun 13 14:54:31 rpmi: libpixman-3:0.40.0-alt1 sisyphus+250700.100.1.1 1587971055 installed
<13>Jun 13 14:54:31 rpmi: libbrotlicommon-1.0.7-alt1 sisyphus+226738.100.2.1 1554554568 installed
<13>Jun 13 14:54:31 rpmi: libbrotlidec-1.0.7-alt1 sisyphus+226738.100.2.1 1554554568 installed
<13>Jun 13 14:54:31 rpmi: libcurl-7.70.0-alt1 sisyphus+251607.100.1.1 1589303299 installed
<13>Jun 13 14:54:31 rpmi: libgraphite2-1.3.14-alt2 sisyphus+250009.100.1.1 1586943065 installed
<13>Jun 13 14:54:32 rpmi: libharfbuzz-2.6.7-alt1 sisyphus+252769.100.1.1 1591212292 installed
<13>Jun 13 14:54:32 rpmi: libfreetype-2.10.2-alt1 sisyphus+251736.100.1.1 1589531905 installed
<13>Jun 13 14:54:32 rpmi: fontconfig-2.13.1-alt1 sisyphus+247349.100.1.2 1583841221 installed
Updating fonts cache: <29>Jun 13 14:54:33 fontconfig: Updating fonts cache: succeeded
[ DONE ]
<13>Jun 13 14:54:33 rpmi: libpoppler97-0.86.1-alt1 sisyphus+247631.100.1.1 1583927460 installed
<13>Jun 13 14:54:33 rpmi: libpoppler0-cpp-0.86.1-alt1 sisyphus+247631.100.1.1 1583927460 installed
<13>Jun 13 14:54:33 rpmi: fonts-type1-urw-3:1.0.7pre44-alt3 sisyphus+224082.100.2.1 1552406640 installed
<13>Jun 13 14:54:33 rpmi: fonts-type1-xorg-7.0.0-alt4 1188553211 installed
<13>Jun 13 14:54:34 rpmi: libxshmfence-1.3-alt1 sisyphus+223149.1000.2.1 1551268571 installed
<13>Jun 13 14:54:34 rpmi: libpciaccess-1:0.16-alt1 sisyphus+234814.100.1.1 1563438291 installed
<13>Jun 13 14:54:34 rpmi: libdrm-1:2.4.102-alt1 sisyphus+252307.100.1.1 1590574828 installed
<13>Jun 13 14:54:34 rpmi: libgbm-4:20.1.1-alt1 sisyphus+253144.100.1.1 1591823782 installed
<13>Jun 13 14:54:34 rpmi: jboss-interceptors-1.2-api-1.0.0-alt1_10jpp8 sisyphus+230808.100.1.1 1559189873 installed
<13>Jun 13 14:54:34 rpmi: glassfish-el-api-3.0.1-alt1_0.13.b08jpp8 sisyphus+246188.100.1.3 1581646552 installed
<13>Jun 13 14:54:34 rpmi: cdi-api-1.2-alt1_12jpp8 sisyphus+246450.100.1.1 1581841321 installed
<13>Jun 13 14:54:34 rpmi: sisu-inject-2:0.3.3-alt1_8jpp8 sisyphus+249061.100.1.1 1585693066 installed
<13>Jun 13 14:54:34 rpmi: sisu-plexus-2:0.3.3-alt1_8jpp8 sisyphus+249061.100.1.1 1585693066 installed
<13>Jun 13 14:54:34 rpmi: maven-1:3.5.4-alt1_10jpp8 sisyphus+234629.100.1.2 1563267886 installed
<13>Jun 13 14:54:34 rpmi: maven-lib-1:3.5.4-alt1_10jpp8 sisyphus+234629.100.1.2 1563267886 installed
<13>Jun 13 14:54:34 rpmi: maven-common-artifact-filters-3.0.1-alt1_8jpp8 sisyphus+246378.100.1.2 1581805207 installed
<13>Jun 13 14:54:34 rpmi: maven-artifact-transfer-1:0.9.0-alt1_6jpp8 sisyphus+230479.100.1.2 1558990306 installed
<13>Jun 13 14:54:34 rpmi: maven-archiver-0:3.2.0-alt1_4jpp8 sisyphus+230477.100.1.3 1558989899 installed
<13>Jun 13 14:54:34 rpmi: maven-jar-plugin-3.1.0-alt1_3jpp8 sisyphus+230496.100.1.3 1559025734 installed
<13>Jun 13 14:54:34 rpmi: maven-shared-incremental-1.1-alt1_18jpp8 sisyphus+246396.100.1.2 1581810480 installed
<13>Jun 13 14:54:34 rpmi: maven-filtering-3.1.1-alt1_9jpp8 sisyphus+246380.100.1.3 1581806111 installed
<13>Jun 13 14:54:34 rpmi: maven-resources-plugin-3.1.0-alt1_6jpp8 sisyphus+246394.100.1.3 1581808735 installed
<13>Jun 13 14:54:34 rpmi: xmvn-minimal-3.0.0-alt1_23jpp8 sisyphus+234592.200.1.1 1563216657 installed
<13>Jun 13 14:54:34 rpmi: ca-trust-java-0.1.2-alt1 sisyphus+233348.100.1.1 1561653823 installed
<13>Jun 13 14:54:34 rpmi: bc-1:1.07.1-alt1 sisyphus+221902.700.4.1 1550587857 installed
<13>Jun 13 14:54:34 rpmi: jai-imageio-core-1.2-alt1_0.24.20100217cvsjpp8 sisyphus+221788.100.1.1 1550423410 installed
<13>Jun 13 14:54:34 rpmi: avalon-logkit-0:2.1-alt2_32jpp8 sisyphus+230676.100.1.3 1559090555 installed
<13>Jun 13 14:54:34 rpmi: avalon-framework-0:4.3-alt4_24jpp8 sisyphus+246481.100.1.3 1581864563 installed
<13>Jun 13 14:54:34 rpmi: libatk-locales-2.36.0-alt1 sisyphus+249208.100.1.1 1585840405 installed
<13>Jun 13 14:54:34 rpmi: libatk-2.36.0-alt1 sisyphus+249208.100.1.1 1585840406 installed
<13>Jun 13 14:54:34 rpmi: shared-mime-info-2.0-alt1 sisyphus+251302.100.1.1 1588847607 installed
<13>Jun 13 14:54:35 rpmi: gsettings-desktop-schemas-data-3.36.1-alt1 sisyphus+250870.100.1.1 1588227108 installed
<13>Jun 13 14:54:35 rpmi: libgio-2.64.3-alt1 sisyphus+251581.40.3.3 1590771553 installed
<13>Jun 13 14:54:35 rpmi: gsettings-desktop-schemas-3.36.1-alt1 sisyphus+250870.100.1.1 1588227105 installed
<13>Jun 13 14:54:35 rpmi: libgdk-pixbuf-2.40.0-alt1 sisyphus+238952.140.2.1 1570644615 installed
<13>Jun 13 14:54:35 rpmi: libgusb-0.3.4-alt1 sisyphus+247875.100.1.1 1584292779 installed
<13>Jun 13 14:54:35 rpmi: libcolord-1.4.4-alt2 sisyphus+229904.100.1.1 1558606569 installed
<13>Jun 13 14:54:35 rpmi: gtk-update-icon-cache-3.24.20-alt1 sisyphus+250751.100.1.1 1588052725 installed
<13>Jun 13 14:54:35 rpmi: glib-networking-2.64.3-alt1 sisyphus+251581.1300.3.3 1590773671 installed
<13>Jun 13 14:54:35 rpmi: libsoup-2.70.0-alt1 sisyphus+247780.1300.3.2 1584200094 installed
<13>Jun 13 14:54:35 rpmi: libsoup-gnome-2.70.0-alt1 sisyphus+247780.1300.3.2 1584200094 installed
<13>Jun 13 14:54:35 rpmi: librest-0.8.1-alt1 1508266400 installed
<13>Jun 13 14:54:35 rpmi: libdconf-0.36.0-alt1 sisyphus+247780.1000.3.2 1584199861 installed
<13>Jun 13 14:54:35 rpmi: libjson-glib-1.4.4-alt1 sisyphus.213175.100 1537249589 installed
<13>Jun 13 14:54:35 rpmi: liblz4-1:1.9.2-alt1 sisyphus+238585.100.2.2 1570066927 installed
<13>Jun 13 14:54:35 rpmi: libsystemd-1:245.6-alt1 sisyphus+252793.100.1.1 1591265141 installed
<13>Jun 13 14:54:35 rpmi: libdbus-1.12.18-alt1 sisyphus+252758.100.1.1 1591203693 installed
<13>Jun 13 14:54:35 rpmi: libavahi-0.7-alt3 sisyphus+250384.100.2.1 1587547019 installed
<13>Jun 13 14:54:35 rpmi: libcups-2.3.1-alt1 sisyphus+247381.100.2.2 1583841455 installed
<13>Jun 13 14:54:37 rpmi: libgs-9.28-alt0.rc1.1 sisyphus+237325.100.1.1 1568104012 installed
<13>Jun 13 14:54:37 rpmi: ghostscript-common-9.28-alt0.rc1.1 sisyphus+237325.100.1.1 1568103940 installed
<13>Jun 13 14:54:37 rpmi: ghostscript-classic-9.28-alt0.rc1.1 sisyphus+237325.100.1.1 1568104012 installed
<13>Jun 13 14:54:37 rpmi: cups-filters-libs-1.27.4-alt2 sisyphus+252343.100.1.1 1590663705 installed
<13>Jun 13 14:54:37 rpmi: libavahi-glib-0.7-alt3 sisyphus+250384.100.2.1 1587547019 installed
<13>Jun 13 14:54:37 rpmi: dbus-tools-1.12.18-alt1 sisyphus+252758.100.1.1 1591203693 installed
<86>Jun 13 14:54:37 groupadd[3696546]: group added to /etc/group: name=messagebus, GID=497
<86>Jun 13 14:54:37 groupadd[3696546]: group added to /etc/gshadow: name=messagebus
<86>Jun 13 14:54:37 groupadd[3696546]: new group: name=messagebus, GID=497
<86>Jun 13 14:54:37 useradd[3696558]: new user: name=messagebus, UID=499, GID=497, home=/run/dbus, shell=/dev/null
<13>Jun 13 14:54:37 rpmi: dbus-1.12.18-alt1 sisyphus+252758.100.1.1 1591203693 installed
<13>Jun 13 14:54:37 rpmi: dconf-0.36.0-alt1 sisyphus+247780.1000.3.2 1584199861 installed
<13>Jun 13 14:54:37 rpmi: libgtk+3-schemas-3.24.20-alt1 sisyphus+250751.100.1.1 1588052716 installed
<13>Jun 13 14:54:37 rpmi: libpolkit-0.116-alt2 sisyphus+242835.100.1.1 1576161160 installed
<86>Jun 13 14:54:37 groupadd[3696710]: group added to /etc/group: name=colord, GID=496
<86>Jun 13 14:54:37 groupadd[3696710]: group added to /etc/gshadow: name=colord
<86>Jun 13 14:54:37 groupadd[3696710]: new group: name=colord, GID=496
<86>Jun 13 14:54:37 useradd[3696732]: new user: name=colord, UID=498, GID=496, home=/var/colord, shell=/dev/null
<13>Jun 13 14:54:38 rpmi: colord-1.4.4-alt2 sisyphus+229904.100.1.1 1558606569 installed
<13>Jun 13 14:54:38 rpmi: libX11-locales-3:1.6.9-alt1 sisyphus+239210.100.1.1 1571056781 installed
<13>Jun 13 14:54:38 rpmi: libXdmcp-1.1.3-alt1 sisyphus+225206.600.1.2 1552949353 installed
<13>Jun 13 14:54:38 rpmi: libXau-1.0.9-alt1 sisyphus+223149.200.2.1 1551268152 installed
<13>Jun 13 14:54:38 rpmi: libxcb-1.14-alt1 sisyphus+247358.200.1.3 1583854228 installed
<13>Jun 13 14:54:38 rpmi: libX11-3:1.6.9-alt1 sisyphus+239210.100.1.1 1571056801 installed
<13>Jun 13 14:54:38 rpmi: libXext-1.3.4-alt1 sisyphus+225206.700.1.2 1552949429 installed
<13>Jun 13 14:54:38 rpmi: libXrender-0.9.8-alt1 1371312112 installed
<13>Jun 13 14:54:38 rpmi: libXfixes-5.0.3-alt1 sisyphus+226736.100.2.2 1554614841 installed
<13>Jun 13 14:54:38 rpmi: libXtst-1.2.2-alt1 1369984893 installed
<13>Jun 13 14:54:38 rpmi: libXi-1.7.10-alt1 sisyphus+232786.300.1.1 1561106978 installed
<13>Jun 13 14:54:38 rpmi: libat-spi2-core-2.36.0-alt1 sisyphus+247780.1600.3.2 1584200495 installed
<13>Jun 13 14:54:38 rpmi: libXdamage-1.1.5-alt1 sisyphus+225206.500.1.2 1552949286 installed
<13>Jun 13 14:54:38 rpmi: libXcursor-1.2.0-alt1 sisyphus+225206.400.1.2 1552949218 installed
<13>Jun 13 14:54:38 rpmi: libXft-2.3.3-alt1 sisyphus+225206.1000.3.2 1552987708 installed
<13>Jun 13 14:54:38 rpmi: libXrandr-1.5.2-alt1 sisyphus+225206.1300.1.2 1552949710 installed
<13>Jun 13 14:54:38 rpmi: libXxf86vm-1.1.4-alt2 1527672187 installed
<13>Jun 13 14:54:38 rpmi: libGLX-mesa-4:20.1.1-alt1 sisyphus+253144.100.1.1 1591823782 installed
<13>Jun 13 14:54:38 rpmi: libEGL-mesa-4:20.1.1-alt1 sisyphus+253144.100.1.1 1591823782 installed
<13>Jun 13 14:54:38 rpmi: libEGL-7:1.3.1-alt2 sisyphus+252520.100.1.1 1590837007 installed
<13>Jun 13 14:54:38 rpmi: libGLX-7:1.3.1-alt2 sisyphus+252520.100.1.1 1590837007 installed
<13>Jun 13 14:54:38 rpmi: libGL-7:1.3.1-alt2 sisyphus+252520.100.1.1 1590837007 installed
<13>Jun 13 14:54:38 rpmi: libcairo-1:1.16.0-alt1 sisyphus+226534.100.2.3 1554515535 installed
<13>Jun 13 14:54:38 rpmi: libpango-1.44.7-alt1 sisyphus+239731.100.1.1 1571986949 installed
<13>Jun 13 14:54:38 rpmi: poppler-0.86.1-alt1 sisyphus+247631.100.1.1 1583927460 installed
<13>Jun 13 14:54:38 rpmi: cups-filters-1.27.4-alt2 sisyphus+252343.100.1.1 1590663705 installed
<13>Jun 13 14:54:39 rpmi: cups-2.3.1-alt1 sisyphus+247381.100.2.2 1583841455 installed
<13>Jun 13 14:54:42 rpmi: java-10-openjdk-headless-0:10.0.2.13-alt1_7jpp9 sisyphus+234186.100.1.2 1562726544 installed
<13>Jun 13 14:54:43 rpmi: libcairo-gobject-1:1.16.0-alt1 sisyphus+226534.100.2.3 1554515535 installed
<13>Jun 13 14:54:43 rpmi: libXinerama-1.1.4-alt1 sisyphus+223149.300.2.1 1551268216 installed
<13>Jun 13 14:54:43 rpmi: dbus-tools-gui-1.12.18-alt1 sisyphus+252758.100.1.1 1591203693 installed
<13>Jun 13 14:54:43 rpmi: at-spi2-core-2.36.0-alt1 sisyphus+247780.1600.3.2 1584200495 installed
<13>Jun 13 14:54:43 rpmi: at-spi2-atk-2.34.2-alt1 sisyphus+247242.200.7.1 1583839952 installed
<13>Jun 13 14:54:43 rpmi: libXcomposite-0.4.5-alt1 sisyphus+225206.300.1.2 1552949137 installed
<13>Jun 13 14:54:43 rpmi: libgtk+3-3.24.20-alt1 sisyphus+250751.100.1.1 1588052725 installed
<13>Jun 13 14:54:44 rpmi: gtk3-demo-3.24.20-alt1 sisyphus+250751.100.1.1 1588052725 installed
<13>Jun 13 14:54:44 rpmi: libgail3-3.24.20-alt1 sisyphus+250751.100.1.1 1588052725 installed
<13>Jun 13 14:54:45 rpmi: libxcb-devel-1.14-alt1 sisyphus+247358.200.1.3 1583854228 installed
<13>Jun 13 14:54:45 rpmi: libX11-devel-3:1.6.9-alt1 sisyphus+239210.100.1.1 1571056801 installed
<13>Jun 13 14:54:45 rpmi: apache-ivy-0:2.4.0-alt1_16jpp8 sisyphus+230669.100.1.3 1559087305 installed
<13>Jun 13 14:54:45 rpmi: python3-module-pkg_resources-1:46.1.3-alt1 sisyphus+250566.200.3.1 1587973342 installed
<13>Jun 13 14:54:45 rpmi: python3-module-markupsafe-1.1.1-alt1 sisyphus+248369.100.1.1 1585046136 installed
<13>Jun 13 14:54:45 rpmi: python3-module-jinja2-2.10.3-alt1 sisyphus+241982.100.1.1 1575023523 installed
<13>Jun 13 14:54:45 rpmi: python3-module-clyde-0.8.0-alt1.git20141130.2.1 sisyphus+227465.1600.1.2 1555756906 installed
<13>Jun 13 14:54:45 rpmi: python3-module-runfile-0.46.1-alt1.git20141130.2.1 sisyphus+227469.1300.2.3 1555706376 installed
<13>Jun 13 14:54:45 rpmi: objectweb-asm-0:7.0-alt1_4jpp8 sisyphus+246362.100.1.3 1581801326 installed
<13>Jun 13 14:54:45 rpmi: plexus-languages-0.9.10-alt1_5jpp8 sisyphus+249036.100.1.3 1585686585 installed
<13>Jun 13 14:54:45 rpmi: maven-compiler-plugin-3.8.0-alt1_2jpp8 sisyphus+234770.100.1.1 1563387380 installed
<13>Jun 13 14:54:45 rpmi: cglib-0:3.2.9-alt1_4jpp8 sisyphus+246451.100.1.1 1581841093 installed
<13>Jun 13 14:54:45 rpmi: easymock-0:3.6-alt1_5jpp8 sisyphus+246439.100.1.3 1581839231 installed
<13>Jun 13 14:54:45 rpmi: xmvn-install-3.0.0-alt1_23jpp8 sisyphus+234592.200.1.1 1563216657 installed
<13>Jun 13 14:54:45 rpmi: jdependency-0:1.2-alt1_6jpp8 sisyphus+246130.100.1.1 1581624851 installed
<13>Jun 13 14:54:45 rpmi: parboiled-1.1.6-alt1_16jpp8 sisyphus+249040.100.1.3 1585687650 installed
<13>Jun 13 14:54:45 rpmi: pegdown-1.4.2-alt1_15jpp8 sisyphus+249043.100.1.1 1585686958 installed
<13>Jun 13 14:54:45 rpmi: antlr-tool-0:2.7.7-alt12_57jpp8 sisyphus+230655.100.1.1 1559061963 installed
<13>Jun 13 14:54:45 rpmi: xml-commons-resolver-0:1.2-alt1_29jpp8 sisyphus+246085.100.1.1 1581616616 installed
<13>Jun 13 14:54:46 rpmi: xalan-j2-0:2.7.1-alt4_39jpp8 sisyphus+230759.100.1.3 1559127607 installed
<13>Jun 13 14:54:46 rpmi: xerces-j2-0:2.12.0-alt1_4jpp8 sisyphus+246082.100.1.1 1581615230 installed
<13>Jun 13 14:54:46 rpmi: batik-css-0:1.10-alt1_4jpp8 sisyphus+230679.100.1.3 1559093898 installed
<13>Jun 13 14:54:46 rpmi: batik-0:1.10-alt1_4jpp8 sisyphus+230679.100.1.3 1559093898 installed
<13>Jun 13 14:54:46 rpmi: xmlunit-0:1.6-alt1_9jpp8 sisyphus+231069.100.1.1 1559306501 installed
<13>Jun 13 14:54:46 rpmi: bsh-0:2.0-alt1_16.b6jpp8 sisyphus+246487.100.1.1 1581862559 installed
<13>Jun 13 14:54:46 rpmi: xmvn-subst-3.0.0-alt1_23jpp8 sisyphus+234592.200.1.1 1563216657 installed
<13>Jun 13 14:54:46 rpmi: xmvn-resolve-3.0.0-alt1_23jpp8 sisyphus+234592.200.1.1 1563216657 installed
<13>Jun 13 14:54:46 rpmi: javapackages-local-1:5.3.0-alt1_4jpp8 sisyphus+234467.100.1.1 1563037789 installed
<13>Jun 13 14:54:46 rpmi: jtidy-3:1.0-alt3_0.31.20100930svn1125jpp8 sisyphus+246171.100.1.1 1581628409 installed
<13>Jun 13 14:54:47 rpmi: ant-lib-0:1.10.5-alt1_5jpp8 sisyphus+232747.100.2.1 1561092977 installed
<13>Jun 13 14:54:47 rpmi: gpars-1.2.1-alt1_13jpp8 sisyphus+230383.100.1.2 1558956752 installed
<13>Jun 13 14:54:48 rpmi: groovy-lib-0:2.4.8-alt1_9jpp8 sisyphus+234614.100.1.2 1563229744 installed
<13>Jun 13 14:54:48 rpmi: xbean-0:4.9-alt1_2jpp8 sisyphus+230152.100.1.1 1558817445 installed
<13>Jun 13 14:54:48 rpmi: plexus-containers-container-default-0:1.7.1-alt1_9jpp8 sisyphus+230738.100.1.2 1559119352 installed
<13>Jun 13 14:54:48 rpmi: maven-plugin-registry-1:2.2.1-alt6_61jpp8 sisyphus+230725.100.1.2 1559113327 installed
<13>Jun 13 14:54:48 rpmi: maven-plugin-tools-api-0:3.5.1-alt1_7jpp8 sisyphus+246389.100.1.3 1581809388 installed
<13>Jun 13 14:54:48 rpmi: maven-plugin-annotations-0:3.5.1-alt1_7jpp8 sisyphus+246389.100.1.3 1581809388 installed
<13>Jun 13 14:54:48 rpmi: maven-surefire-0:2.22.0-alt1_6jpp8 sisyphus+246401.100.1.3 1581813318 installed
<13>Jun 13 14:54:48 rpmi: maven-doxia-logging-api-0:1.7-alt1_10jpp8 sisyphus+230487.100.1.3 1559021328 installed
<13>Jun 13 14:54:48 rpmi: maven-doxia-sink-api-0:1.7-alt1_10jpp8 sisyphus+230487.100.1.3 1559021328 installed
<13>Jun 13 14:54:48 rpmi: maven-doxia-core-0:1.7-alt1_10jpp8 sisyphus+230487.100.1.3 1559021328 installed
<13>Jun 13 14:54:48 rpmi: maven-reporting-api-1:3.0-alt3_18jpp8 sisyphus+246392.100.1.2 1581808388 installed
<13>Jun 13 14:54:48 rpmi: maven-doxia-module-xhtml-0:1.7-alt1_10jpp8 sisyphus+230487.100.1.3 1559021328 installed
<13>Jun 13 14:54:48 rpmi: plexus-i18n-0:1.0-alt7_0.15.b10.4jpp8 sisyphus+246340.100.1.2 1581794394 installed
<13>Jun 13 14:54:48 rpmi: plexus-velocity-0:1.2-alt1_8jpp8 sisyphus+246342.100.1.3 1581795180 installed
<13>Jun 13 14:54:48 rpmi: maven-plugin-tools-generators-0:3.5.1-alt1_7jpp8 sisyphus+246389.100.1.3 1581809388 installed
<13>Jun 13 14:54:48 rpmi: maven-doxia-module-markdown-0:1.7-alt1_10jpp8 sisyphus+230487.100.1.3 1559021328 installed
<13>Jun 13 14:54:48 rpmi: maven-doxia-module-apt-0:1.7-alt1_10jpp8 sisyphus+230487.100.1.3 1559021328 installed
<13>Jun 13 14:54:48 rpmi: maven-doxia-module-fml-0:1.7-alt1_10jpp8 sisyphus+230487.100.1.3 1559021328 installed
<13>Jun 13 14:54:48 rpmi: maven-doxia-module-xdoc-0:1.7-alt1_10jpp8 sisyphus+230487.100.1.3 1559021328 installed
<13>Jun 13 14:54:48 rpmi: maven-surefire-plugin-0:2.22.0-alt1_6jpp8 sisyphus+246401.100.1.3 1581813318 installed
<13>Jun 13 14:54:48 rpmi: maven-surefire-provider-junit-0:2.22.0-alt1_6jpp8 sisyphus+246401.100.1.3 1581813318 installed
<13>Jun 13 14:54:48 rpmi: maven-surefire-provider-testng-0:2.22.0-alt1_6jpp8 sisyphus+246401.100.1.3 1581813318 installed
<13>Jun 13 14:54:48 rpmi: maven-plugin-tools-annotations-0:3.5.1-alt1_7jpp8 sisyphus+246389.100.1.3 1581809388 installed
<13>Jun 13 14:54:48 rpmi: maven-plugin-tools-java-0:3.5.1-alt1_7jpp8 sisyphus+246389.100.1.3 1581809388 installed
<13>Jun 13 14:54:48 rpmi: maven-artifact-manager-1:2.2.1-alt6_61jpp8 sisyphus+230725.100.1.2 1559113327 installed
<13>Jun 13 14:54:48 rpmi: maven-enforcer-api-0:1.4.1-alt1_10jpp8 sisyphus+230489.100.1.3 1559022665 installed
<13>Jun 13 14:54:48 rpmi: maven-enforcer-rules-0:1.4.1-alt1_10jpp8 sisyphus+230489.100.1.3 1559022665 installed
<13>Jun 13 14:54:48 rpmi: maven-profile-1:2.2.1-alt6_61jpp8 sisyphus+230725.100.1.2 1559113327 installed
<13>Jun 13 14:54:48 rpmi: maven-settings-1:2.2.1-alt6_61jpp8 sisyphus+230725.100.1.2 1559113327 installed
<13>Jun 13 14:54:48 rpmi: alsa-ucm-conf-1.2.3-alt1 sisyphus+253139.200.1.1 1591812001 installed
<13>Jun 13 14:54:48 rpmi: alsa-topology-conf-1.2.3-alt1 sisyphus+253139.100.1.1 1591811985 installed
<13>Jun 13 14:54:48 rpmi: libalsa-1:1.2.3-alt1 sisyphus+253139.300.1.1 1591812064 installed
<13>Jun 13 14:54:48 rpmi: java-10-openjdk-0:10.0.2.13-alt1_7jpp9 sisyphus+234186.100.1.2 1562726544 installed
<13>Jun 13 14:54:48 rpmi: fop-0:2.2-alt1_4jpp8 sisyphus+232748.200.2.2 1561094573 installed
<13>Jun 13 14:54:48 rpmi: maven-doxia-module-fo-0:1.7-alt1_10jpp8 sisyphus+230487.100.1.3 1559021328 installed
<13>Jun 13 14:54:48 rpmi: maven-doxia-sitetools-0:1.7.5-alt1_4jpp8 sisyphus+230486.100.1.1 1558993278 installed
<13>Jun 13 14:54:48 rpmi: maven-javadoc-plugin-3.0.1-alt1_3jpp8 sisyphus+232632.200.1.1 1560946909 installed
<13>Jun 13 14:54:48 rpmi: maven-reporting-impl-3.0.0-alt1_7jpp8 sisyphus+246393.100.1.3 1581810132 installed
<13>Jun 13 14:54:48 rpmi: maven-plugin-plugin-0:3.5.1-alt1_7jpp8 sisyphus+246389.100.1.3 1581809388 installed
<13>Jun 13 14:54:48 rpmi: maven-local-1:5.3.0-alt1_4jpp8 sisyphus+234467.100.1.1 1563037789 installed
<13>Jun 13 14:54:49 rpmi: java-10-openjdk-devel-0:10.0.2.13-alt1_7jpp9 sisyphus+234186.100.1.2 1562726544 installed
<13>Jun 13 14:54:49 rpmi: maven-project-1:2.2.1-alt6_61jpp8 sisyphus+230725.100.1.2 1559113327 installed
<13>Jun 13 14:54:49 rpmi: maven-enforcer-plugin-0:1.4.1-alt1_10jpp8 sisyphus+230489.100.1.3 1559022665 installed
<13>Jun 13 14:54:49 rpmi: maven-shade-plugin-3.1.1-alt1_3jpp8 sisyphus+230144.100.1.1 1558808143 installed
<13>Jun 13 14:54:49 rpmi: maven-toolchain-1:2.2.1-alt6_61jpp8 sisyphus+230725.100.1.2 1559113327 installed
<13>Jun 13 14:54:49 rpmi: mojo-parent-0:40-alt1_10jpp8 sisyphus+246407.100.1.2 1581814643 installed
Building target platforms: i586
Building for target i586
Wrote: /usr/src/in/nosrpm/animal-sniffer-1.17-alt1.nosrc.rpm
Installing animal-sniffer-1.17-alt1.src.rpm
Building target platforms: i586
Building for target i586
Executing(%prep): /bin/sh -e /usr/src/tmp/rpm-tmp.49155
+ umask 022
+ /bin/mkdir -p /usr/src/RPM/BUILD
+ cd /usr/src/RPM/BUILD
+ cd /usr/src/RPM/BUILD
+ rm -rf animal-sniffer-1.17
+ echo 'Source #0 (animal-sniffer-1.17.tar):'
Source #0 (animal-sniffer-1.17.tar):
+ /bin/tar -xf /usr/src/RPM/SOURCES/animal-sniffer-1.17.tar
+ cd animal-sniffer-1.17
+ /bin/chmod -c -Rf u+rwX,go-w .
+ exit 0
Executing(%build): /bin/sh -e /usr/src/tmp/rpm-tmp.4610
+ umask 022
+ /bin/mkdir -p /usr/src/RPM/BUILD
+ cd /usr/src/RPM/BUILD
+ cd animal-sniffer-1.17
+ /usr/bin/python3 /usr/share/java-utils/mvn_build.py
Executing: xmvn --batch-mode --offline verify org.fedoraproject.xmvn:xmvn-mojo:install org.apache.maven.plugins:maven-javadoc-plugin:aggregate org.fedoraproject.xmvn:xmvn-mojo:builddep
['xmvn', '--batch-mode', '--offline', 'verify', 'org.fedoraproject.xmvn:xmvn-mojo:install', 'org.apache.maven.plugins:maven-javadoc-plugin:aggregate', 'org.fedoraproject.xmvn:xmvn-mojo:builddep']
[INFO] Scanning for projects...
[INFO] ------------------------------------------------------------------------
[INFO] Reactor Build Order:
[INFO] 
[INFO] Animal Sniffer                                                     [pom]
[INFO] Java boot classpath detector                                       [jar]
[INFO] Animal Sniffer Annotations                                         [jar]
[INFO] Animal Sniffer                                                     [jar]
[INFO] Animal Sniffer Maven Plugin                               [maven-plugin]
[INFO] Animal Sniffer Maven Enforcer Rule                                 [jar]
[INFO] Animal Sniffer Ant Tasks                                           [jar]
[INFO] 
[INFO] --------------< org.codehaus.mojo:animal-sniffer-parent >---------------
[INFO] Building Animal Sniffer 1.17                                       [1/7]
[INFO] --------------------------------[ pom ]---------------------------------
[INFO] 
[INFO] -----------< org.codehaus.mojo:java-boot-classpath-detector >-----------
[INFO] Building Java boot classpath detector 1.17                         [2/7]
[INFO] --------------------------------[ jar ]---------------------------------
[INFO] 
[INFO] --- maven-resources-plugin:3.1.0:resources (default-resources) @ java-boot-classpath-detector ---
[INFO] Using 'UTF-8' encoding to copy filtered resources.
[INFO] skip non existing resourceDirectory /usr/src/RPM/BUILD/animal-sniffer-1.17/java-boot-classpath-detector/src/main/resources
[INFO] 
[INFO] --- maven-compiler-plugin:3.8.0:compile (default-compile) @ java-boot-classpath-detector ---
[INFO] Changes detected - recompiling the module!
[INFO] Compiling 1 source file to /usr/src/RPM/BUILD/animal-sniffer-1.17/java-boot-classpath-detector/target/classes
[INFO] 
[INFO] --- maven-resources-plugin:3.1.0:testResources (default-testResources) @ java-boot-classpath-detector ---
[INFO] Using 'UTF-8' encoding to copy filtered resources.
[INFO] skip non existing resourceDirectory /usr/src/RPM/BUILD/animal-sniffer-1.17/java-boot-classpath-detector/src/test/resources
[INFO] 
[INFO] --- maven-compiler-plugin:3.8.0:testCompile (default-testCompile) @ java-boot-classpath-detector ---
[INFO] No sources to compile
[INFO] 
[INFO] --- maven-surefire-plugin:2.22.0:test (default-test) @ java-boot-classpath-detector ---
[INFO] No tests to run.
[INFO] 
[INFO] --- maven-jar-plugin:3.1.0:jar (default-jar) @ java-boot-classpath-detector ---
[INFO] Building jar: /usr/src/RPM/BUILD/animal-sniffer-1.17/java-boot-classpath-detector/target/java-boot-classpath-detector-1.17.jar
[INFO] 
[INFO] ------------< org.codehaus.mojo:animal-sniffer-annotations >------------
[INFO] Building Animal Sniffer Annotations 1.17                           [3/7]
[INFO] --------------------------------[ jar ]---------------------------------
[INFO] 
[INFO] --- maven-enforcer-plugin:1.4.1:enforce (enforce-java) @ animal-sniffer-annotations ---
[INFO] 
[INFO] --- maven-resources-plugin:3.1.0:resources (default-resources) @ animal-sniffer-annotations ---
[INFO] Using 'UTF-8' encoding to copy filtered resources.
[INFO] skip non existing resourceDirectory /usr/src/RPM/BUILD/animal-sniffer-1.17/animal-sniffer-annotations/src/main/resources
[INFO] 
[INFO] --- maven-compiler-plugin:3.8.0:compile (default-compile) @ animal-sniffer-annotations ---
[INFO] Changes detected - recompiling the module!
[INFO] Compiling 1 source file to /usr/src/RPM/BUILD/animal-sniffer-1.17/animal-sniffer-annotations/target/classes
[INFO] 
[INFO] --- maven-resources-plugin:3.1.0:testResources (default-testResources) @ animal-sniffer-annotations ---
[INFO] Using 'UTF-8' encoding to copy filtered resources.
[INFO] skip non existing resourceDirectory /usr/src/RPM/BUILD/animal-sniffer-1.17/animal-sniffer-annotations/src/test/resources
[INFO] 
[INFO] --- maven-compiler-plugin:3.8.0:testCompile (default-testCompile) @ animal-sniffer-annotations ---
[INFO] No sources to compile
[INFO] 
[INFO] --- maven-surefire-plugin:2.22.0:test (default-test) @ animal-sniffer-annotations ---
[INFO] No tests to run.
[INFO] 
[INFO] --- maven-jar-plugin:3.1.0:jar (default-jar) @ animal-sniffer-annotations ---
[INFO] Building jar: /usr/src/RPM/BUILD/animal-sniffer-1.17/animal-sniffer-annotations/target/animal-sniffer-annotations-1.17.jar
[INFO] 
[INFO] ------------------< org.codehaus.mojo:animal-sniffer >------------------
[INFO] Building Animal Sniffer 1.17                                       [4/7]
[INFO] --------------------------------[ jar ]---------------------------------
[INFO] 
[INFO] --- maven-resources-plugin:3.1.0:resources (default-resources) @ animal-sniffer ---
[INFO] Using 'UTF-8' encoding to copy filtered resources.
[INFO] skip non existing resourceDirectory /usr/src/RPM/BUILD/animal-sniffer-1.17/animal-sniffer/src/main/resources
[INFO] 
[INFO] --- maven-compiler-plugin:3.8.0:compile (default-compile) @ animal-sniffer ---
[INFO] Changes detected - recompiling the module!
[INFO] Compiling 10 source files to /usr/src/RPM/BUILD/animal-sniffer-1.17/animal-sniffer/target/classes
[INFO] 
[INFO] --- maven-resources-plugin:3.1.0:testResources (default-testResources) @ animal-sniffer ---
[INFO] Using 'UTF-8' encoding to copy filtered resources.
[INFO] skip non existing resourceDirectory /usr/src/RPM/BUILD/animal-sniffer-1.17/animal-sniffer/src/test/resources
[INFO] 
[INFO] --- maven-compiler-plugin:3.8.0:testCompile (default-testCompile) @ animal-sniffer ---
[INFO] Changes detected - recompiling the module!
[INFO] Compiling 1 source file to /usr/src/RPM/BUILD/animal-sniffer-1.17/animal-sniffer/target/test-classes
[INFO] 
[INFO] --- maven-surefire-plugin:2.22.0:test (default-test) @ animal-sniffer ---
[INFO] 
[INFO] -------------------------------------------------------
[INFO]  T E S T S
[INFO] -------------------------------------------------------
[INFO] Running org.codehaus.mojo.animal_sniffer.SignatureCheckerTest
[INFO] Tests run: 2, Failures: 0, Errors: 0, Skipped: 0, Time elapsed: 0.016 s - in org.codehaus.mojo.animal_sniffer.SignatureCheckerTest
[INFO] 
[INFO] Results:
[INFO] 
[INFO] Tests run: 2, Failures: 0, Errors: 0, Skipped: 0
[INFO] 
[INFO] 
[INFO] --- maven-jar-plugin:3.1.0:jar (default-jar) @ animal-sniffer ---
[INFO] Building jar: /usr/src/RPM/BUILD/animal-sniffer-1.17/animal-sniffer/target/animal-sniffer-1.17.jar
[INFO] 
[INFO] -----------< org.codehaus.mojo:animal-sniffer-maven-plugin >------------
[INFO] Building Animal Sniffer Maven Plugin 1.17                          [5/7]
[INFO] ----------------------------[ maven-plugin ]----------------------------
[INFO] 
[INFO] --- maven-plugin-plugin:3.5.1:helpmojo (help-mojo) @ animal-sniffer-maven-plugin ---
[INFO] Using 'UTF-8' encoding to read mojo source files.
[INFO] java-javadoc mojo extractor found 0 mojo descriptor.
[INFO] java-annotations mojo extractor found 0 mojo descriptor.
[INFO] 
[INFO] --- maven-plugin-plugin:3.5.1:helpmojo (help-goal) @ animal-sniffer-maven-plugin ---
[INFO] Using 'UTF-8' encoding to read mojo source files.
[INFO] java-javadoc mojo extractor found 0 mojo descriptor.
[INFO] java-annotations mojo extractor found 0 mojo descriptor.
[INFO] 
[INFO] --- maven-resources-plugin:3.1.0:resources (default-resources) @ animal-sniffer-maven-plugin ---
[INFO] Using 'UTF-8' encoding to copy filtered resources.
[INFO] Copying 1 resource
[INFO] 
[INFO] --- maven-compiler-plugin:3.8.0:compile (default-compile) @ animal-sniffer-maven-plugin ---
[INFO] Changes detected - recompiling the module!
[INFO] Compiling 7 source files to /usr/src/RPM/BUILD/animal-sniffer-1.17/animal-sniffer-maven-plugin/target/classes
[INFO] /usr/src/RPM/BUILD/animal-sniffer-1.17/animal-sniffer-maven-plugin/src/main/java/org/codehaus/mojo/animal_sniffer/maven/CheckSignatureMojo.java: Some input files use or override a deprecated API.
[INFO] /usr/src/RPM/BUILD/animal-sniffer-1.17/animal-sniffer-maven-plugin/src/main/java/org/codehaus/mojo/animal_sniffer/maven/CheckSignatureMojo.java: Recompile with -Xlint:deprecation for details.
[INFO] 
[INFO] --- maven-plugin-plugin:3.5.1:descriptor (default-descriptor) @ animal-sniffer-maven-plugin ---
[INFO] Using 'UTF-8' encoding to read mojo source files.
[INFO] java-javadoc mojo extractor found 0 mojo descriptor.
[INFO] java-annotations mojo extractor found 3 mojo descriptors.
[INFO] 
[INFO] --- maven-plugin-plugin:3.5.1:descriptor (mojo-descriptor) @ animal-sniffer-maven-plugin ---
[INFO] Using 'UTF-8' encoding to read mojo source files.
[INFO] java-javadoc mojo extractor found 0 mojo descriptor.
[INFO] java-annotations mojo extractor found 3 mojo descriptors.
[INFO] 
[INFO] --- maven-resources-plugin:3.1.0:testResources (default-testResources) @ animal-sniffer-maven-plugin ---
[INFO] Using 'UTF-8' encoding to copy filtered resources.
[INFO] skip non existing resourceDirectory /usr/src/RPM/BUILD/animal-sniffer-1.17/animal-sniffer-maven-plugin/src/test/resources
[INFO] 
[INFO] --- maven-compiler-plugin:3.8.0:testCompile (default-testCompile) @ animal-sniffer-maven-plugin ---
[INFO] No sources to compile
[INFO] 
[INFO] --- maven-surefire-plugin:2.22.0:test (default-test) @ animal-sniffer-maven-plugin ---
[INFO] No tests to run.
[INFO] 
[INFO] --- maven-jar-plugin:3.1.0:jar (default-jar) @ animal-sniffer-maven-plugin ---
[INFO] Building jar: /usr/src/RPM/BUILD/animal-sniffer-1.17/animal-sniffer-maven-plugin/target/animal-sniffer-maven-plugin-1.17.jar
[INFO] 
[INFO] --- maven-plugin-plugin:3.5.1:addPluginArtifactMetadata (default-addPluginArtifactMetadata) @ animal-sniffer-maven-plugin ---
[INFO] 
[INFO] -----------< org.codehaus.mojo:animal-sniffer-enforcer-rule >-----------
[INFO] Building Animal Sniffer Maven Enforcer Rule 1.17                   [6/7]
[INFO] --------------------------------[ jar ]---------------------------------
[INFO] 
[INFO] --- maven-resources-plugin:3.1.0:resources (default-resources) @ animal-sniffer-enforcer-rule ---
[INFO] Using 'UTF-8' encoding to copy filtered resources.
[INFO] skip non existing resourceDirectory /usr/src/RPM/BUILD/animal-sniffer-1.17/animal-sniffer-enforcer-rule/src/main/resources
[INFO] 
[INFO] --- maven-compiler-plugin:3.8.0:compile (default-compile) @ animal-sniffer-enforcer-rule ---
[INFO] Changes detected - recompiling the module!
[INFO] Compiling 3 source files to /usr/src/RPM/BUILD/animal-sniffer-1.17/animal-sniffer-enforcer-rule/target/classes
[INFO] /usr/src/RPM/BUILD/animal-sniffer-1.17/animal-sniffer-enforcer-rule/src/main/java/org/codehaus/mojo/animal_sniffer/enforcer/Signature.java: Some input files use or override a deprecated API.
[INFO] /usr/src/RPM/BUILD/animal-sniffer-1.17/animal-sniffer-enforcer-rule/src/main/java/org/codehaus/mojo/animal_sniffer/enforcer/Signature.java: Recompile with -Xlint:deprecation for details.
[INFO] /usr/src/RPM/BUILD/animal-sniffer-1.17/animal-sniffer-enforcer-rule/src/main/java/org/codehaus/mojo/animal_sniffer/enforcer/CheckSignatureRule.java: /usr/src/RPM/BUILD/animal-sniffer-1.17/animal-sniffer-enforcer-rule/src/main/java/org/codehaus/mojo/animal_sniffer/enforcer/CheckSignatureRule.java uses unchecked or unsafe operations.
[INFO] /usr/src/RPM/BUILD/animal-sniffer-1.17/animal-sniffer-enforcer-rule/src/main/java/org/codehaus/mojo/animal_sniffer/enforcer/CheckSignatureRule.java: Recompile with -Xlint:unchecked for details.
[INFO] 
[INFO] --- maven-resources-plugin:3.1.0:testResources (default-testResources) @ animal-sniffer-enforcer-rule ---
[INFO] Using 'UTF-8' encoding to copy filtered resources.
[INFO] skip non existing resourceDirectory /usr/src/RPM/BUILD/animal-sniffer-1.17/animal-sniffer-enforcer-rule/src/test/resources
[INFO] 
[INFO] --- maven-compiler-plugin:3.8.0:testCompile (default-testCompile) @ animal-sniffer-enforcer-rule ---
[INFO] No sources to compile
[INFO] 
[INFO] --- maven-surefire-plugin:2.22.0:test (default-test) @ animal-sniffer-enforcer-rule ---
[INFO] No tests to run.
[INFO] 
[INFO] --- maven-jar-plugin:3.1.0:jar (default-jar) @ animal-sniffer-enforcer-rule ---
[INFO] Building jar: /usr/src/RPM/BUILD/animal-sniffer-1.17/animal-sniffer-enforcer-rule/target/animal-sniffer-enforcer-rule-1.17.jar
[INFO] 
[INFO] -------------< org.codehaus.mojo:animal-sniffer-ant-tasks >-------------
[INFO] Building Animal Sniffer Ant Tasks 1.17                             [7/7]
[INFO] --------------------------------[ jar ]---------------------------------
[INFO] 
[INFO] --- maven-resources-plugin:3.1.0:resources (default-resources) @ animal-sniffer-ant-tasks ---
[INFO] Using 'UTF-8' encoding to copy filtered resources.
[INFO] Copying 1 resource
[INFO] 
[INFO] --- maven-compiler-plugin:3.8.0:compile (default-compile) @ animal-sniffer-ant-tasks ---
[INFO] Changes detected - recompiling the module!
[INFO] Compiling 6 source files to /usr/src/RPM/BUILD/animal-sniffer-1.17/animal-sniffer-ant-tasks/target/classes
[INFO] 
[INFO] --- maven-resources-plugin:3.1.0:testResources (default-testResources) @ animal-sniffer-ant-tasks ---
[INFO] Using 'UTF-8' encoding to copy filtered resources.
[INFO] skip non existing resourceDirectory /usr/src/RPM/BUILD/animal-sniffer-1.17/animal-sniffer-ant-tasks/src/test/resources
[INFO] 
[INFO] --- maven-compiler-plugin:3.8.0:testCompile (default-testCompile) @ animal-sniffer-ant-tasks ---
[INFO] No sources to compile
[INFO] 
[INFO] --- maven-surefire-plugin:2.22.0:test (default-test) @ animal-sniffer-ant-tasks ---
[INFO] No tests to run.
[INFO] 
[INFO] --- maven-jar-plugin:3.1.0:jar (default-jar) @ animal-sniffer-ant-tasks ---
[INFO] Building jar: /usr/src/RPM/BUILD/animal-sniffer-1.17/animal-sniffer-ant-tasks/target/animal-sniffer-ant-tasks-1.17.jar
[INFO] 
[INFO] --- maven-shade-plugin:3.1.1:shade (default) @ animal-sniffer-ant-tasks ---
[INFO] Including org.codehaus.mojo:animal-sniffer:jar:1.17 in the shaded jar.
[INFO] Including org.ow2.asm:asm:jar:6.2 in the shaded jar.
[WARNING] Discovered module-info.class. Shading will break its strong encapsulation.
[INFO] Replacing original artifact with shaded artifact.
[INFO] Replacing /usr/src/RPM/BUILD/animal-sniffer-1.17/animal-sniffer-ant-tasks/target/animal-sniffer-ant-tasks-1.17.jar with /usr/src/RPM/BUILD/animal-sniffer-1.17/animal-sniffer-ant-tasks/target/animal-sniffer-ant-tasks-1.17-shaded.jar
[INFO] 
[INFO] --------------< org.codehaus.mojo:animal-sniffer-parent >---------------
[INFO] Building Animal Sniffer 1.17                                       [8/7]
[INFO] --------------------------------[ pom ]---------------------------------
[INFO] 
[INFO] --- xmvn-mojo:3.0.0:install (default-cli) @ animal-sniffer-parent ---
[INFO] 
[INFO] >>> maven-javadoc-plugin:3.0.1:aggregate (default-cli) > compile @ animal-sniffer-parent >>>
[INFO] 
[INFO] >>>>>>>>>>>>>>>>>>>>>>>>>>>>>>>>>>>>>>>>>>>>>>>>>>>>>>>>>>>>>>>>>>>>>>>>
[INFO] Forking Java boot classpath detector 1.17
[INFO] >>>>>>>>>>>>>>>>>>>>>>>>>>>>>>>>>>>>>>>>>>>>>>>>>>>>>>>>>>>>>>>>>>>>>>>>
[INFO] 
[INFO] --- maven-resources-plugin:3.1.0:resources (default-resources) @ java-boot-classpath-detector ---
[INFO] Using 'UTF-8' encoding to copy filtered resources.
[INFO] skip non existing resourceDirectory /usr/src/RPM/BUILD/animal-sniffer-1.17/java-boot-classpath-detector/src/main/resources
[INFO] 
[INFO] --- maven-compiler-plugin:3.8.0:compile (default-compile) @ java-boot-classpath-detector ---
[INFO] Nothing to compile - all classes are up to date
[INFO] 
[INFO] >>>>>>>>>>>>>>>>>>>>>>>>>>>>>>>>>>>>>>>>>>>>>>>>>>>>>>>>>>>>>>>>>>>>>>>>
[INFO] Forking Animal Sniffer Annotations 1.17
[INFO] >>>>>>>>>>>>>>>>>>>>>>>>>>>>>>>>>>>>>>>>>>>>>>>>>>>>>>>>>>>>>>>>>>>>>>>>
[INFO] 
[INFO] --- maven-enforcer-plugin:1.4.1:enforce (enforce-java) @ animal-sniffer-annotations ---
[INFO] 
[INFO] --- maven-resources-plugin:3.1.0:resources (default-resources) @ animal-sniffer-annotations ---
[INFO] Using 'UTF-8' encoding to copy filtered resources.
[INFO] skip non existing resourceDirectory /usr/src/RPM/BUILD/animal-sniffer-1.17/animal-sniffer-annotations/src/main/resources
[INFO] 
[INFO] --- maven-compiler-plugin:3.8.0:compile (default-compile) @ animal-sniffer-annotations ---
[INFO] Nothing to compile - all classes are up to date
[INFO] 
[INFO] >>>>>>>>>>>>>>>>>>>>>>>>>>>>>>>>>>>>>>>>>>>>>>>>>>>>>>>>>>>>>>>>>>>>>>>>
[INFO] Forking Animal Sniffer 1.17
[INFO] >>>>>>>>>>>>>>>>>>>>>>>>>>>>>>>>>>>>>>>>>>>>>>>>>>>>>>>>>>>>>>>>>>>>>>>>
[INFO] 
[INFO] --- maven-resources-plugin:3.1.0:resources (default-resources) @ animal-sniffer ---
[INFO] Using 'UTF-8' encoding to copy filtered resources.
[INFO] skip non existing resourceDirectory /usr/src/RPM/BUILD/animal-sniffer-1.17/animal-sniffer/src/main/resources
[INFO] 
[INFO] --- maven-compiler-plugin:3.8.0:compile (default-compile) @ animal-sniffer ---
[INFO] Nothing to compile - all classes are up to date
[INFO] 
[INFO] >>>>>>>>>>>>>>>>>>>>>>>>>>>>>>>>>>>>>>>>>>>>>>>>>>>>>>>>>>>>>>>>>>>>>>>>
[INFO] Forking Animal Sniffer Maven Plugin 1.17
[INFO] >>>>>>>>>>>>>>>>>>>>>>>>>>>>>>>>>>>>>>>>>>>>>>>>>>>>>>>>>>>>>>>>>>>>>>>>
[INFO] 
[INFO] --- maven-plugin-plugin:3.5.1:helpmojo (help-mojo) @ animal-sniffer-maven-plugin ---
[INFO] Using 'UTF-8' encoding to read mojo source files.
[INFO] java-javadoc mojo extractor found 0 mojo descriptor.
[INFO] java-annotations mojo extractor found 3 mojo descriptors.
[INFO] 
[INFO] --- maven-plugin-plugin:3.5.1:helpmojo (help-goal) @ animal-sniffer-maven-plugin ---
[INFO] Using 'UTF-8' encoding to read mojo source files.
[INFO] java-javadoc mojo extractor found 0 mojo descriptor.
[INFO] java-annotations mojo extractor found 3 mojo descriptors.
[INFO] 
[INFO] --- maven-resources-plugin:3.1.0:resources (default-resources) @ animal-sniffer-maven-plugin ---
[INFO] Using 'UTF-8' encoding to copy filtered resources.
[INFO] Copying 1 resource
[INFO] 
[INFO] --- maven-compiler-plugin:3.8.0:compile (default-compile) @ animal-sniffer-maven-plugin ---
[INFO] Changes detected - recompiling the module!
[INFO] Compiling 7 source files to /usr/src/RPM/BUILD/animal-sniffer-1.17/animal-sniffer-maven-plugin/target/classes
[INFO] /usr/src/RPM/BUILD/animal-sniffer-1.17/animal-sniffer-maven-plugin/src/main/java/org/codehaus/mojo/animal_sniffer/maven/CheckSignatureMojo.java: Some input files use or override a deprecated API.
[INFO] /usr/src/RPM/BUILD/animal-sniffer-1.17/animal-sniffer-maven-plugin/src/main/java/org/codehaus/mojo/animal_sniffer/maven/CheckSignatureMojo.java: Recompile with -Xlint:deprecation for details.
[INFO] 
[INFO] >>>>>>>>>>>>>>>>>>>>>>>>>>>>>>>>>>>>>>>>>>>>>>>>>>>>>>>>>>>>>>>>>>>>>>>>
[INFO] Forking Animal Sniffer Maven Enforcer Rule 1.17
[INFO] >>>>>>>>>>>>>>>>>>>>>>>>>>>>>>>>>>>>>>>>>>>>>>>>>>>>>>>>>>>>>>>>>>>>>>>>
[INFO] 
[INFO] --- maven-resources-plugin:3.1.0:resources (default-resources) @ animal-sniffer-enforcer-rule ---
[INFO] Using 'UTF-8' encoding to copy filtered resources.
[INFO] skip non existing resourceDirectory /usr/src/RPM/BUILD/animal-sniffer-1.17/animal-sniffer-enforcer-rule/src/main/resources
[INFO] 
[INFO] --- maven-compiler-plugin:3.8.0:compile (default-compile) @ animal-sniffer-enforcer-rule ---
[INFO] Nothing to compile - all classes are up to date
[INFO] 
[INFO] >>>>>>>>>>>>>>>>>>>>>>>>>>>>>>>>>>>>>>>>>>>>>>>>>>>>>>>>>>>>>>>>>>>>>>>>
[INFO] Forking Animal Sniffer Ant Tasks 1.17
[INFO] >>>>>>>>>>>>>>>>>>>>>>>>>>>>>>>>>>>>>>>>>>>>>>>>>>>>>>>>>>>>>>>>>>>>>>>>
[INFO] 
[INFO] --- maven-resources-plugin:3.1.0:resources (default-resources) @ animal-sniffer-ant-tasks ---
[INFO] Using 'UTF-8' encoding to copy filtered resources.
[INFO] Copying 1 resource
[INFO] 
[INFO] --- maven-compiler-plugin:3.8.0:compile (default-compile) @ animal-sniffer-ant-tasks ---
[INFO] Nothing to compile - all classes are up to date
[INFO] 
[INFO] <<< maven-javadoc-plugin:3.0.1:aggregate (default-cli) < compile @ animal-sniffer-parent <<<
[INFO] 
[INFO] 
[INFO] --- maven-javadoc-plugin:3.0.1:aggregate (default-cli) @ animal-sniffer-parent ---
[ERROR] no module descriptor for org.codehaus.mojo:animal-sniffer-parent
[ERROR] no module descriptor for org.codehaus.mojo:java-boot-classpath-detector
[ERROR] no module descriptor for org.codehaus.mojo:animal-sniffer-annotations
[ERROR] no module descriptor for org.codehaus.mojo:animal-sniffer
[ERROR] no module descriptor for org.codehaus.mojo:animal-sniffer-maven-plugin
[ERROR] no module descriptor for org.codehaus.mojo:animal-sniffer-enforcer-rule
[ERROR] no module descriptor for org.codehaus.mojo:animal-sniffer-ant-tasks
[INFO] 
Loading source files for package org.codehaus.mojo.animal_sniffer.jbcpd...
Loading source files for package org.codehaus.mojo.animal_sniffer...
Loading source files for package org.codehaus.mojo.animal_sniffer.logging...
Loading source files for package org.codehaus.mojo.animal_sniffer.maven...
Loading source files for package org.codehaus.mojo.animal_sniffer.enforcer...
Loading source files for package org.codehaus.mojo.animal_sniffer.ant...
Constructing Javadoc information...
Standard Doclet version 10.0.2
Building tree for all the packages and classes...
Generating /usr/src/RPM/BUILD/animal-sniffer-1.17/target/site/apidocs/org/codehaus/mojo/animal_sniffer/ClassFileVisitor.html...
Generating /usr/src/RPM/BUILD/animal-sniffer-1.17/target/site/apidocs/org/codehaus/mojo/animal_sniffer/ClassListBuilder.html...
Generating /usr/src/RPM/BUILD/animal-sniffer-1.17/target/site/apidocs/org/codehaus/mojo/animal_sniffer/Clazz.html...
Generating /usr/src/RPM/BUILD/animal-sniffer-1.17/target/site/apidocs/org/codehaus/mojo/animal_sniffer/IgnoreJRERequirement.html...
Generating /usr/src/RPM/BUILD/animal-sniffer-1.17/target/site/apidocs/org/codehaus/mojo/animal_sniffer/Main.html...
Generating /usr/src/RPM/BUILD/animal-sniffer-1.17/target/site/apidocs/org/codehaus/mojo/animal_sniffer/RegexUtils.html...
Generating /usr/src/RPM/BUILD/animal-sniffer-1.17/target/site/apidocs/org/codehaus/mojo/animal_sniffer/SignatureBuilder.html...
Generating /usr/src/RPM/BUILD/animal-sniffer-1.17/target/site/apidocs/org/codehaus/mojo/animal_sniffer/SignatureChecker.html...
Generating /usr/src/RPM/BUILD/animal-sniffer-1.17/target/site/apidocs/org/codehaus/mojo/animal_sniffer/SignatureMerger.html...
Generating /usr/src/RPM/BUILD/animal-sniffer-1.17/target/site/apidocs/org/codehaus/mojo/animal_sniffer/ant/Annotation.html...
Generating /usr/src/RPM/BUILD/animal-sniffer-1.17/target/site/apidocs/org/codehaus/mojo/animal_sniffer/ant/AntLogger.html...
Generating /usr/src/RPM/BUILD/animal-sniffer-1.17/target/site/apidocs/org/codehaus/mojo/animal_sniffer/ant/BuildSignaturesTask.html...
Generating /usr/src/RPM/BUILD/animal-sniffer-1.17/target/site/apidocs/org/codehaus/mojo/animal_sniffer/ant/CheckSignatureTask.html...
Generating /usr/src/RPM/BUILD/animal-sniffer-1.17/target/site/apidocs/org/codehaus/mojo/animal_sniffer/ant/Ignore.html...
Generating /usr/src/RPM/BUILD/animal-sniffer-1.17/target/site/apidocs/org/codehaus/mojo/animal_sniffer/ant/Signature.html...
Generating /usr/src/RPM/BUILD/animal-sniffer-1.17/target/site/apidocs/org/codehaus/mojo/animal_sniffer/enforcer/CheckSignatureRule.html...
Generating /usr/src/RPM/BUILD/animal-sniffer-1.17/target/site/apidocs/org/codehaus/mojo/animal_sniffer/enforcer/MavenLogger.html...
Generating /usr/src/RPM/BUILD/animal-sniffer-1.17/target/site/apidocs/org/codehaus/mojo/animal_sniffer/enforcer/Signature.html...
Generating /usr/src/RPM/BUILD/animal-sniffer-1.17/target/site/apidocs/org/codehaus/mojo/animal_sniffer/jbcpd/ShowClassPath.html...
Generating /usr/src/RPM/BUILD/animal-sniffer-1.17/target/site/apidocs/org/codehaus/mojo/animal_sniffer/logging/Logger.html...
Generating /usr/src/RPM/BUILD/animal-sniffer-1.17/target/site/apidocs/org/codehaus/mojo/animal_sniffer/logging/PrintWriterLogger.html...
Generating /usr/src/RPM/BUILD/animal-sniffer-1.17/target/site/apidocs/org/codehaus/mojo/animal_sniffer/maven/BuildSignaturesMojo.html...
Generating /usr/src/RPM/BUILD/animal-sniffer-1.17/target/site/apidocs/org/codehaus/mojo/animal_sniffer/maven/CheckSignatureMojo.html...
Generating /usr/src/RPM/BUILD/animal-sniffer-1.17/target/site/apidocs/org/codehaus/mojo/animal_sniffer/maven/HelpMojo.html...
Generating /usr/src/RPM/BUILD/animal-sniffer-1.17/target/site/apidocs/org/codehaus/mojo/animal_sniffer/maven/JdkToolchain.html...
Generating /usr/src/RPM/BUILD/animal-sniffer-1.17/target/site/apidocs/org/codehaus/mojo/animal_sniffer/maven/JdkToolchainConverter.html...
Generating /usr/src/RPM/BUILD/animal-sniffer-1.17/target/site/apidocs/org/codehaus/mojo/animal_sniffer/maven/MavenLogger.html...
Generating /usr/src/RPM/BUILD/animal-sniffer-1.17/target/site/apidocs/org/codehaus/mojo/animal_sniffer/maven/Signature.html...
Generating /usr/src/RPM/BUILD/animal-sniffer-1.17/target/site/apidocs/overview-frame.html...
Generating /usr/src/RPM/BUILD/animal-sniffer-1.17/target/site/apidocs/org/codehaus/mojo/animal_sniffer/package-frame.html...
Generating /usr/src/RPM/BUILD/animal-sniffer-1.17/target/site/apidocs/org/codehaus/mojo/animal_sniffer/package-summary.html...
Generating /usr/src/RPM/BUILD/animal-sniffer-1.17/target/site/apidocs/org/codehaus/mojo/animal_sniffer/package-tree.html...
Generating /usr/src/RPM/BUILD/animal-sniffer-1.17/target/site/apidocs/org/codehaus/mojo/animal_sniffer/ant/package-frame.html...
Generating /usr/src/RPM/BUILD/animal-sniffer-1.17/target/site/apidocs/org/codehaus/mojo/animal_sniffer/ant/package-summary.html...
Generating /usr/src/RPM/BUILD/animal-sniffer-1.17/target/site/apidocs/org/codehaus/mojo/animal_sniffer/ant/package-tree.html...
Generating /usr/src/RPM/BUILD/animal-sniffer-1.17/target/site/apidocs/org/codehaus/mojo/animal_sniffer/enforcer/package-frame.html...
Generating /usr/src/RPM/BUILD/animal-sniffer-1.17/target/site/apidocs/org/codehaus/mojo/animal_sniffer/enforcer/package-summary.html...
Generating /usr/src/RPM/BUILD/animal-sniffer-1.17/target/site/apidocs/org/codehaus/mojo/animal_sniffer/enforcer/package-tree.html...
Generating /usr/src/RPM/BUILD/animal-sniffer-1.17/target/site/apidocs/org/codehaus/mojo/animal_sniffer/jbcpd/package-frame.html...
Generating /usr/src/RPM/BUILD/animal-sniffer-1.17/target/site/apidocs/org/codehaus/mojo/animal_sniffer/jbcpd/package-summary.html...
Generating /usr/src/RPM/BUILD/animal-sniffer-1.17/target/site/apidocs/org/codehaus/mojo/animal_sniffer/jbcpd/package-tree.html...
Generating /usr/src/RPM/BUILD/animal-sniffer-1.17/target/site/apidocs/org/codehaus/mojo/animal_sniffer/logging/package-frame.html...
Generating /usr/src/RPM/BUILD/animal-sniffer-1.17/target/site/apidocs/org/codehaus/mojo/animal_sniffer/logging/package-summary.html...
Generating /usr/src/RPM/BUILD/animal-sniffer-1.17/target/site/apidocs/org/codehaus/mojo/animal_sniffer/logging/package-tree.html...
Generating /usr/src/RPM/BUILD/animal-sniffer-1.17/target/site/apidocs/org/codehaus/mojo/animal_sniffer/maven/package-frame.html...
Generating /usr/src/RPM/BUILD/animal-sniffer-1.17/target/site/apidocs/org/codehaus/mojo/animal_sniffer/maven/package-summary.html...
Generating /usr/src/RPM/BUILD/animal-sniffer-1.17/target/site/apidocs/org/codehaus/mojo/animal_sniffer/maven/package-tree.html...
Generating /usr/src/RPM/BUILD/animal-sniffer-1.17/target/site/apidocs/constant-values.html...
Generating /usr/src/RPM/BUILD/animal-sniffer-1.17/target/site/apidocs/serialized-form.html...
Generating /usr/src/RPM/BUILD/animal-sniffer-1.17/target/site/apidocs/org/codehaus/mojo/animal_sniffer/jbcpd/class-use/ShowClassPath.html...
Generating /usr/src/RPM/BUILD/animal-sniffer-1.17/target/site/apidocs/org/codehaus/mojo/animal_sniffer/class-use/ClassListBuilder.html...
Generating /usr/src/RPM/BUILD/animal-sniffer-1.17/target/site/apidocs/org/codehaus/mojo/animal_sniffer/class-use/ClassFileVisitor.html...
Generating /usr/src/RPM/BUILD/animal-sniffer-1.17/target/site/apidocs/org/codehaus/mojo/animal_sniffer/class-use/SignatureChecker.html...
Generating /usr/src/RPM/BUILD/animal-sniffer-1.17/target/site/apidocs/org/codehaus/mojo/animal_sniffer/class-use/Clazz.html...
Generating /usr/src/RPM/BUILD/animal-sniffer-1.17/target/site/apidocs/org/codehaus/mojo/animal_sniffer/class-use/RegexUtils.html...
Generating /usr/src/RPM/BUILD/animal-sniffer-1.17/target/site/apidocs/org/codehaus/mojo/animal_sniffer/class-use/Main.html...
Generating /usr/src/RPM/BUILD/animal-sniffer-1.17/target/site/apidocs/org/codehaus/mojo/animal_sniffer/class-use/SignatureMerger.html...
Generating /usr/src/RPM/BUILD/animal-sniffer-1.17/target/site/apidocs/org/codehaus/mojo/animal_sniffer/class-use/SignatureBuilder.html...
Generating /usr/src/RPM/BUILD/animal-sniffer-1.17/target/site/apidocs/org/codehaus/mojo/animal_sniffer/class-use/IgnoreJRERequirement.html...
Generating /usr/src/RPM/BUILD/animal-sniffer-1.17/target/site/apidocs/org/codehaus/mojo/animal_sniffer/logging/class-use/Logger.html...
Generating /usr/src/RPM/BUILD/animal-sniffer-1.17/target/site/apidocs/org/codehaus/mojo/animal_sniffer/logging/class-use/PrintWriterLogger.html...
Generating /usr/src/RPM/BUILD/animal-sniffer-1.17/target/site/apidocs/org/codehaus/mojo/animal_sniffer/maven/class-use/HelpMojo.html...
Generating /usr/src/RPM/BUILD/animal-sniffer-1.17/target/site/apidocs/org/codehaus/mojo/animal_sniffer/maven/class-use/CheckSignatureMojo.html...
Generating /usr/src/RPM/BUILD/animal-sniffer-1.17/target/site/apidocs/org/codehaus/mojo/animal_sniffer/maven/class-use/Signature.html...
Generating /usr/src/RPM/BUILD/animal-sniffer-1.17/target/site/apidocs/org/codehaus/mojo/animal_sniffer/maven/class-use/BuildSignaturesMojo.html...
Generating /usr/src/RPM/BUILD/animal-sniffer-1.17/target/site/apidocs/org/codehaus/mojo/animal_sniffer/maven/class-use/JdkToolchain.html...
Generating /usr/src/RPM/BUILD/animal-sniffer-1.17/target/site/apidocs/org/codehaus/mojo/animal_sniffer/maven/class-use/MavenLogger.html...
Generating /usr/src/RPM/BUILD/animal-sniffer-1.17/target/site/apidocs/org/codehaus/mojo/animal_sniffer/maven/class-use/JdkToolchainConverter.html...
Generating /usr/src/RPM/BUILD/animal-sniffer-1.17/target/site/apidocs/org/codehaus/mojo/animal_sniffer/enforcer/class-use/Signature.html...
Generating /usr/src/RPM/BUILD/animal-sniffer-1.17/target/site/apidocs/org/codehaus/mojo/animal_sniffer/enforcer/class-use/MavenLogger.html...
Generating /usr/src/RPM/BUILD/animal-sniffer-1.17/target/site/apidocs/org/codehaus/mojo/animal_sniffer/enforcer/class-use/CheckSignatureRule.html...
Generating /usr/src/RPM/BUILD/animal-sniffer-1.17/target/site/apidocs/org/codehaus/mojo/animal_sniffer/ant/class-use/Annotation.html...
Generating /usr/src/RPM/BUILD/animal-sniffer-1.17/target/site/apidocs/org/codehaus/mojo/animal_sniffer/ant/class-use/AntLogger.html...
Generating /usr/src/RPM/BUILD/animal-sniffer-1.17/target/site/apidocs/org/codehaus/mojo/animal_sniffer/ant/class-use/CheckSignatureTask.html...
Generating /usr/src/RPM/BUILD/animal-sniffer-1.17/target/site/apidocs/org/codehaus/mojo/animal_sniffer/ant/class-use/Ignore.html...
Generating /usr/src/RPM/BUILD/animal-sniffer-1.17/target/site/apidocs/org/codehaus/mojo/animal_sniffer/ant/class-use/Signature.html...
Generating /usr/src/RPM/BUILD/animal-sniffer-1.17/target/site/apidocs/org/codehaus/mojo/animal_sniffer/ant/class-use/BuildSignaturesTask.html...
Generating /usr/src/RPM/BUILD/animal-sniffer-1.17/target/site/apidocs/org/codehaus/mojo/animal_sniffer/package-use.html...
Generating /usr/src/RPM/BUILD/animal-sniffer-1.17/target/site/apidocs/org/codehaus/mojo/animal_sniffer/ant/package-use.html...
Generating /usr/src/RPM/BUILD/animal-sniffer-1.17/target/site/apidocs/org/codehaus/mojo/animal_sniffer/enforcer/package-use.html...
Generating /usr/src/RPM/BUILD/animal-sniffer-1.17/target/site/apidocs/org/codehaus/mojo/animal_sniffer/jbcpd/package-use.html...
Generating /usr/src/RPM/BUILD/animal-sniffer-1.17/target/site/apidocs/org/codehaus/mojo/animal_sniffer/logging/package-use.html...
Generating /usr/src/RPM/BUILD/animal-sniffer-1.17/target/site/apidocs/org/codehaus/mojo/animal_sniffer/maven/package-use.html...
Building index for all the packages and classes...
Generating /usr/src/RPM/BUILD/animal-sniffer-1.17/target/site/apidocs/overview-tree.html...
Generating /usr/src/RPM/BUILD/animal-sniffer-1.17/target/site/apidocs/index-all.html...
Generating /usr/src/RPM/BUILD/animal-sniffer-1.17/target/site/apidocs/deprecated-list.html...
Building index for all classes...
Generating /usr/src/RPM/BUILD/animal-sniffer-1.17/target/site/apidocs/allclasses-frame.html...
Generating /usr/src/RPM/BUILD/animal-sniffer-1.17/target/site/apidocs/allclasses-frame.html...
Generating /usr/src/RPM/BUILD/animal-sniffer-1.17/target/site/apidocs/allclasses-noframe.html...
Generating /usr/src/RPM/BUILD/animal-sniffer-1.17/target/site/apidocs/allclasses-noframe.html...
Generating /usr/src/RPM/BUILD/animal-sniffer-1.17/target/site/apidocs/index.html...
Generating /usr/src/RPM/BUILD/animal-sniffer-1.17/target/site/apidocs/overview-summary.html...
Generating /usr/src/RPM/BUILD/animal-sniffer-1.17/target/site/apidocs/help-doc.html...
1 warning
[WARNING] Javadoc Warnings
[WARNING] javadoc: warning - You have not specified the version of HTML to use.
[WARNING] The default is currently HTML 4.01, but this will change to HTML5
[WARNING] in a future release. To suppress this warning, please specify the
[WARNING] version of HTML used in your documentation comments and to be
[WARNING] generated by this doclet, using the -html4 or -html5 options.
[INFO] 
[INFO] --- xmvn-mojo:3.0.0:builddep (default-cli) @ animal-sniffer-parent ---
[INFO] ------------------------------------------------------------------------
[INFO] Reactor Summary:
[INFO] 
[INFO] Animal Sniffer 1.17 ................................ SUCCESS [  7.231 s]
[INFO] Java boot classpath detector ....................... SUCCESS [  2.337 s]
[INFO] Animal Sniffer Annotations ......................... SUCCESS [  0.493 s]
[INFO] Animal Sniffer ..................................... SUCCESS [ 11.958 s]
[INFO] Animal Sniffer Maven Plugin ........................ SUCCESS [  3.303 s]
[INFO] Animal Sniffer Maven Enforcer Rule ................. SUCCESS [  0.295 s]
[INFO] Animal Sniffer Ant Tasks 1.17 ...................... SUCCESS [  0.929 s]
[INFO] ------------------------------------------------------------------------
[INFO] BUILD SUCCESS
[INFO] ------------------------------------------------------------------------
[INFO] Total time: 27.734 s
[INFO] Finished at: 2020-06-13T14:55:37Z
[INFO] ------------------------------------------------------------------------
-----BEGIN MAVEN BUILD DEPENDENCIES-----
H4sIAAAAAAACA71WTVPCMBC9+ysi97SC11pHPXHwxDjjdU2WEibdzaQpwr83hfKh4xSEynF338x7
+5HXZo/L0ooF+sowPQyGyd1AICnWhoqHwdtEPk1exuPBY36T3UopnmtjtdDokHSEGaxEgYQeAmrx
sRLvrwsSUkb0ISa/EWKfWDVhTBSeazfWOfsiiYQ4g7pKSp5zlm5LGyD4YKagQkw0ZenAI4UsPchv
gLgMSE0jueMyS/dhw59+F9CtBxyoGSYlLJC65DR16WxdGJLgzE9NfyPlz1ECVdnBt65eQnHYV7LR
XR3tD2nKXqFvG71MwW7TzuKy7iLfAKRiCmDijUmNU6htOJ9/XpMJHYxt/eoDbg+oj/H+6XAVe7wi
nfM8RxWuyLhN/OIVreXlo2SUDLN0G/6vnsBs1Qx6WrLisuTO82oR0gIV9z0edjWLFqxPuK+GfrcF
OTU2xDlf2UDqYGzV+6te7/Lkpw1EHCCY9bp6U7I15g4VO++++Ot0lrPFQ9HYp7EBdRk40BF3OYia
/5IvFbHtpv4IAAA=
-----END MAVEN BUILD DEPENDENCIES-----
+ exit 0
Executing(%install): /bin/sh -e /usr/src/tmp/rpm-tmp.93965
+ umask 022
+ /bin/mkdir -p /usr/src/RPM/BUILD
+ cd /usr/src/RPM/BUILD
+ /bin/chmod -Rf u+rwX -- /usr/src/tmp/animal-sniffer-buildroot
+ :
+ /bin/rm -rf -- /usr/src/tmp/animal-sniffer-buildroot
+ cd animal-sniffer-1.17
+ xmvn-install -R .xmvn-reactor -n animal-sniffer -d /usr/src/tmp/animal-sniffer-buildroot
[INFO] Installing artifact org.codehaus.mojo:animal-sniffer-parent:pom:1.17
[INFO] Installing artifact org.codehaus.mojo:java-boot-classpath-detector:jar:1.17
[INFO] Installing artifact org.codehaus.mojo:java-boot-classpath-detector:pom:1.17
[INFO] Installing artifact org.codehaus.mojo:animal-sniffer-annotations:jar:1.17
[INFO] Installing artifact org.codehaus.mojo:animal-sniffer-annotations:pom:1.17
[INFO] Installing artifact org.codehaus.mojo:animal-sniffer:jar:1.17
[INFO] Installing artifact org.codehaus.mojo:animal-sniffer:pom:1.17
[INFO] Installing artifact org.codehaus.mojo:animal-sniffer-maven-plugin:jar:1.17
[INFO] Installing artifact org.codehaus.mojo:animal-sniffer-maven-plugin:pom:1.17
[INFO] Installing artifact org.codehaus.mojo:animal-sniffer-enforcer-rule:jar:1.17
[INFO] Installing artifact org.codehaus.mojo:animal-sniffer-enforcer-rule:pom:1.17
[INFO] Installing artifact org.codehaus.mojo:animal-sniffer-ant-tasks:jar:1.17
[INFO] Installing artifact org.codehaus.mojo:animal-sniffer-ant-tasks:pom:1.17
[INFO] Installation successful
+ jdir=target/site/apidocs
+ '[' -d .xmvn/apidocs ']'
+ jdir=.xmvn/apidocs
+ /bin/mkdir -p /usr/src/tmp/animal-sniffer-buildroot/usr/share/license
+ '[' -d .xmvn/apidocs ']'
+ install -dm755 /usr/src/tmp/animal-sniffer-buildroot/usr/share/javadoc/animal-sniffer
+ cp -pr .xmvn/apidocs/allclasses-frame.html .xmvn/apidocs/allclasses-noframe.html .xmvn/apidocs/constant-values.html .xmvn/apidocs/deprecated-list.html .xmvn/apidocs/element-list .xmvn/apidocs/help-doc.html .xmvn/apidocs/index-all.html .xmvn/apidocs/index.html .xmvn/apidocs/jquery .xmvn/apidocs/member-search-index.js .xmvn/apidocs/member-search-index.zip .xmvn/apidocs/org .xmvn/apidocs/overview-frame.html .xmvn/apidocs/overview-summary.html .xmvn/apidocs/overview-tree.html .xmvn/apidocs/package-search-index.js .xmvn/apidocs/package-search-index.zip .xmvn/apidocs/resources .xmvn/apidocs/script.js .xmvn/apidocs/search.js .xmvn/apidocs/serialized-form.html .xmvn/apidocs/stylesheet.css .xmvn/apidocs/type-search-index.js .xmvn/apidocs/type-search-index.zip /usr/src/tmp/animal-sniffer-buildroot/usr/share/javadoc/animal-sniffer
+ echo /usr/share/javadoc/animal-sniffer
+ install -Dpm 644 pom.xml /usr/src/tmp/animal-sniffer-buildroot/usr/share/maven-poms/JPP-animal-sniffer.pom
+ /usr/lib/rpm/brp-alt
Cleaning files in /usr/src/tmp/animal-sniffer-buildroot (auto)
Verifying and fixing files in /usr/src/tmp/animal-sniffer-buildroot (binconfig,pkgconfig,libtool,desktop)
Checking contents of files in /usr/src/tmp/animal-sniffer-buildroot/ (default)
Compressing files in /usr/src/tmp/animal-sniffer-buildroot (auto)
Verifying ELF objects in /usr/src/tmp/animal-sniffer-buildroot (arch=normal,fhs=normal,lfs=relaxed,lint=relaxed,rpath=normal,stack=normal,textrel=normal,unresolved=normal)
Hardlinking identical .pyc and .pyo files
Processing files: animal-sniffer-1.17-alt1
Executing(%doc): /bin/sh -e /usr/src/tmp/rpm-tmp.42869
+ umask 022
+ /bin/mkdir -p /usr/src/RPM/BUILD
+ cd /usr/src/RPM/BUILD
+ cd animal-sniffer-1.17
+ DOCDIR=/usr/src/tmp/animal-sniffer-buildroot/usr/share/doc/animal-sniffer-1.17
+ export DOCDIR
+ rm -rf /usr/src/tmp/animal-sniffer-buildroot/usr/share/doc/animal-sniffer-1.17
+ /bin/mkdir -p /usr/src/tmp/animal-sniffer-buildroot/usr/share/doc/animal-sniffer-1.17
+ cp -prL README.md /usr/src/tmp/animal-sniffer-buildroot/usr/share/doc/animal-sniffer-1.17
+ chmod -R go-w /usr/src/tmp/animal-sniffer-buildroot/usr/share/doc/animal-sniffer-1.17
+ chmod -R a+rX /usr/src/tmp/animal-sniffer-buildroot/usr/share/doc/animal-sniffer-1.17
+ exit 0
warning: File listed twice: /usr/share/maven-poms/animal-sniffer
warning: File listed twice: /usr/share/maven-poms/animal-sniffer/animal-sniffer-annotations.pom
warning: File listed twice: /usr/share/maven-poms/animal-sniffer/animal-sniffer-ant-tasks.pom
warning: File listed twice: /usr/share/maven-poms/animal-sniffer/animal-sniffer-enforcer-rule.pom
warning: File listed twice: /usr/share/maven-poms/animal-sniffer/animal-sniffer-maven-plugin.pom
warning: File listed twice: /usr/share/maven-poms/animal-sniffer/animal-sniffer-parent.pom
warning: File listed twice: /usr/share/maven-poms/animal-sniffer/animal-sniffer.pom
warning: File listed twice: /usr/share/maven-poms/animal-sniffer/java-boot-classpath-detector.pom
Finding Provides (using /usr/lib/rpm/find-provides)
Executing: /bin/sh -e /usr/src/tmp/rpm-tmp.XpJLcg
find-provides: running scripts (alternatives,debuginfo,lib,maven,osgi-fc,pam,perl,pkgconfig,python,shell)
[INFO maven.prov] input: ['/usr/src/tmp/animal-sniffer-buildroot/usr/share/maven-metadata/animal-sniffer.xml']
[INFO maven.prov] mvn(org.codehaus.mojo:animal-sniffer-annotations:pom:) = 1.17, mvn(org.codehaus.mojo:animal-sniffer-ant-tasks:pom:) = 1.17, mvn(org.codehaus.mojo:animal-sniffer-ant-tasks) = 1.17, mvn(org.codehaus.mojo:animal-sniffer) = 1.17, mvn(org.codehaus.mojo:animal-sniffer-maven-plugin) = 1.17, mvn(org.codehaus.mojo:java-boot-classpath-detector) = 1.17, mvn(org.codehaus.mojo:animal-sniffer-parent:pom:) = 1.17, mvn(org.codehaus.mojo:animal-sniffer-annotations) = 1.17, mvn(org.codehaus.mojo:animal-sniffer-enforcer-rule:pom:) = 1.17, mvn(org.codehaus.mojo:animal-sniffer:pom:) = 1.17, mvn(org.codehaus.mojo:animal-sniffer-maven-plugin:pom:) = 1.17, mvn(org.codehaus.mojo:java-boot-classpath-detector:pom:) = 1.17, mvn(org.codehaus.mojo:animal-sniffer-enforcer-rule) = 1.17
[INFO osgi.prov] input: ['/usr/src/tmp/animal-sniffer-buildroot/usr/share/java/animal-sniffer/animal-sniffer-annotations.jar', '/usr/src/tmp/animal-sniffer-buildroot/usr/share/java/animal-sniffer/animal-sniffer-ant-tasks.jar', '/usr/src/tmp/animal-sniffer-buildroot/usr/share/java/animal-sniffer/animal-sniffer-enforcer-rule.jar', '/usr/src/tmp/animal-sniffer-buildroot/usr/share/java/animal-sniffer/animal-sniffer-maven-plugin.jar', '/usr/src/tmp/animal-sniffer-buildroot/usr/share/java/animal-sniffer/animal-sniffer.jar', '/usr/src/tmp/animal-sniffer-buildroot/usr/share/java/animal-sniffer/java-boot-classpath-detector.jar']
Finding Requires (using /usr/lib/rpm/find-requires)
Executing: /bin/sh -e /usr/src/tmp/rpm-tmp.ejKYDh
find-requires: running scripts (cpp,debuginfo,files,javadoc,lib,maven,osgi-fc,pam,perl,pkgconfig,pkgconfiglib,python,rpmlib,shebang,shell,static,symlinks,systemd-services)
[INFO maven.req] input: ['/usr/src/tmp/animal-sniffer-buildroot/usr/share/maven-metadata/animal-sniffer.xml']
[INFO maven.req] javapackages-filesystem, mvn(org.apache.maven:maven-artifact:2.2.1), mvn(org.apache.maven.enforcer:enforcer-api), mvn(org.apache.maven:maven-plugin-api), mvn(org.ow2.asm:asm), mvn(org.apache.commons:commons-lang3), mvn(org.apache.maven:maven-core), mvn(org.apache.maven.shared:maven-common-artifact-filters), mvn(org.codehaus.plexus:plexus-container-default), mvn(org.apache.maven:maven-toolchain), mvn(org.apache.maven:maven-project), mvn(org.codehaus.plexus:plexus-utils)
[INFO osgi.req] input: ['/usr/src/tmp/animal-sniffer-buildroot/usr/share/java/animal-sniffer/animal-sniffer-annotations.jar', '/usr/src/tmp/animal-sniffer-buildroot/usr/share/java/animal-sniffer/animal-sniffer-ant-tasks.jar', '/usr/src/tmp/animal-sniffer-buildroot/usr/share/java/animal-sniffer/animal-sniffer-enforcer-rule.jar', '/usr/src/tmp/animal-sniffer-buildroot/usr/share/java/animal-sniffer/animal-sniffer-maven-plugin.jar', '/usr/src/tmp/animal-sniffer-buildroot/usr/share/java/animal-sniffer/animal-sniffer.jar', '/usr/src/tmp/animal-sniffer-buildroot/usr/share/java/animal-sniffer/java-boot-classpath-detector.jar']
Provides: mvn(org.codehaus.mojo:animal-sniffer) = 1.17, mvn(org.codehaus.mojo:animal-sniffer-annotations) = 1.17, mvn(org.codehaus.mojo:animal-sniffer-annotations:pom:) = 1.17, mvn(org.codehaus.mojo:animal-sniffer-ant-tasks) = 1.17, mvn(org.codehaus.mojo:animal-sniffer-ant-tasks:pom:) = 1.17, mvn(org.codehaus.mojo:animal-sniffer-enforcer-rule) = 1.17, mvn(org.codehaus.mojo:animal-sniffer-enforcer-rule:pom:) = 1.17, mvn(org.codehaus.mojo:animal-sniffer-maven-plugin) = 1.17, mvn(org.codehaus.mojo:animal-sniffer-maven-plugin:pom:) = 1.17, mvn(org.codehaus.mojo:animal-sniffer-parent:pom:) = 1.17, mvn(org.codehaus.mojo:animal-sniffer:pom:) = 1.17, mvn(org.codehaus.mojo:java-boot-classpath-detector) = 1.17, mvn(org.codehaus.mojo:java-boot-classpath-detector:pom:) = 1.17
Requires: java >= 1.6.0, javapackages-filesystem, mvn(org.apache.commons:commons-lang3), mvn(org.apache.maven.enforcer:enforcer-api), mvn(org.apache.maven.shared:maven-common-artifact-filters), mvn(org.apache.maven:maven-artifact:2.2.1), mvn(org.apache.maven:maven-core), mvn(org.apache.maven:maven-plugin-api), mvn(org.apache.maven:maven-project), mvn(org.apache.maven:maven-toolchain), mvn(org.codehaus.plexus:plexus-container-default), mvn(org.codehaus.plexus:plexus-utils), mvn(org.ow2.asm:asm)
Processing files: animal-sniffer-javadoc-1.17-alt1
Finding Provides (using /usr/lib/rpm/find-provides)
Executing: /bin/sh -e /usr/src/tmp/rpm-tmp.EIekXh
find-provides: running scripts (alternatives,debuginfo,lib,maven,osgi-fc,pam,perl,pkgconfig,python,shell)
Finding Requires (using /usr/lib/rpm/find-requires)
Executing: /bin/sh -e /usr/src/tmp/rpm-tmp.9f5sKf
find-requires: running scripts (cpp,debuginfo,files,javadoc,lib,maven,osgi-fc,pam,perl,pkgconfig,pkgconfiglib,python,rpmlib,shebang,shell,static,symlinks,systemd-services)
Requires: jpackage-utils, animal-sniffer = 1.17-alt1, javapackages-filesystem
Adding to animal-sniffer-javadoc a strict dependency on animal-sniffer
Removing 1 extra deps from animal-sniffer-javadoc due to repentancy on animal-sniffer
Wrote: /usr/src/RPM/RPMS/noarch/animal-sniffer-1.17-alt1.noarch.rpm
Wrote: /usr/src/RPM/RPMS/noarch/animal-sniffer-javadoc-1.17-alt1.noarch.rpm
35.93user 1.37system 0:42.49elapsed 87%CPU (0avgtext+0avgdata 308476maxresident)k
0inputs+0outputs (0major+346568minor)pagefaults 0swaps
63.15user 6.94system 1:35.63elapsed 73%CPU (0avgtext+0avgdata 308476maxresident)k
288inputs+0outputs (0major+1196463minor)pagefaults 0swaps
--- animal-sniffer-1.17-alt1.noarch.rpm.repo	2019-03-31 17:45:23.000000000 +0000
+++ animal-sniffer-1.17-alt1.noarch.rpm.hasher	2020-06-13 14:55:46.105800166 +0000
@@ -20,3 +20,3 @@
 Requires: java >= 1.6.0
-Requires: javapackages-tools  
+Requires: javapackages-filesystem  
 Requires: mvn(org.apache.commons:commons-lang3)  
--- animal-sniffer-javadoc-1.17-alt1.noarch.rpm.repo	2019-03-31 17:45:23.000000000 +0000
+++ animal-sniffer-javadoc-1.17-alt1.noarch.rpm.hasher	2020-06-13 14:55:46.128800218 +0000
@@ -5,2 +5,3 @@
 /usr/share/javadoc/animal-sniffer/deprecated-list.html	100644	
+/usr/share/javadoc/animal-sniffer/element-list	100644	
 /usr/share/javadoc/animal-sniffer/help-doc.html	100644	
@@ -8,2 +9,39 @@
 /usr/share/javadoc/animal-sniffer/index.html	100644	
+/usr/share/javadoc/animal-sniffer/jquery	40755	
+/usr/share/javadoc/animal-sniffer/jquery/external	40755	
+/usr/share/javadoc/animal-sniffer/jquery/external/jquery	40755	
+/usr/share/javadoc/animal-sniffer/jquery/external/jquery/jquery.js	100644	
+/usr/share/javadoc/animal-sniffer/jquery/images	40755	
+/usr/share/javadoc/animal-sniffer/jquery/images/ui-bg_flat_0_aaaaaa_40x100.png	100644	
+/usr/share/javadoc/animal-sniffer/jquery/images/ui-bg_flat_75_ffffff_40x100.png	100644	
+/usr/share/javadoc/animal-sniffer/jquery/images/ui-bg_glass_55_fbf9ee_1x400.png	100644	
+/usr/share/javadoc/animal-sniffer/jquery/images/ui-bg_glass_65_ffffff_1x400.png	100644	
+/usr/share/javadoc/animal-sniffer/jquery/images/ui-bg_glass_75_dadada_1x400.png	100644	
+/usr/share/javadoc/animal-sniffer/jquery/images/ui-bg_glass_75_e6e6e6_1x400.png	100644	
+/usr/share/javadoc/animal-sniffer/jquery/images/ui-bg_glass_95_fef1ec_1x400.png	100644	
+/usr/share/javadoc/animal-sniffer/jquery/images/ui-bg_highlight-soft_75_cccccc_1x100.png	100644	
+/usr/share/javadoc/animal-sniffer/jquery/images/ui-icons_222222_256x240.png	100644	
+/usr/share/javadoc/animal-sniffer/jquery/images/ui-icons_2e83ff_256x240.png	100644	
+/usr/share/javadoc/animal-sniffer/jquery/images/ui-icons_454545_256x240.png	100644	
+/usr/share/javadoc/animal-sniffer/jquery/images/ui-icons_888888_256x240.png	100644	
+/usr/share/javadoc/animal-sniffer/jquery/images/ui-icons_cd0a0a_256x240.png	100644	
+/usr/share/javadoc/animal-sniffer/jquery/jquery-1.10.2.js	100644	
+/usr/share/javadoc/animal-sniffer/jquery/jquery-ui.css	100644	
+/usr/share/javadoc/animal-sniffer/jquery/jquery-ui.js	100644	
+/usr/share/javadoc/animal-sniffer/jquery/jquery-ui.min.css	100644	
+/usr/share/javadoc/animal-sniffer/jquery/jquery-ui.min.js	100644	
+/usr/share/javadoc/animal-sniffer/jquery/jquery-ui.structure.css	100644	
+/usr/share/javadoc/animal-sniffer/jquery/jquery-ui.structure.min.css	100644	
+/usr/share/javadoc/animal-sniffer/jquery/jszip	40755	
+/usr/share/javadoc/animal-sniffer/jquery/jszip-utils	40755	
+/usr/share/javadoc/animal-sniffer/jquery/jszip-utils/dist	40755	
+/usr/share/javadoc/animal-sniffer/jquery/jszip-utils/dist/jszip-utils-ie.js	100644	
+/usr/share/javadoc/animal-sniffer/jquery/jszip-utils/dist/jszip-utils-ie.min.js	100644	
+/usr/share/javadoc/animal-sniffer/jquery/jszip-utils/dist/jszip-utils.js	100644	
+/usr/share/javadoc/animal-sniffer/jquery/jszip-utils/dist/jszip-utils.min.js	100644	
+/usr/share/javadoc/animal-sniffer/jquery/jszip/dist	40755	
+/usr/share/javadoc/animal-sniffer/jquery/jszip/dist/jszip.js	100644	
+/usr/share/javadoc/animal-sniffer/jquery/jszip/dist/jszip.min.js	100644	
+/usr/share/javadoc/animal-sniffer/member-search-index.js	100644	
+/usr/share/javadoc/animal-sniffer/member-search-index.zip	100644	
 /usr/share/javadoc/animal-sniffer/org	40755	
@@ -106,6 +144,13 @@
 /usr/share/javadoc/animal-sniffer/overview-tree.html	100644	
-/usr/share/javadoc/animal-sniffer/package-list	100644	
+/usr/share/javadoc/animal-sniffer/package-search-index.js	100644	
+/usr/share/javadoc/animal-sniffer/package-search-index.zip	100644	
+/usr/share/javadoc/animal-sniffer/resources	40755	
+/usr/share/javadoc/animal-sniffer/resources/glass.png	100644	
+/usr/share/javadoc/animal-sniffer/resources/x.png	100644	
 /usr/share/javadoc/animal-sniffer/script.js	100644	
+/usr/share/javadoc/animal-sniffer/search.js	100644	
 /usr/share/javadoc/animal-sniffer/serialized-form.html	100644	
 /usr/share/javadoc/animal-sniffer/stylesheet.css	100644	
+/usr/share/javadoc/animal-sniffer/type-search-index.js	100644	
+/usr/share/javadoc/animal-sniffer/type-search-index.zip	100644	
 Requires: jpackage-utils