<86>May 11 12:55:19 userdel[3024950]: delete user 'rooter'
<86>May 11 12:55:19 userdel[3024950]: removed group 'rooter' owned by 'rooter'
<86>May 11 12:55:19 userdel[3024950]: removed shadow group 'rooter' owned by 'rooter'
<86>May 11 12:55:19 groupadd[3024955]: group added to /etc/group: name=rooter, GID=585
<86>May 11 12:55:19 groupadd[3024955]: group added to /etc/gshadow: name=rooter
<86>May 11 12:55:19 groupadd[3024955]: new group: name=rooter, GID=585
<86>May 11 12:55:19 useradd[3024961]: new user: name=rooter, UID=585, GID=585, home=/root, shell=/bin/bash
<86>May 11 12:55:19 userdel[3024970]: delete user 'builder'
<86>May 11 12:55:19 userdel[3024970]: removed group 'builder' owned by 'builder'
<86>May 11 12:55:19 userdel[3024970]: removed shadow group 'builder' owned by 'builder'
<86>May 11 12:55:20 groupadd[3024976]: group added to /etc/group: name=builder, GID=586
<86>May 11 12:55:20 groupadd[3024976]: group added to /etc/gshadow: name=builder
<86>May 11 12:55:20 groupadd[3024976]: new group: name=builder, GID=586
<86>May 11 12:55:20 useradd[3024981]: new user: name=builder, UID=586, GID=586, home=/usr/src, shell=/bin/bash
/usr/src/in/srpm/ppp-2.4.8-alt2.src.rpm: license not found in '/usr/share/license' directory: distributable
<13>May 11 12:55:24 rpmi: perl-IPC-Signal-1.00-alt3.1.1 1290501013 installed
<13>May 11 12:55:24 rpmi: liblz4-1:1.9.2-alt1 sisyphus+238585.100.2.2 1570066927 installed
<13>May 11 12:55:24 rpmi: libgpg-error-1.36-alt1 sisyphus+225621.300.1.1 1553521082 installed
<13>May 11 12:55:24 rpmi: libgcrypt20-1.8.5-alt3 sisyphus+239622.100.1.1 1571746654 installed
<13>May 11 12:55:24 rpmi: libsystemd-1:245.5-alt1 sisyphus+250810.500.6.1 1588357136 installed
<13>May 11 12:55:24 rpmi: libdbus-1.12.16-alt2 sisyphus+240566.100.2.1 1573547696 installed
<13>May 11 12:55:24 rpmi: libpcap0.8-2:1.9.1-alt1 sisyphus+239373.240.3.1 1573482502 installed
<13>May 11 12:55:24 rpmi: libatm-2.5.1-alt6 sisyphus+234093.100.1.1 1562575889 installed
<13>May 11 12:55:24 rpmi: libp11-kit-0.23.15-alt1 sisyphus+226408.100.2.1 1554288204 installed
<13>May 11 12:55:24 rpmi: libtasn1-4.16.0-alt1 sisyphus+245480.100.1.1 1580825062 installed
<13>May 11 12:55:24 rpmi: rpm-macros-alternatives-0.5.1-alt1 sisyphus+226946.100.1.1 1554830426 installed
<13>May 11 12:55:24 rpmi: alternatives-0.5.1-alt1 sisyphus+226946.100.1.1 1554830426 installed
<13>May 11 12:55:24 rpmi: ca-certificates-2020.01.23-alt1 sisyphus+244791.300.2.1 1580285500 installed
<13>May 11 12:55:24 rpmi: ca-trust-0.1.2-alt1 sisyphus+233348.100.1.1 1561653823 installed
<13>May 11 12:55:24 rpmi: p11-kit-trust-0.23.15-alt1 sisyphus+226408.100.2.1 1554288204 installed
<13>May 11 12:55:24 rpmi: libcrypto1.1-1.1.1g-alt1 sisyphus+249982.60.8.1 1587743711 installed
<13>May 11 12:55:24 rpmi: libssl1.1-1.1.1g-alt1 sisyphus+249982.60.8.1 1587743711 installed
<13>May 11 12:55:24 rpmi: rpm-macros-pam0-1.3.1.0.223.c2c0-alt1 sisyphus+250694.100.1.1 1587923013 installed
<13>May 11 12:55:24 rpmi: libpam0-devel-1.3.1.0.223.c2c0-alt1 sisyphus+250694.100.1.1 1587923024 installed
<13>May 11 12:55:24 rpmi: libssl-devel-1.1.1g-alt1 sisyphus+249982.60.8.1 1587743711 installed
<13>May 11 12:55:24 rpmi: libatm-devel-2.5.1-alt6 sisyphus+234093.100.1.1 1562575889 installed
<13>May 11 12:55:24 rpmi: libpcap-devel-2:1.9.1-alt1 sisyphus+239373.240.3.1 1573482502 installed
<13>May 11 12:55:24 rpmi: libsystemd-devel-1:245.5-alt1 sisyphus+250810.500.6.1 1588357136 installed
<13>May 11 12:55:24 rpmi: perl-Proc-WaitStat-1.00-alt4.1.1 1290595156 installed
<13>May 11 12:55:24 rpmi: perl-Proc-Daemon-0.23-alt1 1451923889 installed
<13>May 11 12:55:24 rpmi: libudev-devel-1:245.5-alt1 sisyphus+250810.500.6.1 1588357136 installed
Building target platforms: i586
Building for target i586
Wrote: /usr/src/in/nosrpm/ppp-2.4.8-alt2.nosrc.rpm
Installing ppp-2.4.8-alt2.src.rpm
Building target platforms: i586
Building for target i586
Executing(%prep): /bin/sh -e /usr/src/tmp/rpm-tmp.74266
+ umask 022
+ /bin/mkdir -p /usr/src/RPM/BUILD
+ cd /usr/src/RPM/BUILD
+ cd /usr/src/RPM/BUILD
+ rm -rf ppp-2.4.8
+ echo 'Source #0 (ppp-2.4.8.tar):'
Source #0 (ppp-2.4.8.tar):
+ /bin/tar -xf /usr/src/RPM/SOURCES/ppp-2.4.8.tar
+ cd ppp-2.4.8
+ /bin/chmod -c -Rf u+rwX,go-w .
+ echo 'Patch #1 (ppp-2.4.8-alt2.patch):'
Patch #1 (ppp-2.4.8-alt2.patch):
+ /usr/bin/patch -p1
patching file README.eap-tls
patching file chat/Makefile.linux
patching file chat/chat.8
patching file configure
patching file etc.ppp/eaptls-client
patching file etc.ppp/eaptls-server
patching file etc.ppp/openssl.cnf
patching file etc.ppp/options
patching file linux/Makefile.top
patching file pppd/Makefile.linux
patching file pppd/auth.c
patching file pppd/cbcp.c
patching file pppd/cbcp.h
patching file pppd/ccp.c
patching file pppd/chap-md5.c
patching file pppd/chap-new.c
patching file pppd/chap_ms.c
patching file pppd/demand.c
patching file pppd/eap-tls.c
patching file pppd/eap-tls.h
patching file pppd/eap.c
patching file pppd/eap.h
patching file pppd/ipcp.c
patching file pppd/ipcp.h
patching file pppd/ipv6cp.c
patching file pppd/ipv6cp.h
patching file pppd/ipxcp.c
patching file pppd/lcp.c
patching file pppd/main.c
patching file pppd/md4.c
patching file pppd/md4.h
patching file pppd/md5.c
patching file pppd/md5.h
patching file pppd/multilink.c
patching file pppd/options.c
patching file pppd/pathnames.h
patching file pppd/plugins/Makefile.linux
patching file pppd/plugins/dhcp/AUTHORS
patching file pppd/plugins/dhcp/COPYING
patching file pppd/plugins/dhcp/Makefile.linux
patching file pppd/plugins/dhcp/README
patching file pppd/plugins/dhcp/clientpacket.c
patching file pppd/plugins/dhcp/clientpacket.h
patching file pppd/plugins/dhcp/debug.h
patching file pppd/plugins/dhcp/dhcpc.c
patching file pppd/plugins/dhcp/dhcpc.h
patching file pppd/plugins/dhcp/dhcpd.h
patching file pppd/plugins/dhcp/files.h
patching file pppd/plugins/dhcp/leases.h
patching file pppd/plugins/dhcp/options.c
patching file pppd/plugins/dhcp/options.h
patching file pppd/plugins/dhcp/packet.c
patching file pppd/plugins/dhcp/packet.h
patching file pppd/plugins/dhcp/socket.c
patching file pppd/plugins/dhcp/socket.h
patching file pppd/plugins/passprompt.c
patching file pppd/plugins/passwordfd.c
patching file pppd/plugins/pppoatm/Makefile.linux
patching file pppd/plugins/pppoatm/pppoatm.c
patching file pppd/plugins/pppol2tp/Makefile.linux
patching file pppd/plugins/pppol2tp/l2tp_event.h
patching file pppd/plugins/pppol2tp/openl2tp.c
patching file pppd/plugins/pppol2tp/pppol2tp.c
patching file pppd/plugins/radius/Makefile.linux
patching file pppd/plugins/radius/clientid.c
patching file pppd/plugins/radius/md5.c
patching file pppd/plugins/radius/radius.c
patching file pppd/plugins/radius/util.c
patching file pppd/plugins/rp-pppoe/Makefile.linux
patching file pppd/plugins/rp-pppoe/if.c
patching file pppd/plugins/rp-pppoe/plugin.c
patching file pppd/plugins/rp-pppoe/pppoe-discovery.8
patching file pppd/plugins/rp-pppoe/pppoe-discovery.c
patching file pppd/plugins/winbind.c
patching file pppd/pppd.8
patching file pppd/pppd.h
patching file pppd/sha1.c
patching file pppd/sha1.h
patching file pppd/sys-linux.c
patching file pppd/sys-solaris.c
patching file pppd/tdb.c
patching file pppd/tty.c
patching file pppd/utils.c
patching file pppdump/Makefile.linux
patching file pppstats/Makefile.linux
patching file sample/auth-down
patching file sample/auth-up
patching file sample/callback-client
patching file sample/callback-server
patching file sample/callback-users
patching file sample/ip-down
patching file sample/ip-up
patching file sample/options
patching file sample/options.ttyXX
patching file sample/pap-secrets
+ sed -i -e 's|/usr/local/etc|/etc|' -e 's|/usr/local/sbin|/usr/sbin|' pppd/plugins/radius/etc/radiusclient.conf
+ sed -i -e 's|/etc/radiusclient|/etc/ppp/radius|g' pppd/plugins/radius/pppd-radattr.8 pppd/plugins/radius/pppd-radius.8 pppd/plugins/radius/avpair.c pppd/plugins/radius/buildreq.c pppd/plugins/radius/clientid.c pppd/plugins/radius/config.c pppd/plugins/radius/dict.c pppd/plugins/radius/ip_util.c pppd/plugins/radius/lock.c pppd/plugins/radius/md5.c pppd/plugins/radius/radattr.c pppd/plugins/radius/radius.c pppd/plugins/radius/radrealms.c pppd/plugins/radius/sendserver.c pppd/plugins/radius/util.c pppd/plugins/radius/includes.h pppd/plugins/radius/options.h pppd/plugins/radius/pathnames.h pppd/plugins/radius/radiusclient.h pppd/plugins/radius/etc/dictionary pppd/plugins/radius/etc/dictionary.ascend pppd/plugins/radius/etc/dictionary.compat pppd/plugins/radius/etc/dictionary.merit pppd/plugins/radius/etc/dictionary.microsoft pppd/plugins/radius/etc/issue pppd/plugins/radius/etc/port-id-map pppd/plugins/radius/etc/radiusclient.conf pppd/plugins/radius/etc/radiusclient.conf.in pppd/plugins/radius/etc/realms pppd/plugins/radius/etc/servers
+ find -type f -name '*.orig' -print -delete
+ rm -f include/linux/if_pppol2tp.h
+ exit 0
Executing(%build): /bin/sh -e /usr/src/tmp/rpm-tmp.98303
+ umask 022
+ /bin/mkdir -p /usr/src/RPM/BUILD
+ cd /usr/src/RPM/BUILD
+ cd ppp-2.4.8
+ CFLAGS='-pipe -frecord-gcc-switches -Wall -g -O2 -march=i586 -mtune=generic -fPIC -Wall -D_GNU_SOURCE -fno-strict-aliasing'
+ export CFLAGS
+ CXXFLAGS='-pipe -frecord-gcc-switches -Wall -g -O2 -march=i586 -mtune=generic -fPIC -Wall -D_GNU_SOURCE -fno-strict-aliasing'
+ export CXXFLAGS
+ FFLAGS='-pipe -frecord-gcc-switches -Wall -g -O2 -march=i586 -mtune=generic -fPIC -Wall -D_GNU_SOURCE -fno-strict-aliasing'
+ export FFLAGS
+ '[' -n '' ']'
++ printf %s '-pipe -frecord-gcc-switches -Wall -g -O2 -march=i586 -mtune=generic -fPIC -Wall -D_GNU_SOURCE -fno-strict-aliasing'
++ sed -r 's/(^|[[:space:]]+)-[^m][^[:space:]]*//g'
+ ASFLAGS=' -march=i586 -mtune=generic'
+ export ASFLAGS
+ export lt_cv_prog_cc_static_works=no
+ lt_cv_prog_cc_static_works=no
+ export lt_cv_deplibs_check_method=pass_all
+ lt_cv_deplibs_check_method=pass_all
+ xargs -ri dirname -- '{}'
+ readlink -e -- ./configure
+ xargs -ri find '{}' -type f '(' -name config.sub -or -name config.guess ')' -printf '%h/\n'
+ sort -u
+ xargs -rn1 install -pm755 -- /usr/share/gnu-config/config.sub /usr/share/gnu-config/config.guess
+ ./configure --build=i586-alt-linux --host=i586-alt-linux --prefix=/usr --exec-prefix=/usr --bindir=/usr/bin --sbindir=/usr/sbin --sysconfdir=/etc --datadir=/usr/share --includedir=/usr/include --libdir=/usr/lib --libexecdir=/usr/lib --localstatedir=/var/lib --sharedstatedir=/var/lib --mandir=/usr/share/man --infodir=/usr/share/info --disable-dependency-tracking --disable-silent-rules --without-included-gettext
Configuring for Linux
Creating Makefiles.
  Makefile <= linux/Makefile.top
  pppd/Makefile <= pppd/Makefile.linux
  pppstats/Makefile <= pppstats/Makefile.linux
  chat/Makefile <= chat/Makefile.linux
  pppdump/Makefile <= pppdump/Makefile.linux
  pppd/plugins/Makefile <= pppd/plugins/Makefile.linux
  pppd/plugins/rp-pppoe/Makefile <= pppd/plugins/rp-pppoe/Makefile.linux
  pppd/plugins/radius/Makefile <= pppd/plugins/radius/Makefile.linux
  pppd/plugins/pppoatm/Makefile <= pppd/plugins/pppoatm/Makefile.linux
  pppd/plugins/pppol2tp/Makefile <= pppd/plugins/pppol2tp/Makefile.linux
  pppd/plugins/dhcp/Makefile <= pppd/plugins/dhcp/Makefile.linux
+ make -j8 USE_PAM=y CBCP=y CHAPMS=y MPPE=y HAVE_LIBATM=y HAVE_INET6=y SYSTEMD=y 'COPTS=-pipe -frecord-gcc-switches -Wall -g -O2 -march=i586 -mtune=generic -fPIC -Wall -D_GNU_SOURCE -fno-strict-aliasing' CC=gcc libdir=/usr/lib
cd chat; make -w -j8 -Otarget --jobserver-auth=3,4 all
make[1]: Entering directory '/usr/src/RPM/BUILD/ppp-2.4.8/chat'
make[1]: warning: -j8 forced in submake: resetting jobserver mode.
make[1]: Leaving directory '/usr/src/RPM/BUILD/ppp-2.4.8/chat'
make[1]: Entering directory '/usr/src/RPM/BUILD/ppp-2.4.8/chat'
gcc -c -pipe -frecord-gcc-switches -Wall -g -O2 -march=i586 -mtune=generic -fPIC -Wall -D_GNU_SOURCE -fno-strict-aliasing -DTERMIOS			 -DSIGTYPE=void			 -UNO_SLEEP			 -DFNDELAY=O_NDELAY		 -o chat.o chat.c
chat.c: In function 'main':
chat.c:151:59: warning: value computed is not used [-Wunused-value]
  151 | #define OPTION(c,v) (_O&2&&**v?*(*v)++:!c||_O&4?0:(!(_O&1)&& \
      |                                                           ^~
chat.c:297:22: note: in expansion of macro 'OPTION'
  297 |     while ((option = OPTION(argc, argv)) != 0) {
      |                      ^~~~~~
chat.c: In function 'chat_send':
chat.c:1047:2: warning: ignoring return value of 'write', declared with attribute warn_unused_result [-Wunused-result]
 1047 |  write(2, s, strlen(s));
      |  ^~~~~~~~~~~~~~~~~~~~~~
chat.c: In function 'echo_stderr':
chat.c:1370:2: warning: ignoring return value of 'write', declared with attribute warn_unused_result [-Wunused-result]
 1370 |  write(2, "\n", 1);
      |  ^~~~~~~~~~~~~~~~~
chat.c:1375:2: warning: ignoring return value of 'write', declared with attribute warn_unused_result [-Wunused-result]
 1375 |  write(2, s, strlen(s));
      |  ^~~~~~~~~~~~~~~~~~~~~~
At top level:
chat.c:90:19: warning: 'rcsid' defined but not used [-Wunused-const-variable=]
   90 | static const char rcsid[] = "$Id: chat.c,v 1.30 2004/01/17 05:47:55 carlsonj Exp $";
      |                   ^~~~~
make[1]: Leaving directory '/usr/src/RPM/BUILD/ppp-2.4.8/chat'
make[1]: Entering directory '/usr/src/RPM/BUILD/ppp-2.4.8/chat'
gcc  -pie -o chat chat.o
make[1]: Leaving directory '/usr/src/RPM/BUILD/ppp-2.4.8/chat'
cd pppd/plugins; make -w -j8 -Otarget --jobserver-auth=3,4 all
make[1]: Entering directory '/usr/src/RPM/BUILD/ppp-2.4.8/pppd/plugins'
make[1]: warning: -j8 forced in submake: resetting jobserver mode.
make[1]: Leaving directory '/usr/src/RPM/BUILD/ppp-2.4.8/pppd/plugins'
make[1]: Entering directory '/usr/src/RPM/BUILD/ppp-2.4.8/pppd/plugins'
gcc -pipe -frecord-gcc-switches -Wall -g -O2 -march=i586 -mtune=generic -fPIC -Wall -D_GNU_SOURCE -fno-strict-aliasing -I.. -I../../include -fPIC -DUSE_EAPTLS=1 -DMPPE=1  -shared -o minconn.so minconn.c
make[1]: Leaving directory '/usr/src/RPM/BUILD/ppp-2.4.8/pppd/plugins'
make[1]: Entering directory '/usr/src/RPM/BUILD/ppp-2.4.8/pppd/plugins'
gcc -pipe -frecord-gcc-switches -Wall -g -O2 -march=i586 -mtune=generic -fPIC -Wall -D_GNU_SOURCE -fno-strict-aliasing -I.. -I../../include -fPIC -DUSE_EAPTLS=1 -DMPPE=1  -shared -o passwordfd.so passwordfd.c
make[1]: Leaving directory '/usr/src/RPM/BUILD/ppp-2.4.8/pppd/plugins'
make[1]: Entering directory '/usr/src/RPM/BUILD/ppp-2.4.8/pppd/plugins'
gcc -pipe -frecord-gcc-switches -Wall -g -O2 -march=i586 -mtune=generic -fPIC -Wall -D_GNU_SOURCE -fno-strict-aliasing -I.. -I../../include -fPIC -DUSE_EAPTLS=1 -DMPPE=1  -shared -o passprompt.so passprompt.c
passprompt.c: In function 'promptpass':
passprompt.c:57:2: warning: ignoring return value of 'seteuid', declared with attribute warn_unused_result [-Wunused-result]
   57 |  seteuid(getuid());
      |  ^~~~~~~~~~~~~~~~~
passprompt.c:58:2: warning: ignoring return value of 'setegid', declared with attribute warn_unused_result [-Wunused-result]
   58 |  setegid(getgid());
      |  ^~~~~~~~~~~~~~~~~
make[1]: Leaving directory '/usr/src/RPM/BUILD/ppp-2.4.8/pppd/plugins'
make[1]: Entering directory '/usr/src/RPM/BUILD/ppp-2.4.8/pppd/plugins'
gcc -pipe -frecord-gcc-switches -Wall -g -O2 -march=i586 -mtune=generic -fPIC -Wall -D_GNU_SOURCE -fno-strict-aliasing -I.. -I../../include -fPIC -DUSE_EAPTLS=1 -DMPPE=1  -shared -o winbind.so winbind.c
winbind.c: In function 'run_ntlm_auth':
winbind.c:421:23: warning: pointer targets in passing argument 1 of 'strhex_to_str' differ in signedness [-Wpointer-sign]
  421 |     if (strhex_to_str(nt_key, 32, parameter) == 16) {
      |                       ^~~~~~
      |                       |
      |                       u_char * {aka unsigned char *}
winbind.c:168:28: note: expected 'char *' but argument is of type 'u_char *' {aka 'unsigned char *'}
  168 | size_t strhex_to_str(char *p, size_t len, const char *strhex)
      |                      ~~~~~~^
winbind.c: In function 'winbind_chap_verify':
winbind.c:637:22: warning: pointer targets in passing argument 6 of 'GenerateAuthenticatorResponse' differ in signedness [-Wpointer-sign]
  637 |     challenge, user, saresponse);
      |                      ^~~~~~~~~~
      |                      |
      |                      char *
In file included from winbind.c:39:
../chap_ms.h:104:11: note: expected 'u_char *' {aka 'unsigned char *'} but argument is of type 'char *'
  104 |    u_char authResponse[MS_AUTH_RESPONSE_LENGTH+1]);
      |    ~~~~~~~^~~~~~~~~~~~~~~~~~~~~~~~~~~~~~~~~~~~~~~
winbind.c: In function 'run_ntlm_auth':
winbind.c:305:3: warning: ignoring return value of 'setgid', declared with attribute warn_unused_result [-Wunused-result]
  305 |   setgid(getgid());
      |   ^~~~~~~~~~~~~~~~
make[1]: Leaving directory '/usr/src/RPM/BUILD/ppp-2.4.8/pppd/plugins'
for d in rp-pppoe pppoatm pppol2tp radius dhcp; do make -w -j8 -Otarget --jobserver-auth=5,7 -C $d all || exit $?; done
make[2]: Entering directory '/usr/src/RPM/BUILD/ppp-2.4.8/pppd/plugins/rp-pppoe'
make[2]: warning: -j8 forced in submake: resetting jobserver mode.
make[2]: Leaving directory '/usr/src/RPM/BUILD/ppp-2.4.8/pppd/plugins/rp-pppoe'
make[2]: Entering directory '/usr/src/RPM/BUILD/ppp-2.4.8/pppd/plugins/rp-pppoe'
gcc -pipe -frecord-gcc-switches -Wall -g -O2 -march=i586 -mtune=generic -fPIC -Wall -D_GNU_SOURCE -fno-strict-aliasing -I../../../include -fPIC '-DRP_VERSION="3.8p"' -I../../.. -c -o if.o if.c
if.c:16:19: warning: 'RCSID' defined but not used [-Wunused-const-variable=]
   16 | static char const RCSID[] =
      |                   ^~~~~
make[2]: Leaving directory '/usr/src/RPM/BUILD/ppp-2.4.8/pppd/plugins/rp-pppoe'
make[2]: Entering directory '/usr/src/RPM/BUILD/ppp-2.4.8/pppd/plugins/rp-pppoe'
gcc -pipe -frecord-gcc-switches -Wall -g -O2 -march=i586 -mtune=generic -fPIC -Wall -D_GNU_SOURCE -fno-strict-aliasing -I../../../include -fPIC '-DRP_VERSION="3.8p"' -I../../.. -c -o debug.o debug.c
debug.c:16:19: warning: 'RCSID' defined but not used [-Wunused-const-variable=]
   16 | static char const RCSID[] =
      |                   ^~~~~
make[2]: Leaving directory '/usr/src/RPM/BUILD/ppp-2.4.8/pppd/plugins/rp-pppoe'
make[2]: Entering directory '/usr/src/RPM/BUILD/ppp-2.4.8/pppd/plugins/rp-pppoe'
gcc -pipe -frecord-gcc-switches -Wall -g -O2 -march=i586 -mtune=generic -fPIC -Wall -D_GNU_SOURCE -fno-strict-aliasing -I../../../include -fPIC '-DRP_VERSION="3.8p"' -I../../.. -c -o common.o common.c
common.c: In function 'sendPADT':
common.c:135:12: warning: pointer targets in passing argument 1 of 'strcpy' differ in signedness [-Wpointer-sign]
  135 |  strcpy(err.payload, msg);
      |         ~~~^~~~~~~~
      |            |
      |            unsigned char *
In file included from /usr/include/features.h:450,
                 from /usr/include/bits/libc-header-start.h:33,
                 from /usr/include/stdio.h:27,
                 from pppoe.h:18,
                 from common.c:20:
/usr/include/bits/string_fortified.h:88:1: note: expected 'char * restrict' but argument is of type 'unsigned char *'
   88 | __NTH (strcpy (char *__restrict __dest, const char *__restrict __src))
      | ^~~~~
At top level:
common.c:16:19: warning: 'RCSID' defined but not used [-Wunused-const-variable=]
   16 | static char const RCSID[] =
      |                   ^~~~~
make[2]: Leaving directory '/usr/src/RPM/BUILD/ppp-2.4.8/pppd/plugins/rp-pppoe'
make[2]: Entering directory '/usr/src/RPM/BUILD/ppp-2.4.8/pppd/plugins/rp-pppoe'
gcc -pipe -frecord-gcc-switches -Wall -g -O2 -march=i586 -mtune=generic -fPIC -Wall -D_GNU_SOURCE -fno-strict-aliasing -I../../../include -fPIC '-DRP_VERSION="3.8p"' -I../../.. -c -o pppoe-discovery.o pppoe-discovery.c
In file included from /usr/include/string.h:507,
                 from pppoe-discovery.c:17:
In function 'strncpy',
    inlined from 'openInterface' at pppoe-discovery.c:153:2:
/usr/include/bits/string_fortified.h:106:10: warning: '__builtin_strncpy' specified bound 16 equals destination size [-Wstringop-truncation]
  106 |   return __builtin___strncpy_chk (__dest, __src, __len, __bos (__dest));
      |          ^~~~~~~~~~~~~~~~~~~~~~~~~~~~~~~~~~~~~~~~~~~~~~~~~~~~~~~~~~~~~~
In function 'strncpy',
    inlined from 'openInterface' at pppoe-discovery.c:175:5:
/usr/include/bits/string_fortified.h:106:10: warning: '__builtin_strncpy' specified bound 16 equals destination size [-Wstringop-truncation]
  106 |   return __builtin___strncpy_chk (__dest, __src, __len, __bos (__dest));
      |          ^~~~~~~~~~~~~~~~~~~~~~~~~~~~~~~~~~~~~~~~~~~~~~~~~~~~~~~~~~~~~~
make[2]: Leaving directory '/usr/src/RPM/BUILD/ppp-2.4.8/pppd/plugins/rp-pppoe'
make[2]: Entering directory '/usr/src/RPM/BUILD/ppp-2.4.8/pppd/plugins/rp-pppoe'
gcc -pipe -frecord-gcc-switches -Wall -g -O2 -march=i586 -mtune=generic -fPIC -Wall -D_GNU_SOURCE -fno-strict-aliasing -I../../../include -fPIC '-DRP_VERSION="3.8p"' -I../../.. -c -o plugin.o plugin.c
plugin.c:55:2: warning: #warning ugly hack: aligned_u64 must be defined in linux/types.h [-Wcpp]
   55 | #warning ugly hack: aligned_u64 must be defined in linux/types.h
      |  ^~~~~~~
plugin.c:25:19: warning: 'RCSID' defined but not used [-Wunused-const-variable=]
   25 | static char const RCSID[] =
      |                   ^~~~~
make[2]: Leaving directory '/usr/src/RPM/BUILD/ppp-2.4.8/pppd/plugins/rp-pppoe'
make[2]: Entering directory '/usr/src/RPM/BUILD/ppp-2.4.8/pppd/plugins/rp-pppoe'
gcc -pipe -frecord-gcc-switches -Wall -g -O2 -march=i586 -mtune=generic -fPIC -Wall -D_GNU_SOURCE -fno-strict-aliasing -I../../../include -fPIC '-DRP_VERSION="3.8p"' -shared -o pppoe-discovery pppoe-discovery.o debug.o -ludev
make[2]: Leaving directory '/usr/src/RPM/BUILD/ppp-2.4.8/pppd/plugins/rp-pppoe'
make[2]: Entering directory '/usr/src/RPM/BUILD/ppp-2.4.8/pppd/plugins/rp-pppoe'
gcc -pipe -frecord-gcc-switches -Wall -g -O2 -march=i586 -mtune=generic -fPIC -Wall -D_GNU_SOURCE -fno-strict-aliasing -I../../../include -fPIC '-DRP_VERSION="3.8p"' -I../../.. -c -o discovery.o discovery.c
discovery.c: In function 'parsePADOTags':
discovery.c:136:9: warning: unused variable 'i' [-Wunused-variable]
  136 |     int i;
      |         ^
At top level:
discovery.c:11:19: warning: 'RCSID' defined but not used [-Wunused-const-variable=]
   11 | static char const RCSID[] =
      |                   ^~~~~
make[2]: Leaving directory '/usr/src/RPM/BUILD/ppp-2.4.8/pppd/plugins/rp-pppoe'
make[2]: Entering directory '/usr/src/RPM/BUILD/ppp-2.4.8/pppd/plugins/rp-pppoe'
gcc -pipe -frecord-gcc-switches -Wall -g -O2 -march=i586 -mtune=generic -fPIC -Wall -D_GNU_SOURCE -fno-strict-aliasing -I../../../include -fPIC '-DRP_VERSION="3.8p"' -shared -o rp-pppoe.so plugin.o discovery.o if.o common.o
make[2]: Leaving directory '/usr/src/RPM/BUILD/ppp-2.4.8/pppd/plugins/rp-pppoe'
make[2]: Entering directory '/usr/src/RPM/BUILD/ppp-2.4.8/pppd/plugins/pppoatm'
make[2]: warning: -j8 forced in submake: resetting jobserver mode.
make[2]: Leaving directory '/usr/src/RPM/BUILD/ppp-2.4.8/pppd/plugins/pppoatm'
make[2]: Entering directory '/usr/src/RPM/BUILD/ppp-2.4.8/pppd/plugins/pppoatm'
gcc -pipe -frecord-gcc-switches -Wall -g -O2 -march=i586 -mtune=generic -fPIC -Wall -D_GNU_SOURCE -fno-strict-aliasing -I../.. -I../../../include -fPIC -c -o pppoatm.o pppoatm.c
make[2]: Leaving directory '/usr/src/RPM/BUILD/ppp-2.4.8/pppd/plugins/pppoatm'
make[2]: Entering directory '/usr/src/RPM/BUILD/ppp-2.4.8/pppd/plugins/pppoatm'
gcc -pipe -frecord-gcc-switches -Wall -g -O2 -march=i586 -mtune=generic -fPIC -Wall -D_GNU_SOURCE -fno-strict-aliasing -I../.. -I../../../include -fPIC  -shared -o pppoatm.so pppoatm.o -latm
make[2]: Leaving directory '/usr/src/RPM/BUILD/ppp-2.4.8/pppd/plugins/pppoatm'
make[2]: Entering directory '/usr/src/RPM/BUILD/ppp-2.4.8/pppd/plugins/pppol2tp'
make[2]: warning: -j8 forced in submake: resetting jobserver mode.
make[2]: Leaving directory '/usr/src/RPM/BUILD/ppp-2.4.8/pppd/plugins/pppol2tp'
make[2]: Entering directory '/usr/src/RPM/BUILD/ppp-2.4.8/pppd/plugins/pppol2tp'
gcc -pipe -frecord-gcc-switches -Wall -g -O2 -march=i586 -mtune=generic -fPIC -Wall -D_GNU_SOURCE -fno-strict-aliasing -I. -I../.. -I../../../include -fPIC -c -o openl2tp.o openl2tp.c
make[2]: Leaving directory '/usr/src/RPM/BUILD/ppp-2.4.8/pppd/plugins/pppol2tp'
make[2]: Entering directory '/usr/src/RPM/BUILD/ppp-2.4.8/pppd/plugins/pppol2tp'
gcc -pipe -frecord-gcc-switches -Wall -g -O2 -march=i586 -mtune=generic -fPIC -Wall -D_GNU_SOURCE -fno-strict-aliasing -I. -I../.. -I../../../include -fPIC  -shared -o openl2tp.so openl2tp.o 
make[2]: Leaving directory '/usr/src/RPM/BUILD/ppp-2.4.8/pppd/plugins/pppol2tp'
make[2]: Entering directory '/usr/src/RPM/BUILD/ppp-2.4.8/pppd/plugins/pppol2tp'
gcc -pipe -frecord-gcc-switches -Wall -g -O2 -march=i586 -mtune=generic -fPIC -Wall -D_GNU_SOURCE -fno-strict-aliasing -I. -I../.. -I../../../include -fPIC -c -o pppol2tp.o pppol2tp.c
pppol2tp.c: In function 'setdevname_pppol2tp':
pppol2tp.c:135:53: warning: pointer targets in passing argument 3 of 'getsockname' differ in signedness [-Wpointer-sign]
  135 |  if(getsockname(pppol2tp_fd, (struct sockaddr *)&s, &len) < 0) {
      |                                                     ^~~~
      |                                                     |
      |                                                     int *
In file included from /usr/include/net/if.h:26,
                 from pppol2tp.c:34:
/usr/include/sys/socket.h:117:26: note: expected 'socklen_t * restrict' {aka 'unsigned int * restrict'} but argument is of type 'int *'
  117 |    socklen_t *__restrict __len) __THROW;
      |    ~~~~~~~~~~~~~~~~~~~~~~^~~~~
pppol2tp.c:147:16: warning: pointer targets in passing argument 5 of 'getsockopt' differ in signedness [-Wpointer-sign]
  147 |          &tmp, &tmp_len) < 0) {
      |                ^~~~~~~~
      |                |
      |                int *
In file included from /usr/include/net/if.h:26,
                 from pppol2tp.c:34:
/usr/include/sys/socket.h:210:32: note: expected 'socklen_t * restrict' {aka 'unsigned int * restrict'} but argument is of type 'int *'
  210 |          socklen_t *__restrict __optlen) __THROW;
      |          ~~~~~~~~~~~~~~~~~~~~~~^~~~~~~~
pppol2tp.c:125:9: warning: unused variable 'a' [-Wunused-variable]
  125 |  char **a;
      |         ^
pppol2tp.c: In function 'send_config_pppol2tp':
pppol2tp.c:204:6: warning: unused variable 'fd' [-Wunused-variable]
  204 |  int fd;
      |      ^~
pppol2tp.c:202:15: warning: unused variable 'ifr' [-Wunused-variable]
  202 |  struct ifreq ifr;
      |               ^~~
pppol2tp.c: In function 'pppol2tp_lcp_snoop':
pppol2tp.c:304:14: warning: variable 'snooping' set but not used [-Wunused-but-set-variable]
  304 |  static bool snooping = 1;
      |              ^~~~~~~~
At top level:
pppol2tp.c:483:13: warning: 'pppol2tp_cleanup' defined but not used [-Wunused-function]
  483 | static void pppol2tp_cleanup(void)
      |             ^~~~~~~~~~~~~~~~
make[2]: Leaving directory '/usr/src/RPM/BUILD/ppp-2.4.8/pppd/plugins/pppol2tp'
make[2]: Entering directory '/usr/src/RPM/BUILD/ppp-2.4.8/pppd/plugins/pppol2tp'
gcc -pipe -frecord-gcc-switches -Wall -g -O2 -march=i586 -mtune=generic -fPIC -Wall -D_GNU_SOURCE -fno-strict-aliasing -I. -I../.. -I../../../include -fPIC  -shared -o pppol2tp.so pppol2tp.o 
make[2]: Leaving directory '/usr/src/RPM/BUILD/ppp-2.4.8/pppd/plugins/pppol2tp'
rm pppol2tp.o openl2tp.o
make[2]: Entering directory '/usr/src/RPM/BUILD/ppp-2.4.8/pppd/plugins/radius'
make[2]: warning: -j8 forced in submake: resetting jobserver mode.
make[2]: Leaving directory '/usr/src/RPM/BUILD/ppp-2.4.8/pppd/plugins/radius'
make[2]: Entering directory '/usr/src/RPM/BUILD/ppp-2.4.8/pppd/plugins/radius'
gcc -pipe -frecord-gcc-switches -Wall -g -O2 -march=i586 -mtune=generic -fPIC -Wall -D_GNU_SOURCE -fno-strict-aliasing -I. -I../.. -I../../../include -fPIC -DRC_LOG_FACILITY=LOG_DAEMON -DCHAPMS=1 -DMPPE=1 -DMAXOCTETS=1 -DUSE_OPENSSL=1 -c -o clientid.o clientid.c
make[2]: Leaving directory '/usr/src/RPM/BUILD/ppp-2.4.8/pppd/plugins/radius'
make[2]: Entering directory '/usr/src/RPM/BUILD/ppp-2.4.8/pppd/plugins/radius'
gcc -pipe -frecord-gcc-switches -Wall -g -O2 -march=i586 -mtune=generic -fPIC -Wall -D_GNU_SOURCE -fno-strict-aliasing -I. -I../.. -I../../../include -fPIC -DRC_LOG_FACILITY=LOG_DAEMON -DCHAPMS=1 -DMPPE=1 -DMAXOCTETS=1 -DUSE_OPENSSL=1 -c -o ip_util.o ip_util.c
make[2]: Leaving directory '/usr/src/RPM/BUILD/ppp-2.4.8/pppd/plugins/radius'
make[2]: Entering directory '/usr/src/RPM/BUILD/ppp-2.4.8/pppd/plugins/radius'
gcc -pipe -frecord-gcc-switches -Wall -g -O2 -march=i586 -mtune=generic -fPIC -Wall -D_GNU_SOURCE -fno-strict-aliasing -I. -I../.. -I../../../include -fPIC -DRC_LOG_FACILITY=LOG_DAEMON -DCHAPMS=1 -DMPPE=1 -DMAXOCTETS=1 -DUSE_OPENSSL=1 -c -o dict.o dict.c
make[2]: Leaving directory '/usr/src/RPM/BUILD/ppp-2.4.8/pppd/plugins/radius'
make[2]: Entering directory '/usr/src/RPM/BUILD/ppp-2.4.8/pppd/plugins/radius'
gcc -pipe -frecord-gcc-switches -Wall -g -O2 -march=i586 -mtune=generic -fPIC -Wall -D_GNU_SOURCE -fno-strict-aliasing -I. -I../.. -I../../../include -fPIC -DRC_LOG_FACILITY=LOG_DAEMON -DCHAPMS=1 -DMPPE=1 -DMAXOCTETS=1 -DUSE_OPENSSL=1 -c -o sendserver.o sendserver.c
sendserver.c: In function 'rc_pack_list':
sendserver.c:107:14: warning: pointer targets in assignment from 'char *' to 'unsigned char *' differ in signedness [-Wpointer-sign]
  107 |       vector = (char *)auth->vector;
      |              ^
sendserver.c: In function 'rc_send_server':
sendserver.c:250:52: warning: pointer targets in passing argument 3 of 'getsockname' differ in signedness [-Wpointer-sign]
  250 |      getsockname (sockfd, (struct sockaddr *) sin, &length) < 0)
      |                                                    ^~~~~~~
      |                                                    |
      |                                                    int *
In file included from /usr/include/netinet/in.h:23,
                 from /usr/include/netdb.h:27,
                 from ./includes.h:22,
                 from sendserver.c:17:
/usr/include/sys/socket.h:117:26: note: expected 'socklen_t * restrict' {aka 'unsigned int * restrict'} but argument is of type 'int *'
  117 |    socklen_t *__restrict __len) __THROW;
      |    ~~~~~~~~~~~~~~~~~~~~~~^~~~~
sendserver.c:275:24: warning: pointer targets in passing argument 2 of 'rc_md5_calc' differ in signedness [-Wpointer-sign]
  275 |   rc_md5_calc (vector, (char *) auth, total_length + secretlen);
      |                        ^~~~~~~~~~~~~
      |                        |
      |                        char *
In file included from ./radiusclient.h:23,
                 from sendserver.c:18:
./radiusclient.h:458:40: note: expected 'unsigned char *' but argument is of type 'char *'
  458 | void rc_md5_calc __P((unsigned char *, unsigned char *, unsigned int));
      |                                        ^~~~~~~~~~~~~~~
../../pppd.h:66:19: note: in definition of macro '__P'
   66 | #define __P(args) args
      |                   ^~~~
sendserver.c:331:27: warning: pointer targets in passing argument 6 of 'recvfrom' differ in signedness [-Wpointer-sign]
  331 |       (int) 0, &saremote, &salen);
      |                           ^~~~~~
      |                           |
      |                           int *
In file included from /usr/include/sys/socket.h:269,
                 from /usr/include/netinet/in.h:23,
                 from /usr/include/netdb.h:27,
                 from ./includes.h:22,
                 from sendserver.c:17:
/usr/include/bits/socket2.h:65:49: note: expected 'socklen_t * restrict' {aka 'unsigned int * restrict'} but argument is of type 'int *'
   65 |    __SOCKADDR_ARG __addr, socklen_t *__restrict __addr_len)
      |                           ~~~~~~~~~~~~~~~~~~~~~~^~~~~~~~~~
sendserver.c:365:18: warning: pointer targets in passing argument 2 of 'strcat' differ in signedness [-Wpointer-sign]
  365 |    strcat(msg, vp->strvalue);
      |                ~~^~~~~~~~~~
      |                  |
      |                  u_char * {aka unsigned char *}
In file included from /usr/include/features.h:450,
                 from /usr/include/sys/types.h:25,
                 from ./includes.h:17,
                 from sendserver.c:17:
/usr/include/bits/string_fortified.h:126:1: note: expected 'const char * restrict' but argument is of type 'u_char *' {aka 'unsigned char *'}
  126 | __NTH (strcat (char *__restrict __dest, const char *__restrict __src))
      | ^~~~~
sendserver.c: In function 'rc_check_reply':
sendserver.c:431:28: warning: pointer targets in passing argument 2 of 'rc_md5_calc' differ in signedness [-Wpointer-sign]
  431 |  rc_md5_calc (calc_digest, (char *) auth, totallen + secretlen);
      |                            ^~~~~~~~~~~~~
      |                            |
      |                            char *
In file included from ./radiusclient.h:23,
                 from sendserver.c:18:
./radiusclient.h:458:40: note: expected 'unsigned char *' but argument is of type 'char *'
  458 | void rc_md5_calc __P((unsigned char *, unsigned char *, unsigned int));
      |                                        ^~~~~~~~~~~~~~~
../../pppd.h:66:19: note: in definition of macro '__P'
   66 | #define __P(args) args
      |                   ^~~~
make[2]: Leaving directory '/usr/src/RPM/BUILD/ppp-2.4.8/pppd/plugins/radius'
make[2]: Entering directory '/usr/src/RPM/BUILD/ppp-2.4.8/pppd/plugins/radius'
gcc -pipe -frecord-gcc-switches -Wall -g -O2 -march=i586 -mtune=generic -fPIC -Wall -D_GNU_SOURCE -fno-strict-aliasing -I. -I../.. -I../../../include -fPIC -DRC_LOG_FACILITY=LOG_DAEMON -DCHAPMS=1 -DMPPE=1 -DMAXOCTETS=1 -DUSE_OPENSSL=1 -c -o util.o util.c
make[2]: Leaving directory '/usr/src/RPM/BUILD/ppp-2.4.8/pppd/plugins/radius'
make[2]: Entering directory '/usr/src/RPM/BUILD/ppp-2.4.8/pppd/plugins/radius'
gcc -pipe -frecord-gcc-switches -Wall -g -O2 -march=i586 -mtune=generic -fPIC -Wall -D_GNU_SOURCE -fno-strict-aliasing -I. -I../.. -I../../../include -fPIC -DRC_LOG_FACILITY=LOG_DAEMON -DCHAPMS=1 -DMPPE=1 -DMAXOCTETS=1 -DUSE_OPENSSL=1 -c -o config.o config.c
config.c: In function 'rc_find_server':
config.c:528:32: warning: argument to 'sizeof' in 'memset' call is the same expression as the destination; did you mean to provide an explicit length? [-Wsizeof-pointer-memaccess]
  528 |   memset (secret, '\0', sizeof (secret));
      |                                ^
config.c:455:18: warning: unused variable 'len' [-Wunused-variable]
  455 |  int             len;
      |                  ^~~
make[2]: Leaving directory '/usr/src/RPM/BUILD/ppp-2.4.8/pppd/plugins/radius'
make[2]: Entering directory '/usr/src/RPM/BUILD/ppp-2.4.8/pppd/plugins/radius'
gcc -pipe -frecord-gcc-switches -Wall -g -O2 -march=i586 -mtune=generic -fPIC -Wall -D_GNU_SOURCE -fno-strict-aliasing -I. -I../.. -I../../../include -fPIC -DRC_LOG_FACILITY=LOG_DAEMON -DCHAPMS=1 -DMPPE=1 -DMAXOCTETS=1 -DUSE_OPENSSL=1 -c -o lock.o lock.c
make[2]: Leaving directory '/usr/src/RPM/BUILD/ppp-2.4.8/pppd/plugins/radius'
make[2]: Entering directory '/usr/src/RPM/BUILD/ppp-2.4.8/pppd/plugins/radius'
gcc -pipe -frecord-gcc-switches -Wall -g -O2 -march=i586 -mtune=generic -fPIC -Wall -D_GNU_SOURCE -fno-strict-aliasing -I. -I../.. -I../../../include -fPIC -DRC_LOG_FACILITY=LOG_DAEMON -DCHAPMS=1 -DMPPE=1 -DMAXOCTETS=1 -DUSE_OPENSSL=1 -c -o md5.o md5.c
make[2]: Leaving directory '/usr/src/RPM/BUILD/ppp-2.4.8/pppd/plugins/radius'
make[2]: Entering directory '/usr/src/RPM/BUILD/ppp-2.4.8/pppd/plugins/radius'
gcc -pipe -frecord-gcc-switches -Wall -g -O2 -march=i586 -mtune=generic -fPIC -Wall -D_GNU_SOURCE -fno-strict-aliasing -I. -I../.. -I../../../include -fPIC -DRC_LOG_FACILITY=LOG_DAEMON -DCHAPMS=1 -DMPPE=1 -DMAXOCTETS=1 -DUSE_OPENSSL=1 -c -o radrealms.o radrealms.c
radrealms.c:17:19: warning: 'RCSID' defined but not used [-Wunused-const-variable=]
   17 | static char const RCSID[] =
      |                   ^~~~~
make[2]: Leaving directory '/usr/src/RPM/BUILD/ppp-2.4.8/pppd/plugins/radius'
make[2]: Entering directory '/usr/src/RPM/BUILD/ppp-2.4.8/pppd/plugins/radius'
gcc -pipe -frecord-gcc-switches -Wall -g -O2 -march=i586 -mtune=generic -fPIC -Wall -D_GNU_SOURCE -fno-strict-aliasing -I. -I../.. -I../../../include -fPIC -DRC_LOG_FACILITY=LOG_DAEMON -DCHAPMS=1 -DMPPE=1 -DMAXOCTETS=1 -DUSE_OPENSSL=1 -c -o buildreq.o buildreq.c
buildreq.c: In function 'rc_get_seqnbr':
buildreq.c:138:2: warning: ignoring return value of 'ftruncate', declared with attribute warn_unused_result [-Wunused-result]
  138 |  ftruncate(fileno(sf),0);
      |  ^~~~~~~~~~~~~~~~~~~~~~~
make[2]: Leaving directory '/usr/src/RPM/BUILD/ppp-2.4.8/pppd/plugins/radius'
make[2]: Entering directory '/usr/src/RPM/BUILD/ppp-2.4.8/pppd/plugins/radius'
gcc -pipe -frecord-gcc-switches -Wall -g -O2 -march=i586 -mtune=generic -fPIC -Wall -D_GNU_SOURCE -fno-strict-aliasing -I. -I../.. -I../../../include -fPIC -DRC_LOG_FACILITY=LOG_DAEMON -DCHAPMS=1 -DMPPE=1 -DMAXOCTETS=1 -DUSE_OPENSSL=1 -c -o radattr.o radattr.c
radattr.c:17:19: warning: 'RCSID' defined but not used [-Wunused-const-variable=]
   17 | static char const RCSID[] =
      |                   ^~~~~
make[2]: Leaving directory '/usr/src/RPM/BUILD/ppp-2.4.8/pppd/plugins/radius'
make[2]: Entering directory '/usr/src/RPM/BUILD/ppp-2.4.8/pppd/plugins/radius'
gcc -pipe -frecord-gcc-switches -Wall -g -O2 -march=i586 -mtune=generic -fPIC -Wall -D_GNU_SOURCE -fno-strict-aliasing -I. -I../.. -I../../../include -fPIC -DRC_LOG_FACILITY=LOG_DAEMON -DCHAPMS=1 -DMPPE=1 -DMAXOCTETS=1 -DUSE_OPENSSL=1 -shared -o radrealms.so radrealms.o
make[2]: Leaving directory '/usr/src/RPM/BUILD/ppp-2.4.8/pppd/plugins/radius'
make[2]: Entering directory '/usr/src/RPM/BUILD/ppp-2.4.8/pppd/plugins/radius'
gcc -pipe -frecord-gcc-switches -Wall -g -O2 -march=i586 -mtune=generic -fPIC -Wall -D_GNU_SOURCE -fno-strict-aliasing -I. -I../.. -I../../../include -fPIC -DRC_LOG_FACILITY=LOG_DAEMON -DCHAPMS=1 -DMPPE=1 -DMAXOCTETS=1 -DUSE_OPENSSL=1 -shared -o radattr.so radattr.o
make[2]: Leaving directory '/usr/src/RPM/BUILD/ppp-2.4.8/pppd/plugins/radius'
make[2]: Entering directory '/usr/src/RPM/BUILD/ppp-2.4.8/pppd/plugins/radius'
gcc -pipe -frecord-gcc-switches -Wall -g -O2 -march=i586 -mtune=generic -fPIC -Wall -D_GNU_SOURCE -fno-strict-aliasing -I. -I../.. -I../../../include -fPIC -DRC_LOG_FACILITY=LOG_DAEMON -DCHAPMS=1 -DMPPE=1 -DMAXOCTETS=1 -DUSE_OPENSSL=1 -c -o avpair.o avpair.c
avpair.c: In function 'rc_avpair_assign':
avpair.c:79:15: warning: pointer targets in passing argument 1 of 'strncpy' differ in signedness [-Wpointer-sign]
   79 |    strncpy (vp->strvalue, (char *) pval, AUTH_STRING_LEN);
      |             ~~^~~~~~~~~~
      |               |
      |               u_char * {aka unsigned char *}
In file included from /usr/include/features.h:450,
                 from /usr/include/sys/types.h:25,
                 from ./includes.h:17,
                 from avpair.c:17:
/usr/include/bits/string_fortified.h:103:1: note: expected 'char * restrict' but argument is of type 'u_char *' {aka 'unsigned char *'}
  103 | __NTH (strncpy (char *__restrict __dest, const char *__restrict __src,
      | ^~~~~
avpair.c: In function 'rc_avpair_gen':
avpair.c:199:14: warning: pointer targets in passing argument 1 of 'sprintf' differ in signedness [-Wpointer-sign]
  199 |     sprintf (hex, "%2.2X", *x_ptr);
      |              ^~~
      |              |
      |              unsigned char *
In file included from /usr/include/features.h:450,
                 from /usr/include/sys/types.h:25,
                 from ./includes.h:17,
                 from avpair.c:17:
/usr/include/bits/stdio2.h:34:1: note: expected 'char * restrict' but argument is of type 'unsigned char *'
   34 | __NTH (sprintf (char *__restrict __s, const char *__restrict __fmt, ...))
      | ^~~~~
avpair.c:200:21: warning: pointer targets in passing argument 2 of 'strcat' differ in signedness [-Wpointer-sign]
  200 |     strcat (buffer, hex);
      |                     ^~~
      |                     |
      |                     unsigned char *
In file included from /usr/include/features.h:450,
                 from /usr/include/sys/types.h:25,
                 from ./includes.h:17,
                 from avpair.c:17:
/usr/include/bits/string_fortified.h:126:1: note: expected 'const char * restrict' but argument is of type 'unsigned char *'
  126 | __NTH (strcat (char *__restrict __dest, const char *__restrict __src))
      | ^~~~~
avpair.c: In function 'rc_avpair_parse':
avpair.c:600:17: warning: pointer targets in passing argument 1 of 'strcpy' differ in signedness [-Wpointer-sign]
  600 |     strcpy (pair->strvalue, valstr);
      |             ~~~~^~~~~~~~~~
      |                 |
      |                 u_char * {aka unsigned char *}
In file included from /usr/include/features.h:450,
                 from /usr/include/sys/types.h:25,
                 from ./includes.h:17,
                 from avpair.c:17:
/usr/include/bits/string_fortified.h:88:1: note: expected 'char * restrict' but argument is of type 'u_char *' {aka 'unsigned char *'}
   88 | __NTH (strcpy (char *__restrict __dest, const char *__restrict __src))
      | ^~~~~
avpair.c: In function 'rc_avpair_tostr':
avpair.c:724:20: warning: pointer targets in passing argument 2 of 'strncat' differ in signedness [-Wpointer-sign]
  724 |     strncat(value, ptr, 1);
      |                    ^~~
      |                    |
      |                    unsigned char *
In file included from /usr/include/features.h:450,
                 from /usr/include/sys/types.h:25,
                 from ./includes.h:17,
                 from avpair.c:17:
/usr/include/bits/string_fortified.h:133:1: note: expected 'const char * restrict' but argument is of type 'unsigned char *'
  133 | __NTH (strncat (char *__restrict __dest, const char *__restrict __src,
      | ^~~~~
In file included from /usr/include/string.h:507,
                 from ./includes.h:26,
                 from avpair.c:17:
In function 'strncat',
    inlined from 'rc_avpair_tostr' at avpair.c:724:5:
/usr/include/bits/string_fortified.h:136:10: warning: '__builtin_strncat' output may be truncated copying 1 byte from a string of length 128 [-Wstringop-truncation]
  136 |   return __builtin___strncat_chk (__dest, __src, __len, __bos (__dest));
      |          ^~~~~~~~~~~~~~~~~~~~~~~~~~~~~~~~~~~~~~~~~~~~~~~~~~~~~~~~~~~~~~
make[2]: Leaving directory '/usr/src/RPM/BUILD/ppp-2.4.8/pppd/plugins/radius'
make[2]: Entering directory '/usr/src/RPM/BUILD/ppp-2.4.8/pppd/plugins/radius'
ar rv libradiusclient.a avpair.o buildreq.o config.o dict.o ip_util.o clientid.o sendserver.o lock.o util.o md5.o
ar: creating libradiusclient.a
a - avpair.o
a - buildreq.o
a - config.o
a - dict.o
a - ip_util.o
a - clientid.o
a - sendserver.o
a - lock.o
a - util.o
a - md5.o
make[2]: Leaving directory '/usr/src/RPM/BUILD/ppp-2.4.8/pppd/plugins/radius'
make[2]: Entering directory '/usr/src/RPM/BUILD/ppp-2.4.8/pppd/plugins/radius'
gcc -pipe -frecord-gcc-switches -Wall -g -O2 -march=i586 -mtune=generic -fPIC -Wall -D_GNU_SOURCE -fno-strict-aliasing -I. -I../.. -I../../../include -fPIC -DRC_LOG_FACILITY=LOG_DAEMON -DCHAPMS=1 -DMPPE=1 -DMAXOCTETS=1 -DUSE_OPENSSL=1 -c -o radius.o radius.c
radius.c:209:34: warning: "/*" within comment [-Wcomment]
  209 | * worry about looking in /etc/ppp/*-secrets
      |                                   
radius.c: In function 'radius_setparams':
radius.c:600:52: warning: pointer targets in passing argument 2 of 'script_setenv' differ in signedness [-Wpointer-sign]
  600 |                script_setenv("RADIUS_FILTER_ID", vp->strvalue, 1);
      |                                                  ~~^~~~~~~~~~
      |                                                    |
      |                                                    u_char * {aka unsigned char *}
In file included from radius.c:29:
../../pppd.h:546:33: note: expected 'char *' but argument is of type 'u_char *' {aka 'unsigned char *'}
  546 | void script_setenv __P((char *, char *, int)); /* set script env var */
      |                                 ^~~~~~
../../pppd.h:66:19: note: in definition of macro '__P'
   66 | #define __P(args) args
      |                   ^~~~
radius.c:604:55: warning: pointer targets in passing argument 2 of 'script_setenv' differ in signedness [-Wpointer-sign]
  604 |                script_setenv("RADIUS_FRAMED_ROUTE", vp->strvalue, 1);
      |                                                     ~~^~~~~~~~~~
      |                                                       |
      |                                                       u_char * {aka unsigned char *}
In file included from radius.c:29:
../../pppd.h:546:33: note: expected 'char *' but argument is of type 'u_char *' {aka 'unsigned char *'}
  546 | void script_setenv __P((char *, char *, int)); /* set script env var */
      |                                 ^~~~~~
../../pppd.h:66:19: note: in definition of macro '__P'
   66 | #define __P(args) args
      |                   ^~~~
radius.c:665:50: warning: pointer targets in passing argument 1 of 'strncmp' differ in signedness [-Wpointer-sign]
  665 |   if ((vp->lvalue != 43) || strncmp(vp->strvalue + 1, "S=", 2)) {
      |                                     ~~~~~~~~~~~~~^~~
      |                                                  |
      |                                                  u_char * {aka unsigned char *}
In file included from radius.c:47:
/usr/include/string.h:139:33: note: expected 'const char *' but argument is of type 'u_char *' {aka 'unsigned char *'}
  139 | extern int strncmp (const char *__s1, const char *__s2, size_t __n)
      |                     ~~~~~~~~~~~~^~~~
radius.c:670:37: warning: pointer targets in passing argument 2 of 'strlcpy' differ in signedness [-Wpointer-sign]
  670 |       strlcpy(message, vp->strvalue + 1, message_space);
      |                        ~~~~~~~~~~~~~^~~
      |                                     |
      |                                     u_char * {aka unsigned char *}
In file included from /usr/include/features.h:450,
                 from /usr/include/bits/libc-header-start.h:33,
                 from /usr/include/stdio.h:27,
                 from ../../pppd.h:52,
                 from radius.c:29:
/usr/include/bits/string_fortified.h:151:1: note: expected 'const char * restrict' but argument is of type 'u_char *' {aka 'unsigned char *'}
  151 | __NTH (strlcpy (char *__restrict __dest, const char *__restrict __src,
      | ^~~~~
At top level:
radius.c:26:19: warning: 'RCSID' defined but not used [-Wunused-const-variable=]
   26 | static char const RCSID[] =
      |                   ^~~~~
make[2]: Leaving directory '/usr/src/RPM/BUILD/ppp-2.4.8/pppd/plugins/radius'
make[2]: Entering directory '/usr/src/RPM/BUILD/ppp-2.4.8/pppd/plugins/radius'
gcc -pipe -frecord-gcc-switches -Wall -g -O2 -march=i586 -mtune=generic -fPIC -Wall -D_GNU_SOURCE -fno-strict-aliasing -I. -I../.. -I../../../include -fPIC -DRC_LOG_FACILITY=LOG_DAEMON -DCHAPMS=1 -DMPPE=1 -DMAXOCTETS=1 -DUSE_OPENSSL=1 -shared -o radius.so radius.o libradiusclient.a -lcrypto
make[2]: Leaving directory '/usr/src/RPM/BUILD/ppp-2.4.8/pppd/plugins/radius'
make[2]: Entering directory '/usr/src/RPM/BUILD/ppp-2.4.8/pppd/plugins/dhcp'
make[2]: warning: -j8 forced in submake: resetting jobserver mode.
make[2]: Leaving directory '/usr/src/RPM/BUILD/ppp-2.4.8/pppd/plugins/dhcp'
make[2]: Entering directory '/usr/src/RPM/BUILD/ppp-2.4.8/pppd/plugins/dhcp'
libtool --mode=compile --tag=CC gcc -I../.. -I../../../include -pipe -frecord-gcc-switches -Wall -g -O2 -march=i586 -mtune=generic -fPIC -Wall -D_GNU_SOURCE -fno-strict-aliasing  -c socket.c
libtool-default: compile:  gcc -I../.. -I../../../include -pipe -frecord-gcc-switches -Wall -g -O2 -march=i586 -mtune=generic -fPIC -Wall -D_GNU_SOURCE -fno-strict-aliasing -c socket.c  -fPIC -DPIC -o .libs/socket.o
In file included from socket.c:44:
socket.c: In function 'read_interface':
debug.h:9:37: warning: implicit declaration of function 'dbglog' [-Wimplicit-function-declaration]
    9 | # define DEBUG(level, str, args...) dbglog("DHCPC: " str, ## args)
      |                                     ^~~~~~
socket.c:61:5: note: in expansion of macro 'DEBUG'
   61 |     DEBUG(LOG_INFO, "%s (our ip) = %s", ifr.ifr_name, inet_ntoa(sin->sin_addr));
      |     ^~~~~
debug.h:16:34: warning: implicit declaration of function 'info' [-Wimplicit-function-declaration]
   16 | #define LOG(level, str, args...) info("DHCPC: " str, ## args)
      |                                  ^~~~
socket.c:63:5: note: in expansion of macro 'LOG'
   63 |     LOG(LOG_ERR, "SIOCGIFADDR failed!: %s", sys_errlist[errno]);
      |     ^~~
In file included from /usr/include/string.h:507,
                 from socket.c:30:
In function 'strncpy',
    inlined from 'listen_socket' at socket.c:124:6:
/usr/include/bits/string_fortified.h:106:10: warning: '__builtin_strncpy' specified bound 16 equals destination size [-Wstringop-truncation]
  106 |   return __builtin___strncpy_chk (__dest, __src, __len, __bos (__dest));
      |          ^~~~~~~~~~~~~~~~~~~~~~~~~~~~~~~~~~~~~~~~~~~~~~~~~~~~~~~~~~~~~~
libtool-default: compile:  gcc -I../.. -I../../../include -pipe -frecord-gcc-switches -Wall -g -O2 -march=i586 -mtune=generic -fPIC -Wall -D_GNU_SOURCE -fno-strict-aliasing -c socket.c -o socket.o >/dev/null 2>&1
make[2]: Leaving directory '/usr/src/RPM/BUILD/ppp-2.4.8/pppd/plugins/dhcp'
make[2]: Entering directory '/usr/src/RPM/BUILD/ppp-2.4.8/pppd/plugins/dhcp'
libtool --mode=compile --tag=CC gcc -I../.. -I../../../include -pipe -frecord-gcc-switches -Wall -g -O2 -march=i586 -mtune=generic -fPIC -Wall -D_GNU_SOURCE -fno-strict-aliasing  -c options.c
libtool-default: compile:  gcc -I../.. -I../../../include -pipe -frecord-gcc-switches -Wall -g -O2 -march=i586 -mtune=generic -fPIC -Wall -D_GNU_SOURCE -fno-strict-aliasing -c options.c  -fPIC -DPIC -o .libs/options.o
In file included from options.c:10:
options.c: In function 'get_option':
debug.h:16:34: warning: implicit declaration of function 'info' [-Wimplicit-function-declaration]
   16 | #define LOG(level, str, args...) info("DHCPC: " str, ## args)
      |                                  ^~~~
options.c:76:4: note: in expansion of macro 'LOG'
   76 |    LOG(LOG_WARNING, "bogus packet, option fields too long.");
      |    ^~~
options.c: In function 'add_option_string':
debug.h:9:37: warning: implicit declaration of function 'dbglog' [-Wimplicit-function-declaration]
    9 | # define DEBUG(level, str, args...) dbglog("DHCPC: " str, ## args)
      |                                     ^~~~~~
options.c:143:2: note: in expansion of macro 'DEBUG'
  143 |  DEBUG(LOG_INFO, "adding option 0x%02x", string[OPT_CODE]);
      |  ^~~~~
libtool-default: compile:  gcc -I../.. -I../../../include -pipe -frecord-gcc-switches -Wall -g -O2 -march=i586 -mtune=generic -fPIC -Wall -D_GNU_SOURCE -fno-strict-aliasing -c options.c -o options.o >/dev/null 2>&1
make[2]: Leaving directory '/usr/src/RPM/BUILD/ppp-2.4.8/pppd/plugins/dhcp'
make[2]: Entering directory '/usr/src/RPM/BUILD/ppp-2.4.8/pppd/plugins/dhcp'
libtool --mode=compile --tag=CC gcc -I../.. -I../../../include -pipe -frecord-gcc-switches -Wall -g -O2 -march=i586 -mtune=generic -fPIC -Wall -D_GNU_SOURCE -fno-strict-aliasing  -c packet.c
libtool-default: compile:  gcc -I../.. -I../../../include -pipe -frecord-gcc-switches -Wall -g -O2 -march=i586 -mtune=generic -fPIC -Wall -D_GNU_SOURCE -fno-strict-aliasing -c packet.c  -fPIC -DPIC -o .libs/packet.o
In file included from packet.c:18:
packet.c: In function 'get_packet':
debug.h:9:37: warning: implicit declaration of function 'dbglog' [-Wimplicit-function-declaration]
    9 | # define DEBUG(level, str, args...) dbglog("DHCPC: " str, ## args)
      |                                     ^~~~~~
packet.c:60:3: note: in expansion of macro 'DEBUG'
   60 |   DEBUG(LOG_INFO, "couldn't read on listening socket, ignoring");
      |   ^~~~~
debug.h:16:34: warning: implicit declaration of function 'info' [-Wimplicit-function-declaration]
   16 | #define LOG(level, str, args...) info("DHCPC: " str, ## args)
      |                                  ^~~~
packet.c:65:3: note: in expansion of macro 'LOG'
   65 |   LOG(LOG_ERR, "received bogus message, ignoring");
      |   ^~~
packet.c:73:17: warning: pointer targets in passing argument 1 of 'strncmp' differ in signedness [-Wpointer-sign]
   73 |        !strncmp(vendor, broken_vendors[i], vendor[OPT_LEN - 2])) {
      |                 ^~~~~~
      |                 |
      |                 unsigned char *
In file included from packet.c:2:
/usr/include/string.h:139:33: note: expected 'const char *' but argument is of type 'unsigned char *'
  139 | extern int strncmp (const char *__s1, const char *__s2, size_t __n)
      |                     ~~~~~~~~~~~~^~~~
packet.c: In function 'raw_packet':
packet.c:121:5: warning: suggest explicit braces to avoid ambiguous 'else' [-Wdangling-else]
  121 |  if (payload->giaddr && source_port==CLIENT_PORT)
      |     ^
libtool-default: compile:  gcc -I../.. -I../../../include -pipe -frecord-gcc-switches -Wall -g -O2 -march=i586 -mtune=generic -fPIC -Wall -D_GNU_SOURCE -fno-strict-aliasing -c packet.c -o packet.o >/dev/null 2>&1
make[2]: Leaving directory '/usr/src/RPM/BUILD/ppp-2.4.8/pppd/plugins/dhcp'
make[2]: Entering directory '/usr/src/RPM/BUILD/ppp-2.4.8/pppd/plugins/dhcp'
libtool --mode=compile --tag=CC gcc -I../.. -I../../../include -pipe -frecord-gcc-switches -Wall -g -O2 -march=i586 -mtune=generic -fPIC -Wall -D_GNU_SOURCE -fno-strict-aliasing  -c clientpacket.c
libtool-default: compile:  gcc -I../.. -I../../../include -pipe -frecord-gcc-switches -Wall -g -O2 -march=i586 -mtune=generic -fPIC -Wall -D_GNU_SOURCE -fno-strict-aliasing -c clientpacket.c  -fPIC -DPIC -o .libs/clientpacket.o
In file included from clientpacket.c:44:
clientpacket.c: In function 'send_discover':
debug.h:16:34: warning: implicit declaration of function 'info' [-Wimplicit-function-declaration]
   16 | #define LOG(level, str, args...) info("DHCPC: " str, ## args)
      |                                  ^~~~
clientpacket.c:109:2: note: in expansion of macro 'LOG'
  109 |  LOG(LOG_DEBUG, "Sending discover...");
      |  ^~~
clientpacket.c: In function 'get_raw_packet':
debug.h:9:37: warning: implicit declaration of function 'dbglog' [-Wimplicit-function-declaration]
    9 | # define DEBUG(level, str, args...) dbglog("DHCPC: " str, ## args)
      |                                     ^~~~~~
clientpacket.c:188:3: note: in expansion of macro 'DEBUG'
  188 |   DEBUG(LOG_INFO, "couldn't read on raw listening socket -- ignoring");
      |   ^~~~~
libtool-default: compile:  gcc -I../.. -I../../../include -pipe -frecord-gcc-switches -Wall -g -O2 -march=i586 -mtune=generic -fPIC -Wall -D_GNU_SOURCE -fno-strict-aliasing -c clientpacket.c -o clientpacket.o >/dev/null 2>&1
make[2]: Leaving directory '/usr/src/RPM/BUILD/ppp-2.4.8/pppd/plugins/dhcp'
make[2]: Entering directory '/usr/src/RPM/BUILD/ppp-2.4.8/pppd/plugins/dhcp'
libtool --mode=compile --tag=CC gcc -I../.. -I../../../include -pipe -frecord-gcc-switches -Wall -g -O2 -march=i586 -mtune=generic -fPIC -Wall -D_GNU_SOURCE -fno-strict-aliasing  -c dhcpc.c
libtool-default: compile:  gcc -I../.. -I../../../include -pipe -frecord-gcc-switches -Wall -g -O2 -march=i586 -mtune=generic -fPIC -Wall -D_GNU_SOURCE -fno-strict-aliasing -c dhcpc.c  -fPIC -DPIC -o .libs/dhcpc.o
dhcpc.c: In function 'change_mode':
dhcpc.c:127:6: warning: suggest explicit braces to avoid ambiguous 'else' [-Wdangling-else]
  127 |   if (new_mode == LISTEN_RAW && client_config.giaddr)
      |      ^
dhcpc.c: In function 'dhcp_rx':
dhcpc.c:191:10: warning: unused variable 'now' [-Wunused-variable]
  191 |   time_t now;
      |          ^~~
dhcpc.c:190:7: warning: unused variable 'pid_fd' [-Wunused-variable]
  190 |   int pid_fd;
      |       ^~~~~~
dhcpc.c:189:18: warning: unused variable 'temp_addr' [-Wunused-variable]
  189 |   struct in_addr temp_addr;
      |                  ^~~~~~~~~
dhcpc.c:187:7: warning: unused variable 'c' [-Wunused-variable]
  187 |   int c, len;
      |       ^
dhcpc.c:185:7: warning: unused variable 'retval' [-Wunused-variable]
  185 |   int retval;
      |       ^~~~~~
dhcpc.c:183:17: warning: unused variable 't2' [-Wunused-variable]
  183 |   unsigned long t2 = 0;
      |                 ^~
dhcpc.c:182:18: warning: unused variable 'temp' [-Wunused-variable]
  182 |   unsigned char *temp, *message;
      |                  ^~~~
dhcpc.c: In function 'dhcp_request_new':
dhcpc.c:312:7: warning: unused variable 'c' [-Wunused-variable]
  312 |   int c, len;
      |       ^
dhcpc.c:308:25: warning: unused variable 't2' [-Wunused-variable]
  308 |   unsigned long t1 = 0, t2 = 0;
      |                         ^~
dhcpc.c:308:17: warning: unused variable 't1' [-Wunused-variable]
  308 |   unsigned long t1 = 0, t2 = 0;
      |                 ^~
dhcpc.c: In function 'dhcp_read_options':
dhcpc.c:514:6: warning: suggest explicit braces to avoid ambiguous 'else' [-Wdangling-else]
  514 |   if (dhcp_subnet_selection)
      |      ^
libtool-default: compile:  gcc -I../.. -I../../../include -pipe -frecord-gcc-switches -Wall -g -O2 -march=i586 -mtune=generic -fPIC -Wall -D_GNU_SOURCE -fno-strict-aliasing -c dhcpc.c -o dhcpc.o >/dev/null 2>&1
make[2]: Leaving directory '/usr/src/RPM/BUILD/ppp-2.4.8/pppd/plugins/dhcp'
make[2]: Entering directory '/usr/src/RPM/BUILD/ppp-2.4.8/pppd/plugins/dhcp'
libtool --mode=link --tag=CC gcc -I../.. -I../../../include -pipe -frecord-gcc-switches -Wall -g -O2 -march=i586 -mtune=generic -fPIC -Wall -D_GNU_SOURCE -fno-strict-aliasing  -o libdhcpc.la dhcpc.lo clientpacket.lo packet.lo socket.lo options.lo -shared -Wl,-soname,dhcpc.so
libtool-default: link: ar cr .libs/libdhcpc.a .libs/dhcpc.o .libs/clientpacket.o .libs/packet.o .libs/socket.o .libs/options.o 
libtool-default: link: ranlib .libs/libdhcpc.a
libtool-default: link: ( cd ".libs" && rm -f "libdhcpc.la" && ln -s "../libdhcpc.la" "libdhcpc.la" )
make[2]: Leaving directory '/usr/src/RPM/BUILD/ppp-2.4.8/pppd/plugins/dhcp'
make[2]: Entering directory '/usr/src/RPM/BUILD/ppp-2.4.8/pppd/plugins/dhcp'
gcc -o dhcpc.so .libs/dhcpc.o .libs/clientpacket.o .libs/packet.o .libs/socket.o .libs/options.o -shared -Wl,-soname,dhcpc.so
/usr/bin/ld.default: .libs/dhcpc.o: in function `change_mode':
/usr/src/RPM/BUILD/ppp-2.4.8/pppd/plugins/dhcp/dhcpc.c:147: warning: `sys_errlist' is deprecated; use `strerror' or `strerror_r' instead
make[2]: Leaving directory '/usr/src/RPM/BUILD/ppp-2.4.8/pppd/plugins/dhcp'
cd pppd; make -w -j8 -Otarget --jobserver-auth=3,4 all
make[1]: Entering directory '/usr/src/RPM/BUILD/ppp-2.4.8/pppd'
make[1]: warning: -j8 forced in submake: resetting jobserver mode.
make[1]: Leaving directory '/usr/src/RPM/BUILD/ppp-2.4.8/pppd'
make[1]: Entering directory '/usr/src/RPM/BUILD/ppp-2.4.8/pppd'
gcc -pipe -frecord-gcc-switches -Wall -g -O2 -march=i586 -mtune=generic -fPIC -Wall -D_GNU_SOURCE -fno-strict-aliasing -DHAVE_PATHS_H -DIPX_CHANGE -DHAVE_MMAP -I../include '-DDESTDIR="/usr"' '-DLIBDIR="/usr/lib"' -DCHAPMS=1 -DMPPE=1 -DUSE_OPENSSL -DUSE_EAPTLS=1 -DHAS_SHADOW -DHAVE_CRYPT_H=1 -DHAVE_LOGWTMP=1 -I/usr/include/openssl -DUSE_PAM -DHAVE_MULTILINK -DUSE_TDB=1 -DSYSTEMD=1 -DPLUGIN -DPPP_FILTER -DINET6=1 -DCBCP_SUPPORT -DMAXOCTETS   -c -o magic.o magic.c
make[1]: Leaving directory '/usr/src/RPM/BUILD/ppp-2.4.8/pppd'
make[1]: Entering directory '/usr/src/RPM/BUILD/ppp-2.4.8/pppd'
gcc -pipe -frecord-gcc-switches -Wall -g -O2 -march=i586 -mtune=generic -fPIC -Wall -D_GNU_SOURCE -fno-strict-aliasing -DHAVE_PATHS_H -DIPX_CHANGE -DHAVE_MMAP -I../include '-DDESTDIR="/usr"' '-DLIBDIR="/usr/lib"' -DCHAPMS=1 -DMPPE=1 -DUSE_OPENSSL -DUSE_EAPTLS=1 -DHAS_SHADOW -DHAVE_CRYPT_H=1 -DHAVE_LOGWTMP=1 -I/usr/include/openssl -DUSE_PAM -DHAVE_MULTILINK -DUSE_TDB=1 -DSYSTEMD=1 -DPLUGIN -DPPP_FILTER -DINET6=1 -DCBCP_SUPPORT -DMAXOCTETS   -c -o ecp.o ecp.c
make[1]: Leaving directory '/usr/src/RPM/BUILD/ppp-2.4.8/pppd'
make[1]: Entering directory '/usr/src/RPM/BUILD/ppp-2.4.8/pppd'
gcc -pipe -frecord-gcc-switches -Wall -g -O2 -march=i586 -mtune=generic -fPIC -Wall -D_GNU_SOURCE -fno-strict-aliasing -DHAVE_PATHS_H -DIPX_CHANGE -DHAVE_MMAP -I../include '-DDESTDIR="/usr"' '-DLIBDIR="/usr/lib"' -DCHAPMS=1 -DMPPE=1 -DUSE_OPENSSL -DUSE_EAPTLS=1 -DHAS_SHADOW -DHAVE_CRYPT_H=1 -DHAVE_LOGWTMP=1 -I/usr/include/openssl -DUSE_PAM -DHAVE_MULTILINK -DUSE_TDB=1 -DSYSTEMD=1 -DPLUGIN -DPPP_FILTER -DINET6=1 -DCBCP_SUPPORT -DMAXOCTETS   -c -o fsm.o fsm.c
make[1]: Leaving directory '/usr/src/RPM/BUILD/ppp-2.4.8/pppd'
make[1]: Entering directory '/usr/src/RPM/BUILD/ppp-2.4.8/pppd'
gcc -pipe -frecord-gcc-switches -Wall -g -O2 -march=i586 -mtune=generic -fPIC -Wall -D_GNU_SOURCE -fno-strict-aliasing -DHAVE_PATHS_H -DIPX_CHANGE -DHAVE_MMAP -I../include '-DDESTDIR="/usr"' '-DLIBDIR="/usr/lib"' -DCHAPMS=1 -DMPPE=1 -DUSE_OPENSSL -DUSE_EAPTLS=1 -DHAS_SHADOW -DHAVE_CRYPT_H=1 -DHAVE_LOGWTMP=1 -I/usr/include/openssl -DUSE_PAM -DHAVE_MULTILINK -DUSE_TDB=1 -DSYSTEMD=1 -DPLUGIN -DPPP_FILTER -DINET6=1 -DCBCP_SUPPORT -DMAXOCTETS   -c -o upap.o upap.c
make[1]: Leaving directory '/usr/src/RPM/BUILD/ppp-2.4.8/pppd'
make[1]: Entering directory '/usr/src/RPM/BUILD/ppp-2.4.8/pppd'
gcc -pipe -frecord-gcc-switches -Wall -g -O2 -march=i586 -mtune=generic -fPIC -Wall -D_GNU_SOURCE -fno-strict-aliasing -DHAVE_PATHS_H -DIPX_CHANGE -DHAVE_MMAP -I../include '-DDESTDIR="/usr"' '-DLIBDIR="/usr/lib"' -DCHAPMS=1 -DMPPE=1 -DUSE_OPENSSL -DUSE_EAPTLS=1 -DHAS_SHADOW -DHAVE_CRYPT_H=1 -DHAVE_LOGWTMP=1 -I/usr/include/openssl -DUSE_PAM -DHAVE_MULTILINK -DUSE_TDB=1 -DSYSTEMD=1 -DPLUGIN -DPPP_FILTER -DINET6=1 -DCBCP_SUPPORT -DMAXOCTETS   -c -o main.o main.c
main.c: In function 'main':
main.c:584:3: warning: implicit declaration of function 'tty_close_fds' [-Wimplicit-function-declaration]
  584 |   tty_close_fds();
      |   ^~~~~~~~~~~~~
main.c:436:5: warning: ignoring return value of 'chdir', declared with attribute warn_unused_result [-Wunused-result]
  436 |     chdir("/");
      |     ^~~~~~~~~~
main.c: In function 'open_ccp':
main.c:1615:2: warning: ignoring return value of 'write', declared with attribute warn_unused_result [-Wunused-result]
 1615 |  write(sigpipe[1], &sig, sizeof(sig));
      |  ^~~~~~~~~~~~~~~~~~~~~~~~~~~~~~~~~~~~
main.c: In function 'chld':
main.c:1580:2: warning: ignoring return value of 'write', declared with attribute warn_unused_result [-Wunused-result]
 1580 |  write(sigpipe[1], &sig, sizeof(sig));
      |  ^~~~~~~~~~~~~~~~~~~~~~~~~~~~~~~~~~~~
main.c: In function 'term':
main.c:1566:2: warning: ignoring return value of 'write', declared with attribute warn_unused_result [-Wunused-result]
 1566 |  write(sigpipe[1], &sig, sizeof(sig));
      |  ^~~~~~~~~~~~~~~~~~~~~~~~~~~~~~~~~~~~
main.c: In function 'hup':
main.c:1544:2: warning: ignoring return value of 'write', declared with attribute warn_unused_result [-Wunused-result]
 1544 |  write(sigpipe[1], &sig, sizeof(sig));
      |  ^~~~~~~~~~~~~~~~~~~~~~~~~~~~~~~~~~~~
main.c: In function 'device_script':
main.c:1824:5: warning: ignoring return value of 'setgid', declared with attribute warn_unused_result [-Wunused-result]
 1824 |     setgid(getgid());
      |     ^~~~~~~~~~~~~~~~
main.c:1825:5: warning: ignoring return value of 'setuid', declared with attribute warn_unused_result [-Wunused-result]
 1825 |     setuid(uid);
      |     ^~~~~~~~~~~
main.c: In function 'run_program':
main.c:1935:12: warning: ignoring return value of 'chdir', declared with attribute warn_unused_result [-Wunused-result]
 1935 |     (void) chdir ("/"); /* no current directory. */
      |            ^~~~~~~~~~~
main.c:1936:5: warning: ignoring return value of 'setuid', declared with attribute warn_unused_result [-Wunused-result]
 1936 |     setuid(0);  /* set real UID = root */
      |     ^~~~~~~~~
main.c:1937:5: warning: ignoring return value of 'setgid', declared with attribute warn_unused_result [-Wunused-result]
 1937 |     setgid(getegid());
      |     ^~~~~~~~~~~~~~~~~
make[1]: Leaving directory '/usr/src/RPM/BUILD/ppp-2.4.8/pppd'
make[1]: Entering directory '/usr/src/RPM/BUILD/ppp-2.4.8/pppd'
gcc -pipe -frecord-gcc-switches -Wall -g -O2 -march=i586 -mtune=generic -fPIC -Wall -D_GNU_SOURCE -fno-strict-aliasing -DHAVE_PATHS_H -DIPX_CHANGE -DHAVE_MMAP -I../include '-DDESTDIR="/usr"' '-DLIBDIR="/usr/lib"' -DCHAPMS=1 -DMPPE=1 -DUSE_OPENSSL -DUSE_EAPTLS=1 -DHAS_SHADOW -DHAVE_CRYPT_H=1 -DHAVE_LOGWTMP=1 -I/usr/include/openssl -DUSE_PAM -DHAVE_MULTILINK -DUSE_TDB=1 -DSYSTEMD=1 -DPLUGIN -DPPP_FILTER -DINET6=1 -DCBCP_SUPPORT -DMAXOCTETS   -c -o chap-new.o chap-new.c
make[1]: Leaving directory '/usr/src/RPM/BUILD/ppp-2.4.8/pppd'
make[1]: Entering directory '/usr/src/RPM/BUILD/ppp-2.4.8/pppd'
gcc -pipe -frecord-gcc-switches -Wall -g -O2 -march=i586 -mtune=generic -fPIC -Wall -D_GNU_SOURCE -fno-strict-aliasing -DHAVE_PATHS_H -DIPX_CHANGE -DHAVE_MMAP -I../include '-DDESTDIR="/usr"' '-DLIBDIR="/usr/lib"' -DCHAPMS=1 -DMPPE=1 -DUSE_OPENSSL -DUSE_EAPTLS=1 -DHAS_SHADOW -DHAVE_CRYPT_H=1 -DHAVE_LOGWTMP=1 -I/usr/include/openssl -DUSE_PAM -DHAVE_MULTILINK -DUSE_TDB=1 -DSYSTEMD=1 -DPLUGIN -DPPP_FILTER -DINET6=1 -DCBCP_SUPPORT -DMAXOCTETS   -c -o demand.o demand.c
make[1]: Leaving directory '/usr/src/RPM/BUILD/ppp-2.4.8/pppd'
make[1]: Entering directory '/usr/src/RPM/BUILD/ppp-2.4.8/pppd'
gcc -pipe -frecord-gcc-switches -Wall -g -O2 -march=i586 -mtune=generic -fPIC -Wall -D_GNU_SOURCE -fno-strict-aliasing -DHAVE_PATHS_H -DIPX_CHANGE -DHAVE_MMAP -I../include '-DDESTDIR="/usr"' '-DLIBDIR="/usr/lib"' -DCHAPMS=1 -DMPPE=1 -DUSE_OPENSSL -DUSE_EAPTLS=1 -DHAS_SHADOW -DHAVE_CRYPT_H=1 -DHAVE_LOGWTMP=1 -I/usr/include/openssl -DUSE_PAM -DHAVE_MULTILINK -DUSE_TDB=1 -DSYSTEMD=1 -DPLUGIN -DPPP_FILTER -DINET6=1 -DCBCP_SUPPORT -DMAXOCTETS   -c -o ccp.o ccp.c
make[1]: Leaving directory '/usr/src/RPM/BUILD/ppp-2.4.8/pppd'
make[1]: Entering directory '/usr/src/RPM/BUILD/ppp-2.4.8/pppd'
gcc -pipe -frecord-gcc-switches -Wall -g -O2 -march=i586 -mtune=generic -fPIC -Wall -D_GNU_SOURCE -fno-strict-aliasing -DHAVE_PATHS_H -DIPX_CHANGE -DHAVE_MMAP -I../include '-DDESTDIR="/usr"' '-DLIBDIR="/usr/lib"' -DCHAPMS=1 -DMPPE=1 -DUSE_OPENSSL -DUSE_EAPTLS=1 -DHAS_SHADOW -DHAVE_CRYPT_H=1 -DHAVE_LOGWTMP=1 -I/usr/include/openssl -DUSE_PAM -DHAVE_MULTILINK -DUSE_TDB=1 -DSYSTEMD=1 -DPLUGIN -DPPP_FILTER -DINET6=1 -DCBCP_SUPPORT -DMAXOCTETS   -c -o ipcp.o ipcp.c
make[1]: Leaving directory '/usr/src/RPM/BUILD/ppp-2.4.8/pppd'
make[1]: Entering directory '/usr/src/RPM/BUILD/ppp-2.4.8/pppd'
gcc -pipe -frecord-gcc-switches -Wall -g -O2 -march=i586 -mtune=generic -fPIC -Wall -D_GNU_SOURCE -fno-strict-aliasing -DHAVE_PATHS_H -DIPX_CHANGE -DHAVE_MMAP -I../include '-DDESTDIR="/usr"' '-DLIBDIR="/usr/lib"' -DCHAPMS=1 -DMPPE=1 -DUSE_OPENSSL -DUSE_EAPTLS=1 -DHAS_SHADOW -DHAVE_CRYPT_H=1 -DHAVE_LOGWTMP=1 -I/usr/include/openssl -DUSE_PAM -DHAVE_MULTILINK -DUSE_TDB=1 -DSYSTEMD=1 -DPLUGIN -DPPP_FILTER -DINET6=1 -DCBCP_SUPPORT -DMAXOCTETS   -c -o utils.o utils.c
utils.c: In function 'lock':
utils.c:978:5: warning: ignoring return value of 'write', declared with attribute warn_unused_result [-Wunused-result]
  978 |     write (fd, lock_buffer, 11);
      |     ^~~~~~~~~~~~~~~~~~~~~~~~~~~
utils.c: In function 'relock':
utils.c:1020:5: warning: ignoring return value of 'write', declared with attribute warn_unused_result [-Wunused-result]
 1020 |     write (fd, lock_buffer, 11);
      |     ^~~~~~~~~~~~~~~~~~~~~~~~~~~
make[1]: Leaving directory '/usr/src/RPM/BUILD/ppp-2.4.8/pppd'
make[1]: Entering directory '/usr/src/RPM/BUILD/ppp-2.4.8/pppd'
gcc -pipe -frecord-gcc-switches -Wall -g -O2 -march=i586 -mtune=generic -fPIC -Wall -D_GNU_SOURCE -fno-strict-aliasing -DHAVE_PATHS_H -DIPX_CHANGE -DHAVE_MMAP -I../include '-DDESTDIR="/usr"' '-DLIBDIR="/usr/lib"' -DCHAPMS=1 -DMPPE=1 -DUSE_OPENSSL -DUSE_EAPTLS=1 -DHAS_SHADOW -DHAVE_CRYPT_H=1 -DHAVE_LOGWTMP=1 -I/usr/include/openssl -DUSE_PAM -DHAVE_MULTILINK -DUSE_TDB=1 -DSYSTEMD=1 -DPLUGIN -DPPP_FILTER -DINET6=1 -DCBCP_SUPPORT -DMAXOCTETS   -c -o chap-md5.o chap-md5.c
make[1]: Leaving directory '/usr/src/RPM/BUILD/ppp-2.4.8/pppd'
make[1]: Entering directory '/usr/src/RPM/BUILD/ppp-2.4.8/pppd'
gcc -pipe -frecord-gcc-switches -Wall -g -O2 -march=i586 -mtune=generic -fPIC -Wall -D_GNU_SOURCE -fno-strict-aliasing -DHAVE_PATHS_H -DIPX_CHANGE -DHAVE_MMAP -I../include '-DDESTDIR="/usr"' '-DLIBDIR="/usr/lib"' -DCHAPMS=1 -DMPPE=1 -DUSE_OPENSSL -DUSE_EAPTLS=1 -DHAS_SHADOW -DHAVE_CRYPT_H=1 -DHAVE_LOGWTMP=1 -I/usr/include/openssl -DUSE_PAM -DHAVE_MULTILINK -DUSE_TDB=1 -DSYSTEMD=1 -DPLUGIN -DPPP_FILTER -DINET6=1 -DCBCP_SUPPORT -DMAXOCTETS   -c -o tty.o tty.c
tty.c: In function 'setup_serial':
tty.c:1241:12: warning: 'return' with a value, in function returning void [-Wreturn-type]
 1241 |     return -1;
      |            ^
tty.c:1205:6: note: declared here
 1205 | void setup_serial(char *connector)
      |      ^~~~~~~~~~~~
tty.c: In function 'start_charshunt':
tty.c:880:2: warning: ignoring return value of 'setgid', declared with attribute warn_unused_result [-Wunused-result]
  880 |  setgid(getgid());
      |  ^~~~~~~~~~~~~~~~
tty.c:881:2: warning: ignoring return value of 'setuid', declared with attribute warn_unused_result [-Wunused-result]
  881 |  setuid(uid);
      |  ^~~~~~~~~~~
tty.c: In function 'setup_serial':
tty.c:1228:5: warning: ignoring return value of 'seteuid', declared with attribute warn_unused_result [-Wunused-result]
 1228 |     seteuid(uid);
      |     ^~~~~~~~~~~~
tty.c:1232:5: warning: ignoring return value of 'seteuid', declared with attribute warn_unused_result [-Wunused-result]
 1232 |     seteuid(0);
      |     ^~~~~~~~~~
make[1]: Leaving directory '/usr/src/RPM/BUILD/ppp-2.4.8/pppd'
make[1]: Entering directory '/usr/src/RPM/BUILD/ppp-2.4.8/pppd'
gcc -pipe -frecord-gcc-switches -Wall -g -O2 -march=i586 -mtune=generic -fPIC -Wall -D_GNU_SOURCE -fno-strict-aliasing -DHAVE_PATHS_H -DIPX_CHANGE -DHAVE_MMAP -I../include '-DDESTDIR="/usr"' '-DLIBDIR="/usr/lib"' -DCHAPMS=1 -DMPPE=1 -DUSE_OPENSSL -DUSE_EAPTLS=1 -DHAS_SHADOW -DHAVE_CRYPT_H=1 -DHAVE_LOGWTMP=1 -I/usr/include/openssl -DUSE_PAM -DHAVE_MULTILINK -DUSE_TDB=1 -DSYSTEMD=1 -DPLUGIN -DPPP_FILTER -DINET6=1 -DCBCP_SUPPORT -DMAXOCTETS   -c -o session.o session.c
make[1]: Leaving directory '/usr/src/RPM/BUILD/ppp-2.4.8/pppd'
make[1]: Entering directory '/usr/src/RPM/BUILD/ppp-2.4.8/pppd'
gcc -pipe -frecord-gcc-switches -Wall -g -O2 -march=i586 -mtune=generic -fPIC -Wall -D_GNU_SOURCE -fno-strict-aliasing -DHAVE_PATHS_H -DIPX_CHANGE -DHAVE_MMAP -I../include '-DDESTDIR="/usr"' '-DLIBDIR="/usr/lib"' -DCHAPMS=1 -DMPPE=1 -DUSE_OPENSSL -DUSE_EAPTLS=1 -DHAS_SHADOW -DHAVE_CRYPT_H=1 -DHAVE_LOGWTMP=1 -I/usr/include/openssl -DUSE_PAM -DHAVE_MULTILINK -DUSE_TDB=1 -DSYSTEMD=1 -DPLUGIN -DPPP_FILTER -DINET6=1 -DCBCP_SUPPORT -DMAXOCTETS   -c -o auth.o auth.c
make[1]: Leaving directory '/usr/src/RPM/BUILD/ppp-2.4.8/pppd'
make[1]: Entering directory '/usr/src/RPM/BUILD/ppp-2.4.8/pppd'
gcc -pipe -frecord-gcc-switches -Wall -g -O2 -march=i586 -mtune=generic -fPIC -Wall -D_GNU_SOURCE -fno-strict-aliasing -DHAVE_PATHS_H -DIPX_CHANGE -DHAVE_MMAP -I../include '-DDESTDIR="/usr"' '-DLIBDIR="/usr/lib"' -DCHAPMS=1 -DMPPE=1 -DUSE_OPENSSL -DUSE_EAPTLS=1 -DHAS_SHADOW -DHAVE_CRYPT_H=1 -DHAVE_LOGWTMP=1 -I/usr/include/openssl -DUSE_PAM -DHAVE_MULTILINK -DUSE_TDB=1 -DSYSTEMD=1 -DPLUGIN -DPPP_FILTER -DINET6=1 -DCBCP_SUPPORT -DMAXOCTETS   -c -o options.o options.c
make[1]: Leaving directory '/usr/src/RPM/BUILD/ppp-2.4.8/pppd'
make[1]: Entering directory '/usr/src/RPM/BUILD/ppp-2.4.8/pppd'
gcc -pipe -frecord-gcc-switches -Wall -g -O2 -march=i586 -mtune=generic -fPIC -Wall -D_GNU_SOURCE -fno-strict-aliasing -DHAVE_PATHS_H -DIPX_CHANGE -DHAVE_MMAP -I../include '-DDESTDIR="/usr"' '-DLIBDIR="/usr/lib"' -DCHAPMS=1 -DMPPE=1 -DUSE_OPENSSL -DUSE_EAPTLS=1 -DHAS_SHADOW -DHAVE_CRYPT_H=1 -DHAVE_LOGWTMP=1 -I/usr/include/openssl -DUSE_PAM -DHAVE_MULTILINK -DUSE_TDB=1 -DSYSTEMD=1 -DPLUGIN -DPPP_FILTER -DINET6=1 -DCBCP_SUPPORT -DMAXOCTETS   -c -o ipxcp.o ipxcp.c
make[1]: Leaving directory '/usr/src/RPM/BUILD/ppp-2.4.8/pppd'
make[1]: Entering directory '/usr/src/RPM/BUILD/ppp-2.4.8/pppd'
gcc -pipe -frecord-gcc-switches -Wall -g -O2 -march=i586 -mtune=generic -fPIC -Wall -D_GNU_SOURCE -fno-strict-aliasing -DHAVE_PATHS_H -DIPX_CHANGE -DHAVE_MMAP -I../include '-DDESTDIR="/usr"' '-DLIBDIR="/usr/lib"' -DCHAPMS=1 -DMPPE=1 -DUSE_OPENSSL -DUSE_EAPTLS=1 -DHAS_SHADOW -DHAVE_CRYPT_H=1 -DHAVE_LOGWTMP=1 -I/usr/include/openssl -DUSE_PAM -DHAVE_MULTILINK -DUSE_TDB=1 -DSYSTEMD=1 -DPLUGIN -DPPP_FILTER -DINET6=1 -DCBCP_SUPPORT -DMAXOCTETS   -c -o chap_ms.o chap_ms.c
make[1]: Leaving directory '/usr/src/RPM/BUILD/ppp-2.4.8/pppd'
make[1]: Entering directory '/usr/src/RPM/BUILD/ppp-2.4.8/pppd'
gcc -pipe -frecord-gcc-switches -Wall -g -O2 -march=i586 -mtune=generic -fPIC -Wall -D_GNU_SOURCE -fno-strict-aliasing -DHAVE_PATHS_H -DIPX_CHANGE -DHAVE_MMAP -I../include '-DDESTDIR="/usr"' '-DLIBDIR="/usr/lib"' -DCHAPMS=1 -DMPPE=1 -DUSE_OPENSSL -DUSE_EAPTLS=1 -DHAS_SHADOW -DHAVE_CRYPT_H=1 -DHAVE_LOGWTMP=1 -I/usr/include/openssl -DUSE_PAM -DHAVE_MULTILINK -DUSE_TDB=1 -DSYSTEMD=1 -DPLUGIN -DPPP_FILTER -DINET6=1 -DCBCP_SUPPORT -DMAXOCTETS   -c -o pppcrypt.o pppcrypt.c
make[1]: Leaving directory '/usr/src/RPM/BUILD/ppp-2.4.8/pppd'
make[1]: Entering directory '/usr/src/RPM/BUILD/ppp-2.4.8/pppd'
gcc -pipe -frecord-gcc-switches -Wall -g -O2 -march=i586 -mtune=generic -fPIC -Wall -D_GNU_SOURCE -fno-strict-aliasing -DHAVE_PATHS_H -DIPX_CHANGE -DHAVE_MMAP -I../include '-DDESTDIR="/usr"' '-DLIBDIR="/usr/lib"' -DCHAPMS=1 -DMPPE=1 -DUSE_OPENSSL -DUSE_EAPTLS=1 -DHAS_SHADOW -DHAVE_CRYPT_H=1 -DHAVE_LOGWTMP=1 -I/usr/include/openssl -DUSE_PAM -DHAVE_MULTILINK -DUSE_TDB=1 -DSYSTEMD=1 -DPLUGIN -DPPP_FILTER -DINET6=1 -DCBCP_SUPPORT -DMAXOCTETS   -c -o lcp.o lcp.c
make[1]: Leaving directory '/usr/src/RPM/BUILD/ppp-2.4.8/pppd'
make[1]: Entering directory '/usr/src/RPM/BUILD/ppp-2.4.8/pppd'
gcc -pipe -frecord-gcc-switches -Wall -g -O2 -march=i586 -mtune=generic -fPIC -Wall -D_GNU_SOURCE -fno-strict-aliasing -DHAVE_PATHS_H -DIPX_CHANGE -DHAVE_MMAP -I../include '-DDESTDIR="/usr"' '-DLIBDIR="/usr/lib"' -DCHAPMS=1 -DMPPE=1 -DUSE_OPENSSL -DUSE_EAPTLS=1 -DHAS_SHADOW -DHAVE_CRYPT_H=1 -DHAVE_LOGWTMP=1 -I/usr/include/openssl -DUSE_PAM -DHAVE_MULTILINK -DUSE_TDB=1 -DSYSTEMD=1 -DPLUGIN -DPPP_FILTER -DINET6=1 -DCBCP_SUPPORT -DMAXOCTETS   -c -o spinlock.o spinlock.c
make[1]: Leaving directory '/usr/src/RPM/BUILD/ppp-2.4.8/pppd'
make[1]: Entering directory '/usr/src/RPM/BUILD/ppp-2.4.8/pppd'
gcc -pipe -frecord-gcc-switches -Wall -g -O2 -march=i586 -mtune=generic -fPIC -Wall -D_GNU_SOURCE -fno-strict-aliasing -DHAVE_PATHS_H -DIPX_CHANGE -DHAVE_MMAP -I../include '-DDESTDIR="/usr"' '-DLIBDIR="/usr/lib"' -DCHAPMS=1 -DMPPE=1 -DUSE_OPENSSL -DUSE_EAPTLS=1 -DHAS_SHADOW -DHAVE_CRYPT_H=1 -DHAVE_LOGWTMP=1 -I/usr/include/openssl -DUSE_PAM -DHAVE_MULTILINK -DUSE_TDB=1 -DSYSTEMD=1 -DPLUGIN -DPPP_FILTER -DINET6=1 -DCBCP_SUPPORT -DMAXOCTETS   -c -o eui64.o eui64.c
make[1]: Leaving directory '/usr/src/RPM/BUILD/ppp-2.4.8/pppd'
make[1]: Entering directory '/usr/src/RPM/BUILD/ppp-2.4.8/pppd'
gcc -pipe -frecord-gcc-switches -Wall -g -O2 -march=i586 -mtune=generic -fPIC -Wall -D_GNU_SOURCE -fno-strict-aliasing -DHAVE_PATHS_H -DIPX_CHANGE -DHAVE_MMAP -I../include '-DDESTDIR="/usr"' '-DLIBDIR="/usr/lib"' -DCHAPMS=1 -DMPPE=1 -DUSE_OPENSSL -DUSE_EAPTLS=1 -DHAS_SHADOW -DHAVE_CRYPT_H=1 -DHAVE_LOGWTMP=1 -I/usr/include/openssl -DUSE_PAM -DHAVE_MULTILINK -DUSE_TDB=1 -DSYSTEMD=1 -DPLUGIN -DPPP_FILTER -DINET6=1 -DCBCP_SUPPORT -DMAXOCTETS   -c -o eap.o eap.c
eap.c:156:21: warning: 'wkmodulus' defined but not used [-Wunused-const-variable=]
  156 | static const u_char wkmodulus[] = {
      |                     ^~~~~~~~~
make[1]: Leaving directory '/usr/src/RPM/BUILD/ppp-2.4.8/pppd'
make[1]: Entering directory '/usr/src/RPM/BUILD/ppp-2.4.8/pppd'
gcc -pipe -frecord-gcc-switches -Wall -g -O2 -march=i586 -mtune=generic -fPIC -Wall -D_GNU_SOURCE -fno-strict-aliasing -DHAVE_PATHS_H -DIPX_CHANGE -DHAVE_MMAP -I../include '-DDESTDIR="/usr"' '-DLIBDIR="/usr/lib"' -DCHAPMS=1 -DMPPE=1 -DUSE_OPENSSL -DUSE_EAPTLS=1 -DHAS_SHADOW -DHAVE_CRYPT_H=1 -DHAVE_LOGWTMP=1 -I/usr/include/openssl -DUSE_PAM -DHAVE_MULTILINK -DUSE_TDB=1 -DSYSTEMD=1 -DPLUGIN -DPPP_FILTER -DINET6=1 -DCBCP_SUPPORT -DMAXOCTETS   -c -o multilink.o multilink.c
make[1]: Leaving directory '/usr/src/RPM/BUILD/ppp-2.4.8/pppd'
make[1]: Entering directory '/usr/src/RPM/BUILD/ppp-2.4.8/pppd'
gcc -pipe -frecord-gcc-switches -Wall -g -O2 -march=i586 -mtune=generic -fPIC -Wall -D_GNU_SOURCE -fno-strict-aliasing -DHAVE_PATHS_H -DIPX_CHANGE -DHAVE_MMAP -I../include '-DDESTDIR="/usr"' '-DLIBDIR="/usr/lib"' -DCHAPMS=1 -DMPPE=1 -DUSE_OPENSSL -DUSE_EAPTLS=1 -DHAS_SHADOW -DHAVE_CRYPT_H=1 -DHAVE_LOGWTMP=1 -I/usr/include/openssl -DUSE_PAM -DHAVE_MULTILINK -DUSE_TDB=1 -DSYSTEMD=1 -DPLUGIN -DPPP_FILTER -DINET6=1 -DCBCP_SUPPORT -DMAXOCTETS   -c -o eap-tls.o eap-tls.c
In file included from /usr/include/string.h:507,
                 from eap-tls.c:32:
In function 'strncpy',
    inlined from 'eaptls_init_ssl_server' at eap-tls.c:697:2:
/usr/include/bits/string_fortified.h:106:10: warning: '__builtin_strncpy' specified bound 1024 equals destination size [-Wstringop-truncation]
  106 |   return __builtin___strncpy_chk (__dest, __src, __len, __bos (__dest));
      |          ^~~~~~~~~~~~~~~~~~~~~~~~~~~~~~~~~~~~~~~~~~~~~~~~~~~~~~~~~~~~~~
In function 'strncpy',
    inlined from 'eaptls_init_ssl_client' at eap-tls.c:785:3:
/usr/include/bits/string_fortified.h:106:10: warning: '__builtin_strncpy' specified bound 1024 equals destination size [-Wstringop-truncation]
  106 |   return __builtin___strncpy_chk (__dest, __src, __len, __bos (__dest));
      |          ^~~~~~~~~~~~~~~~~~~~~~~~~~~~~~~~~~~~~~~~~~~~~~~~~~~~~~~~~~~~~~
make[1]: Leaving directory '/usr/src/RPM/BUILD/ppp-2.4.8/pppd'
make[1]: Entering directory '/usr/src/RPM/BUILD/ppp-2.4.8/pppd'
gcc -pipe -frecord-gcc-switches -Wall -g -O2 -march=i586 -mtune=generic -fPIC -Wall -D_GNU_SOURCE -fno-strict-aliasing -DHAVE_PATHS_H -DIPX_CHANGE -DHAVE_MMAP -I../include '-DDESTDIR="/usr"' '-DLIBDIR="/usr/lib"' -DCHAPMS=1 -DMPPE=1 -DUSE_OPENSSL -DUSE_EAPTLS=1 -DHAS_SHADOW -DHAVE_CRYPT_H=1 -DHAVE_LOGWTMP=1 -I/usr/include/openssl -DUSE_PAM -DHAVE_MULTILINK -DUSE_TDB=1 -DSYSTEMD=1 -DPLUGIN -DPPP_FILTER -DINET6=1 -DCBCP_SUPPORT -DMAXOCTETS   -c -o tdb.o tdb.c
make[1]: Leaving directory '/usr/src/RPM/BUILD/ppp-2.4.8/pppd'
make[1]: Entering directory '/usr/src/RPM/BUILD/ppp-2.4.8/pppd'
gcc -pipe -frecord-gcc-switches -Wall -g -O2 -march=i586 -mtune=generic -fPIC -Wall -D_GNU_SOURCE -fno-strict-aliasing -DHAVE_PATHS_H -DIPX_CHANGE -DHAVE_MMAP -I../include '-DDESTDIR="/usr"' '-DLIBDIR="/usr/lib"' -DCHAPMS=1 -DMPPE=1 -DUSE_OPENSSL -DUSE_EAPTLS=1 -DHAS_SHADOW -DHAVE_CRYPT_H=1 -DHAVE_LOGWTMP=1 -I/usr/include/openssl -DUSE_PAM -DHAVE_MULTILINK -DUSE_TDB=1 -DSYSTEMD=1 -DPLUGIN -DPPP_FILTER -DINET6=1 -DCBCP_SUPPORT -DMAXOCTETS   -c -o cbcp.o cbcp.c
cbcp.c: In function 'cbcp_input':
cbcp.c:206:20: warning: pointer targets in passing argument 2 of 'cbcp_recvresp' differ in signedness [-Wpointer-sign]
  206 |  cbcp_recvresp(us, inp, len);
      |                    ^~~
      |                    |
      |                    u_char * {aka unsigned char *}
In file included from cbcp.c:43:
cbcp.c:104:54: note: expected 'char *' but argument is of type 'u_char *' {aka 'unsigned char *'}
  104 | static void cbcp_recvresp __P((cbcp_state *us, char *pckt, int len));
      |                                                ~~~~~~^~~~
pppd.h:66:19: note: in definition of macro '__P'
   66 | #define __P(args) args
      |                   ^~~~
cbcp.c: In function 'cbcp_printpkt':
cbcp.c:297:14: warning: variable 'addrt' set but not used [-Wunused-but-set-variable]
  297 |          int addrt;
      |              ^~~~~
cbcp.c: In function 'cbcp_recvreq':
cbcp.c:328:27: warning: variable 'addr_type' set but not used [-Wunused-but-set-variable]
  328 |     u_char type, opt_len, addr_type;
      |                           ^~~~~~~~~
cbcp.c: In function 'cbcp_recvack':
cbcp.c:473:18: warning: variable 'addr_type' set but not used [-Wunused-but-set-variable]
  473 |     u_char type, addr_type;
      |                  ^~~~~~~~~
cbcp.c: In function 'cbcp_recvresp':
cbcp.c:662:18: warning: variable 'addr_type' set but not used [-Wunused-but-set-variable]
  662 |     u_char type, addr_type;
      |                  ^~~~~~~~~
make[1]: Leaving directory '/usr/src/RPM/BUILD/ppp-2.4.8/pppd'
make[1]: Entering directory '/usr/src/RPM/BUILD/ppp-2.4.8/pppd'
gcc -pipe -frecord-gcc-switches -Wall -g -O2 -march=i586 -mtune=generic -fPIC -Wall -D_GNU_SOURCE -fno-strict-aliasing -DHAVE_PATHS_H -DIPX_CHANGE -DHAVE_MMAP -I../include '-DDESTDIR="/usr"' '-DLIBDIR="/usr/lib"' -DCHAPMS=1 -DMPPE=1 -DUSE_OPENSSL -DUSE_EAPTLS=1 -DHAS_SHADOW -DHAVE_CRYPT_H=1 -DHAVE_LOGWTMP=1 -I/usr/include/openssl -DUSE_PAM -DHAVE_MULTILINK -DUSE_TDB=1 -DSYSTEMD=1 -DPLUGIN -DPPP_FILTER -DINET6=1 -DCBCP_SUPPORT -DMAXOCTETS   -c -o ipv6cp.o ipv6cp.c
make[1]: Leaving directory '/usr/src/RPM/BUILD/ppp-2.4.8/pppd'
make[1]: Entering directory '/usr/src/RPM/BUILD/ppp-2.4.8/pppd'
gcc -pipe -frecord-gcc-switches -Wall -g -O2 -march=i586 -mtune=generic -fPIC -Wall -D_GNU_SOURCE -fno-strict-aliasing -DHAVE_PATHS_H -DIPX_CHANGE -DHAVE_MMAP -I../include '-DDESTDIR="/usr"' '-DLIBDIR="/usr/lib"' -DCHAPMS=1 -DMPPE=1 -DUSE_OPENSSL -DUSE_EAPTLS=1 -DHAS_SHADOW -DHAVE_CRYPT_H=1 -DHAVE_LOGWTMP=1 -I/usr/include/openssl -DUSE_PAM -DHAVE_MULTILINK -DUSE_TDB=1 -DSYSTEMD=1 -DPLUGIN -DPPP_FILTER -DINET6=1 -DCBCP_SUPPORT -DMAXOCTETS   -c -o sys-linux.o sys-linux.c
sys-linux.c: In function 'get_pty':
sys-linux.c:2965:7: warning: ignoring return value of 'fchown', declared with attribute warn_unused_result [-Wunused-result]
 2965 |       fchown(sfd, uid, -1);
      |       ^~~~~~~~~~~~~~~~~~~~
In file included from /usr/include/string.h:507,
                 from sys-linux.c:85:
In function 'strncpy',
    inlined from 'make_ppp_unit' at sys-linux.c:684:3:
/usr/include/bits/string_fortified.h:106:10: warning: '__builtin_strncpy' output may be truncated copying 16 bytes from a string of length 31 [-Wstringop-truncation]
  106 |   return __builtin___strncpy_chk (__dest, __src, __len, __bos (__dest));
      |          ^~~~~~~~~~~~~~~~~~~~~~~~~~~~~~~~~~~~~~~~~~~~~~~~~~~~~~~~~~~~~~
In function 'strncpy',
    inlined from 'make_ppp_unit' at sys-linux.c:685:3:
/usr/include/bits/string_fortified.h:106:10: warning: '__builtin_strncpy' output may be truncated copying 16 bytes from a string of length 31 [-Wstringop-truncation]
  106 |   return __builtin___strncpy_chk (__dest, __src, __len, __bos (__dest));
      |          ^~~~~~~~~~~~~~~~~~~~~~~~~~~~~~~~~~~~~~~~~~~~~~~~~~~~~~~~~~~~~~
sys-linux.c: In function 'make_ppp_unit':
sys-linux.c:666:5: warning: 'x' may be used uninitialized in this function [-Wmaybe-uninitialized]
  666 |  if ((x < 0) || (req_minunit == -1)) {
      |     ^
make[1]: Leaving directory '/usr/src/RPM/BUILD/ppp-2.4.8/pppd'
make[1]: Entering directory '/usr/src/RPM/BUILD/ppp-2.4.8/pppd'
gcc -pipe -frecord-gcc-switches -Wall -g -O2 -march=i586 -mtune=generic -fPIC -Wall -D_GNU_SOURCE -fno-strict-aliasing -DHAVE_PATHS_H -DIPX_CHANGE -DHAVE_MMAP -I../include '-DDESTDIR="/usr"' '-DLIBDIR="/usr/lib"' -DCHAPMS=1 -DMPPE=1 -DUSE_OPENSSL -DUSE_EAPTLS=1 -DHAS_SHADOW -DHAVE_CRYPT_H=1 -DHAVE_LOGWTMP=1 -I/usr/include/openssl -DUSE_PAM -DHAVE_MULTILINK -DUSE_TDB=1 -DSYSTEMD=1 -DPLUGIN -DPPP_FILTER -DINET6=1 -DCBCP_SUPPORT -DMAXOCTETS -pie  -Wl,-E -o pppd main.o magic.o fsm.o lcp.o ipcp.o upap.o chap-new.o ccp.o ecp.o auth.o options.o demand.o utils.o sys-linux.o ipxcp.o tty.o eap.o chap-md5.o session.o chap_ms.o eap-tls.o pppcrypt.o multilink.o tdb.o spinlock.o ipv6cp.o eui64.o cbcp.o -ludev -lcrypto -lssl -lcrypto -lcrypt -lutil -lcrypto -lpam -ldl -lsystemd -ldl -lpcap
make[1]: Leaving directory '/usr/src/RPM/BUILD/ppp-2.4.8/pppd'
cd pppstats; make -w -j8 -Otarget --jobserver-auth=3,4 all
make[1]: Entering directory '/usr/src/RPM/BUILD/ppp-2.4.8/pppstats'
make[1]: warning: -j8 forced in submake: resetting jobserver mode.
make[1]: Leaving directory '/usr/src/RPM/BUILD/ppp-2.4.8/pppstats'
make[1]: Entering directory '/usr/src/RPM/BUILD/ppp-2.4.8/pppstats'
gcc -pipe -frecord-gcc-switches -Wall -g -O2 -march=i586 -mtune=generic -fPIC -Wall -D_GNU_SOURCE -fno-strict-aliasing -I../include  -o pppstats pppstats.c 
pppstats.c:39:19: warning: 'rcsid' defined but not used [-Wunused-const-variable=]
   39 | static const char rcsid[] = "$Id: pppstats.c,v 1.29 2002/10/27 12:56:26 fcusack Exp $";
      |                   ^~~~~
make[1]: Leaving directory '/usr/src/RPM/BUILD/ppp-2.4.8/pppstats'
cd pppdump; make -w -j8 -Otarget --jobserver-auth=3,4 all
make[1]: Entering directory '/usr/src/RPM/BUILD/ppp-2.4.8/pppdump'
make[1]: warning: -j8 forced in submake: resetting jobserver mode.
make[1]: Leaving directory '/usr/src/RPM/BUILD/ppp-2.4.8/pppdump'
make[1]: Entering directory '/usr/src/RPM/BUILD/ppp-2.4.8/pppdump'
gcc -I../include/net -fPIC   -c -o deflate.o deflate.c
make[1]: Leaving directory '/usr/src/RPM/BUILD/ppp-2.4.8/pppdump'
make[1]: Entering directory '/usr/src/RPM/BUILD/ppp-2.4.8/pppdump'
gcc -I../include/net -fPIC   -c -o bsd-comp.o bsd-comp.c
make[1]: Leaving directory '/usr/src/RPM/BUILD/ppp-2.4.8/pppdump'
make[1]: Entering directory '/usr/src/RPM/BUILD/ppp-2.4.8/pppdump'
gcc -I../include/net -fPIC   -c -o pppdump.o pppdump.c
make[1]: Leaving directory '/usr/src/RPM/BUILD/ppp-2.4.8/pppdump'
make[1]: Entering directory '/usr/src/RPM/BUILD/ppp-2.4.8/pppdump'
gcc -I../include/net -fPIC   -c -o zlib.o zlib.c
make[1]: Leaving directory '/usr/src/RPM/BUILD/ppp-2.4.8/pppdump'
make[1]: Entering directory '/usr/src/RPM/BUILD/ppp-2.4.8/pppdump'
gcc -I../include/net -fPIC  -o pppdump pppdump.o bsd-comp.o deflate.o zlib.o
make[1]: Leaving directory '/usr/src/RPM/BUILD/ppp-2.4.8/pppdump'
+ exit 0
Executing(%install): /bin/sh -e /usr/src/tmp/rpm-tmp.94496
+ umask 022
+ /bin/mkdir -p /usr/src/RPM/BUILD
+ cd /usr/src/RPM/BUILD
+ /bin/chmod -Rf u+rwX -- /usr/src/tmp/ppp-buildroot
+ :
+ /bin/rm -rf -- /usr/src/tmp/ppp-buildroot
+ cd ppp-2.4.8
+ make 'INSTALL=/bin/install -p' install DESTDIR=/usr/src/tmp/ppp-buildroot BINDIR=/usr/src/tmp/ppp-buildroot/usr/sbin INCDIR=/usr/src/tmp/ppp-buildroot/usr/include libdir=/usr/lib MANDIR=/usr/src/tmp/ppp-buildroot/usr/share/man/man8 RUNDIR=/usr/src/tmp/ppp-buildroot/var/run/ppp LOGDIR=/usr/src/tmp/ppp-buildroot/var/log/ppp
make: Entering directory '/usr/src/RPM/BUILD/ppp-2.4.8'
/bin/install -p -d -m 755 /usr/src/tmp/ppp-buildroot/usr/sbin
/bin/install -p -d -m 755 /usr/src/tmp/ppp-buildroot/var/run/ppp
/bin/install -p -d -m 755 /usr/src/tmp/ppp-buildroot/var/log/ppp
/bin/install -p -d -m 755 /usr/src/tmp/ppp-buildroot/usr/share/man/man8/man8
cd chat; make -w -Otarget install
make[1]: Entering directory '/usr/src/RPM/BUILD/ppp-2.4.8/chat'
mkdir -p /usr/src/tmp/ppp-buildroot/usr/sbin /usr/src/tmp/ppp-buildroot/usr/share/man/man8
/bin/install -p -m 755 chat /usr/src/tmp/ppp-buildroot/usr/sbin
/bin/install -p -m 644 chat.8 /usr/src/tmp/ppp-buildroot/usr/share/man/man8
make[1]: Leaving directory '/usr/src/RPM/BUILD/ppp-2.4.8/chat'
cd pppd/plugins; make -w -Otarget install
make[1]: Entering directory '/usr/src/RPM/BUILD/ppp-2.4.8/pppd/plugins'
mkdir -p /usr/src/tmp/ppp-buildroot//usr/lib/pppd/2.4.8
/bin/install -p minconn.so passprompt.so passwordfd.so winbind.so /usr/src/tmp/ppp-buildroot//usr/lib/pppd/2.4.8
for d in rp-pppoe pppoatm pppol2tp radius dhcp; do make -w -Otarget -C $d install || exit $?; done
make[2]: Entering directory '/usr/src/RPM/BUILD/ppp-2.4.8/pppd/plugins/rp-pppoe'
/bin/install -p -d -m 755 /usr/src/tmp/ppp-buildroot//usr/lib/pppd/2.4.8
/bin/install -p -m 644 rp-pppoe.so /usr/src/tmp/ppp-buildroot//usr/lib/pppd/2.4.8
/bin/install -p -d -m 755 /usr/src/tmp/ppp-buildroot/usr/sbin
/bin/install -p -m 755 pppoe-discovery /usr/src/tmp/ppp-buildroot/usr/sbin
/bin/install -p -c -m 644 pppoe-discovery.8 /usr/src/tmp/ppp-buildroot/usr/share/man/man8
make[2]: Leaving directory '/usr/src/RPM/BUILD/ppp-2.4.8/pppd/plugins/rp-pppoe'
make[2]: Entering directory '/usr/src/RPM/BUILD/ppp-2.4.8/pppd/plugins/pppoatm'
cc  -I../.. -I../../../include -fPIC -I. -c -o text2qos.o text2qos.c
cc  -I../.. -I../../../include -fPIC -I. -c -o text2atm.o text2atm.c
cc  -I../.. -I../../../include -fPIC -I. -c -o misc.o misc.c
cc  -I../.. -I../../../include -fPIC -I. -c -o ans.o ans.c
cc  -I../.. -I../../../include -fPIC -I.  -shared -o pppoatm.so pppoatm.o text2qos.o text2atm.o misc.o ans.o -lresolv
/bin/install -p -d -m 755 /usr/src/tmp/ppp-buildroot//usr/lib/pppd/2.4.8
/bin/install -p -m 0644 pppoatm.so /usr/src/tmp/ppp-buildroot//usr/lib/pppd/2.4.8
make[2]: Leaving directory '/usr/src/RPM/BUILD/ppp-2.4.8/pppd/plugins/pppoatm'
make[2]: Entering directory '/usr/src/RPM/BUILD/ppp-2.4.8/pppd/plugins/pppol2tp'
/bin/install -p -d -m 755 /usr/src/tmp/ppp-buildroot//usr/lib/pppd/2.4.8
/bin/install -p -c -m 755 pppol2tp.so openl2tp.so /usr/src/tmp/ppp-buildroot//usr/lib/pppd/2.4.8
make[2]: Leaving directory '/usr/src/RPM/BUILD/ppp-2.4.8/pppd/plugins/pppol2tp'
make[2]: Entering directory '/usr/src/RPM/BUILD/ppp-2.4.8/pppd/plugins/radius'
mkdir -p /usr/src/tmp/ppp-buildroot//usr/lib/pppd/2.4.8
/bin/install -p -m 755 radius.so /usr/src/tmp/ppp-buildroot//usr/lib/pppd/2.4.8
/bin/install -p -m 755 radattr.so /usr/src/tmp/ppp-buildroot//usr/lib/pppd/2.4.8
/bin/install -p -m 755 radrealms.so /usr/src/tmp/ppp-buildroot//usr/lib/pppd/2.4.8
/bin/install -p -m 644 pppd-radius.8 /usr/src/tmp/ppp-buildroot/usr/share/man/man8
/bin/install -p -m 644 pppd-radattr.8 /usr/src/tmp/ppp-buildroot/usr/share/man/man8
make[2]: Leaving directory '/usr/src/RPM/BUILD/ppp-2.4.8/pppd/plugins/radius'
make[2]: Entering directory '/usr/src/RPM/BUILD/ppp-2.4.8/pppd/plugins/dhcp'
mkdir -p /usr/src/tmp/ppp-buildroot//usr/lib/pppd/2.4.8
/bin/install -p -m 755 dhcpc.so /usr/src/tmp/ppp-buildroot//usr/lib/pppd/2.4.8
make[2]: Leaving directory '/usr/src/RPM/BUILD/ppp-2.4.8/pppd/plugins/dhcp'
make[1]: Leaving directory '/usr/src/RPM/BUILD/ppp-2.4.8/pppd/plugins'
cd pppd; make -w -Otarget install
make[1]: Entering directory '/usr/src/RPM/BUILD/ppp-2.4.8/pppd'
mkdir -p /usr/src/tmp/ppp-buildroot/usr/sbin /usr/src/tmp/ppp-buildroot/usr/share/man/man8
/bin/install -p -m 755 pppd /usr/src/tmp/ppp-buildroot/usr/sbin/pppd
/bin/install -p -m 644 pppd.8 /usr/src/tmp/ppp-buildroot/usr/share/man/man8
make[1]: Leaving directory '/usr/src/RPM/BUILD/ppp-2.4.8/pppd'
cd pppstats; make -w -Otarget install
make[1]: Entering directory '/usr/src/RPM/BUILD/ppp-2.4.8/pppstats'
mkdir -p /usr/src/tmp/ppp-buildroot/usr/share/man/man8
/bin/install -p -m 755 pppstats /usr/src/tmp/ppp-buildroot/usr/sbin
/bin/install -p -m 644 pppstats.8 /usr/src/tmp/ppp-buildroot/usr/share/man/man8
make[1]: Leaving directory '/usr/src/RPM/BUILD/ppp-2.4.8/pppstats'
cd pppdump; make -w -Otarget install
make[1]: Entering directory '/usr/src/RPM/BUILD/ppp-2.4.8/pppdump'
mkdir -p /usr/src/tmp/ppp-buildroot/usr/sbin /usr/src/tmp/ppp-buildroot/usr/share/man/man8
/bin/install -p -m 755 pppdump /usr/src/tmp/ppp-buildroot/usr/sbin
/bin/install -p -m 644 pppdump.8 /usr/src/tmp/ppp-buildroot/usr/share/man/man8
make[1]: Leaving directory '/usr/src/RPM/BUILD/ppp-2.4.8/pppdump'
cd pppd; make -w -Otarget install-devel
make[1]: Entering directory '/usr/src/RPM/BUILD/ppp-2.4.8/pppd'
mkdir -p /usr/src/tmp/ppp-buildroot/usr/include/pppd
/bin/install -p -m 644 ccp.h session.h chap-new.h ecp.h fsm.h ipcp.h ipxcp.h lcp.h magic.h md5.h patchlevel.h pathnames.h pppd.h upap.h eap.h cbcp.h chap_ms.h eap-tls.h pppcrypt.h tdb.h spinlock.h ipv6cp.h eui64.h /usr/src/tmp/ppp-buildroot/usr/include/pppd
make[1]: Leaving directory '/usr/src/RPM/BUILD/ppp-2.4.8/pppd'
make: Leaving directory '/usr/src/RPM/BUILD/ppp-2.4.8'
+ make 'INSTALL=/bin/install -p' install-etcppp INSTROOT=/usr/src/tmp/ppp-buildroot ETCDIR=/usr/src/tmp/ppp-buildroot/etc/ppp
make: Entering directory '/usr/src/RPM/BUILD/ppp-2.4.8'
/bin/install -p -d -m 755 /usr/src/tmp/ppp-buildroot/etc/ppp
/bin/install -p -c -m 644 etc.ppp/options /usr/src/tmp/ppp-buildroot/etc/ppp/options
/bin/install -p -c -m 600 etc.ppp/pap-secrets /usr/src/tmp/ppp-buildroot/etc/ppp/pap-secrets
/bin/install -p -c -m 600 etc.ppp/chap-secrets /usr/src/tmp/ppp-buildroot/etc/ppp/chap-secrets
/bin/install -p -c -m 600 etc.ppp/eaptls-server /usr/src/tmp/ppp-buildroot/etc/ppp/eaptls-server
/bin/install -p -c -m 600 etc.ppp/eaptls-client /usr/src/tmp/ppp-buildroot/etc/ppp/eaptls-client
make: Leaving directory '/usr/src/RPM/BUILD/ppp-2.4.8'
++ find scripts/ sample/ -type f
+ for f in `find scripts/ sample/ -type f`
+ chmod 644 scripts/secure-card
+ fgrep -qs /usr/local/bin/ scripts/secure-card
+ subst -p 's|/usr/local/bin|/usr/bin|g' scripts/secure-card
+ file -b scripts/secure-card
+ fgrep -qs 'shell script'
+ for f in `find scripts/ sample/ -type f`
+ chmod 644 scripts/redialer
+ fgrep -qs /usr/local/bin/ scripts/redialer
+ file -b scripts/redialer
+ fgrep -qs 'shell script'
+ chmod a+x scripts/redialer
+ for f in `find scripts/ sample/ -type f`
+ chmod 644 scripts/ppp-on-ssh
+ fgrep -qs /usr/local/bin/ scripts/ppp-on-ssh
+ subst -p 's|/usr/local/bin|/usr/bin|g' scripts/ppp-on-ssh
+ file -b scripts/ppp-on-ssh
+ fgrep -qs 'shell script'
+ chmod a+x scripts/ppp-on-ssh
+ for f in `find scripts/ sample/ -type f`
+ chmod 644 scripts/ppp-on-rsh
+ fgrep -qs /usr/local/bin/ scripts/ppp-on-rsh
+ subst -p 's|/usr/local/bin|/usr/bin|g' scripts/ppp-on-rsh
+ file -b scripts/ppp-on-rsh
+ fgrep -qs 'shell script'
+ chmod a+x scripts/ppp-on-rsh
+ for f in `find scripts/ sample/ -type f`
+ chmod 644 scripts/ppp-on-dialer
+ fgrep -qs /usr/local/bin/ scripts/ppp-on-dialer
+ file -b scripts/ppp-on-dialer
+ fgrep -qs 'shell script'
+ chmod a+x scripts/ppp-on-dialer
+ for f in `find scripts/ sample/ -type f`
+ chmod 644 scripts/ppp-on
+ fgrep -qs /usr/local/bin/ scripts/ppp-on
+ file -b scripts/ppp-on
+ fgrep -qs 'shell script'
+ chmod a+x scripts/ppp-on
+ for f in `find scripts/ sample/ -type f`
+ chmod 644 scripts/ppp-off
+ fgrep -qs /usr/local/bin/ scripts/ppp-off
+ file -b scripts/ppp-off
+ fgrep -qs 'shell script'
+ chmod a+x scripts/ppp-off
+ for f in `find scripts/ sample/ -type f`
+ chmod 644 scripts/pon.1
+ fgrep -qs /usr/local/bin/ scripts/pon.1
+ file -b scripts/pon.1
+ fgrep -qs 'shell script'
+ for f in `find scripts/ sample/ -type f`
+ chmod 644 scripts/pon
+ fgrep -qs /usr/local/bin/ scripts/pon
+ file -b scripts/pon
+ fgrep -qs 'shell script'
+ chmod a+x scripts/pon
+ for f in `find scripts/ sample/ -type f`
+ chmod 644 scripts/poff
+ fgrep -qs /usr/local/bin/ scripts/poff
+ file -b scripts/poff
+ fgrep -qs 'shell script'
+ chmod a+x scripts/poff
+ for f in `find scripts/ sample/ -type f`
+ chmod 644 scripts/plog
+ fgrep -qs /usr/local/bin/ scripts/plog
+ file -b scripts/plog
+ fgrep -qs 'shell script'
+ chmod a+x scripts/plog
+ for f in `find scripts/ sample/ -type f`
+ chmod 644 scripts/options-ssh-rem
+ fgrep -qs /usr/local/bin/ scripts/options-ssh-rem
+ file -b scripts/options-ssh-rem
+ fgrep -qs 'shell script'
+ for f in `find scripts/ sample/ -type f`
+ chmod 644 scripts/options-ssh-loc
+ fgrep -qs /usr/local/bin/ scripts/options-ssh-loc
+ file -b scripts/options-ssh-loc
+ fgrep -qs 'shell script'
+ for f in `find scripts/ sample/ -type f`
+ chmod 644 scripts/options-rsh-rem
+ fgrep -qs /usr/local/bin/ scripts/options-rsh-rem
+ file -b scripts/options-rsh-rem
+ fgrep -qs 'shell script'
+ for f in `find scripts/ sample/ -type f`
+ chmod 644 scripts/options-rsh-loc
+ fgrep -qs /usr/local/bin/ scripts/options-rsh-loc
+ file -b scripts/options-rsh-loc
+ fgrep -qs 'shell script'
+ for f in `find scripts/ sample/ -type f`
+ chmod 644 scripts/ipv6-up.sample
+ fgrep -qs /usr/local/bin/ scripts/ipv6-up.sample
+ file -b scripts/ipv6-up.sample
+ fgrep -qs 'shell script'
+ chmod a+x scripts/ipv6-up.sample
+ for f in `find scripts/ sample/ -type f`
+ chmod 644 scripts/ipv6-down.sample
+ fgrep -qs /usr/local/bin/ scripts/ipv6-down.sample
+ file -b scripts/ipv6-down.sample
+ fgrep -qs 'shell script'
+ chmod a+x scripts/ipv6-down.sample
+ for f in `find scripts/ sample/ -type f`
+ chmod 644 scripts/ip-up.local.add
+ fgrep -qs /usr/local/bin/ scripts/ip-up.local.add
+ file -b scripts/ip-up.local.add
+ fgrep -qs 'shell script'
+ for f in `find scripts/ sample/ -type f`
+ chmod 644 scripts/ip-down.local.add
+ fgrep -qs /usr/local/bin/ scripts/ip-down.local.add
+ file -b scripts/ip-down.local.add
+ fgrep -qs 'shell script'
+ for f in `find scripts/ sample/ -type f`
+ chmod 644 scripts/chatchat/chatchat.c
+ fgrep -qs /usr/local/bin/ scripts/chatchat/chatchat.c
+ file -b scripts/chatchat/chatchat.c
+ fgrep -qs 'shell script'
+ for f in `find scripts/ sample/ -type f`
+ chmod 644 scripts/chatchat/README
+ fgrep -qs /usr/local/bin/ scripts/chatchat/README
+ file -b scripts/chatchat/README
+ fgrep -qs 'shell script'
+ for f in `find scripts/ sample/ -type f`
+ chmod 644 scripts/chat-callback
+ fgrep -qs /usr/local/bin/ scripts/chat-callback
+ file -b scripts/chat-callback
+ fgrep -qs 'shell script'
+ for f in `find scripts/ sample/ -type f`
+ chmod 644 scripts/callback
+ fgrep -qs /usr/local/bin/ scripts/callback
+ file -b scripts/callback
+ fgrep -qs 'shell script'
+ chmod a+x scripts/callback
+ for f in `find scripts/ sample/ -type f`
+ chmod 644 scripts/autopppd
+ fgrep -qs /usr/local/bin/ scripts/autopppd
+ file -b scripts/autopppd
+ fgrep -qs 'shell script'
+ for f in `find scripts/ sample/ -type f`
+ chmod 644 scripts/README
+ fgrep -qs /usr/local/bin/ scripts/README
+ file -b scripts/README
+ fgrep -qs 'shell script'
+ for f in `find scripts/ sample/ -type f`
+ chmod 644 sample/pap-secrets
+ fgrep -qs /usr/local/bin/ sample/pap-secrets
+ file -b sample/pap-secrets
+ fgrep -qs 'shell script'
+ for f in `find scripts/ sample/ -type f`
+ chmod 644 sample/options.ttyXX
+ fgrep -qs /usr/local/bin/ sample/options.ttyXX
+ file -b sample/options.ttyXX
+ fgrep -qs 'shell script'
+ for f in `find scripts/ sample/ -type f`
+ chmod 644 sample/options
+ fgrep -qs /usr/local/bin/ sample/options
+ file -b sample/options
+ fgrep -qs 'shell script'
+ for f in `find scripts/ sample/ -type f`
+ chmod 644 sample/ip-up
+ fgrep -qs /usr/local/bin/ sample/ip-up
+ file -b sample/ip-up
+ fgrep -qs 'shell script'
+ chmod a+x sample/ip-up
+ for f in `find scripts/ sample/ -type f`
+ chmod 644 sample/ip-down
+ fgrep -qs /usr/local/bin/ sample/ip-down
+ file -b sample/ip-down
+ fgrep -qs 'shell script'
+ chmod a+x sample/ip-down
+ for f in `find scripts/ sample/ -type f`
+ chmod 644 sample/callback-users
+ fgrep -qs /usr/local/bin/ sample/callback-users
+ file -b sample/callback-users
+ fgrep -qs 'shell script'
+ for f in `find scripts/ sample/ -type f`
+ chmod 644 sample/callback-server
+ fgrep -qs /usr/local/bin/ sample/callback-server
+ file -b sample/callback-server
+ fgrep -qs 'shell script'
+ chmod a+x sample/callback-server
+ for f in `find scripts/ sample/ -type f`
+ chmod 644 sample/callback-client
+ fgrep -qs /usr/local/bin/ sample/callback-client
+ file -b sample/callback-client
+ fgrep -qs 'shell script'
+ chmod a+x sample/callback-client
+ for f in `find scripts/ sample/ -type f`
+ chmod 644 sample/auth-up
+ fgrep -qs /usr/local/bin/ sample/auth-up
+ file -b sample/auth-up
+ fgrep -qs 'shell script'
+ chmod a+x sample/auth-up
+ for f in `find scripts/ sample/ -type f`
+ chmod 644 sample/auth-down
+ fgrep -qs /usr/local/bin/ sample/auth-down
+ fgrep -qs 'shell script'
+ file -b sample/auth-down
+ chmod a+x sample/auth-down
+ install -pDm640 /usr/src/RPM/SOURCES/ppp.pamd /usr/src/tmp/ppp-buildroot/etc/pam.d/ppp
+ mkdir -p /usr/src/tmp/ppp-buildroot/etc/ppp/peers
+ install -pm600 sample/callback-client sample/callback-server sample/callback-users /usr/src/tmp/ppp-buildroot/etc/ppp/
+ mkdir -p /usr/src/tmp/ppp-buildroot/etc/ppp/radius
+ cp -a pppd/plugins/radius/etc/dictionary pppd/plugins/radius/etc/dictionary.ascend pppd/plugins/radius/etc/dictionary.compat pppd/plugins/radius/etc/dictionary.merit pppd/plugins/radius/etc/dictionary.microsoft pppd/plugins/radius/etc/issue pppd/plugins/radius/etc/port-id-map pppd/plugins/radius/etc/radiusclient.conf pppd/plugins/radius/etc/radiusclient.conf.in pppd/plugins/radius/etc/realms pppd/plugins/radius/etc/servers /usr/src/tmp/ppp-buildroot/etc/ppp/radius/
+ install -pDm755 /usr/src/RPM/SOURCES/ppp.control /usr/src/tmp/ppp-buildroot/etc/control.d/facilities/ppp
+ mkdir -p /usr/src/tmp/ppp-buildroot/var/log/ppp /usr/src/tmp/ppp-buildroot/var/run/ppp
+ touch /usr/src/tmp/ppp-buildroot/var/log/ppp/connect-errors
+ touch /usr/src/tmp/ppp-buildroot/var/run/ppp/resolv.conf
+ ln -s ../../var/log/ppp/connect-errors /usr/src/tmp/ppp-buildroot/etc/ppp/connect-errors
+ ln -s ../../var/run/ppp/resolv.conf /usr/src/tmp/ppp-buildroot/etc/ppp/resolv.conf
+ install -pDm644 /usr/src/RPM/SOURCES/ppp.tmpfiles /usr/src/tmp/ppp-buildroot//lib/tmpfiles.d/ppp.conf
+ install -pDm644 /usr/src/RPM/SOURCES/95-ppp.rules /usr/src/tmp/ppp-buildroot//lib/udev/rules.d/95-ppp.rules
+ install -pDm644 /usr/src/RPM/SOURCES/ppp.logrotate /usr/src/tmp/ppp-buildroot/etc/logrotate.d/ppp
+ install -pm600 etc.ppp/openssl.cnf /usr/src/tmp/ppp-buildroot/etc/ppp/openssl.cnf
+ /usr/lib/rpm/brp-alt
Cleaning files in /usr/src/tmp/ppp-buildroot (auto)
mode of './usr/lib/pppd/2.4.8/dhcpc.so' changed from 0755 (rwxr-xr-x) to 0644 (rw-r--r--)
mode of './usr/lib/pppd/2.4.8/radrealms.so' changed from 0755 (rwxr-xr-x) to 0644 (rw-r--r--)
mode of './usr/lib/pppd/2.4.8/radattr.so' changed from 0755 (rwxr-xr-x) to 0644 (rw-r--r--)
mode of './usr/lib/pppd/2.4.8/radius.so' changed from 0755 (rwxr-xr-x) to 0644 (rw-r--r--)
mode of './usr/lib/pppd/2.4.8/openl2tp.so' changed from 0755 (rwxr-xr-x) to 0644 (rw-r--r--)
mode of './usr/lib/pppd/2.4.8/pppol2tp.so' changed from 0755 (rwxr-xr-x) to 0644 (rw-r--r--)
mode of './usr/lib/pppd/2.4.8/winbind.so' changed from 0755 (rwxr-xr-x) to 0644 (rw-r--r--)
mode of './usr/lib/pppd/2.4.8/passwordfd.so' changed from 0755 (rwxr-xr-x) to 0644 (rw-r--r--)
mode of './usr/lib/pppd/2.4.8/passprompt.so' changed from 0755 (rwxr-xr-x) to 0644 (rw-r--r--)
mode of './usr/lib/pppd/2.4.8/minconn.so' changed from 0755 (rwxr-xr-x) to 0644 (rw-r--r--)
mode of './usr/sbin/pppoe-discovery' changed from 0755 (rwxr-xr-x) to 0644 (rw-r--r--)
Verifying and fixing files in /usr/src/tmp/ppp-buildroot (binconfig,pkgconfig,libtool,desktop)
Checking contents of files in /usr/src/tmp/ppp-buildroot/ (default)
Compressing files in /usr/src/tmp/ppp-buildroot (auto)
Adjusting library links in /usr/src/tmp/ppp-buildroot
./lib:
./usr/lib:
Verifying ELF objects in /usr/src/tmp/ppp-buildroot (arch=normal,fhs=normal,lfs=relaxed,lint=relaxed,rpath=normal,stack=normal,textrel=normal,unresolved=normal)
verify-elf: WARNING: ./usr/lib/pppd/2.4.8/dhcpc.so: undefined symbol: peer_authname
verify-elf: WARNING: ./usr/lib/pppd/2.4.8/dhcpc.so: undefined symbol: ip_choose_hook
verify-elf: WARNING: ./usr/lib/pppd/2.4.8/dhcpc.so: undefined symbol: exitnotify
verify-elf: WARNING: ./usr/lib/pppd/2.4.8/dhcpc.so: undefined symbol: untimeout
verify-elf: WARNING: ./usr/lib/pppd/2.4.8/dhcpc.so: undefined symbol: add_options
verify-elf: WARNING: ./usr/lib/pppd/2.4.8/dhcpc.so: undefined symbol: timeout
verify-elf: WARNING: ./usr/lib/pppd/2.4.8/dhcpc.so: undefined symbol: dbglog
verify-elf: WARNING: ./usr/lib/pppd/2.4.8/dhcpc.so: undefined symbol: add_notifier
verify-elf: WARNING: ./usr/lib/pppd/2.4.8/dhcpc.so: undefined symbol: fatal
verify-elf: WARNING: ./usr/lib/pppd/2.4.8/dhcpc.so: undefined symbol: info
verify-elf: WARNING: ./usr/lib/pppd/2.4.8/radrealms.so: undefined symbol: radius_pre_auth_hook
verify-elf: WARNING: ./usr/lib/pppd/2.4.8/radrealms.so: undefined symbol: option_error
verify-elf: WARNING: ./usr/lib/pppd/2.4.8/radrealms.so: undefined symbol: add_options
verify-elf: WARNING: ./usr/lib/pppd/2.4.8/radrealms.so: undefined symbol: info
verify-elf: WARNING: ./usr/lib/pppd/2.4.8/radrealms.so: uses non-LFS functions: fopen
verify-elf: WARNING: ./usr/lib/pppd/2.4.8/radattr.so: undefined symbol: ifname
verify-elf: WARNING: ./usr/lib/pppd/2.4.8/radattr.so: undefined symbol: exitnotify
verify-elf: WARNING: ./usr/lib/pppd/2.4.8/radattr.so: undefined symbol: radius_attributes_hook
verify-elf: WARNING: ./usr/lib/pppd/2.4.8/radattr.so: undefined symbol: slprintf
verify-elf: WARNING: ./usr/lib/pppd/2.4.8/radattr.so: undefined symbol: dbglog
verify-elf: WARNING: ./usr/lib/pppd/2.4.8/radattr.so: undefined symbol: add_notifier
verify-elf: WARNING: ./usr/lib/pppd/2.4.8/radattr.so: undefined symbol: rc_avpair_tostr
verify-elf: WARNING: ./usr/lib/pppd/2.4.8/radattr.so: undefined symbol: info
verify-elf: WARNING: ./usr/lib/pppd/2.4.8/radattr.so: uses non-LFS functions: fopen
verify-elf: WARNING: ./usr/lib/pppd/2.4.8/radius.so: undefined symbol: sync_serial
verify-elf: WARNING: ./usr/lib/pppd/2.4.8/radius.so: undefined symbol: maxconnect
verify-elf: WARNING: ./usr/lib/pppd/2.4.8/radius.so: undefined symbol: ip_choose_hook
verify-elf: WARNING: ./usr/lib/pppd/2.4.8/radius.so: undefined symbol: hostname
verify-elf: WARNING: ./usr/lib/pppd/2.4.8/radius.so: undefined symbol: chap_verify_hook
verify-elf: WARNING: ./usr/lib/pppd/2.4.8/radius.so: undefined symbol: mppe_send_key
verify-elf: WARNING: ./usr/lib/pppd/2.4.8/radius.so: undefined symbol: mppe_keys_set
verify-elf: WARNING: ./usr/lib/pppd/2.4.8/radius.so: undefined symbol: maxoctets
verify-elf: WARNING: ./usr/lib/pppd/2.4.8/radius.so: undefined symbol: chap_check_hook
verify-elf: WARNING: ./usr/lib/pppd/2.4.8/radius.so: undefined symbol: ipcp_hisoptions
verify-elf: WARNING: ./usr/lib/pppd/2.4.8/radius.so: undefined symbol: ip_down_notifier
verify-elf: WARNING: ./usr/lib/pppd/2.4.8/radius.so: undefined symbol: ipparam
verify-elf: WARNING: ./usr/lib/pppd/2.4.8/radius.so: undefined symbol: ipcp_allowoptions
verify-elf: WARNING: ./usr/lib/pppd/2.4.8/radius.so: undefined symbol: ipcp_wantoptions
verify-elf: WARNING: ./usr/lib/pppd/2.4.8/radius.so: undefined symbol: link_stats_valid
verify-elf: WARNING: ./usr/lib/pppd/2.4.8/radius.so: undefined symbol: ifname
verify-elf: WARNING: ./usr/lib/pppd/2.4.8/radius.so: undefined symbol: using_pty
verify-elf: WARNING: ./usr/lib/pppd/2.4.8/radius.so: undefined symbol: status
verify-elf: WARNING: ./usr/lib/pppd/2.4.8/radius.so: undefined symbol: allowed_address_hook
verify-elf: WARNING: ./usr/lib/pppd/2.4.8/radius.so: undefined symbol: maxoctets_dir
verify-elf: WARNING: ./usr/lib/pppd/2.4.8/radius.so: undefined symbol: ip_up_notifier
verify-elf: WARNING: ./usr/lib/pppd/2.4.8/radius.so: undefined symbol: devnam
verify-elf: WARNING: ./usr/lib/pppd/2.4.8/radius.so: undefined symbol: mppe_recv_key
verify-elf: WARNING: ./usr/lib/pppd/2.4.8/radius.so: undefined symbol: idle_time_limit
verify-elf: WARNING: ./usr/lib/pppd/2.4.8/radius.so: undefined symbol: link_connect_time
verify-elf: WARNING: ./usr/lib/pppd/2.4.8/radius.so: undefined symbol: remote_number
verify-elf: WARNING: ./usr/lib/pppd/2.4.8/radius.so: undefined symbol: pap_auth_hook
verify-elf: WARNING: ./usr/lib/pppd/2.4.8/radius.so: undefined symbol: link_stats
verify-elf: WARNING: ./usr/lib/pppd/2.4.8/radius.so: undefined symbol: pap_check_hook
verify-elf: WARNING: ./usr/lib/pppd/2.4.8/radius.so: undefined symbol: novm
verify-elf: WARNING: ./usr/lib/pppd/2.4.8/radius.so: undefined symbol: update_link_stats
verify-elf: WARNING: ./usr/lib/pppd/2.4.8/radius.so: undefined symbol: bad_ip_adrs
verify-elf: WARNING: ./usr/lib/pppd/2.4.8/radius.so: undefined symbol: mppe_set_keys
verify-elf: WARNING: ./usr/lib/pppd/2.4.8/radius.so: undefined symbol: script_setenv
verify-elf: WARNING: ./usr/lib/pppd/2.4.8/radius.so: undefined symbol: magic
verify-elf: WARNING: ./usr/lib/pppd/2.4.8/radius.so: undefined symbol: set_mppe_enc_types
verify-elf: WARNING: ./usr/lib/pppd/2.4.8/radius.so: undefined symbol: info
verify-elf: WARNING: ./usr/lib/pppd/2.4.8/radius.so: undefined symbol: slprintf
verify-elf: WARNING: ./usr/lib/pppd/2.4.8/radius.so: undefined symbol: untimeout
verify-elf: WARNING: ./usr/lib/pppd/2.4.8/radius.so: undefined symbol: add_notifier
verify-elf: WARNING: ./usr/lib/pppd/2.4.8/radius.so: undefined symbol: add_options
verify-elf: WARNING: ./usr/lib/pppd/2.4.8/radius.so: undefined symbol: fatal
verify-elf: WARNING: ./usr/lib/pppd/2.4.8/radius.so: undefined symbol: timeout
verify-elf: WARNING: ./usr/lib/pppd/2.4.8/radius.so: uses non-LFS functions: fcntl fopen ftruncate open
verify-elf: WARNING: ./usr/lib/pppd/2.4.8/openl2tp.so: undefined symbol: multilink_join_hook
verify-elf: WARNING: ./usr/lib/pppd/2.4.8/openl2tp.so: undefined symbol: ifname
verify-elf: WARNING: ./usr/lib/pppd/2.4.8/openl2tp.so: undefined symbol: ifunit
verify-elf: WARNING: ./usr/lib/pppd/2.4.8/openl2tp.so: undefined symbol: peer_authname
verify-elf: WARNING: ./usr/lib/pppd/2.4.8/openl2tp.so: undefined symbol: pppol2tp_ip_updown_hook
verify-elf: WARNING: ./usr/lib/pppd/2.4.8/openl2tp.so: undefined symbol: pppol2tp_send_accm_hook
verify-elf: WARNING: ./usr/lib/pppd/2.4.8/openl2tp.so: undefined symbol: dbglog
verify-elf: WARNING: ./usr/lib/pppd/2.4.8/pppol2tp.so: undefined symbol: ip_up_notifier
verify-elf: WARNING: ./usr/lib/pppd/2.4.8/pppol2tp.so: undefined symbol: ifname
verify-elf: WARNING: ./usr/lib/pppd/2.4.8/pppol2tp.so: undefined symbol: ip_down_notifier
verify-elf: WARNING: ./usr/lib/pppd/2.4.8/pppol2tp.so: undefined symbol: ifunit
verify-elf: WARNING: ./usr/lib/pppd/2.4.8/pppol2tp.so: undefined symbol: the_channel
verify-elf: WARNING: ./usr/lib/pppd/2.4.8/pppol2tp.so: undefined symbol: snoop_send_hook
verify-elf: WARNING: ./usr/lib/pppd/2.4.8/pppol2tp.so: undefined symbol: ipcp_allowoptions
verify-elf: WARNING: ./usr/lib/pppd/2.4.8/pppol2tp.so: undefined symbol: lcp_allowoptions
verify-elf: WARNING: ./usr/lib/pppd/2.4.8/pppol2tp.so: undefined symbol: snoop_recv_hook
verify-elf: WARNING: ./usr/lib/pppd/2.4.8/pppol2tp.so: undefined symbol: ccp_allowoptions
verify-elf: WARNING: ./usr/lib/pppd/2.4.8/pppol2tp.so: undefined symbol: ccp_wantoptions
verify-elf: WARNING: ./usr/lib/pppd/2.4.8/pppol2tp.so: undefined symbol: ipcp_wantoptions
verify-elf: WARNING: ./usr/lib/pppd/2.4.8/pppol2tp.so: undefined symbol: ipv6_up_notifier
verify-elf: WARNING: ./usr/lib/pppd/2.4.8/pppol2tp.so: undefined symbol: modem
verify-elf: WARNING: ./usr/lib/pppd/2.4.8/pppol2tp.so: undefined symbol: lcp_wantoptions
verify-elf: WARNING: ./usr/lib/pppd/2.4.8/pppol2tp.so: undefined symbol: new_style_driver
verify-elf: WARNING: ./usr/lib/pppd/2.4.8/pppol2tp.so: undefined symbol: ipv6_down_notifier
verify-elf: WARNING: ./usr/lib/pppd/2.4.8/pppol2tp.so: undefined symbol: generic_establish_ppp
verify-elf: WARNING: ./usr/lib/pppd/2.4.8/pppol2tp.so: undefined symbol: generic_disestablish_ppp
verify-elf: WARNING: ./usr/lib/pppd/2.4.8/pppol2tp.so: undefined symbol: int_option
verify-elf: WARNING: ./usr/lib/pppd/2.4.8/pppol2tp.so: undefined symbol: add_options
verify-elf: WARNING: ./usr/lib/pppd/2.4.8/pppol2tp.so: undefined symbol: ppp_available
verify-elf: WARNING: ./usr/lib/pppd/2.4.8/pppol2tp.so: undefined symbol: dbglog
verify-elf: WARNING: ./usr/lib/pppd/2.4.8/pppol2tp.so: undefined symbol: add_notifier
verify-elf: WARNING: ./usr/lib/pppd/2.4.8/pppol2tp.so: undefined symbol: novm
verify-elf: WARNING: ./usr/lib/pppd/2.4.8/pppol2tp.so: undefined symbol: fatal
verify-elf: WARNING: ./usr/lib/pppd/2.4.8/pppol2tp.so: undefined symbol: netif_set_mtu
verify-elf: WARNING: ./usr/lib/pppd/2.4.8/pppoatm.so: undefined symbol: the_channel
verify-elf: WARNING: ./usr/lib/pppd/2.4.8/pppoatm.so: undefined symbol: lcp_allowoptions
verify-elf: WARNING: ./usr/lib/pppd/2.4.8/pppoatm.so: undefined symbol: devstat
verify-elf: WARNING: ./usr/lib/pppd/2.4.8/pppoatm.so: undefined symbol: devnam
verify-elf: WARNING: ./usr/lib/pppd/2.4.8/pppoatm.so: undefined symbol: devnam
verify-elf: WARNING: ./usr/lib/pppd/2.4.8/pppoatm.so: undefined symbol: ppp_devnam
verify-elf: WARNING: ./usr/lib/pppd/2.4.8/pppoatm.so: undefined symbol: lcp_wantoptions
verify-elf: WARNING: ./usr/lib/pppd/2.4.8/pppoatm.so: undefined symbol: new_style_driver
verify-elf: WARNING: ./usr/lib/pppd/2.4.8/pppoatm.so: undefined symbol: generic_establish_ppp
verify-elf: WARNING: ./usr/lib/pppd/2.4.8/pppoatm.so: undefined symbol: generic_disestablish_ppp
verify-elf: WARNING: ./usr/lib/pppd/2.4.8/pppoatm.so: undefined symbol: add_options
verify-elf: WARNING: ./usr/lib/pppd/2.4.8/pppoatm.so: undefined symbol: ppp_available
verify-elf: WARNING: ./usr/lib/pppd/2.4.8/pppoatm.so: undefined symbol: fatal
verify-elf: WARNING: ./usr/lib/pppd/2.4.8/pppoatm.so: undefined symbol: info
verify-elf: WARNING: ./usr/lib/pppd/2.4.8/pppoatm.so: uses non-LFS functions: fopen
verify-elf: WARNING: ./usr/lib/pppd/2.4.8/rp-pppoe.so: undefined symbol: the_channel
verify-elf: WARNING: ./usr/lib/pppd/2.4.8/rp-pppoe.so: undefined symbol: debug
verify-elf: WARNING: ./usr/lib/pppd/2.4.8/rp-pppoe.so: undefined symbol: pr_log
verify-elf: WARNING: ./usr/lib/pppd/2.4.8/rp-pppoe.so: undefined symbol: ipcp_allowoptions
verify-elf: WARNING: ./usr/lib/pppd/2.4.8/rp-pppoe.so: undefined symbol: ppp_session_number
verify-elf: WARNING: ./usr/lib/pppd/2.4.8/rp-pppoe.so: undefined symbol: lcp_allowoptions
verify-elf: WARNING: ./usr/lib/pppd/2.4.8/rp-pppoe.so: undefined symbol: ccp_allowoptions
verify-elf: WARNING: ./usr/lib/pppd/2.4.8/rp-pppoe.so: undefined symbol: ccp_wantoptions
verify-elf: WARNING: ./usr/lib/pppd/2.4.8/rp-pppoe.so: undefined symbol: ipcp_wantoptions
verify-elf: WARNING: ./usr/lib/pppd/2.4.8/rp-pppoe.so: undefined symbol: devnam
verify-elf: WARNING: ./usr/lib/pppd/2.4.8/rp-pppoe.so: undefined symbol: devnam
verify-elf: WARNING: ./usr/lib/pppd/2.4.8/rp-pppoe.so: undefined symbol: remote_number
verify-elf: WARNING: ./usr/lib/pppd/2.4.8/rp-pppoe.so: undefined symbol: ppp_devnam
verify-elf: WARNING: ./usr/lib/pppd/2.4.8/rp-pppoe.so: undefined symbol: modem
verify-elf: WARNING: ./usr/lib/pppd/2.4.8/rp-pppoe.so: undefined symbol: lcp_wantoptions
verify-elf: WARNING: ./usr/lib/pppd/2.4.8/rp-pppoe.so: undefined symbol: new_style_driver
verify-elf: WARNING: ./usr/lib/pppd/2.4.8/rp-pppoe.so: undefined symbol: generic_establish_ppp
verify-elf: WARNING: ./usr/lib/pppd/2.4.8/rp-pppoe.so: undefined symbol: generic_disestablish_ppp
verify-elf: WARNING: ./usr/lib/pppd/2.4.8/rp-pppoe.so: undefined symbol: option_error
verify-elf: WARNING: ./usr/lib/pppd/2.4.8/rp-pppoe.so: undefined symbol: script_setenv
verify-elf: WARNING: ./usr/lib/pppd/2.4.8/rp-pppoe.so: undefined symbol: end_pr_log
verify-elf: WARNING: ./usr/lib/pppd/2.4.8/rp-pppoe.so: undefined symbol: add_options
verify-elf: WARNING: ./usr/lib/pppd/2.4.8/rp-pppoe.so: undefined symbol: ppp_available
verify-elf: WARNING: ./usr/lib/pppd/2.4.8/rp-pppoe.so: undefined symbol: dbglog
verify-elf: WARNING: ./usr/lib/pppd/2.4.8/rp-pppoe.so: undefined symbol: options_from_file
verify-elf: WARNING: ./usr/lib/pppd/2.4.8/rp-pppoe.so: undefined symbol: init_pr_log
verify-elf: WARNING: ./usr/lib/pppd/2.4.8/rp-pppoe.so: undefined symbol: novm
verify-elf: WARNING: ./usr/lib/pppd/2.4.8/rp-pppoe.so: undefined symbol: fatal
verify-elf: WARNING: ./usr/lib/pppd/2.4.8/rp-pppoe.so: undefined symbol: info
verify-elf: WARNING: ./usr/lib/pppd/2.4.8/winbind.so: undefined symbol: pap_check_hook
verify-elf: WARNING: ./usr/lib/pppd/2.4.8/winbind.so: undefined symbol: chap_check_hook
verify-elf: WARNING: ./usr/lib/pppd/2.4.8/winbind.so: undefined symbol: chap_verify_hook
verify-elf: WARNING: ./usr/lib/pppd/2.4.8/winbind.so: undefined symbol: allowed_address_hook
verify-elf: WARNING: ./usr/lib/pppd/2.4.8/winbind.so: undefined symbol: ipcp_wantoptions
verify-elf: WARNING: ./usr/lib/pppd/2.4.8/winbind.so: undefined symbol: pap_auth_hook
verify-elf: WARNING: ./usr/lib/pppd/2.4.8/winbind.so: undefined symbol: chap_mdtype_all
verify-elf: WARNING: ./usr/lib/pppd/2.4.8/winbind.so: undefined symbol: option_error
verify-elf: WARNING: ./usr/lib/pppd/2.4.8/winbind.so: undefined symbol: slprintf
verify-elf: WARNING: ./usr/lib/pppd/2.4.8/winbind.so: undefined symbol: add_options
verify-elf: WARNING: ./usr/lib/pppd/2.4.8/winbind.so: undefined symbol: GenerateAuthenticatorResponse
verify-elf: WARNING: ./usr/lib/pppd/2.4.8/winbind.so: undefined symbol: mppe_set_keys2
verify-elf: WARNING: ./usr/lib/pppd/2.4.8/winbind.so: undefined symbol: safe_fork
verify-elf: WARNING: ./usr/lib/pppd/2.4.8/winbind.so: undefined symbol: mppe_set_keys
verify-elf: WARNING: ./usr/lib/pppd/2.4.8/winbind.so: undefined symbol: ChallengeHash
verify-elf: WARNING: ./usr/lib/pppd/2.4.8/winbind.so: undefined symbol: novm
verify-elf: WARNING: ./usr/lib/pppd/2.4.8/winbind.so: undefined symbol: fatal
verify-elf: WARNING: ./usr/lib/pppd/2.4.8/winbind.so: undefined symbol: info
verify-elf: WARNING: ./usr/lib/pppd/2.4.8/winbind.so: undefined symbol: notice
verify-elf: WARNING: ./usr/lib/pppd/2.4.8/passwordfd.so: undefined symbol: eaptls_passwd_hook
verify-elf: WARNING: ./usr/lib/pppd/2.4.8/passwordfd.so: undefined symbol: pap_check_hook
verify-elf: WARNING: ./usr/lib/pppd/2.4.8/passwordfd.so: undefined symbol: chap_check_hook
verify-elf: WARNING: ./usr/lib/pppd/2.4.8/passwordfd.so: undefined symbol: pap_passwd_hook
verify-elf: WARNING: ./usr/lib/pppd/2.4.8/passwordfd.so: undefined symbol: chap_passwd_hook
verify-elf: WARNING: ./usr/lib/pppd/2.4.8/passwordfd.so: undefined symbol: add_options
verify-elf: WARNING: ./usr/lib/pppd/2.4.8/passprompt.so: undefined symbol: eaptls_passwd_hook
verify-elf: WARNING: ./usr/lib/pppd/2.4.8/passprompt.so: undefined symbol: pap_passwd_hook
verify-elf: WARNING: ./usr/lib/pppd/2.4.8/passprompt.so: undefined symbol: status
verify-elf: WARNING: ./usr/lib/pppd/2.4.8/passprompt.so: undefined symbol: remote_name
verify-elf: WARNING: ./usr/lib/pppd/2.4.8/passprompt.so: undefined symbol: add_options
verify-elf: WARNING: ./usr/lib/pppd/2.4.8/passprompt.so: undefined symbol: sys_close
verify-elf: WARNING: ./usr/lib/pppd/2.4.8/minconn.so: undefined symbol: idle_time_limit
verify-elf: WARNING: ./usr/lib/pppd/2.4.8/minconn.so: undefined symbol: idle_time_hook
verify-elf: WARNING: ./usr/lib/pppd/2.4.8/minconn.so: undefined symbol: info
verify-elf: WARNING: ./usr/lib/pppd/2.4.8/minconn.so: undefined symbol: add_options
verify-elf: WARNING: ./usr/sbin/pppdump: uses non-LFS functions: fopen
verify-elf: WARNING: ./usr/sbin/pppd: uses non-LFS functions: __fxstat __lxstat __xstat fcntl fopen ftruncate lseek mmap open readdir
verify-elf: WARNING: ./usr/sbin/pppoe-discovery: uses non-LFS functions: fopen readdir
verify-elf: WARNING: ./usr/sbin/chat: uses non-LFS functions: fcntl fopen
Hardlinking identical .pyc and .pyo files
Processing files: ppp-2.4.8-alt2
Executing(%doc): /bin/sh -e /usr/src/tmp/rpm-tmp.34840
+ umask 022
+ /bin/mkdir -p /usr/src/RPM/BUILD
+ cd /usr/src/RPM/BUILD
+ cd ppp-2.4.8
+ DOCDIR=/usr/src/tmp/ppp-buildroot/usr/share/doc/ppp-2.4.8
+ export DOCDIR
+ rm -rf /usr/src/tmp/ppp-buildroot/usr/share/doc/ppp-2.4.8
+ /bin/mkdir -p /usr/src/tmp/ppp-buildroot/usr/share/doc/ppp-2.4.8
+ cp -prL PLUGINS SETUP FAQ README README.MPPE README.MSCHAP80 README.MSCHAP81 README.cbcp README.eap-srp README.eap-tls README.linux README.pppoe README.pppol2tp README.pwfd README.sol2 scripts sample /usr/src/tmp/ppp-buildroot/usr/share/doc/ppp-2.4.8
+ chmod -R go-w /usr/src/tmp/ppp-buildroot/usr/share/doc/ppp-2.4.8
+ chmod -R a+rX /usr/src/tmp/ppp-buildroot/usr/share/doc/ppp-2.4.8
+ exit 0
Finding Provides (using /usr/lib/rpm/find-provides)
Executing: /bin/sh -e /usr/src/tmp/rpm-tmp.meI98A
find-provides: running scripts (alternatives,debuginfo,lib,pam,perl,pkgconfig,python,shell)
lib.prov: /usr/src/tmp/ppp-buildroot/usr/lib/pppd/2.4.8/minconn.so: 2 symbols, 11 bpp
lib.prov: /usr/src/tmp/ppp-buildroot/usr/lib/pppd/2.4.8/openl2tp.so: 2 symbols, 11 bpp
lib.prov: /usr/src/tmp/ppp-buildroot/usr/lib/pppd/2.4.8/passprompt.so: 2 symbols, 11 bpp
lib.prov: /usr/src/tmp/ppp-buildroot/usr/lib/pppd/2.4.8/passwordfd.so: 2 symbols, 11 bpp
lib.prov: /usr/src/tmp/ppp-buildroot/usr/lib/pppd/2.4.8/pppol2tp.so: 7 symbols, 13 bpp
lib.prov: /usr/src/tmp/ppp-buildroot/usr/lib/pppd/2.4.8/winbind.so: 5 symbols, 13 bpp
Finding Requires (using /usr/lib/rpm/find-requires)
Executing: /bin/sh -e /usr/src/tmp/rpm-tmp.phMkcB
find-requires: running scripts (cpp,debuginfo,files,lib,pam,perl,pkgconfig,pkgconfiglib,python,rpmlib,shebang,shell,static,symlinks,systemd-services)
shebang.req.files: executable script /usr/src/tmp/ppp-buildroot/etc/ppp/callback-client is not executable
shebang.req.files: executable script /usr/src/tmp/ppp-buildroot/etc/ppp/callback-server is not executable
find-requires: FINDPACKAGE-COMMANDS: sleep
Finding Requires(pre) (using /usr/lib/rpm/find-scriptlet-requires)
Executing: /bin/sh -e /usr/src/tmp/rpm-tmp.dEuzYA
Finding Requires(post) (using /usr/lib/rpm/find-scriptlet-requires)
Executing: /bin/sh -e /usr/src/tmp/rpm-tmp.P7EBlA
Provides: /usr/lib/pppd/2.4.8/minconn.so = set:ecvwB6, /usr/lib/pppd/2.4.8/openl2tp.so = set:ecvwB6, /usr/lib/pppd/2.4.8/passprompt.so = set:ecvwB6, /usr/lib/pppd/2.4.8/passwordfd.so = set:ecvwB6, /usr/lib/pppd/2.4.8/pppol2tp.so = set:gdLFRUUjAiRqaCL0, /usr/lib/pppd/2.4.8/winbind.so = set:gdLi4TeC5GN6, pam0(ppp)
Requires: ppp-common, libssl, kmod >= 14, udev >= 204-alt2, /bin/sh, /etc/control.d/facilities(control_fmode), /etc/control.d/facilities(new_fmode), /etc/control.d/facilities(new_help), /etc/control.d/functions, /etc/logrotate.d, /etc/pam.d, /lib/ld-linux.so.2, /lib/udev/rules.d, coreutils, libc.so.6 >= set:poiedc, libc.so.6(ALT_2.24), libc.so.6(GLIBC_2.0), libc.so.6(GLIBC_2.1), libc.so.6(GLIBC_2.1.3), libc.so.6(GLIBC_2.15), libc.so.6(GLIBC_2.2.5), libc.so.6(GLIBC_2.28), libc.so.6(GLIBC_2.3), libc.so.6(GLIBC_2.3.4), libc.so.6(GLIBC_2.4), libc.so.6(GLIBC_2.7), libcrypt.so.1 >= set:ihuTa, libcrypt.so.1(XCRYPT_2.0), libcrypto.so.1.1 >= set:qkvV29JtreDN5HlasJkEbPMX922H9lrMsJanBZl5tXFL9j5mFUQy8ZFiUmvvfvsjbSdJxtv8nPTE3LDknPZ6U22um4zkMEzkMCWzFNV9fNCju6wsWa3u9wQwCkmKAWMXhmYUQXP6Nx8TUNNE13AUnq5NVKRbJAxmoxhS5k2ZewdWzgGumy3lo, libcrypto.so.1.1(OPENSSL_1_1_0), libdl.so.2(GLIBC_2.0), libdl.so.2(GLIBC_2.1), libpam(include), libpam.so.0 >= set:jfaU0elpOZaI4OMxyIgYI1, libpam.so.0(LIBPAM_1.0), libpcap.so.0.8 >= set:khO4qzPRREupwgY1, libssl.so.1.1 >= set:mg0FWuLbyh1NQA0hGcVffzxQ9a2gXJZlaLYJOXW1Xr8ha2bMWr0Ftq9u7LWZlqL1Hm3Oz9HgwiEOqgjNZD3UZ2DPHr6, libssl.so.1.1(OPENSSL_1_1_0), libsystemd.so.0 >= set:nmZGf6, libsystemd.so.0(LIBSYSTEMD_209), libudev.so.1 >= set:khX6Jf02g5ZgIbNol7, libudev.so.1(LIBUDEV_183), libutil.so.1(GLIBC_2.0), pam0(common-login), rtld(GNU_HASH)
Requires(interp): /bin/sh
Requires(rpmlib): rpmlib(SetVersions)
Requires(pre): /bin/sh, /usr/sbin/control-dump
Requires(post): /bin/sh, /usr/sbin/control, /usr/sbin/control-restore
Obsoletes: ppp-cbcp, ppp-mppe, ppp-extra
Finding debuginfo files (using /usr/lib/rpm/find-debuginfo-files)
Executing: /bin/sh -e /usr/src/tmp/rpm-tmp.yXskpA
Creating ppp-debuginfo package
Processing files: ppp-devel-2.4.8-alt2
Finding Provides (using /usr/lib/rpm/find-provides)
Executing: /bin/sh -e /usr/src/tmp/rpm-tmp.3XI1RB
find-provides: running scripts (alternatives,debuginfo,lib,pam,perl,pkgconfig,python,shell)
Finding Requires (using /usr/lib/rpm/find-requires)
Executing: /bin/sh -e /usr/src/tmp/rpm-tmp.YD5WGD
find-requires: running scripts (cpp,debuginfo,files,lib,pam,perl,pkgconfig,pkgconfiglib,python,rpmlib,shebang,shell,static,symlinks,systemd-services)
/usr/src/tmp/ppp-buildroot/usr/include/pppd/eui64.h:42:2: error: #error "this file should only be included when INET6 is defined"
   42 | #error "this file should only be included when INET6 is defined"
      |  ^~~~~
cpp.req: /usr/src/tmp/ppp-buildroot/usr/include/pppd/eui64.h: cpp failed, trying c++ mode
i586-alt-linux-cpp: fatal error: cannot execute 'cc1plus': execvp: No such file or directory
compilation terminated.
cpp.req: WARNING: /usr/src/tmp/ppp-buildroot/usr/include/pppd/eui64.h: cpp failed
/usr/src/tmp/ppp-buildroot/usr/include/pppd/pppcrypt.h:41:10: fatal error: des.h: No such file or directory
   41 | #include <des.h>
      |          ^~~~~~~
compilation terminated.
cpp.req: WARNING: /usr/src/tmp/ppp-buildroot/usr/include/pppd/pppcrypt.h: cpp failed
Requires: ppp = 2.4.8-alt2, libssl-devel
Processing files: ppp-radius-2.4.8-alt2
Finding Provides (using /usr/lib/rpm/find-provides)
Executing: /bin/sh -e /usr/src/tmp/rpm-tmp.Wg662A
find-provides: running scripts (alternatives,debuginfo,lib,pam,perl,pkgconfig,python,shell)
lib.prov: /usr/src/tmp/ppp-buildroot/usr/lib/pppd/2.4.8/radattr.so: 2 symbols, 11 bpp
lib.prov: /usr/src/tmp/ppp-buildroot/usr/lib/pppd/2.4.8/radius.so: 54 symbols, 16 bpp
lib.prov: /usr/src/tmp/ppp-buildroot/usr/lib/pppd/2.4.8/radrealms.so: 3 symbols, 12 bpp
Finding Requires (using /usr/lib/rpm/find-requires)
Executing: /bin/sh -e /usr/src/tmp/rpm-tmp.BMSIlC
find-requires: running scripts (cpp,debuginfo,files,lib,pam,perl,pkgconfig,pkgconfiglib,python,rpmlib,shebang,shell,static,symlinks,systemd-services)
Provides: /usr/lib/pppd/2.4.8/radattr.so = set:ecvwB6, /usr/lib/pppd/2.4.8/radius.so = set:jdEZ0hTcGQPRu11RZmOT2lCSTBktszQZcXPkvevCzv9B6ZfrVP9WZ42zhVgGOSuOg6uIVCk6bIGQMgmkZj81mGS4ZyhfksoVcFAF6KNEIpuYp2, /usr/lib/pppd/2.4.8/radrealms.so = set:fdvwBeFq
Requires: ppp = 2.4.8-alt2, libc.so.6 >= set:poiedc, libc.so.6(ALT_2.24), libc.so.6(GLIBC_2.0), libc.so.6(GLIBC_2.1), libc.so.6(GLIBC_2.1.3), libc.so.6(GLIBC_2.15), libc.so.6(GLIBC_2.2.5), libc.so.6(GLIBC_2.28), libc.so.6(GLIBC_2.3), libc.so.6(GLIBC_2.3.4), libc.so.6(GLIBC_2.4), libc.so.6(GLIBC_2.7), libcrypto.so.1.1 >= set:qoRmGPiyXFOpk0, libcrypto.so.1.1(OPENSSL_1_1_0), rtld(GNU_HASH)
Requires(rpmlib): rpmlib(SetVersions)
Finding debuginfo files (using /usr/lib/rpm/find-debuginfo-files)
Executing: /bin/sh -e /usr/src/tmp/rpm-tmp.qvRToB
Creating ppp-radius-debuginfo package
Processing files: ppp-pppoatm-2.4.8-alt2
Finding Provides (using /usr/lib/rpm/find-provides)
Executing: /bin/sh -e /usr/src/tmp/rpm-tmp.DK5EXD
find-provides: running scripts (alternatives,debuginfo,lib,pam,perl,pkgconfig,python,shell)
lib.prov: /usr/src/tmp/ppp-buildroot/usr/lib/pppd/2.4.8/pppoatm.so: 11 symbols, 14 bpp
Finding Requires (using /usr/lib/rpm/find-requires)
Executing: /bin/sh -e /usr/src/tmp/rpm-tmp.RQqNCC
find-requires: running scripts (cpp,debuginfo,files,lib,pam,perl,pkgconfig,pkgconfiglib,python,rpmlib,shebang,shell,static,symlinks,systemd-services)
Provides: /usr/lib/pppd/2.4.8/pppoatm.so = set:hdnWBliaZJVhPzQ8szZ285di1
Requires: ppp = 2.4.8-alt2, libc.so.6(ALT_2.24), libc.so.6(GLIBC_2.0), libc.so.6(GLIBC_2.1), libc.so.6(GLIBC_2.1.3), libc.so.6(GLIBC_2.3), libc.so.6(GLIBC_2.4), libc.so.6(GLIBC_2.7), libresolv.so.2(GLIBC_2.2), rtld(GNU_HASH)
Finding debuginfo files (using /usr/lib/rpm/find-debuginfo-files)
Executing: /bin/sh -e /usr/src/tmp/rpm-tmp.oCd0XC
Creating ppp-pppoatm-debuginfo package
Processing files: ppp-pppoe-2.4.8-alt2
Finding Provides (using /usr/lib/rpm/find-provides)
Executing: /bin/sh -e /usr/src/tmp/rpm-tmp.FXg0AB
find-provides: running scripts (alternatives,debuginfo,lib,pam,perl,pkgconfig,python,shell)
lib.prov: /usr/src/tmp/ppp-buildroot/usr/lib/pppd/2.4.8/rp-pppoe.so: 19 symbols, 15 bpp
Finding Requires (using /usr/lib/rpm/find-requires)
Executing: /bin/sh -e /usr/src/tmp/rpm-tmp.ce1MtC
find-requires: running scripts (cpp,debuginfo,files,lib,pam,perl,pkgconfig,pkgconfiglib,python,rpmlib,shebang,shell,static,symlinks,systemd-services)
Provides: /usr/lib/pppd/2.4.8/rp-pppoe.so = set:idsHZJQIK09eSoyBLUucKy92rv0HwqaVQZfaKOz9f
Requires: ppp = 2.4.8-alt2, libc.so.6(ALT_2.24), libc.so.6(GLIBC_2.0), libc.so.6(GLIBC_2.1), libc.so.6(GLIBC_2.1.3), libc.so.6(GLIBC_2.15), libc.so.6(GLIBC_2.3), libc.so.6(GLIBC_2.3.4), libc.so.6(GLIBC_2.4), libc.so.6(GLIBC_2.7), libudev.so.1 >= set:khX6Jf02g5ZgIbNol7, libudev.so.1(LIBUDEV_183), rtld(GNU_HASH)
Requires(rpmlib): rpmlib(SetVersions)
Finding debuginfo files (using /usr/lib/rpm/find-debuginfo-files)
Executing: /bin/sh -e /usr/src/tmp/rpm-tmp.gsDokB
Creating ppp-pppoe-debuginfo package
Processing files: ppp-dhcp-2.4.8-alt2
Executing(%doc): /bin/sh -e /usr/src/tmp/rpm-tmp.54429
+ umask 022
+ /bin/mkdir -p /usr/src/RPM/BUILD
+ cd /usr/src/RPM/BUILD
+ cd ppp-2.4.8
+ DOCDIR=/usr/src/tmp/ppp-buildroot/usr/share/doc/ppp-dhcp-2.4.8
+ export DOCDIR
+ rm -rf /usr/src/tmp/ppp-buildroot/usr/share/doc/ppp-dhcp-2.4.8
+ /bin/mkdir -p /usr/src/tmp/ppp-buildroot/usr/share/doc/ppp-dhcp-2.4.8
+ cp -prL pppd/plugins/dhcp/README /usr/src/tmp/ppp-buildroot/usr/share/doc/ppp-dhcp-2.4.8
+ chmod -R go-w /usr/src/tmp/ppp-buildroot/usr/share/doc/ppp-dhcp-2.4.8
+ chmod -R a+rX /usr/src/tmp/ppp-buildroot/usr/share/doc/ppp-dhcp-2.4.8
+ cp -prL pppd/plugins/dhcp/AUTHORS /usr/src/tmp/ppp-buildroot/usr/share/doc/ppp-dhcp-2.4.8
+ chmod -R go-w /usr/src/tmp/ppp-buildroot/usr/share/doc/ppp-dhcp-2.4.8
+ chmod -R a+rX /usr/src/tmp/ppp-buildroot/usr/share/doc/ppp-dhcp-2.4.8
+ cp -prL pppd/plugins/dhcp/COPYING /usr/src/tmp/ppp-buildroot/usr/share/doc/ppp-dhcp-2.4.8
+ chmod -R go-w /usr/src/tmp/ppp-buildroot/usr/share/doc/ppp-dhcp-2.4.8
+ chmod -R a+rX /usr/src/tmp/ppp-buildroot/usr/share/doc/ppp-dhcp-2.4.8
+ exit 0
Finding Provides (using /usr/lib/rpm/find-provides)
Executing: /bin/sh -e /usr/src/tmp/rpm-tmp.rgLzpA
find-provides: running scripts (alternatives,debuginfo,lib,pam,perl,pkgconfig,python,shell)
lib.prov: /usr/src/tmp/ppp-buildroot/usr/lib/pppd/2.4.8/dhcpc.so: 37 symbols, 16 bpp
Finding Requires (using /usr/lib/rpm/find-requires)
Executing: /bin/sh -e /usr/src/tmp/rpm-tmp.A2jFpA
find-requires: running scripts (cpp,debuginfo,files,lib,pam,perl,pkgconfig,pkgconfiglib,python,rpmlib,shebang,shell,static,symlinks,systemd-services)
Provides: /usr/lib/pppd/2.4.8/dhcpc.so = set:jdRhg2HGhYaI9TK34mgtn7m8N85C4k0miH5GGQfP3D2iOvKSdFKg91mnCYoXWucK0UE8TnWIkppTU0
Requires: ppp = 2.4.8-alt2, libc.so.6(GLIBC_2.0), libc.so.6(GLIBC_2.1.3), libc.so.6(GLIBC_2.12), libc.so.6(GLIBC_2.15), libc.so.6(GLIBC_2.3.4), libc.so.6(GLIBC_2.4), rtld(GNU_HASH)
Finding debuginfo files (using /usr/lib/rpm/find-debuginfo-files)
Executing: /bin/sh -e /usr/src/tmp/rpm-tmp.BWWuYB
Creating ppp-dhcp-debuginfo package
Processing files: ppp-debuginfo-2.4.8-alt2
Finding Provides (using /usr/lib/rpm/find-provides)
Executing: /bin/sh -e /usr/src/tmp/rpm-tmp.HpeGnA
find-provides: running scripts (debuginfo)
Finding Requires (using /usr/lib/rpm/find-requires)
Executing: /bin/sh -e /usr/src/tmp/rpm-tmp.e73YiE
find-requires: running scripts (debuginfo)
Requires: ppp = 2.4.8-alt2, /usr/lib/debug/lib/ld-linux.so.2.debug, debug(libc.so.6), debug(libcrypt.so.1), debug(libcrypto.so.1.1), debug(libdl.so.2), debug(libpam.so.0), debug(libpcap.so.0.8), debug(libssl.so.1.1), debug(libsystemd.so.0), debug(libudev.so.1), debug(libutil.so.1)
Processing files: ppp-radius-debuginfo-2.4.8-alt2
Finding Provides (using /usr/lib/rpm/find-provides)
Executing: /bin/sh -e /usr/src/tmp/rpm-tmp.AAACTA
find-provides: running scripts (debuginfo)
Finding Requires (using /usr/lib/rpm/find-requires)
Executing: /bin/sh -e /usr/src/tmp/rpm-tmp.aqcheD
find-requires: running scripts (debuginfo)
Requires: ppp-radius = 2.4.8-alt2, debug(libc.so.6), debug(libcrypto.so.1.1)
Processing files: ppp-pppoatm-debuginfo-2.4.8-alt2
Finding Provides (using /usr/lib/rpm/find-provides)
Executing: /bin/sh -e /usr/src/tmp/rpm-tmp.Auk3vB
find-provides: running scripts (debuginfo)
Finding Requires (using /usr/lib/rpm/find-requires)
Executing: /bin/sh -e /usr/src/tmp/rpm-tmp.kqoajC
find-requires: running scripts (debuginfo)
Requires: ppp-pppoatm = 2.4.8-alt2, debug(libc.so.6), debug(libresolv.so.2)
Processing files: ppp-pppoe-debuginfo-2.4.8-alt2
Finding Provides (using /usr/lib/rpm/find-provides)
Executing: /bin/sh -e /usr/src/tmp/rpm-tmp.QSUzlA
find-provides: running scripts (debuginfo)
Finding Requires (using /usr/lib/rpm/find-requires)
Executing: /bin/sh -e /usr/src/tmp/rpm-tmp.vplElE
find-requires: running scripts (debuginfo)
Requires: ppp-pppoe = 2.4.8-alt2, debug(libc.so.6), debug(libudev.so.1)
Processing files: ppp-dhcp-debuginfo-2.4.8-alt2
Finding Provides (using /usr/lib/rpm/find-provides)
Executing: /bin/sh -e /usr/src/tmp/rpm-tmp.HfF47A
find-provides: running scripts (debuginfo)
Finding Requires (using /usr/lib/rpm/find-requires)
Executing: /bin/sh -e /usr/src/tmp/rpm-tmp.gMo4sB
find-requires: running scripts (debuginfo)
Requires: ppp-dhcp = 2.4.8-alt2, debug(libc.so.6)
Adding to ppp-devel a strict dependency on ppp
Adding to ppp-radius a strict dependency on ppp
Adding to ppp-pppoatm a strict dependency on ppp
Adding to ppp-pppoe a strict dependency on ppp
Adding to ppp-dhcp a strict dependency on ppp
Adding to ppp-debuginfo a strict dependency on ppp
Adding to ppp-radius-debuginfo a strict dependency on ppp-radius
Adding to ppp-pppoatm-debuginfo a strict dependency on ppp-pppoatm
Adding to ppp-pppoe-debuginfo a strict dependency on ppp-pppoe
Adding to ppp-dhcp-debuginfo a strict dependency on ppp-dhcp
Adding to ppp-radius-debuginfo a strict dependency on ppp-debuginfo
Removing from ppp-radius-debuginfo 8 sources provided by ppp-debuginfo
also prunning dir /usr/src/debug/ppp-2.4.8/include/net
also prunning dir /usr/src/debug/ppp-2.4.8/include
Adding to ppp-pppoatm-debuginfo a strict dependency on ppp-debuginfo
Removing from ppp-pppoatm-debuginfo 5 sources provided by ppp-debuginfo
also prunning dir /usr/src/debug/ppp-2.4.8/include/net
also prunning dir /usr/src/debug/ppp-2.4.8/include
Adding to ppp-pppoe-debuginfo a strict dependency on ppp-debuginfo
Removing from ppp-pppoe-debuginfo 7 sources provided by ppp-debuginfo
also prunning dir /usr/src/debug/ppp-2.4.8/include/net
also prunning dir /usr/src/debug/ppp-2.4.8/include
Adding to ppp-dhcp-debuginfo a strict dependency on ppp-debuginfo
Removing from ppp-dhcp-debuginfo 3 sources provided by ppp-debuginfo
also prunning dir /usr/src/debug/ppp-2.4.8/include/net
also prunning dir /usr/src/debug/ppp-2.4.8/include
Removing 16 extra deps from ppp-radius due to repentancy on ppp
Removing 8 extra deps from ppp-pppoatm due to repentancy on ppp
Removing 13 extra deps from ppp-pppoe due to repentancy on ppp
Removing 6 extra deps from ppp-dhcp due to repentancy on ppp
Removing 2 extra deps from ppp-radius-debuginfo due to repentancy on ppp-debuginfo
Removing 1 extra deps from ppp-pppoatm-debuginfo due to repentancy on ppp-debuginfo
Removing 2 extra deps from ppp-pppoe-debuginfo due to repentancy on ppp-debuginfo
Removing 1 extra deps from ppp-dhcp-debuginfo due to repentancy on ppp-debuginfo
Wrote: /usr/src/RPM/RPMS/i586/ppp-2.4.8-alt2.i586.rpm
Wrote: /usr/src/RPM/RPMS/noarch/ppp-devel-2.4.8-alt2.noarch.rpm
Wrote: /usr/src/RPM/RPMS/i586/ppp-radius-2.4.8-alt2.i586.rpm
Wrote: /usr/src/RPM/RPMS/i586/ppp-pppoatm-2.4.8-alt2.i586.rpm
Wrote: /usr/src/RPM/RPMS/i586/ppp-pppoe-2.4.8-alt2.i586.rpm
Wrote: /usr/src/RPM/RPMS/i586/ppp-dhcp-2.4.8-alt2.i586.rpm
Wrote: /usr/src/RPM/RPMS/i586/ppp-debuginfo-2.4.8-alt2.i586.rpm
Wrote: /usr/src/RPM/RPMS/i586/ppp-radius-debuginfo-2.4.8-alt2.i586.rpm
Wrote: /usr/src/RPM/RPMS/i586/ppp-pppoatm-debuginfo-2.4.8-alt2.i586.rpm
Wrote: /usr/src/RPM/RPMS/i586/ppp-pppoe-debuginfo-2.4.8-alt2.i586.rpm
Wrote: /usr/src/RPM/RPMS/i586/ppp-dhcp-debuginfo-2.4.8-alt2.i586.rpm
55.64user 14.01system 1:13.26elapsed 95%CPU (0avgtext+0avgdata 41004maxresident)k
0inputs+0outputs (0major+1993940minor)pagefaults 0swaps
/.out/ppp-devel-2.4.8-alt2.noarch.rpm: license not found in '/usr/share/license' directory: distributable
/.out/ppp-2.4.8-alt2.i586.rpm: license not found in '/usr/share/license' directory: distributable
/.out/ppp-radius-2.4.8-alt2.i586.rpm: license not found in '/usr/share/license' directory: distributable
/.out/ppp-pppoatm-2.4.8-alt2.i586.rpm: license not found in '/usr/share/license' directory: distributable
/.out/ppp-pppoe-2.4.8-alt2.i586.rpm: license not found in '/usr/share/license' directory: distributable
/.out/ppp-dhcp-2.4.8-alt2.i586.rpm: license not found in '/usr/share/license' directory: distributable
/.out/ppp-debuginfo-2.4.8-alt2.i586.rpm: license not found in '/usr/share/license' directory: distributable
/.out/ppp-radius-debuginfo-2.4.8-alt2.i586.rpm: license not found in '/usr/share/license' directory: distributable
/.out/ppp-pppoatm-debuginfo-2.4.8-alt2.i586.rpm: license not found in '/usr/share/license' directory: distributable
/.out/ppp-pppoe-debuginfo-2.4.8-alt2.i586.rpm: license not found in '/usr/share/license' directory: distributable
/.out/ppp-dhcp-debuginfo-2.4.8-alt2.i586.rpm: license not found in '/usr/share/license' directory: distributable
65.67user 21.60system 1:34.53elapsed 92%CPU (0avgtext+0avgdata 108524maxresident)k
88inputs+0outputs (0major+2515290minor)pagefaults 0swaps