<86>Feb 22 12:11:58 userdel[2864988]: delete user 'rooter'
<86>Feb 22 12:11:58 userdel[2864988]: removed group 'rooter' owned by 'rooter'
<86>Feb 22 12:11:58 userdel[2864988]: removed shadow group 'rooter' owned by 'rooter'
<86>Feb 22 12:11:58 groupadd[2865067]: group added to /etc/group: name=rooter, GID=585
<86>Feb 22 12:11:58 groupadd[2865067]: group added to /etc/gshadow: name=rooter
<86>Feb 22 12:11:58 groupadd[2865067]: new group: name=rooter, GID=585
<86>Feb 22 12:11:58 useradd[2865096]: new user: name=rooter, UID=585, GID=585, home=/root, shell=/bin/bash
<86>Feb 22 12:11:58 userdel[2865165]: delete user 'builder'
<86>Feb 22 12:11:58 userdel[2865165]: removed group 'builder' owned by 'builder'
<86>Feb 22 12:11:58 userdel[2865165]: removed shadow group 'builder' owned by 'builder'
<86>Feb 22 12:11:58 groupadd[2865248]: group added to /etc/group: name=builder, GID=586
<86>Feb 22 12:11:58 groupadd[2865248]: group added to /etc/gshadow: name=builder
<86>Feb 22 12:11:58 groupadd[2865248]: new group: name=builder, GID=586
<86>Feb 22 12:11:58 useradd[2865282]: new user: name=builder, UID=586, GID=586, home=/usr/src, shell=/bin/bash
warning: user mike does not exist - using root
warning: group mike does not exist - using root
warning: user mike does not exist - using root
warning: group mike does not exist - using root
warning: Macro %_vapidir not found
warning: Macro %_vapidir not found
warning: Macro %_typelibdir not found
warning: Macro %_girdir not found
<13>Feb 22 12:12:06 rpmi: sgml-common-0.6.3-alt15 1423664786 installed
<13>Feb 22 12:12:06 rpmi: libogg-1.3.3-alt1 sisyphus+221902.4000.4.1 1550598661 installed
<13>Feb 22 12:12:06 rpmi: xml-utils-1:2.9.10-alt3 sisyphus+243434.100.1.1 1577103645 installed
<13>Feb 22 12:12:07 rpmi: docbook-dtds-4.5-alt1 1223476557 installed
<13>Feb 22 12:12:07 rpmi: rpm-build-gir-0.7.3-alt3 sisyphus+242150.100.1.1 1575312005 installed
<13>Feb 22 12:12:07 rpmi: libvorbis-1.3.6-alt2 sisyphus+220072.200.2.2 1548744475 installed
<13>Feb 22 12:12:07 rpmi: vapi-common-0.46.6-alt1 sisyphus+245768.100.1.1 1581321094 installed
<13>Feb 22 12:12:07 rpmi: libnspr-1:4.24-alt1 sisyphus+244791.100.2.1 1580285077 installed
<13>Feb 22 12:12:07 rpmi: libgdbm-1.8.3-alt10 1454943334 installed
<13>Feb 22 12:12:07 rpmi: libexpat-2.2.4-alt1 1503305345 installed
<13>Feb 22 12:12:07 rpmi: docbook-style-xsl-1.79.1-alt4 sisyphus+232871.100.1.1 1561238010 installed
<13>Feb 22 12:12:07 rpmi: libflac8-1.3.2-alt2 sisyphus+220898.4400.11.1 1551973321 installed
<13>Feb 22 12:12:07 rpmi: rpm-build-vala-0.3-alt1 1332324961 installed
<13>Feb 22 12:12:08 rpmi: vala-0.46.6-alt1 sisyphus+245768.100.1.1 1581321139 installed
<13>Feb 22 12:12:08 rpmi: libtdb-1.4.3-alt1 sisyphus+245511.300.7.1 1581302811 installed
<13>Feb 22 12:12:08 rpmi: libltdl7-2.4.6-alt1 sisyphus+226971.100.2.1 1554906368 installed
<13>Feb 22 12:12:08 rpmi: libgsm-1.0.17-alt1 1523356165 installed
<13>Feb 22 12:12:08 rpmi: libsndfile-1.0.28-alt2 sisyphus.212728.100 1536333068 installed
<13>Feb 22 12:12:08 rpmi: liblz4-1:1.9.2-alt1 sisyphus+238585.100.2.2 1570066927 installed
<13>Feb 22 12:12:08 rpmi: sound-theme-freedesktop-0.8-alt1 1402011605 installed
<13>Feb 22 12:12:08 rpmi: libasyncns-0.8-alt2.qa1 1365949820 installed
<13>Feb 22 12:12:08 rpmi: libXdmcp-1.1.3-alt1 sisyphus+225206.600.1.2 1552949353 installed
<13>Feb 22 12:12:08 rpmi: libXau-1.0.9-alt1 sisyphus+223149.200.2.1 1551268152 installed
<13>Feb 22 12:12:08 rpmi: libxcb-1.13.1-alt1 sisyphus+226527.100.2.2 1554593801 installed
<13>Feb 22 12:12:08 rpmi: libOpenSP-1.5.2-alt3.qa1 1365943435 installed
<13>Feb 22 12:12:08 rpmi: openjade-1.3.2-alt15 sisyphus+219815.100.1.1 1548167857 installed
<13>Feb 22 12:12:09 rpmi: docbook-style-dsssl-1.79-alt3 1324062818 installed
<13>Feb 22 12:12:09 rpmi: python-modules-curses-2.7.17-alt4 sisyphus+244873.100.2.1 1581419544 installed
<13>Feb 22 12:12:09 rpmi: libverto-0.3.0-alt1_7 sisyphus+225932.100.1.1 1553994919 installed
<13>Feb 22 12:12:09 rpmi: libkeyutils-1.6-alt2 sisyphus+226520.100.2.1 1554512089 installed
<13>Feb 22 12:12:09 rpmi: libcom_err-1.44.6-alt1 sisyphus+224154.100.1.1 1552091678 installed
<13>Feb 22 12:12:09 rpmi: python-sphinx-objects.inv-1:2.3.9.20200128-alt1 sisyphus+245259.100.1.1 1580342608 installed
<13>Feb 22 12:12:09 rpmi: libgpg-error-1.36-alt1 sisyphus+225621.300.1.1 1553521082 installed
<13>Feb 22 12:12:09 rpmi: libgcrypt20-1.8.5-alt3 sisyphus+239622.100.1.1 1571746654 installed
<13>Feb 22 12:12:09 rpmi: libxslt-1.1.34-alt1 sisyphus+240826.100.1.1 1573801860 installed
<13>Feb 22 12:12:10 rpmi: libsystemd-1:244.3-alt2 sisyphus+246535.200.2.1 1581950464 installed
<13>Feb 22 12:12:10 rpmi: libdbus-1.12.16-alt2 sisyphus+240566.100.2.1 1573547696 installed
<13>Feb 22 12:12:10 rpmi: libpulseaudio-13.0-alt3 sisyphus+242188.100.1.1 1575382773 installed
<13>Feb 22 12:12:10 rpmi: xsltproc-1.1.34-alt1 sisyphus+240826.100.1.1 1573801860 installed
<13>Feb 22 12:12:10 rpmi: libsqlite3-3.31.0-alt1 sisyphus+244880.100.1.1 1579796940 installed
<13>Feb 22 12:12:10 rpmi: libffi-devel-1:3.2.1-alt2 1528881777 installed
<13>Feb 22 12:12:10 rpmi: shared-mime-info-1.15-alt1 sisyphus+240378.100.1.1 1573073800 installed
<13>Feb 22 12:12:10 rpmi: gsettings-desktop-schemas-data-3.34.0-alt1 sisyphus+237956.300.4.2 1569331130 installed
<13>Feb 22 12:12:10 rpmi: libgio-2.62.4-alt1 sisyphus+243311.100.1.3 1576855800 installed
<13>Feb 22 12:12:10 rpmi: gsettings-desktop-schemas-3.34.0-alt1 sisyphus+237956.300.4.2 1569331192 installed
<13>Feb 22 12:12:10 rpmi: gobject-introspection-1.62.0-alt1 sisyphus+237956.200.4.2 1569331106 installed
<13>Feb 22 12:12:10 rpmi: gobject-introspection-x11-1.62.0-alt1 sisyphus+237956.200.4.2 1569331106 installed
<13>Feb 22 12:12:10 rpmi: libgstreamer1.0-1.16.2-alt1 sisyphus+242248.100.2.1 1575475168 installed
<13>Feb 22 12:12:10 rpmi: libp11-kit-0.23.15-alt1 sisyphus+226408.100.2.1 1554288204 installed
<13>Feb 22 12:12:10 rpmi: libtasn1-4.16.0-alt1 sisyphus+245480.100.1.1 1580825062 installed
<13>Feb 22 12:12:10 rpmi: rpm-macros-alternatives-0.5.1-alt1 sisyphus+226946.100.1.1 1554830426 installed
<13>Feb 22 12:12:10 rpmi: alternatives-0.5.1-alt1 sisyphus+226946.100.1.1 1554830426 installed
<13>Feb 22 12:12:11 rpmi: ca-certificates-2020.01.23-alt1 sisyphus+244791.300.2.1 1580285500 installed
<13>Feb 22 12:12:11 rpmi: ca-trust-0.1.2-alt1 sisyphus+233348.100.1.1 1561653823 installed
<13>Feb 22 12:12:11 rpmi: p11-kit-trust-0.23.15-alt1 sisyphus+226408.100.2.1 1554288204 installed
<13>Feb 22 12:12:11 rpmi: libcrypto1.1-1.1.1d-alt1.1 sisyphus+237931.100.2.1 1569235729 installed
<13>Feb 22 12:12:11 rpmi: libssl1.1-1.1.1d-alt1.1 sisyphus+237931.100.2.1 1569235729 installed
<13>Feb 22 12:12:11 rpmi: libpython3-3.7.4-alt2 sisyphus+239418.100.1.1 1571389913 installed
<13>Feb 22 12:12:11 rpmi: python3-3.7.4-alt2 sisyphus+239418.100.1.1 1571389913 installed
<13>Feb 22 12:12:12 rpmi: python3-base-3.7.4-alt2 sisyphus+239418.100.1.1 1571389913 installed
<13>Feb 22 12:12:12 rpmi: python3-module-pkg_resources-1:41.4.0-alt1 sisyphus+238787.100.2.1 1570608044 installed
<13>Feb 22 12:12:13 rpmi: python3-module-six-1.13.0-alt1 sisyphus+240546.100.2.1 1573542703 installed
<13>Feb 22 12:12:13 rpmi: glib2-devel-2.62.4-alt1 sisyphus+243311.100.1.3 1576855800 installed
<13>Feb 22 12:12:13 rpmi: libgio-devel-2.62.4-alt1 sisyphus+243311.100.1.3 1576855800 installed
<13>Feb 22 12:12:13 rpmi: python3-module-anytree-2.8.0-alt1 sisyphus+244447.100.1.1 1579262422 installed
<13>Feb 22 12:12:13 rpmi: python3-module-ntlm-1.1.0-alt1.2 sisyphus+228512.100.1.1 1556654575 installed
<13>Feb 22 12:12:13 rpmi: python3-module-pycparser-2.19-alt2 sisyphus+245734.100.1.1 1581192421 installed
<13>Feb 22 12:12:13 rpmi: python3-module-cffi-1.13.2-alt1 sisyphus+240882.100.2.1 1573892898 installed
<13>Feb 22 12:12:13 rpmi: python3-module-cryptography-2.8-alt1 sisyphus+239390.100.1.2 1571349426 installed
<13>Feb 22 12:12:13 rpmi: python3-module-OpenSSL-19.0.0-alt1 sisyphus+238757.100.1.1 1570339901 installed
<13>Feb 22 12:12:13 rpmi: python3-module-pytz-1:2019.3-alt1 sisyphus+242012.100.2.1 1575623104 installed
<13>Feb 22 12:12:14 rpmi: python3-module-babel-1:2.6.0-alt1 sisyphus+228351.2400.6.2 1556652168 installed
<13>Feb 22 12:12:14 rpmi: python3-module-zope.interface-4.7.1-alt1 sisyphus+243962.100.1.1 1578571077 installed
<13>Feb 22 12:12:14 rpmi: python3-module-chameleon.core-3.1-alt1.2 sisyphus+227476.1500.1.3 1555774056 installed
<13>Feb 22 12:12:14 rpmi: python3-module-polib-1.0.5-alt1.1.2 sisyphus+227468.1200.2.2 1555756059 installed
<13>Feb 22 12:12:14 rpmi: python3-module-lingua-4.13-alt2 sisyphus+231160.100.1.1 1559218715 installed
<13>Feb 22 12:12:14 rpmi: python3-module-genshi-0.7-alt2 sisyphus+229363.100.1.1 1557847335 installed
<13>Feb 22 12:12:14 rpmi: python3-module-webencodings-0.5.1-alt2 sisyphus+245915.200.1.1 1581496105 installed
<13>Feb 22 12:12:14 rpmi: python3-module-cssselect-0.9.1-alt1.2 sisyphus+227479.1100.1.2 1555757152 installed
<13>Feb 22 12:12:14 rpmi: python3-module-html5lib-1:1.0.1-alt1 sisyphus+238807.100.2.1 1570465973 installed
<13>Feb 22 12:12:15 rpmi: python3-module-lxml-4.4.2-alt1 sisyphus+243954.100.1.1 1578563860 installed
<13>Feb 22 12:12:15 rpmi: python3-module-docutils-0.15.2-alt1 sisyphus+239215.200.1.1 1576583082 installed
<13>Feb 22 12:12:15 rpmi: python3-module-chardet-3.0.4-alt1 sisyphus+227476.1700.1.2 1555756717 installed
<13>Feb 22 12:12:15 rpmi: python3-module-idna-2.8-alt1 sisyphus+227494.400.1.3 1555838720 installed
<13>Feb 22 12:12:15 rpmi: python3-module-ndg-0.4.2-alt1.qa1 sisyphus+227504.1300.1.2 1555853234 installed
<13>Feb 22 12:12:15 rpmi: python3-module-ndg-httpsclient-0.4.2-alt1.qa1 sisyphus+227504.1300.1.2 1555853234 installed
<13>Feb 22 12:12:15 rpmi: python3-module-urllib3-2:1.25.6-alt1 sisyphus+238720.100.2.1 1570349439 installed
<13>Feb 22 12:12:15 rpmi: python3-module-requests-2.22.0-alt1 sisyphus+238756.100.1.1 1570338316 installed
<13>Feb 22 12:12:15 rpmi: python3-module-imagesize-1.1.0-alt1 sisyphus+229015.100.2.1 1557233756 installed
<13>Feb 22 12:12:15 rpmi: python3-module-markupsafe-0.23-alt1.2.1.1 sisyphus+225625.12200.91.1 1555289337 installed
<13>Feb 22 12:12:15 rpmi: python3-module-jinja2-2.10.3-alt1 sisyphus+241982.100.1.1 1575023523 installed
<13>Feb 22 12:12:15 rpmi: python3-module-pyparsing-2.4.2-alt1 sisyphus+236061.100.3.1 1565853577 installed
<13>Feb 22 12:12:15 rpmi: python3-module-packaging-19.0-alt2 sisyphus+235493.3500.8.1 1565461874 installed
<13>Feb 22 12:12:15 rpmi: python3-module-snowballstemmer-1.2.0-alt2.1 1457859319 installed
<13>Feb 22 12:12:15 rpmi: python3-module-sphinxcontrib-applehelp-1.0.1-alt1 sisyphus+228217.100.1.1 1556282506 installed
<13>Feb 22 12:12:15 rpmi: python3-module-sphinxcontrib-devhelp-1.0.1-alt1 sisyphus+228218.100.1.1 1556283262 installed
<13>Feb 22 12:12:15 rpmi: python3-module-sphinxcontrib-htmlhelp-1.0.2-alt1 sisyphus+228401.100.1.1 1556572721 installed
<13>Feb 22 12:12:15 rpmi: python3-module-sphinxcontrib-jsmath-1.0.1-alt1 sisyphus+238085.500.1.1 1569313099 installed
<13>Feb 22 12:12:16 rpmi: python3-module-sphinxcontrib-qthelp-1.0.2-alt1 sisyphus+228215.100.1.1 1556282300 installed
<13>Feb 22 12:12:16 rpmi: python3-module-sphinxcontrib-serializinghtml-1.1.3-alt1 sisyphus+228216.100.1.1 1556282403 installed
<13>Feb 22 12:12:16 rpmi: python3-module-alabaster-0.7.6-alt3 sisyphus+228351.700.4.1 1556637370 installed
<13>Feb 22 12:12:16 rpmi: python3-module-Pygments-2.4.2-alt2 sisyphus+245852.1100.2.1 1581424681 installed
<13>Feb 22 12:12:17 rpmi: python3-module-sphinx-1:2.2.0-alt3 sisyphus+238476.100.2.1 1569998637 installed
<13>Feb 22 12:12:17 rpmi: python3-module-markdown-3.2.1-alt1 sisyphus+246174.100.1.1 1581624151 installed
<86>Feb 22 12:12:17 groupadd[2900416]: group added to /etc/group: name=_keytab, GID=499
<86>Feb 22 12:12:17 groupadd[2900416]: group added to /etc/gshadow: name=_keytab
<86>Feb 22 12:12:17 groupadd[2900416]: new group: name=_keytab, GID=499
<13>Feb 22 12:12:17 rpmi: libkrb5-1.17.1-alt1 sisyphus+242784.100.1.1 1576137330 installed
<13>Feb 22 12:12:17 rpmi: libtirpc-1.0.3-alt1 1532008017 installed
<13>Feb 22 12:12:17 rpmi: libnsl2-1.1.0-alt1_1 1511548749 installed
<13>Feb 22 12:12:17 rpmi: python-modules-compiler-2.7.17-alt4 sisyphus+244873.100.2.1 1581419544 installed
<13>Feb 22 12:12:17 rpmi: python-modules-email-2.7.17-alt4 sisyphus+244873.100.2.1 1581419544 installed
<13>Feb 22 12:12:17 rpmi: python-modules-unittest-2.7.17-alt4 sisyphus+244873.100.2.1 1581419544 installed
<13>Feb 22 12:12:17 rpmi: python-modules-nis-2.7.17-alt4 sisyphus+244873.100.2.1 1581419544 installed
<13>Feb 22 12:12:17 rpmi: python-modules-encodings-2.7.17-alt4 sisyphus+244873.100.2.1 1581419544 installed
<13>Feb 22 12:12:18 rpmi: python-modules-2.7.17-alt4 sisyphus+244873.100.2.1 1581419544 installed
<13>Feb 22 12:12:18 rpmi: python-modules-xml-2.7.17-alt4 sisyphus+244873.100.2.1 1581419544 installed
<13>Feb 22 12:12:18 rpmi: python-modules-hotshot-2.7.17-alt4 sisyphus+244873.100.2.1 1581419544 installed
<13>Feb 22 12:12:18 rpmi: python-modules-bsddb-2.7.17-alt4 sisyphus+244873.100.2.1 1581419544 installed
<13>Feb 22 12:12:18 rpmi: python-modules-ctypes-2.7.17-alt4 sisyphus+244873.100.2.1 1581419544 installed
<13>Feb 22 12:12:18 rpmi: python-modules-multiprocessing-2.7.17-alt4 sisyphus+244873.100.2.1 1581419544 installed
<13>Feb 22 12:12:18 rpmi: python-modules-logging-2.7.17-alt4 sisyphus+244873.100.2.1 1581419544 installed
<13>Feb 22 12:12:18 rpmi: python-2.7.17-alt4 sisyphus+244873.100.2.1 1581419544 installed
<13>Feb 22 12:12:19 rpmi: libnss-3.49.1-alt1 sisyphus+244791.200.2.1 1580285316 installed
<13>Feb 22 12:12:19 rpmi: python3-module-nss-1.0.1-alt5 sisyphus+245934.100.1.1 1581509959 installed
<13>Feb 22 12:12:19 rpmi: python3-module-beaker-1.10.1-alt1 sisyphus+229409.100.1.1 1557918115 installed
<13>Feb 22 12:12:19 rpmi: python3-module-mako-1.0.9-alt1 sisyphus+228198.40.2.1 1556265453 installed
<13>Feb 22 12:12:19 rpmi: alsa-ucm-conf-1.2.2-alt1 sisyphus+246761.200.1.1 1582270179 installed
<13>Feb 22 12:12:19 rpmi: alsa-topology-conf-1.2.2-alt1 sisyphus+246761.100.1.1 1582270157 installed
<13>Feb 22 12:12:19 rpmi: libalsa-1:1.2.2-alt1 sisyphus+246761.300.1.1 1582270238 installed
<13>Feb 22 12:12:19 rpmi: libcanberra-0.30-alt3 1509034818 installed
<13>Feb 22 12:12:19 rpmi: libcanberra-devel-0.30-alt3 1509034818 installed
<13>Feb 22 12:12:19 rpmi: libcanberra-vala-0.30-alt3 1509034818 installed
<13>Feb 22 12:12:20 rpmi: gobject-introspection-devel-1.62.0-alt1 sisyphus+237956.200.4.2 1569331106 installed
<13>Feb 22 12:12:20 rpmi: gtk-doc-1.32-alt1 sisyphus+236022.20.6.1 1566123168 installed
<13>Feb 22 12:12:20 rpmi: vala-tools-0.46.6-alt1 sisyphus+245768.100.1.1 1581321139 installed
Building target platforms: i586
Building for target i586
Wrote: /usr/src/in/nosrpm/gsound-1.0.2-alt1.1.nosrc.rpm
Installing gsound-1.0.2-alt1.1.src.rpm
Building target platforms: i586
Building for target i586
Executing(%prep): /bin/sh -e /usr/src/tmp/rpm-tmp.24689
+ umask 022
+ /bin/mkdir -p /usr/src/RPM/BUILD
+ cd /usr/src/RPM/BUILD
+ cd /usr/src/RPM/BUILD
+ rm -rf gsound-1.0.2
+ echo 'Source #0 (gsound-1.0.2.tar.xz):'
Source #0 (gsound-1.0.2.tar.xz):
+ /usr/bin/xz -dc /usr/src/RPM/SOURCES/gsound-1.0.2.tar.xz
+ /bin/tar -xf -
+ cd gsound-1.0.2
+ /bin/chmod -c -Rf u+rwX,go-w .
+ exit 0
Executing(%build): /bin/sh -e /usr/src/tmp/rpm-tmp.97909
+ umask 022
+ /bin/mkdir -p /usr/src/RPM/BUILD
+ cd /usr/src/RPM/BUILD
+ cd gsound-1.0.2
+ autoreconf -fisv
autoreconf-default: Entering directory `.'
autoreconf-default: configure.ac: not using Gettext
autoreconf-default: running: aclocal --force 
autoreconf-default: configure.ac: tracing
autoreconf-default: running: libtoolize --force --install
libtoolize-default: putting auxiliary files in AC_CONFIG_AUX_DIR, 'build-aux'.
libtoolize-default: linking file 'build-aux/config.guess'
libtoolize-default: linking file 'build-aux/config.sub'
libtoolize-default: linking file 'build-aux/install-sh'
libtoolize-default: linking file 'build-aux/ltmain.sh'
libtoolize-default: putting macros in AC_CONFIG_MACRO_DIRS, 'm4'.
libtoolize-default: linking file 'm4/libtool.m4'
libtoolize-default: linking file 'm4/ltoptions.m4'
libtoolize-default: linking file 'm4/ltsugar.m4'
libtoolize-default: linking file 'm4/ltversion.m4'
libtoolize-default: linking file 'm4/lt~obsolete.m4'
libtoolize-default: Consider adding '-I m4' to ACLOCAL_AMFLAGS in Makefile.am.
autoreconf-default: configure.ac: not using Intltool
autoreconf-default: running: gtkdocize
autoreconf-default: running: /usr/bin/autoconf-2.60 --force
autoreconf-default: running: /usr/bin/autoheader-2.60 --force
autoreconf-default: running: automake --add-missing --force-missing
configure.ac:14: installing 'build-aux/compile'
configure.ac:10: installing 'build-aux/missing'
gsound/Makefile.am: installing 'build-aux/depcomp'
Unescaped left brace in regex is deprecated here (and will be fatal in Perl 5.30), passed through in regex; marked by <-- HERE in m/${ <-- HERE abs_top_builddir}/gsound/ at /usr/bin/automake-default line 5742.
autoreconf-default: Leaving directory `.'
+ CFLAGS='-pipe -frecord-gcc-switches -Wall -g -O2 -march=i586 -mtune=generic'
+ export CFLAGS
+ CXXFLAGS='-pipe -frecord-gcc-switches -Wall -g -O2 -march=i586 -mtune=generic'
+ export CXXFLAGS
+ FFLAGS='-pipe -frecord-gcc-switches -Wall -g -O2 -march=i586 -mtune=generic'
+ export FFLAGS
+ '[' -n '' ']'
++ printf %s '-pipe -frecord-gcc-switches -Wall -g -O2 -march=i586 -mtune=generic'
++ sed -r 's/(^|[[:space:]]+)-[^m][^[:space:]]*//g'
+ ASFLAGS=' -march=i586 -mtune=generic'
+ export ASFLAGS
+ export lt_cv_deplibs_check_method=pass_all
+ lt_cv_deplibs_check_method=pass_all
+ readlink -e -- ./configure
+ xargs -ri dirname -- '{}'
+ xargs -ri find '{}' -type f '(' -name config.sub -or -name config.guess ')' -printf '%h/\n'
+ sort -u
+ xargs -rn1 install -pm755 -- /usr/share/gnu-config/config.sub /usr/share/gnu-config/config.guess
+ ./configure --build=i586-alt-linux --host=i586-alt-linux --prefix=/usr --exec-prefix=/usr --bindir=/usr/bin --sbindir=/usr/sbin --sysconfdir=/etc --datadir=/usr/share --includedir=/usr/include --libdir=/usr/lib --libexecdir=/usr/libexec --localstatedir=/var/lib --sharedstatedir=/var/lib --mandir=/usr/share/man --infodir=/usr/share/info --disable-dependency-tracking --disable-silent-rules --without-included-gettext --disable-static
configure: WARNING: unrecognized options: --without-included-gettext
checking whether make supports nested variables... yes
checking for a BSD-compatible install... /bin/install -c
checking whether build environment is sane... yes
checking for a thread-safe mkdir -p... /bin/mkdir -p
checking for gawk... gawk
checking whether make sets $(MAKE)... yes
checking whether to enable maintainer-specific portions of Makefiles... yes
checking for i586-alt-linux-gcc... i586-alt-linux-gcc
checking whether the C compiler works... yes
checking for C compiler default output file name... a.out
checking for suffix of executables... 
checking whether we are cross compiling... no
checking for suffix of object files... o
checking whether we are using the GNU C compiler... yes
checking whether i586-alt-linux-gcc accepts -g... yes
checking for i586-alt-linux-gcc option to accept ISO C89... none needed
checking whether i586-alt-linux-gcc understands -c and -o together... yes
checking whether make supports the include directive... yes (GNU style)
checking dependency style of i586-alt-linux-gcc... none
checking for valac... /usr/bin/valac
checking for a sed that does not truncate output... /bin/sed
checking whether C compiler accepts -Werror=unknown-warning-option... no
checking whether C compiler accepts -fno-strict-aliasing... yes
checking whether C compiler accepts -Wall... yes
checking whether C compiler accepts -Wextra... yes
checking whether C compiler accepts -Wundef... yes
checking whether C compiler accepts -Wnested-externs... yes
checking whether C compiler accepts -Wwrite-strings... yes
checking whether C compiler accepts -Wpointer-arith... yes
checking whether C compiler accepts -Wmissing-declarations... yes
checking whether C compiler accepts -Wmissing-prototypes... yes
checking whether C compiler accepts -Wstrict-prototypes... yes
checking whether C compiler accepts -Wredundant-decls... yes
checking whether C compiler accepts -Wno-unused-parameter... yes
checking whether C compiler accepts -Wno-missing-field-initializers... yes
checking whether C compiler accepts -Wdeclaration-after-statement... yes
checking whether C compiler accepts -Wformat=2... yes
checking whether C compiler accepts -Wold-style-definition... yes
checking whether C compiler accepts -Wcast-align... yes
checking whether C compiler accepts -Wformat-nonliteral... yes
checking whether C compiler accepts -Wformat-security... yes
checking whether C compiler accepts -Wsign-compare... yes
checking whether C compiler accepts -Wstrict-aliasing... yes
checking whether C compiler accepts -Wshadow... yes
checking whether C compiler accepts -Winline... yes
checking whether C compiler accepts -Wpacked... yes
checking whether C compiler accepts -Wmissing-format-attribute... yes
checking whether C compiler accepts -Wmissing-noreturn... yes
checking whether C compiler accepts -Winit-self... yes
checking whether C compiler accepts -Wredundant-decls... (cached) yes
checking whether C compiler accepts -Wmissing-include-dirs... yes
checking whether C compiler accepts -Wunused-but-set-variable... yes
checking whether C compiler accepts -Warray-bounds... yes
checking whether C compiler accepts -Wimplicit-function-declaration... yes
checking whether C compiler accepts -Wreturn-type... yes
checking whether C compiler accepts -Wswitch-enum... yes
checking whether C compiler accepts -Wswitch-default... yes
checking whether C compiler accepts -Wno-error=unused-parameter... yes
checking whether C compiler accepts -Wno-error=missing-field-initializers... yes
checking whether C compiler accepts -Werror=unknown-warning-option... (cached) no
checking whether the linker accepts -Wl,--no-as-needed... yes
checking build system type... i586-alt-linux-gnu
checking host system type... i586-alt-linux-gnu
checking how to print strings... printf
checking for a sed that does not truncate output... (cached) /bin/sed
checking for grep that handles long lines and -e... /bin/grep
checking for egrep... /bin/grep -E
checking for fgrep... /bin/grep -F
checking for ld used by i586-alt-linux-gcc... /usr/bin/ld
checking if the linker (/usr/bin/ld) is GNU ld... yes
checking for BSD- or MS-compatible name lister (nm)... /usr/bin/nm -B
checking the name lister (/usr/bin/nm -B) interface... BSD nm
checking whether ln -s works... yes
checking the maximum length of command line arguments... 1572864
checking how to convert i586-alt-linux-gnu file names to i586-alt-linux-gnu format... func_convert_file_noop
checking how to convert i586-alt-linux-gnu file names to toolchain format... func_convert_file_noop
checking for /usr/bin/ld option to reload object files... -r
checking for i586-alt-linux-objdump... no
checking for objdump... objdump
checking how to recognize dependent libraries... (cached) pass_all
checking for i586-alt-linux-dlltool... no
checking for dlltool... no
checking how to associate runtime and link libraries... printf %s\n
checking for i586-alt-linux-ar... no
checking for ar... ar
checking for archiver @FILE support... @
checking for i586-alt-linux-strip... no
checking for strip... strip
checking for i586-alt-linux-ranlib... no
checking for ranlib... ranlib
checking command to parse /usr/bin/nm -B output from i586-alt-linux-gcc object... ok
checking for sysroot... no
checking for a working dd... /bin/dd
checking how to truncate binary pipes... /bin/dd bs=4096 count=1
checking for i586-alt-linux-mt... no
checking for mt... no
checking if : is a manifest tool... no
checking how to run the C preprocessor... i586-alt-linux-gcc -E
checking for ANSI C header files... yes
checking for sys/types.h... yes
checking for sys/stat.h... yes
checking for stdlib.h... yes
checking for string.h... yes
checking for memory.h... yes
checking for strings.h... yes
checking for inttypes.h... yes
checking for stdint.h... yes
checking for unistd.h... yes
checking for dlfcn.h... yes
checking for objdir... .libs
checking if i586-alt-linux-gcc supports -fno-rtti -fno-exceptions... no
checking for i586-alt-linux-gcc option to produce PIC... -fPIC -DPIC
checking if i586-alt-linux-gcc PIC flag -fPIC -DPIC works... yes
checking if i586-alt-linux-gcc static flag -static works... no
checking if i586-alt-linux-gcc supports -c -o file.o... yes
checking if i586-alt-linux-gcc supports -c -o file.o... (cached) yes
checking whether the i586-alt-linux-gcc linker (/usr/bin/ld) supports shared libraries... yes
checking whether -lc should be explicitly linked in... no
checking dynamic linker characteristics... GNU/Linux ld.so
checking how to hardcode library paths into programs... immediate
checking whether stripping libraries is possible... yes
checking if libtool supports shared libraries... yes
checking whether to build shared libraries... yes
checking whether to build static libraries... no
checking for i586-alt-linux-pkg-config... no
checking for pkg-config... /usr/bin/pkg-config
checking pkg-config is at least version 0.9.0... yes
checking for GSOUND... yes
checking for gtk-doc... yes
checking for gtkdoc-check... gtkdoc-check.test
checking for gtkdoc-check... /usr/bin/gtkdoc-check
checking for gtkdoc-rebase... /usr/bin/gtkdoc-rebase
checking for gtkdoc-mkpdf... no
checking whether to build gtk-doc documentation... no
checking for GTKDOC_DEPS... yes
checking for gobject-introspection... yes
checking for i586-alt-linux-pkg-config... /usr/bin/pkg-config
checking pkg-config is at least version 0.9.0... yes
checking for vapigen... yes
checking that generated files are newer than configure... done
configure: creating ./config.status
config.status: creating Makefile
config.status: creating docs/Makefile
config.status: creating docs/version.xml
config.status: creating tools/Makefile
config.status: creating gsound/gsound.pc
config.status: creating gsound/Makefile
config.status: creating config.h
config.status: executing depfiles commands
config.status: executing libtool commands
configure: WARNING: unrecognized options: --without-included-gettext
+ make -j8
make  all-recursive
Making all in gsound
make[2]: Entering directory '/usr/src/RPM/BUILD/gsound-1.0.2/gsound'
echo glib-2.0 gio-2.0 | tr ' ' '\n' > gsound.deps
make[2]: Leaving directory '/usr/src/RPM/BUILD/gsound-1.0.2/gsound'
make[2]: Entering directory '/usr/src/RPM/BUILD/gsound-1.0.2/gsound'
/bin/sh ../libtool  --tag=CC   --mode=compile i586-alt-linux-gcc -DHAVE_CONFIG_H -I. -I..  -pthread -D_REENTRANT -I/usr/include/glib-2.0 -I/usr/lib/glib-2.0/include   -fno-strict-aliasing -Wall -Wextra -Wundef -Wnested-externs -Wwrite-strings -Wpointer-arith -Wmissing-declarations -Wmissing-prototypes -Wstrict-prototypes -Wredundant-decls -Wno-unused-parameter -Wno-missing-field-initializers -Wdeclaration-after-statement -Wformat=2 -Wold-style-definition -Wcast-align -Wformat-nonliteral -Wformat-security -Wsign-compare -Wstrict-aliasing -Wshadow -Winline -Wpacked -Wmissing-format-attribute -Wmissing-noreturn -Winit-self -Wmissing-include-dirs -Wunused-but-set-variable -Warray-bounds -Wimplicit-function-declaration -Wreturn-type -Wswitch-enum -Wswitch-default -Wno-error=unused-parameter -Wno-error=missing-field-initializers  -pipe -frecord-gcc-switches -Wall -g -O2 -march=i586 -mtune=generic -c -o libgsound_la-gsound-context.lo `test -f 'gsound-context.c' || echo './'`gsound-context.c
libtool: compile:  i586-alt-linux-gcc -DHAVE_CONFIG_H -I. -I.. -pthread -D_REENTRANT -I/usr/include/glib-2.0 -I/usr/lib/glib-2.0/include -fno-strict-aliasing -Wall -Wextra -Wundef -Wnested-externs -Wwrite-strings -Wpointer-arith -Wmissing-declarations -Wmissing-prototypes -Wstrict-prototypes -Wredundant-decls -Wno-unused-parameter -Wno-missing-field-initializers -Wdeclaration-after-statement -Wformat=2 -Wold-style-definition -Wcast-align -Wformat-nonliteral -Wformat-security -Wsign-compare -Wstrict-aliasing -Wshadow -Winline -Wpacked -Wmissing-format-attribute -Wmissing-noreturn -Winit-self -Wmissing-include-dirs -Wunused-but-set-variable -Warray-bounds -Wimplicit-function-declaration -Wreturn-type -Wswitch-enum -Wswitch-default -Wno-error=unused-parameter -Wno-error=missing-field-initializers -pipe -frecord-gcc-switches -Wall -g -O2 -march=i586 -mtune=generic -c gsound-context.c  -fPIC -DPIC -o .libs/libgsound_la-gsound-context.o
make[2]: Leaving directory '/usr/src/RPM/BUILD/gsound-1.0.2/gsound'
make[2]: Entering directory '/usr/src/RPM/BUILD/gsound-1.0.2/gsound'
/bin/sh ../libtool  --tag=CC   --mode=link i586-alt-linux-gcc -fno-strict-aliasing -Wall -Wextra -Wundef -Wnested-externs -Wwrite-strings -Wpointer-arith -Wmissing-declarations -Wmissing-prototypes -Wstrict-prototypes -Wredundant-decls -Wno-unused-parameter -Wno-missing-field-initializers -Wdeclaration-after-statement -Wformat=2 -Wold-style-definition -Wcast-align -Wformat-nonliteral -Wformat-security -Wsign-compare -Wstrict-aliasing -Wshadow -Winline -Wpacked -Wmissing-format-attribute -Wmissing-noreturn -Winit-self -Wmissing-include-dirs -Wunused-but-set-variable -Warray-bounds -Wimplicit-function-declaration -Wreturn-type -Wswitch-enum -Wswitch-default -Wno-error=unused-parameter -Wno-error=missing-field-initializers  -pipe -frecord-gcc-switches -Wall -g -O2 -march=i586 -mtune=generic -version-info 0:2:0 -Wl,--no-as-needed   -o libgsound.la -rpath /usr/lib libgsound_la-gsound-context.lo  -lgio-2.0 -lgobject-2.0 -lglib-2.0 -lcanberra  
libtool: link: i586-alt-linux-gcc -shared  -fPIC -DPIC  .libs/libgsound_la-gsound-context.o   -lgio-2.0 -lgobject-2.0 -lglib-2.0 -lcanberra  -g -O2 -march=i586 -mtune=generic -Wl,--no-as-needed   -Wl,-soname -Wl,libgsound.so.0 -o .libs/libgsound.so.0.0.2
libtool: link: (cd ".libs" && rm -f "libgsound.so.0" && ln -s "libgsound.so.0.0.2" "libgsound.so.0")
libtool: link: (cd ".libs" && rm -f "libgsound.so" && ln -s "libgsound.so.0.0.2" "libgsound.so")
libtool: link: ( cd ".libs" && rm -f "libgsound.la" && ln -s "../libgsound.la" "libgsound.la" )
make[2]: Leaving directory '/usr/src/RPM/BUILD/gsound-1.0.2/gsound'
make[2]: Entering directory '/usr/src/RPM/BUILD/gsound-1.0.2/gsound'
CPPFLAGS="" CFLAGS="-pipe -frecord-gcc-switches -Wall -g -O2 -march=i586 -mtune=generic" LDFLAGS="" CC="i586-alt-linux-gcc" PKG_CONFIG="/usr/bin/pkg-config" GI_HOST_OS="" DLLTOOL="false"  /usr/bin/g-ir-scanner  --add-include-path=. --symbol-prefix=gsound --warn-all -v --namespace=GSound --nsversion=1.0 --libtool="/bin/sh ../libtool"  --include=GObject-2.0 --include=Gio-2.0    --library=libgsound.la --c-include "gsound.h" --cflags-begin  --warn-all                                                              --cflags-end  gsound-context.c gsound-context.h gsound-attr.h libgsound.la --output GSound-1.0.gir
i586-alt-linux-gcc -E -I. -I/usr/include/gio-unix-2.0 -I/usr/include/glib-2.0 -I/usr/lib/glib-2.0/include -o g-ir-cpp-wjo3czou.i -C --warn-all /usr/src/RPM/BUILD/gsound-1.0.2/gsound/g-ir-cpp-wjo3czou.c
i586-alt-linux-gcc -pipe -frecord-gcc-switches -Wall -g -O2 -march=i586 -mtune=generic -I/usr/include/gio-unix-2.0 -I/usr/include/glib-2.0 -I/usr/lib/glib-2.0/include -I/usr/include/glib-2.0 -I/usr/lib/glib-2.0/include -c /usr/src/RPM/BUILD/gsound-1.0.2/gsound/tmp-introspect1cpeoav5/GSound-1.0.c -o /usr/src/RPM/BUILD/gsound-1.0.2/gsound/tmp-introspect1cpeoav5/GSound-1.0.o -Wno-deprecated-declarations -pthread --warn-all
g-ir-scanner: link: /bin/sh ../libtool --mode=link --tag=CC i586-alt-linux-gcc -o /usr/src/RPM/BUILD/gsound-1.0.2/gsound/tmp-introspect1cpeoav5/GSound-1.0 -export-dynamic -pipe -frecord-gcc-switches -Wall -g -O2 -march=i586 -mtune=generic /usr/src/RPM/BUILD/gsound-1.0.2/gsound/tmp-introspect1cpeoav5/GSound-1.0.o -L. libgsound.la -lgio-2.0 -lgobject-2.0 -Wl,--export-dynamic -lgmodule-2.0 -pthread -lglib-2.0
libtool: link: i586-alt-linux-gcc -o /usr/src/RPM/BUILD/gsound-1.0.2/gsound/tmp-introspect1cpeoav5/.libs/GSound-1.0 -pipe -frecord-gcc-switches -Wall -g -O2 -march=i586 -mtune=generic /usr/src/RPM/BUILD/gsound-1.0.2/gsound/tmp-introspect1cpeoav5/GSound-1.0.o -Wl,--export-dynamic -pthread -Wl,--export-dynamic  -L. ./.libs/libgsound.so -lgio-2.0 -lgobject-2.0 -lgmodule-2.0 -lglib-2.0 -pthread
/usr/lib/gcc/i586-alt-linux/9/include/stddef.h:424: syntax error, unexpected identifier in '  __float128 __max_align_f128 __attribute__((__aligned__(__alignof(__float128))));' at '__float128'
make[2]: Leaving directory '/usr/src/RPM/BUILD/gsound-1.0.2/gsound'
make[2]: Entering directory '/usr/src/RPM/BUILD/gsound-1.0.2/gsound'
/usr/bin/vapigen-0.46  --library gsound --metadatadir .   --pkg glib-2.0 --pkg gio-2.0 GSound-1.0.gir
Generation succeeded - 0 warning(s)
make[2]: Leaving directory '/usr/src/RPM/BUILD/gsound-1.0.2/gsound'
make[2]: Entering directory '/usr/src/RPM/BUILD/gsound-1.0.2/gsound'
/usr/bin/g-ir-compiler --includedir=. --includedir=. GSound-1.0.gir -o GSound-1.0.typelib
make[2]: Leaving directory '/usr/src/RPM/BUILD/gsound-1.0.2/gsound'
Making all in docs
make[2]: Nothing to be done for 'all'.
Making all in tools
make[2]: Entering directory '/usr/src/RPM/BUILD/gsound-1.0.2/tools'
i586-alt-linux-gcc -DHAVE_CONFIG_H -I. -I..  -I../gsound -pthread -D_REENTRANT -I/usr/include/glib-2.0 -I/usr/lib/glib-2.0/include    -pipe -frecord-gcc-switches -Wall -g -O2 -march=i586 -mtune=generic -c -o gsound_play-gsound-play.o `test -f 'gsound-play.c' || echo './'`gsound-play.c
gsound-play.c: In function 'play':
gsound-play.c:93:2: warning: 'g_simple_async_result_new' is deprecated: Use 'g_task_new' instead [-Wdeprecated-declarations]
   93 |  _data_->_async_result = g_simple_async_result_new (NULL, _callback_, _user_data_, play);
      |  ^~~~~~
In file included from /usr/include/glib-2.0/gio/gio.h:118,
                 from ../gsound/gsound-context.h:22,
                 from ../gsound/gsound.h:22,
                 from gsound-play.c:28:
/usr/include/glib-2.0/gio/gsimpleasyncresult.h:51:21: note: declared here
   51 | GSimpleAsyncResult *g_simple_async_result_new              (GObject                 *source_object,
      |                     ^~~~~~~~~~~~~~~~~~~~~~~~~
gsound-play.c:94:2: warning: 'g_simple_async_result_set_op_res_gpointer' is deprecated [-Wdeprecated-declarations]
   94 |  g_simple_async_result_set_op_res_gpointer (_data_->_async_result, _data_, play_data_free);
      |  ^~~~~~~~~~~~~~~~~~~~~~~~~~~~~~~~~~~~~~~~~
In file included from /usr/include/glib-2.0/gio/gio.h:118,
                 from ../gsound/gsound-context.h:22,
                 from ../gsound/gsound.h:22,
                 from gsound-play.c:28:
/usr/include/glib-2.0/gio/gsimpleasyncresult.h:75:21: note: declared here
   75 | void                g_simple_async_result_set_op_res_gpointer (GSimpleAsyncResult      *simple,
      |                     ^~~~~~~~~~~~~~~~~~~~~~~~~~~~~~~~~~~~~~~~~
gsound-play.c: In function 'play_finish':
gsound-play.c:101:2: warning: 'g_simple_async_result_propagate_error' is deprecated [-Wdeprecated-declarations]
  101 |  if (g_simple_async_result_propagate_error (G_SIMPLE_ASYNC_RESULT (_res_), error)) {
      |  ^~
In file included from /usr/include/glib-2.0/gio/gio.h:118,
                 from ../gsound/gsound-context.h:22,
                 from ../gsound/gsound.h:22,
                 from gsound-play.c:28:
/usr/include/glib-2.0/gio/gsimpleasyncresult.h:119:21: note: declared here
  119 | gboolean            g_simple_async_result_propagate_error  (GSimpleAsyncResult      *simple,
      |                     ^~~~~~~~~~~~~~~~~~~~~~~~~~~~~~~~~~~~~
gsound-play.c:104:2: warning: 'g_simple_async_result_get_op_res_gpointer' is deprecated [-Wdeprecated-declarations]
  104 |  _data_ = g_simple_async_result_get_op_res_gpointer (G_SIMPLE_ASYNC_RESULT (_res_));
      |  ^~~~~~
In file included from /usr/include/glib-2.0/gio/gio.h:118,
                 from ../gsound/gsound-context.h:22,
                 from ../gsound/gsound.h:22,
                 from gsound-play.c:28:
/usr/include/glib-2.0/gio/gsimpleasyncresult.h:79:21: note: declared here
   79 | gpointer            g_simple_async_result_get_op_res_gpointer (GSimpleAsyncResult      *simple);
      |                     ^~~~~~~~~~~~~~~~~~~~~~~~~~~~~~~~~~~~~~~~~
gsound-play.c:100:12: warning: variable '_data_' set but not used [-Wunused-but-set-variable]
  100 |  PlayData* _data_;
      |            ^~~~~~
gsound-play.c: In function 'play_co':
gsound-play.c:144:4: warning: 'g_simple_async_result_set_from_error' is deprecated [-Wdeprecated-declarations]
  144 |    g_simple_async_result_set_from_error (_data_->_async_result, _data_->_inner_error_);
      |    ^~~~~~~~~~~~~~~~~~~~~~~~~~~~~~~~~~~~
In file included from /usr/include/glib-2.0/gio/gio.h:118,
                 from ../gsound/gsound-context.h:22,
                 from ../gsound/gsound.h:22,
                 from gsound-play.c:28:
/usr/include/glib-2.0/gio/gsimpleasyncresult.h:113:21: note: declared here
  113 | void                g_simple_async_result_set_from_error   (GSimpleAsyncResult      *simple,
      |                     ^~~~~~~~~~~~~~~~~~~~~~~~~~~~~~~~~~~~
gsound-play.c:147:5: warning: 'g_simple_async_result_complete_in_idle' is deprecated [-Wdeprecated-declarations]
  147 |     g_simple_async_result_complete_in_idle (_data_->_async_result);
      |     ^~~~~~~~~~~~~~~~~~~~~~~~~~~~~~~~~~~~~~
In file included from /usr/include/glib-2.0/gio/gio.h:118,
                 from ../gsound/gsound-context.h:22,
                 from ../gsound/gsound.h:22,
                 from gsound-play.c:28:
/usr/include/glib-2.0/gio/gsimpleasyncresult.h:106:21: note: declared here
  106 | void                g_simple_async_result_complete_in_idle (GSimpleAsyncResult      *simple);
      |                     ^~~~~~~~~~~~~~~~~~~~~~~~~~~~~~~~~~~~~~
gsound-play.c:149:5: warning: 'g_simple_async_result_complete' is deprecated [-Wdeprecated-declarations]
  149 |     g_simple_async_result_complete (_data_->_async_result);
      |     ^~~~~~~~~~~~~~~~~~~~~~~~~~~~~~
In file included from /usr/include/glib-2.0/gio/gio.h:118,
                 from ../gsound/gsound-context.h:22,
                 from ../gsound/gsound.h:22,
                 from gsound-play.c:28:
/usr/include/glib-2.0/gio/gsimpleasyncresult.h:104:21: note: declared here
  104 | void                g_simple_async_result_complete         (GSimpleAsyncResult      *simple);
      |                     ^~~~~~~~~~~~~~~~~~~~~~~~~~~~~~
gsound-play.c:156:3: warning: 'g_simple_async_result_complete_in_idle' is deprecated [-Wdeprecated-declarations]
  156 |   g_simple_async_result_complete_in_idle (_data_->_async_result);
      |   ^~~~~~~~~~~~~~~~~~~~~~~~~~~~~~~~~~~~~~
In file included from /usr/include/glib-2.0/gio/gio.h:118,
                 from ../gsound/gsound-context.h:22,
                 from ../gsound/gsound.h:22,
                 from gsound-play.c:28:
/usr/include/glib-2.0/gio/gsimpleasyncresult.h:106:21: note: declared here
  106 | void                g_simple_async_result_complete_in_idle (GSimpleAsyncResult      *simple);
      |                     ^~~~~~~~~~~~~~~~~~~~~~~~~~~~~~~~~~~~~~
gsound-play.c:158:3: warning: 'g_simple_async_result_complete' is deprecated [-Wdeprecated-declarations]
  158 |   g_simple_async_result_complete (_data_->_async_result);
      |   ^~~~~~~~~~~~~~~~~~~~~~~~~~~~~~
In file included from /usr/include/glib-2.0/gio/gio.h:118,
                 from ../gsound/gsound-context.h:22,
                 from ../gsound/gsound.h:22,
                 from gsound-play.c:28:
/usr/include/glib-2.0/gio/gsimpleasyncresult.h:104:21: note: declared here
  104 | void                g_simple_async_result_complete         (GSimpleAsyncResult      *simple);
      |                     ^~~~~~~~~~~~~~~~~~~~~~~~~~~~~~
gsound-play.c: In function 'double_to_string':
gsound-play.c:174:7: warning: variable '_tmp1__length1' set but not used [-Wunused-but-set-variable]
  174 |  gint _tmp1__length1 = 0;
      |       ^~~~~~~~~~~~~~
make[2]: Leaving directory '/usr/src/RPM/BUILD/gsound-1.0.2/tools'
make[2]: Entering directory '/usr/src/RPM/BUILD/gsound-1.0.2/tools'
/bin/sh ../libtool  --tag=CC   --mode=link i586-alt-linux-gcc  -pipe -frecord-gcc-switches -Wall -g -O2 -march=i586 -mtune=generic ../gsound/libgsound.la -lgio-2.0 -lgobject-2.0 -lglib-2.0 -lcanberra   -o gsound-play gsound_play-gsound-play.o  
libtool: link: i586-alt-linux-gcc -pipe -frecord-gcc-switches -Wall -g -O2 -march=i586 -mtune=generic -o .libs/gsound-play gsound_play-gsound-play.o  ../gsound/.libs/libgsound.so -lgio-2.0 -lgobject-2.0 -lglib-2.0 -lcanberra
make[2]: Leaving directory '/usr/src/RPM/BUILD/gsound-1.0.2/tools'
+ exit 0
Executing(%install): /bin/sh -e /usr/src/tmp/rpm-tmp.89847
+ umask 022
+ /bin/mkdir -p /usr/src/RPM/BUILD
+ cd /usr/src/RPM/BUILD
+ /bin/chmod -Rf u+rwX -- /usr/src/tmp/gsound-buildroot
+ :
+ /bin/rm -rf -- /usr/src/tmp/gsound-buildroot
+ cd gsound-1.0.2
+ make 'INSTALL=/bin/install -p' install DESTDIR=/usr/src/tmp/gsound-buildroot
make: Entering directory '/usr/src/RPM/BUILD/gsound-1.0.2'
Making install in gsound
make[1]: Entering directory '/usr/src/RPM/BUILD/gsound-1.0.2/gsound'
make[2]: Entering directory '/usr/src/RPM/BUILD/gsound-1.0.2/gsound'
 /bin/mkdir -p '/usr/src/tmp/gsound-buildroot/usr/lib'
 /bin/sh ../libtool   --mode=install /bin/install -p   libgsound.la '/usr/src/tmp/gsound-buildroot/usr/lib'
libtool: install: /bin/install -p .libs/libgsound.so.0.0.2 /usr/src/tmp/gsound-buildroot/usr/lib/libgsound.so.0.0.2
libtool: install: (cd /usr/src/tmp/gsound-buildroot/usr/lib && { ln -s -f libgsound.so.0.0.2 libgsound.so.0 || { rm -f libgsound.so.0 && ln -s libgsound.so.0.0.2 libgsound.so.0; }; })
libtool: install: (cd /usr/src/tmp/gsound-buildroot/usr/lib && { ln -s -f libgsound.so.0.0.2 libgsound.so || { rm -f libgsound.so && ln -s libgsound.so.0.0.2 libgsound.so; }; })
libtool: install: /bin/install -p .libs/libgsound.lai /usr/src/tmp/gsound-buildroot/usr/lib/libgsound.la
libtool: warning: remember to run 'libtool --finish /usr/lib'
 /bin/mkdir -p '/usr/src/tmp/gsound-buildroot/usr/share/gir-1.0'
 /bin/install -p -m 644 GSound-1.0.gir '/usr/src/tmp/gsound-buildroot/usr/share/gir-1.0'
 /bin/mkdir -p '/usr/src/tmp/gsound-buildroot/usr/include'
 /bin/install -p -m 644 gsound.h gsound-attr.h gsound-context.h '/usr/src/tmp/gsound-buildroot/usr/include'
 /bin/mkdir -p '/usr/src/tmp/gsound-buildroot/usr/lib/pkgconfig'
 /bin/install -p -m 644 gsound.pc '/usr/src/tmp/gsound-buildroot/usr/lib/pkgconfig'
 /bin/mkdir -p '/usr/src/tmp/gsound-buildroot/usr/lib/girepository-1.0'
 /bin/install -p -m 644 GSound-1.0.typelib '/usr/src/tmp/gsound-buildroot/usr/lib/girepository-1.0'
 /bin/mkdir -p '/usr/src/tmp/gsound-buildroot/usr/share/vala/vapi'
 /bin/install -p -m 644 gsound.vapi gsound.deps '/usr/src/tmp/gsound-buildroot/usr/share/vala/vapi'
make[2]: Leaving directory '/usr/src/RPM/BUILD/gsound-1.0.2/gsound'
make[1]: Leaving directory '/usr/src/RPM/BUILD/gsound-1.0.2/gsound'
Making install in docs
make[1]: Entering directory '/usr/src/RPM/BUILD/gsound-1.0.2/docs'
make[2]: Entering directory '/usr/src/RPM/BUILD/gsound-1.0.2/docs'
make[2]: Nothing to be done for 'install-exec-am'.
 /bin/install -p -m 644 ./html/GSoundContext.html
 /bin/install -p -m 644 ./html/annotation-glossary.html
 /bin/install -p -m 644 ./html/api-index-full.html
 /bin/install -p -m 644 ./html/ch01.html
 /bin/install -p -m 644 ./html/deprecated-api-index.html
 /bin/install -p -m 644 ./html/gsound-GSound-Attributes.html
 /bin/install -p -m 644 ./html/gsound.devhelp2
 /bin/install -p -m 644 ./html/home.png
 /bin/install -p -m 644 ./html/index.html
 /bin/install -p -m 644 ./html/index.sgml
 /bin/install -p -m 644 ./html/left-insensitive.png
 /bin/install -p -m 644 ./html/left.png
 /bin/install -p -m 644 ./html/object-tree.html
 /bin/install -p -m 644 ./html/right-insensitive.png
 /bin/install -p -m 644 ./html/right.png
 /bin/install -p -m 644 ./html/style.css
 /bin/install -p -m 644 ./html/up-insensitive.png
 /bin/install -p -m 644 ./html/up.png
make[2]: Leaving directory '/usr/src/RPM/BUILD/gsound-1.0.2/docs'
make[1]: Leaving directory '/usr/src/RPM/BUILD/gsound-1.0.2/docs'
Making install in tools
make[1]: Entering directory '/usr/src/RPM/BUILD/gsound-1.0.2/tools'
make[2]: Entering directory '/usr/src/RPM/BUILD/gsound-1.0.2/tools'
 /bin/mkdir -p '/usr/src/tmp/gsound-buildroot/usr/bin'
  /bin/sh ../libtool   --mode=install /bin/install -p gsound-play '/usr/src/tmp/gsound-buildroot/usr/bin'
libtool: warning: '../gsound/libgsound.la' has not been installed in '/usr/lib'
libtool: install: /bin/install -p .libs/gsound-play /usr/src/tmp/gsound-buildroot/usr/bin/gsound-play
make[2]: Nothing to be done for 'install-data-am'.
make[2]: Leaving directory '/usr/src/RPM/BUILD/gsound-1.0.2/tools'
make[1]: Leaving directory '/usr/src/RPM/BUILD/gsound-1.0.2/tools'
make[1]: Entering directory '/usr/src/RPM/BUILD/gsound-1.0.2'
make[2]: Entering directory '/usr/src/RPM/BUILD/gsound-1.0.2'
make[2]: Nothing to be done for 'install-exec-am'.
make[2]: Nothing to be done for 'install-data-am'.
make[2]: Leaving directory '/usr/src/RPM/BUILD/gsound-1.0.2'
make[1]: Leaving directory '/usr/src/RPM/BUILD/gsound-1.0.2'
make: Leaving directory '/usr/src/RPM/BUILD/gsound-1.0.2'
+ /usr/lib/rpm/find-lang gsound
+ /usr/lib/rpm/brp-alt
Cleaning files in /usr/src/tmp/gsound-buildroot (auto)
removed './usr/lib/libgsound.la'
mode of './usr/lib/libgsound.so.0.0.2' changed from 0755 (rwxr-xr-x) to 0644 (rw-r--r--)
Verifying and fixing files in /usr/src/tmp/gsound-buildroot (binconfig,pkgconfig,libtool,desktop)
/usr/lib/pkgconfig/gsound.pc: Cflags: '-I${includedir}' --> ''
/usr/lib/pkgconfig/gsound.pc: Libs: '-L${libdir} -lgsound' --> '-lgsound'
Checking contents of files in /usr/src/tmp/gsound-buildroot/ (default)
Compressing files in /usr/src/tmp/gsound-buildroot (auto)
Adjusting library links in /usr/src/tmp/gsound-buildroot
./usr/lib:
	libgsound.so.0 -> libgsound.so.0.0.2
Verifying ELF objects in /usr/src/tmp/gsound-buildroot (arch=normal,fhs=normal,lfs=relaxed,lint=relaxed,rpath=normal,stack=normal,textrel=normal,unresolved=normal)
Hardlinking identical .pyc and .pyo files
Processing files: gsound-1.0.2-alt1.1
Executing(%doc): /bin/sh -e /usr/src/tmp/rpm-tmp.79058
+ umask 022
+ /bin/mkdir -p /usr/src/RPM/BUILD
+ cd /usr/src/RPM/BUILD
+ cd gsound-1.0.2
+ DOCDIR=/usr/src/tmp/gsound-buildroot/usr/share/doc/gsound-1.0.2
+ export DOCDIR
+ rm -rf /usr/src/tmp/gsound-buildroot/usr/share/doc/gsound-1.0.2
+ /bin/mkdir -p /usr/src/tmp/gsound-buildroot/usr/share/doc/gsound-1.0.2
+ cp -prL NEWS README /usr/src/tmp/gsound-buildroot/usr/share/doc/gsound-1.0.2
+ chmod -R go-w /usr/src/tmp/gsound-buildroot/usr/share/doc/gsound-1.0.2
+ chmod -R a+rX /usr/src/tmp/gsound-buildroot/usr/share/doc/gsound-1.0.2
+ exit 0
Finding Provides (using /usr/lib/rpm/find-provides)
Executing: /bin/sh -e /usr/src/tmp/rpm-tmp.4GDye5
find-provides: running scripts (alternatives,debuginfo,gir,lib,pam,perl,pkgconfig,python,shell,typelib,vala)
Finding Requires (using /usr/lib/rpm/find-requires)
Executing: /bin/sh -e /usr/src/tmp/rpm-tmp.3aYSS0
find-requires: running scripts (cpp,debuginfo,files,gir-js,gir-python,gir,lib,pam,perl,pkgconfig,pkgconfiglib,python,rpmlib,shebang,shell,static,symlinks,systemd-services,typelib,vala)
Requires: libgsound = 1.0.2-alt1.1, /lib/ld-linux.so.2, libc.so.6(GLIBC_2.0), libc.so.6(GLIBC_2.4), libgio-2.0.so.0 >= set:okxfpwyHt9Kktuc2f3ZtdAZw2M1v6, libglib-2.0.so.0 >= set:ojpE2feYzHTdw2G5YHo3uyMGdtvU4JFkDGBb7AZbui0cGfkvIN2dxkfymoQZiGHjABqDUlZ9x09V8S5lCJs, libgobject-2.0.so.0 >= set:mkfqQG5x0, libgsound.so.0 >= set:helUudUbTYvb8, rtld(GNU_HASH)
Requires(rpmlib): rpmlib(SetVersions)
Finding debuginfo files (using /usr/lib/rpm/find-debuginfo-files)
Executing: /bin/sh -e /usr/src/tmp/rpm-tmp.liEaI1
Creating gsound-debuginfo package
Processing files: libgsound-1.0.2-alt1.1
Finding Provides (using /usr/lib/rpm/find-provides)
Executing: /bin/sh -e /usr/src/tmp/rpm-tmp.K1FRd5
find-provides: running scripts (alternatives,debuginfo,gir,lib,pam,perl,pkgconfig,python,shell,typelib,vala)
lib.prov: /usr/src/tmp/gsound-buildroot/usr/lib/libgsound.so.0: 14 symbols, 14 bpp
Finding Requires (using /usr/lib/rpm/find-requires)
Executing: /bin/sh -e /usr/src/tmp/rpm-tmp.8FlLd5
find-requires: running scripts (cpp,debuginfo,files,gir-js,gir-python,gir,lib,pam,perl,pkgconfig,pkgconfiglib,python,rpmlib,shebang,shell,static,symlinks,systemd-services,typelib,vala)
Provides: libgsound.so.0 = set:hd65FIBQwsFpY0h0fVRULmKQ4gbEa1
Requires: libc.so.6(GLIBC_2.1.3), libc.so.6(GLIBC_2.4), libcanberra.so.0 >= set:kggZoSYcZdV0zDZk5vSrdjDrEV1yfZ27i, libgio-2.0.so.0 >= set:okFcmQ9TYZ1twsBht4fQc2dwD0Zp5oImbyHzjY5h2, libglib-2.0.so.0 >= set:okXlvFp2cZ34RhLZftNSvljtrLXZ0Zq6KhZhg0ufG0, libgobject-2.0.so.0 >= set:mihfZvY21e3yYfBAUADge3bZdxVz3, rtld(GNU_HASH)
Requires(rpmlib): rpmlib(SetVersions)
Finding debuginfo files (using /usr/lib/rpm/find-debuginfo-files)
Executing: /bin/sh -e /usr/src/tmp/rpm-tmp.tMS342
Creating libgsound-debuginfo package
Processing files: libgsound-devel-1.0.2-alt1.1
Finding Provides (using /usr/lib/rpm/find-provides)
Executing: /bin/sh -e /usr/src/tmp/rpm-tmp.lnwqs3
find-provides: running scripts (alternatives,debuginfo,gir,lib,pam,perl,pkgconfig,python,shell,typelib,vala)
Finding Requires (using /usr/lib/rpm/find-requires)
Executing: /bin/sh -e /usr/src/tmp/rpm-tmp.rWY6l1
find-requires: running scripts (cpp,debuginfo,files,gir-js,gir-python,gir,lib,pam,perl,pkgconfig,pkgconfiglib,python,rpmlib,shebang,shell,static,symlinks,systemd-services,typelib,vala)
In file included from /usr/src/tmp/gsound-buildroot/usr/include/gsound.h:22:
/usr/src/tmp/gsound-buildroot/usr/include/gsound-context.h:22:10: fatal error: gio/gio.h: No such file or directory
   22 | #include <gio/gio.h>
      |          ^~~~~~~~~~~
compilation terminated.
cpp.req: /usr/src/tmp/gsound-buildroot/usr/include/gsound.h: cpp failed, trying c++ mode
i586-alt-linux-cpp: fatal error: cannot execute 'cc1plus': execvp: No such file or directory
compilation terminated.
cpp.req: WARNING: /usr/src/tmp/gsound-buildroot/usr/include/gsound.h: cpp failed
/usr/src/tmp/gsound-buildroot/usr/include/gsound-attr.h:26:10: fatal error: glib.h: No such file or directory
   26 | #include <glib.h>
      |          ^~~~~~~~
compilation terminated.
cpp.req: WARNING: /usr/src/tmp/gsound-buildroot/usr/include/gsound-attr.h: cpp failed
/usr/src/tmp/gsound-buildroot/usr/include/gsound-context.h:22:10: fatal error: gio/gio.h: No such file or directory
   22 | #include <gio/gio.h>
      |          ^~~~~~~~~~~
compilation terminated.
cpp.req: WARNING: /usr/src/tmp/gsound-buildroot/usr/include/gsound-context.h: cpp failed
Provides: pkgconfig(gsound) = 1.0.2, vapi(gsound)
Requires: libgsound = 1.0.2-alt1.1, /usr/lib/libgsound.so.0.0.2, /usr/lib/pkgconfig, /usr/share/vala/vapi, vapi(gio-2.0), vapi(glib-2.0)
Finding debuginfo files (using /usr/lib/rpm/find-debuginfo-files)
Executing: /bin/sh -e /usr/src/tmp/rpm-tmp.0kfoY1
Processing files: libgsound-devel-doc-1.0.2-alt1.1
Finding Provides (using /usr/lib/rpm/find-provides)
Executing: /bin/sh -e /usr/src/tmp/rpm-tmp.rYk0g2
find-provides: running scripts (alternatives,debuginfo,gir,lib,pam,perl,pkgconfig,python,shell,typelib,vala)
Finding Requires (using /usr/lib/rpm/find-requires)
Executing: /bin/sh -e /usr/src/tmp/rpm-tmp.DYc6l3
find-requires: running scripts (cpp,debuginfo,files,gir-js,gir-python,gir,lib,pam,perl,pkgconfig,pkgconfiglib,python,rpmlib,shebang,shell,static,symlinks,systemd-services,typelib,vala)
Conflicts: libgsound-devel < 1.0.2
Processing files: libgsound-gir-1.0.2-alt1.1
Finding Provides (using /usr/lib/rpm/find-provides)
Executing: /bin/sh -e /usr/src/tmp/rpm-tmp.W4UXx1
find-provides: running scripts (alternatives,debuginfo,gir,lib,pam,perl,pkgconfig,python,shell,typelib,vala)
Finding Requires (using /usr/lib/rpm/find-requires)
Executing: /bin/sh -e /usr/src/tmp/rpm-tmp.Qfuqc5
find-requires: running scripts (cpp,debuginfo,files,gir-js,gir-python,gir,lib,pam,perl,pkgconfig,pkgconfiglib,python,rpmlib,shebang,shell,static,symlinks,systemd-services,typelib,vala)
Provides: typelib(GSound) = 1.0
Requires: libgsound = 1.0.2-alt1.1, typelib(GObject) = 2.0, typelib(Gio) = 2.0
Finding debuginfo files (using /usr/lib/rpm/find-debuginfo-files)
Executing: /bin/sh -e /usr/src/tmp/rpm-tmp.TY6X04
Processing files: libgsound-gir-devel-1.0.2-alt1.1
Finding Provides (using /usr/lib/rpm/find-provides)
Executing: /bin/sh -e /usr/src/tmp/rpm-tmp.ZQdz44
find-provides: running scripts (alternatives,debuginfo,gir,lib,pam,perl,pkgconfig,python,shell,typelib,vala)
Finding Requires (using /usr/lib/rpm/find-requires)
Executing: /bin/sh -e /usr/src/tmp/rpm-tmp.gsQsi2
find-requires: running scripts (cpp,debuginfo,files,gir-js,gir-python,gir,lib,pam,perl,pkgconfig,pkgconfiglib,python,rpmlib,shebang,shell,static,symlinks,systemd-services,typelib,vala)
Provides: gir(GSound) = 1.0
Requires: libgsound-gir = 1.0.2-alt1.1, libgsound-devel = 1.0.2-alt1.1, gir(GObject) = 2.0, gir(Gio) = 2.0
Processing files: gsound-debuginfo-1.0.2-alt1.1
Finding Provides (using /usr/lib/rpm/find-provides)
Executing: /bin/sh -e /usr/src/tmp/rpm-tmp.a53QT3
find-provides: running scripts (debuginfo)
Finding Requires (using /usr/lib/rpm/find-requires)
Executing: /bin/sh -e /usr/src/tmp/rpm-tmp.fPD763
find-requires: running scripts (debuginfo)
Requires: gsound = 1.0.2-alt1.1, /usr/lib/debug/lib/ld-linux.so.2.debug, debug(libc.so.6), debug(libgio-2.0.so.0), debug(libglib-2.0.so.0), debug(libgobject-2.0.so.0), debug(libgsound.so.0)
Processing files: libgsound-debuginfo-1.0.2-alt1.1
Finding Provides (using /usr/lib/rpm/find-provides)
Executing: /bin/sh -e /usr/src/tmp/rpm-tmp.FrpIp3
find-provides: running scripts (debuginfo)
Finding Requires (using /usr/lib/rpm/find-requires)
Executing: /bin/sh -e /usr/src/tmp/rpm-tmp.kvrg41
find-requires: running scripts (debuginfo)
Provides: debug(libgsound.so.0)
Requires: libgsound = 1.0.2-alt1.1, debug(libc.so.6), debug(libcanberra.so.0), debug(libgio-2.0.so.0), debug(libglib-2.0.so.0), debug(libgobject-2.0.so.0)
Adding to gsound a strict dependency on libgsound
Adding to gsound-debuginfo a strict dependency on gsound
Adding to libgsound-devel a strict dependency on libgsound
Adding to libgsound-gir a strict dependency on libgsound
Adding to libgsound-debuginfo a strict dependency on libgsound
Adding to libgsound-gir-devel a strict dependency on libgsound-devel
Adding to libgsound-gir-devel a strict dependency on libgsound-gir
Adding to gsound-debuginfo a strict dependency on libgsound-debuginfo
Removing from gsound-debuginfo 1 sources provided by libgsound-debuginfo
also prunning dir /usr/src/debug/gsound-1.0.2/gsound
Removing 1 extra deps from gsound due to dependency on libgsound
Removing 1 extra deps from libgsound-devel due to dependency on libgsound
Removing 1 extra deps from gsound-debuginfo due to dependency on libgsound-debuginfo
Removing 4 extra deps from gsound due to repentancy on libgsound
Removing 4 extra deps from gsound-debuginfo due to repentancy on libgsound-debuginfo
Wrote: /usr/src/RPM/RPMS/i586/gsound-1.0.2-alt1.1.i586.rpm
Wrote: /usr/src/RPM/RPMS/i586/libgsound-1.0.2-alt1.1.i586.rpm
Wrote: /usr/src/RPM/RPMS/i586/libgsound-devel-1.0.2-alt1.1.i586.rpm
Wrote: /usr/src/RPM/RPMS/noarch/libgsound-devel-doc-1.0.2-alt1.1.noarch.rpm
Wrote: /usr/src/RPM/RPMS/i586/libgsound-gir-1.0.2-alt1.1.i586.rpm
Wrote: /usr/src/RPM/RPMS/noarch/libgsound-gir-devel-1.0.2-alt1.1.noarch.rpm
Wrote: /usr/src/RPM/RPMS/i586/gsound-debuginfo-1.0.2-alt1.1.i586.rpm
Wrote: /usr/src/RPM/RPMS/i586/libgsound-debuginfo-1.0.2-alt1.1.i586.rpm
23.46user 4.44system 1:25.75elapsed 32%CPU (0avgtext+0avgdata 41636maxresident)k
0inputs+0outputs (0major+1330868minor)pagefaults 0swaps
40.08user 12.93system 2:07.12elapsed 41%CPU (0avgtext+0avgdata 108936maxresident)k
0inputs+0outputs (0major+1886359minor)pagefaults 0swaps