86>Feb 18 09:07:10 userdel[68927]: delete user 'rooter'
<86>Feb 18 09:07:10 userdel[68927]: removed group 'rooter' owned by 'rooter'
<86>Feb 18 09:07:10 userdel[68927]: removed shadow group 'rooter' owned by 'rooter'
<86>Feb 18 09:07:10 groupadd[68942]: group added to /etc/group: name=rooter, GID=687
<86>Feb 18 09:07:10 groupadd[68942]: group added to /etc/gshadow: name=rooter
<86>Feb 18 09:07:10 groupadd[68942]: new group: name=rooter, GID=687
<86>Feb 18 09:07:10 useradd[68954]: new user: name=rooter, UID=687, GID=687, home=/root, shell=/bin/bash
<86>Feb 18 09:07:10 userdel[68981]: delete user 'builder'
<86>Feb 18 09:07:10 userdel[68981]: removed group 'builder' owned by 'builder'
<86>Feb 18 09:07:10 userdel[68981]: removed shadow group 'builder' owned by 'builder'
<86>Feb 18 09:07:10 groupadd[69031]: group added to /etc/group: name=builder, GID=688
<86>Feb 18 09:07:10 groupadd[69031]: group added to /etc/gshadow: name=builder
<86>Feb 18 09:07:10 groupadd[69031]: new group: name=builder, GID=688
<86>Feb 18 09:07:10 useradd[69051]: new user: name=builder, UID=688, GID=688, home=/usr/src, shell=/bin/bash
<13>Feb 18 09:07:14 rpmi: libxkbcommon-0.8.3-alt1 sisyphus+221080.100.1.2 1549739888 installed
<13>Feb 18 09:07:14 rpmi: qt5-base-common-5.11.3-alt2 sisyphus+221574.100.1.2 1550273545 installed
<13>Feb 18 09:07:14 rpmi: libexpat-2.2.4-alt1 1503305345 installed
<13>Feb 18 09:07:14 rpmi: libmtdev-1.1.5-alt1 sisyphus+220715.100.1.1 1549364509 installed
<13>Feb 18 09:07:14 rpmi: libpng16-1.6.36-alt1 sisyphus+219478.100.1.1 1547633314 installed
<13>Feb 18 09:07:14 rpmi: libICE-1.0.9-alt1 1409902721 installed
<13>Feb 18 09:07:14 rpmi: libglvnd-7:1.1.0-alt3 sisyphus.215982.100 1541498632 installed
<13>Feb 18 09:07:14 rpmi: libwayland-server-1.16.0-alt1 1535614871 installed
<13>Feb 18 09:07:14 rpmi: libSM-1.2.3-alt1 sisyphus.215747.100 1540812795 installed
<13>Feb 18 09:07:14 rpmi: qt5-xmlpatterns-common-5.11.3-alt1 sisyphus.217836.200 1545041729 installed
<13>Feb 18 09:07:14 rpmi: qt5-declarative-common-5.11.3-alt1 sisyphus.217836.300 1545042975 installed
<13>Feb 18 09:07:14 rpmi: rpm-macros-qt5-5.11.3-alt2 sisyphus+221574.100.1.2 1550273240 installed
<13>Feb 18 09:07:14 rpmi: rpm-macros-ubt-0.2-alt2 1488208885 installed
<13>Feb 18 09:07:14 rpmi: rpm-build-xdg-0.2-alt1 1250461503 installed
<13>Feb 18 09:07:14 rpmi: libsqlite3-3.26.0-alt2 sisyphus+220766.100.5.1 1549611685 installed
<13>Feb 18 09:07:14 rpmi: libts-1.0-alt1.qa1 1366249315 installed
<13>Feb 18 09:07:14 rpmi: libproxy-0.4.15-alt2 sisyphus.214008.100 1538585336 installed
<13>Feb 18 09:07:14 rpmi: libpcre2-10.32-alt1 sisyphus.212994.100 1536866761 installed
<13>Feb 18 09:07:14 rpmi: libjpeg-2:1.5.1-alt1 1498218318 installed
<13>Feb 18 09:07:14 rpmi: libwacom-data-0.32-alt1 sisyphus.216114.100 1541407217 installed
<13>Feb 18 09:07:14 rpmi: udev-rules-1:240-alt4 sisyphus.219244.100 1547241418 installed
<13>Feb 18 09:07:15 rpmi: libicu63-1:6.3.1-alt1 sisyphus.215328.100 1540049988 installed
<13>Feb 18 09:07:15 rpmi: libqt5-core-5.11.3-alt2 sisyphus+221574.100.1.2 1550273545 installed
<13>Feb 18 09:07:15 rpmi: libqt5-sql-5.11.3-alt2 sisyphus+221574.100.1.2 1550273545 installed
<13>Feb 18 09:07:15 rpmi: libgudev-1:232-alt3 1523738518 installed
<13>Feb 18 09:07:15 rpmi: libwacom-0.32-alt1 sisyphus.216114.100 1541407221 installed
<13>Feb 18 09:07:15 rpmi: libgraphite2-1.3.13-alt1 sisyphus.218545.100 1545686511 installed
<13>Feb 18 09:07:15 rpmi: libharfbuzz-2.2.0-alt1 sisyphus.218134.500 1545261518 installed
<13>Feb 18 09:07:15 rpmi: libfreetype-2.9.1-alt1.S1 1530781053 installed
<13>Feb 18 09:07:15 rpmi: fontconfig-2.13.1-alt1 sisyphus.215917.100 1540973886 installed
Updating fonts cache: <29>Feb 18 09:07:16 fontconfig: Updating fonts cache: succeeded
[ DONE ]
<13>Feb 18 09:07:16 rpmi: libevdev-1.6.0-alt1 sisyphus.215605.100 1540547069 installed
<13>Feb 18 09:07:16 rpmi: libinput-1.12.6-alt1 sisyphus+219722.300.2.2 1548107560 installed
<13>Feb 18 09:07:16 rpmi: liblz4-1:1.8.3-alt2 sisyphus.217095.200 1547082375 installed
<13>Feb 18 09:07:16 rpmi: libgpg-error-1.31-alt1.S1 1529015802 installed
<13>Feb 18 09:07:17 rpmi: libgcrypt20-1.8.3-alt4 sisyphus.218050.200 1545223289 installed
<13>Feb 18 09:07:17 rpmi: libsystemd-1:240-alt4 sisyphus.219244.100 1547241502 installed
<13>Feb 18 09:07:17 rpmi: libdbus-1.12.12-alt2 sisyphus+221234.100.1.2 1549918047 installed
<13>Feb 18 09:07:17 rpmi: libqt5-dbus-5.11.3-alt2 sisyphus+221574.100.1.2 1550273545 installed
<13>Feb 18 09:07:17 rpmi: libxshmfence-1.2-alt2 1518613552 installed
<13>Feb 18 09:07:17 rpmi: libX11-locales-3:1.6.7-alt1 sisyphus.214413.200 1539171080 installed
<13>Feb 18 09:07:17 rpmi: libXdmcp-1.1.1-alt1 1334617701 installed
<13>Feb 18 09:07:17 rpmi: libXau-1.0.8-alt1 1369565808 installed
<13>Feb 18 09:07:17 rpmi: libxcb-1.13.1-alt1 sisyphus.214413.100 1539170896 installed
<13>Feb 18 09:07:17 rpmi: libX11-3:1.6.7-alt1 sisyphus.214413.200 1539171143 installed
<13>Feb 18 09:07:17 rpmi: libXext-1.3.3-alt1 1409902959 installed
<13>Feb 18 09:07:17 rpmi: libXxf86vm-1.1.4-alt2 1527672187 installed
<13>Feb 18 09:07:17 rpmi: libXi-1.7.9-alt1.S1 1515755342 installed
<13>Feb 18 09:07:17 rpmi: libXdamage-1.1.3-alt4 1297162593 installed
<13>Feb 18 09:07:17 rpmi: libXfixes-5.0.3-alt1 sisyphus.216396.300 1542022162 installed
<13>Feb 18 09:07:17 rpmi: libXrender-0.9.8-alt1 1371312112 installed
<13>Feb 18 09:07:17 rpmi: libxcbutil-icccm-0.4.1-alt1 1396161557 installed
<13>Feb 18 09:07:17 rpmi: libxcbutil-1:0.4.0-alt1 1413392888 installed
<13>Feb 18 09:07:17 rpmi: libxcbutil-image-0.4.0-alt1 1446204182 installed
<13>Feb 18 09:07:17 rpmi: libxcbutil-keysyms-0.4.0-alt1 1446204124 installed
<13>Feb 18 09:07:17 rpmi: libxcb-render-util-0.3.9-alt3 sisyphus.213915.600 1538554008 installed
<13>Feb 18 09:07:17 rpmi: libxkbcommon-x11-0.8.3-alt1 sisyphus+221080.100.1.2 1549739888 installed
<13>Feb 18 09:07:17 rpmi: libwayland-client-1.16.0-alt1 1535614871 installed
<13>Feb 18 09:07:17 rpmi: libpciaccess-1:0.14-alt1 1528969252 installed
<13>Feb 18 09:07:17 rpmi: libdrm-1:2.4.97-alt1 sisyphus+220483.100.1.1 1549270242 installed
<13>Feb 18 09:07:17 rpmi: libGLX-mesa-4:18.3.3-alt1 sisyphus+220483.200.1.1 1549271174 installed
<13>Feb 18 09:07:17 rpmi: libgbm-4:18.3.3-alt1 sisyphus+220483.200.1.1 1549271174 installed
<13>Feb 18 09:07:17 rpmi: libEGL-mesa-4:18.3.3-alt1 sisyphus+220483.200.1.1 1549271174 installed
<13>Feb 18 09:07:17 rpmi: libEGL-7:1.1.0-alt3 sisyphus.215982.100 1541498632 installed
<13>Feb 18 09:07:17 rpmi: libGLX-7:1.1.0-alt3 sisyphus.215982.100 1541498632 installed
<13>Feb 18 09:07:17 rpmi: libGL-7:1.1.0-alt3 sisyphus.215982.100 1541498632 installed
<13>Feb 18 09:07:17 rpmi: libtasn1-4.13-alt2 1521133850 installed
<13>Feb 18 09:07:17 rpmi: libp11-kit-0.23.9-alt5 1525798298 installed
<13>Feb 18 09:07:17 rpmi: rpm-macros-alternatives-0.5.0-alt1 sisyphus.219012.300 1546745004 installed
<13>Feb 18 09:07:17 rpmi: alternatives-0.5.0-alt1 sisyphus.219012.300 1546745004 installed
<13>Feb 18 09:07:17 rpmi: ca-certificates-2019.02.01-alt1 sisyphus+220384.200.1.1 1549032756 installed
<13>Feb 18 09:07:17 rpmi: ca-trust-0.1.1-alt2 1515595785 installed
<13>Feb 18 09:07:17 rpmi: p11-kit-trust-0.23.9-alt5 1525798298 installed
<13>Feb 18 09:07:17 rpmi: libcrypto1.1-1.1.0j-alt1 sisyphus.216647.100 1542743878 installed
<13>Feb 18 09:07:17 rpmi: libssl1.1-1.1.0j-alt1 sisyphus.216647.100 1542743878 installed
<13>Feb 18 09:07:17 rpmi: libqt5-network-5.11.3-alt2 sisyphus+221574.100.1.2 1550273545 installed
<13>Feb 18 09:07:17 rpmi: libqt5-xcbqpa-5.11.3-alt2 sisyphus+221574.100.1.2 1550273545 installed
<13>Feb 18 09:07:17 rpmi: libqt5-eglfskmssupport-5.11.3-alt2 sisyphus+221574.100.1.2 1550273545 installed
<13>Feb 18 09:07:17 rpmi: libqt5-eglfsdeviceintegration-5.11.3-alt2 sisyphus+221574.100.1.2 1550273545 installed
<13>Feb 18 09:07:17 rpmi: libqt5-gui-5.11.3-alt2 sisyphus+221574.100.1.2 1550273545 installed
<13>Feb 18 09:07:18 rpmi: libqt5-xmlpatterns-5.11.3-alt1 sisyphus.217836.200 1545041957 installed
<13>Feb 18 09:07:18 rpmi: libqt5-quick-5.11.3-alt1 sisyphus.217836.300 1545042975 installed
<13>Feb 18 09:07:18 rpmi: libqt5-qml-5.11.3-alt1 sisyphus.217836.300 1545042975 installed
<13>Feb 18 09:07:18 rpmi: rpm-build-qml-5.11.3-alt1 sisyphus.217836.300 1545042975 installed
<13>Feb 18 09:07:18 rpmi: rpm-build-kf5-5.12.0-alt1.S1 1533765026 installed
<13>Feb 18 09:07:18 rpmi: rpm-build-ubt-0.3.1-alt3 sisyphus.213781.100 1538147677 installed
<13>Feb 18 09:07:22 rpmi: xorg-proto-devel-2018.4-alt3 1527685079 installed
<13>Feb 18 09:07:22 rpmi: libqt5-widgets-5.11.3-alt2 sisyphus+221574.100.1.2 1550273545 installed
<13>Feb 18 09:07:22 rpmi: libogg-1.3.3-alt1 sisyphus.217914.100 1545006091 installed
<13>Feb 18 09:07:22 rpmi: libalsa-1:1.1.8-alt1 sisyphus+219888.100.4.1 1548752826 installed
<13>Feb 18 09:07:22 rpmi: libvorbis-1.3.6-alt2 sisyphus+220072.200.2.2 1548744475 installed
<13>Feb 18 09:07:22 rpmi: libwebp7-1.0.2-alt1 sisyphus+219651.100.1.2 1548057725 installed
<13>Feb 18 09:07:22 rpmi: libraw1394-11-2.1.0-alt1.1 1501764699 installed
<13>Feb 18 09:07:22 rpmi: liborc-0.4.28-alt1 1511201506 installed
<13>Feb 18 09:07:22 rpmi: libtheora-2:1.1.1-alt6 1450061541 installed
<13>Feb 18 09:07:22 rpmi: libv4l-1.16.2-alt2 sisyphus+220174.100.1.1 1548772000 installed
<13>Feb 18 09:07:22 rpmi: liblcms2-2.9-alt1 1516411892 installed
<13>Feb 18 09:07:22 rpmi: libusb-1.0.22-alt1 1525452055 installed
<13>Feb 18 09:07:22 rpmi: perl-HTTP-Date-6.02-alt1 1348645274 installed
<13>Feb 18 09:07:22 rpmi: libopus-1.2.1-alt1.1 1504605295 installed
<13>Feb 18 09:07:22 rpmi: libqt5-opengl-5.11.3-alt2 sisyphus+221574.100.1.2 1550273545 installed
<13>Feb 18 09:07:22 rpmi: libXt-1.1.4-alt1 1369984722 installed
<13>Feb 18 09:07:24 rpmi: libxcb-devel-1.13.1-alt1 sisyphus.214413.100 1539170896 installed
<13>Feb 18 09:07:24 rpmi: libX11-devel-3:1.6.7-alt1 sisyphus.214413.200 1539171143 installed
<13>Feb 18 09:07:24 rpmi: libXfixes-devel-5.0.3-alt1 sisyphus.216396.300 1542022162 installed
<13>Feb 18 09:07:24 rpmi: libopenjpeg2.0-2.3.0-alt2 sisyphus.216213.100 1541598437 installed
<13>Feb 18 09:07:24 rpmi: libserd-0.30.0-alt1_1 sisyphus+221097.100.1.1 1549718401 installed
<13>Feb 18 09:07:24 rpmi: libdvdread-5.0.0-alt1 1414228694 installed
<13>Feb 18 09:07:24 rpmi: libvpx5-1.7.0-alt1 1529659550 installed
<13>Feb 18 09:07:24 rpmi: libspeex-1.2-alt1 1528115225 installed
<13>Feb 18 09:07:24 rpmi: libgsm-1.0.17-alt1 1523356165 installed
<13>Feb 18 09:07:24 rpmi: libXrandr-1.5.0-alt1 1431936189 installed
<13>Feb 18 09:07:24 rpmi: libXcursor-1.1.15-alt1.S1 1512373366 installed
<13>Feb 18 09:07:24 rpmi: libXcomposite-0.4.3-alt3 1297306936 installed
<13>Feb 18 09:07:24 rpmi: perl-XML-NamespaceSupport-1.12-alt1 1491296348 installed
<13>Feb 18 09:07:24 rpmi: libpng15-1.5.28-alt2 1497966749 installed
<13>Feb 18 09:07:24 rpmi: libXv-1.0.11-alt1 1527685499 installed
<13>Feb 18 09:07:24 rpmi: libqt5-xml-5.11.3-alt2 sisyphus+221574.100.1.2 1550273545 installed
<13>Feb 18 09:07:24 rpmi: libidn2-2.1.1-alt1 sisyphus+221274.100.1.2 1549951289 installed
<13>Feb 18 09:07:24 rpmi: libnettle6-3.4.1-alt1 sisyphus.217427.100 1544107917 installed
<13>Feb 18 09:07:24 rpmi: libXtst-1.2.2-alt1 1369984893 installed
<13>Feb 18 09:07:24 rpmi: libsord-0.16.2-alt1_3 sisyphus+221690.100.1.1 1550344143 installed
<13>Feb 18 09:07:24 rpmi: libXrender-devel-0.9.8-alt1 1371312112 installed
<13>Feb 18 09:07:24 rpmi: libdc1394-22-2.2.5-alt1 1529659263 installed
<13>Feb 18 09:07:24 rpmi: libunicap-0.9.8-alt4 sisyphus.213915.400 1538553831 installed
<13>Feb 18 09:07:24 rpmi: libflac8-1.3.2-alt1 1507623955 installed
<13>Feb 18 09:07:24 rpmi: libsndfile-1.0.28-alt2 sisyphus.212728.100 1536333068 installed
<13>Feb 18 09:07:24 rpmi: libqt5-quickwidgets-5.11.3-alt1 sisyphus.217836.300 1545042975 installed
<13>Feb 18 09:07:24 rpmi: libnspr-1:4.20-alt1 sisyphus.216395.100 1542113039 installed
<13>Feb 18 09:07:24 rpmi: libXScrnSaver-1.2.2-alt1 1331212354 installed
<13>Feb 18 09:07:24 rpmi: libqt5-test-5.11.3-alt2 sisyphus+221574.100.1.2 1550273545 installed
<13>Feb 18 09:07:24 rpmi: libvdpau-1:1.1.1-alt1 1441098581 installed
<13>Feb 18 09:07:24 rpmi: libx265-160-2.8-alt1 1529659188 installed
<13>Feb 18 09:07:24 rpmi: libx264-148-alt2 1496163832 installed
<13>Feb 18 09:07:24 rpmi: libva-2.3.0-alt1 sisyphus.214267.100 1539001610 installed
<13>Feb 18 09:07:24 rpmi: libavutil56-2:4.1-alt1 sisyphus.216261.100 1541676633 installed
<13>Feb 18 09:07:24 rpmi: libopencore-amrwb0-0.1.5-alt1 1529659346 installed
<13>Feb 18 09:07:24 rpmi: libopencore-amrnb0-0.1.5-alt1 1529659346 installed
<13>Feb 18 09:07:24 rpmi: libxslt-1.1.32-alt2 1517429984 installed
<13>Feb 18 09:07:24 rpmi: ilmbase12-common-2.2.0-alt1.1 1434452921 installed
<13>Feb 18 09:07:24 rpmi: libiex12-2.2.0-alt1.1 1434452921 installed
<13>Feb 18 09:07:24 rpmi: libhalf12-2.2.0-alt1.1 1434452921 installed
<13>Feb 18 09:07:24 rpmi: libwavpack-5.1.0-alt1 1486754497 installed
<13>Feb 18 09:07:24 rpmi: liblame-3.100-alt1 1527082574 installed
<13>Feb 18 09:07:24 rpmi: libjack-1:1.9.12-alt2 sisyphus.215965.100 1541010132 installed
<13>Feb 18 09:07:24 rpmi: libtiff5-4.0.3-alt1 1348347501 installed
<13>Feb 18 09:07:24 rpmi: libjasper-2.0.14-alt1 1530105217 installed
<13>Feb 18 09:07:24 rpmi: libXinerama-1.1.3-alt2 1527671619 installed
<13>Feb 18 09:07:24 rpmi: perl-LWP-MediaTypes-6.02-alt1 1329754558 installed
<13>Feb 18 09:07:24 rpmi: perl-Compress-Raw-Zlib-2.084-alt1.1 sisyphus+219907.700.1.1 1548343625 installed
<13>Feb 18 09:07:24 rpmi: perl-libnet-1:3.11-alt1 1511423541 installed
<13>Feb 18 09:07:24 rpmi: perl-XML-SAX-Base-1.09-alt1 1494364363 installed
<13>Feb 18 09:07:24 rpmi: libdv-1.0.0-alt5.6 1342763159 installed
<13>Feb 18 09:07:24 rpmi: libfribidi-1.0.5-alt1 1532424345 installed
<13>Feb 18 09:07:24 rpmi: libXft-2.3.2-alt1 1409902660 installed
<13>Feb 18 09:07:24 rpmi: libwayland-egl-4:18.1.0-alt1 1535614871 installed
<13>Feb 18 09:07:24 rpmi: qt5-location-common-5.11.3-alt1 sisyphus.217836.1000 1545132032 installed
<13>Feb 18 09:07:24 rpmi: qt5-tools-common-5.11.3-alt1 sisyphus.217836.400 1545130608 installed
<13>Feb 18 09:07:24 rpmi: qt5-connectivity-common-5.11.3-alt1 sisyphus.217836.2200 1545136820 installed
<13>Feb 18 09:07:24 rpmi: libgdbm-1.8.3-alt10 1454943334 installed
<13>Feb 18 09:07:24 rpmi: libpython3-3.6.8-alt1 sisyphus+220164.200.3.1 1548842636 installed
<13>Feb 18 09:07:24 rpmi: python3-3.6.8-alt1 sisyphus+220164.200.3.1 1548842636 installed
<13>Feb 18 09:07:25 rpmi: python3-base-3.6.8-alt1 sisyphus+220164.200.3.1 1548842636 installed
<13>Feb 18 09:07:25 rpmi: libglog-0.3.4-alt4 1520334127 installed
<13>Feb 18 09:07:25 rpmi: libopenblas-0.2.20-alt1 1527005646 installed
<13>Feb 18 09:07:25 rpmi: libgomp1-8.2.1-alt5 sisyphus+219286.200.2.1 1549854113 installed
<13>Feb 18 09:07:25 rpmi: libat-spi2-core-2.30.0-alt1 sisyphus.212651.600 1536647587 installed
<13>Feb 18 09:07:25 rpmi: libqt5-bluetooth-5.11.3-alt1 sisyphus.217836.2200 1545136912 installed
<13>Feb 18 09:07:25 rpmi: libqt5-nfc-5.11.3-alt1 sisyphus.217836.2200 1545136912 installed
<13>Feb 18 09:07:25 rpmi: libqt5-designer-5.11.3-alt1 sisyphus.217836.400 1545130650 installed
<13>Feb 18 09:07:25 rpmi: libqt5-help-5.11.3-alt1 sisyphus.217836.400 1545130650 installed
<13>Feb 18 09:07:26 rpmi: libXinerama-devel-1.1.3-alt2 1527671619 installed
<13>Feb 18 09:07:26 rpmi: libilmthread12-2.2.0-alt1.1 1434452921 installed
<13>Feb 18 09:07:26 rpmi: libswscale5-2:4.1-alt1 sisyphus.216261.100 1541676633 installed
<13>Feb 18 09:07:26 rpmi: libXScrnSaver-devel-1.2.2-alt1 1331212354 installed
<13>Feb 18 09:07:26 rpmi: libnss-3.42.1-alt1 sisyphus+220384.100.1.1 1549032573 installed
<13>Feb 18 09:07:26 rpmi: libXrandr-devel-1.5.0-alt1 1431936189 installed
<13>Feb 18 09:07:26 rpmi: libsratom-0.6.2-alt1_3 sisyphus+221691.100.1.1 1550345184 installed
<13>Feb 18 09:07:26 rpmi: liblilv-0.24.4-alt1_5 sisyphus+221689.100.1.1 1550343709 installed
<13>Feb 18 09:07:26 rpmi: libarchive13-3.3.1-alt2 sisyphus.219343.100 1547461970 installed
<13>Feb 18 09:07:26 rpmi: libhogweed4-3.4.1-alt1 sisyphus.217427.100 1544107917 installed
<13>Feb 18 09:07:26 rpmi: libgnutls30-3.6.6-alt1 sisyphus+219978.100.1.1 1548422819 installed
<13>Feb 18 09:07:26 rpmi: libzbar-0.10-alt9 1527711188 installed
<13>Feb 18 09:07:26 rpmi: libzvbi-0.2.35-alt1 1410514327 installed
<13>Feb 18 09:07:26 rpmi: libXcomposite-devel-0.4.3-alt3 1297306936 installed
<13>Feb 18 09:07:26 rpmi: libXcursor-devel-1.1.15-alt1.S1 1512373366 installed
<13>Feb 18 09:07:26 rpmi: libshout2-2.2.2-alt3 1303374835 installed
<13>Feb 18 09:07:26 rpmi: libXdamage-devel-1.1.3-alt4 1297162593 installed
<13>Feb 18 09:07:26 rpmi: libxcbutil-keysyms-devel-0.4.0-alt1 1446204124 installed
<13>Feb 18 09:07:26 rpmi: libXmu-1.1.2-alt1 1391072530 installed
<13>Feb 18 09:07:26 rpmi: libXpm-3.5.11-alt1 1391072398 installed
<13>Feb 18 09:07:26 rpmi: libXpm-devel-3.5.11-alt1 1391072398 installed
<13>Feb 18 09:07:26 rpmi: perl-File-Listing-6.04-alt1 1329758996 installed
<13>Feb 18 09:07:26 rpmi: libavc1394-0.5.4-alt1.qa1 1460816781 installed
<13>Feb 18 09:07:26 rpmi: libiec61883-1.2.0-alt1.qa1 1460815903 installed
<13>Feb 18 09:07:26 rpmi: qt5-quickcontrols-5.11.3-alt1 sisyphus.217836.1300 1545132707 installed
<13>Feb 18 09:07:26 rpmi: libICE-devel-1.0.9-alt1 1409902721 installed
<13>Feb 18 09:07:26 rpmi: libSM-devel-1.2.3-alt1 sisyphus.215747.100 1540812795 installed
<13>Feb 18 09:07:26 rpmi: libXt-devel-1.1.4-alt1 1369984722 installed
<13>Feb 18 09:07:26 rpmi: libXmu-devel-1.1.2-alt1 1391072530 installed
<13>Feb 18 09:07:26 rpmi: libXau-devel-1.0.8-alt1 1369565808 installed
<13>Feb 18 09:07:26 rpmi: libXext-devel-1.3.3-alt1 1409902959 installed
<13>Feb 18 09:07:26 rpmi: libXi-devel-1.7.9-alt1.S1 1515755342 installed
<13>Feb 18 09:07:26 rpmi: libXtst-devel-1.2.2-alt1 1369984893 installed
<13>Feb 18 09:07:26 rpmi: libXv-devel-1.0.11-alt1 1527685499 installed
<13>Feb 18 09:07:26 rpmi: libXdmcp-devel-1.1.1-alt1 1334617701 installed
<13>Feb 18 09:07:26 rpmi: libXxf86vm-devel-1.1.4-alt2 1527672187 installed
<86>Feb 18 09:07:26 groupadd[109647]: group added to /etc/group: name=messagebus, GID=499
<86>Feb 18 09:07:26 groupadd[109647]: group added to /etc/gshadow: name=messagebus
<86>Feb 18 09:07:26 groupadd[109647]: new group: name=messagebus, GID=499
<86>Feb 18 09:07:26 useradd[109667]: new user: name=messagebus, UID=499, GID=499, home=/run/dbus, shell=/dev/null
<13>Feb 18 09:07:26 rpmi: dbus-1.12.12-alt2 sisyphus+221234.100.1.2 1549918047 installed
<13>Feb 18 09:07:26 rpmi: dbus-tools-1.12.12-alt2 sisyphus+221234.100.1.2 1549918047 installed
<13>Feb 18 09:07:26 rpmi: dbus-tools-gui-1.12.12-alt2 sisyphus+221234.100.1.2 1549918047 installed
<13>Feb 18 09:07:26 rpmi: xxd-4:8.1.26-alt1.1 sisyphus+219907.2400.1.1 1548344767 installed
<13>Feb 18 09:07:26 rpmi: libxkbfile-1.0.9-alt1 1527685441 installed
<13>Feb 18 09:07:26 rpmi: libxkbfile-devel-1.0.9-alt1 1527685441 installed
<13>Feb 18 09:07:26 rpmi: libqt5-concurrent-5.11.3-alt2 sisyphus+221574.100.1.2 1550273545 installed
<13>Feb 18 09:07:26 rpmi: xorg-xf86miscproto-devel-0.9.3-alt1 1303464883 installed
<13>Feb 18 09:07:26 rpmi: libXxf86misc-1.0.3-alt1.qa1 1365952033 installed
<13>Feb 18 09:07:26 rpmi: libXxf86misc-devel-1.0.3-alt1.qa1 1365952033 installed
<13>Feb 18 09:07:26 rpmi: libGLES-7:1.1.0-alt3 sisyphus.215982.100 1541498632 installed
<13>Feb 18 09:07:26 rpmi: libOpenGL-7:1.1.0-alt3 sisyphus.215982.100 1541498632 installed
<13>Feb 18 09:07:26 rpmi: libglvnd-devel-7:1.1.0-alt3 sisyphus.215982.100 1541498632 installed
<13>Feb 18 09:07:26 rpmi: libEGL-devel-4:18.3.3-alt1 sisyphus+220483.200.1.1 1549271174 installed
<13>Feb 18 09:07:26 rpmi: libGL-devel-4:18.3.3-alt1 sisyphus+220483.200.1.1 1549271174 installed
<13>Feb 18 09:07:26 rpmi: gcc-c++-common-1.4.23-alt1 sisyphus.218115.200 1545282875 installed
<13>Feb 18 09:07:27 rpmi: libstdc++8-devel-8.2.1-alt5 sisyphus+219286.200.2.1 1549854113 installed
<13>Feb 18 09:07:27 rpmi: gcc8-c++-8.2.1-alt5 sisyphus+219286.200.2.1 1549854113 installed
<13>Feb 18 09:07:27 rpmi: gcc-c++-8-alt1 sisyphus.214000.40 1542664775 installed
<13>Feb 18 09:07:27 rpmi: icu-utils-1:6.3.1-alt1 sisyphus.215328.100 1540049988 installed
<13>Feb 18 09:07:28 rpmi: libicu-devel-1:6.3.1-alt1 sisyphus.215328.100 1540049988 installed
<13>Feb 18 09:07:28 rpmi: libgraphite2-devel-1.3.13-alt1 sisyphus.218545.100 1545686511 installed
<13>Feb 18 09:07:28 rpmi: xml-utils-1:2.9.4.0.12.e905-alt1.1 1525115767 installed
<13>Feb 18 09:07:28 rpmi: rpm-build-gir-0.7.2-alt4 1534675014 installed
<13>Feb 18 09:07:28 rpmi: glib2-devel-2.58.3-alt1 sisyphus+219722.100.1.1 1548088777 installed
<13>Feb 18 09:07:28 rpmi: libharfbuzz-icu-2.2.0-alt1 sisyphus.218134.500 1545261518 installed
<13>Feb 18 09:07:28 rpmi: libharfbuzz-devel-2.2.0-alt1 sisyphus.218134.500 1545261518 installed
<13>Feb 18 09:07:28 rpmi: libfreetype-devel-2.9.1-alt1.S1 1530781053 installed
<13>Feb 18 09:07:28 rpmi: fontconfig-devel-2.13.1-alt1 sisyphus.215917.100 1540973886 installed
<13>Feb 18 09:07:28 rpmi: libXft-devel-2.3.2-alt1 1409902660 installed
<13>Feb 18 09:07:28 rpmi: qt5-x11extras-common-5.11.3-alt1 sisyphus.217836.1600 1545135918 installed
<13>Feb 18 09:07:28 rpmi: libqt5-x11extras-5.11.3-alt1 sisyphus.217836.1600 1545135961 installed
<13>Feb 18 09:07:28 rpmi: qt5-websockets-common-5.11.3-alt1 sisyphus.217836.500 1545131045 installed
<13>Feb 18 09:07:28 rpmi: libqt5-websockets-5.11.3-alt1 sisyphus.217836.500 1545131096 installed
<13>Feb 18 09:07:28 rpmi: qt5-webkit-common-5.212.0-alt10 sisyphus.217836.1340 1545135156 installed
<13>Feb 18 09:07:28 rpmi: qt5-webengine-common-5.11.3-alt2 sisyphus+221310.200.3.1 1550062786 installed
<13>Feb 18 09:07:28 rpmi: libsnappy-1.1.3-alt1 1450962245 installed
<13>Feb 18 09:07:28 rpmi: libre2-20160401-alt1_5 1506738944 installed
<13>Feb 18 09:07:28 rpmi: libminizip-1.2.11-alt1 sisyphus.217171.100 1543710737 installed
<13>Feb 18 09:07:28 rpmi: libevent2.1-2.1.8-alt1 sisyphus.212491.200 1535963930 installed
<13>Feb 18 09:07:28 rpmi: qt5-quickcontrols2-common-5.11.3-alt1 sisyphus.217836.2100 1545136462 installed
<13>Feb 18 09:07:28 rpmi: libqt5-quicktemplates2-5.11.3-alt1 sisyphus.217836.2100 1545136533 installed
<13>Feb 18 09:07:28 rpmi: libqt5-quickcontrols2-5.11.3-alt1 sisyphus.217836.2100 1545136533 installed
<13>Feb 18 09:07:29 rpmi: qt5-quickcontrols2-5.11.3-alt1 sisyphus.217836.2100 1545136533 installed
<13>Feb 18 09:07:29 rpmi: qt5-webchannel-common-5.11.3-alt1 sisyphus.217836.1200 1545132464 installed
<13>Feb 18 09:07:29 rpmi: libqt5-webchannel-5.11.3-alt1 sisyphus.217836.1200 1545132548 installed
<13>Feb 18 09:07:30 rpmi: libqt5-webkit-5.212.0-alt10 sisyphus.217836.1340 1545135211 installed
<13>Feb 18 09:07:30 rpmi: qt5-svg-common-5.11.3-alt1 sisyphus.217836.2000 1545136141 installed
<13>Feb 18 09:07:30 rpmi: libqt5-svg-5.11.3-alt1 sisyphus.217836.2000 1545136194 installed
<13>Feb 18 09:07:30 rpmi: qt5-sensors-common-5.11.3-alt1 sisyphus.217836.1100 1545132336 installed
<13>Feb 18 09:07:30 rpmi: libqt5-sensors-5.11.3-alt1 sisyphus.217836.1100 1545132421 installed
<13>Feb 18 09:07:30 rpmi: libopenal1-1.19.1-alt1 sisyphus.217618.20 1544481871 installed
<13>Feb 18 09:07:30 rpmi: libmpeg2-0.5.1-alt3.svn20120718 1410845588 installed
<13>Feb 18 09:07:30 rpmi: libcdio-2.0.0-alt1.1 1516233234 installed
<13>Feb 18 09:07:30 rpmi: liba52-0.7.4-alt9 1528303351 installed
<13>Feb 18 09:07:30 rpmi: libwebrtc-0.3-alt1 1528324192 installed
<13>Feb 18 09:07:30 rpmi: vulkan-filesystem-1.1.96-alt1 sisyphus.218930.100 1546521136 installed
<13>Feb 18 09:07:30 rpmi: libvulkan1-1.1.96-alt1 sisyphus.218930.100 1546521267 installed
<13>Feb 18 09:07:30 rpmi: libvo-amrwbenc-0.1.3-alt1 1465493713 installed
<13>Feb 18 09:07:30 rpmi: libvo-aacenc-0.1.3-alt1 1393497440 installed
<13>Feb 18 09:07:30 rpmi: libsbc-1.2-alt1.1 1501780340 installed
<13>Feb 18 09:07:30 rpmi: libtbb-2019-alt1.u2 sisyphus+221493.100.1.1 1550132478 installed
<13>Feb 18 09:07:30 rpmi: libprotobuf15-3.5.2-alt2 sisyphus.218609.100 1545821975 installed
<13>Feb 18 09:07:30 rpmi: libgflags-2.2.1-alt1 1506439788 installed
<13>Feb 18 09:07:30 rpmi: libjson-c-0.12.1-alt2 1517446106 installed
<13>Feb 18 09:07:30 rpmi: libCharLS-1.0-alt2 1389518019 installed
<13>Feb 18 09:07:30 rpmi: gdcm-2.8.4-alt3_11 sisyphus+221511.100.1.2 1550151960 installed
<13>Feb 18 09:07:30 rpmi: libudfread-1.0.0-alt3 1528906339 installed
<13>Feb 18 09:07:30 rpmi: libbluray-1.0.2-alt1 1529659859 installed
<13>Feb 18 09:07:30 rpmi: libsoxr-0.1.2-alt4 sisyphus.215929.100 1541001035 installed
<13>Feb 18 09:07:30 rpmi: libswresample3-2:4.1-alt1 sisyphus.216261.100 1541676633 installed
<13>Feb 18 09:07:30 rpmi: libxvid-1.3.4-alt1 1507033991 installed
<13>Feb 18 09:07:30 rpmi: libtwolame-0.3.13-alt1 1486717206 installed
<13>Feb 18 09:07:30 rpmi: libcodec2-0.8.1-alt1 1533802541 installed
<13>Feb 18 09:07:30 rpmi: tinyxml-2.6.2-alt1.2 1465754828 installed
<13>Feb 18 09:07:30 rpmi: openni-1.5.7.10-alt2_13 1525876452 installed
<13>Feb 18 09:07:30 rpmi: libfftw3-common-3.3.7-alt1 1512930056 installed
<13>Feb 18 09:07:30 rpmi: libfftw3-3.3.7-alt1 1512930056 installed
<13>Feb 18 09:07:30 rpmi: libofa-0.9.3-alt4.1.qa3 1506957671 installed
<13>Feb 18 09:07:30 rpmi: libmpcdec5-1.2.6-alt4 1300636184 installed
<13>Feb 18 09:07:30 rpmi: libmodplug-0.8.8.5-alt1 1410380710 installed
<13>Feb 18 09:07:30 rpmi: libmms-0.6.4-alt1 1409679935 installed
<13>Feb 18 09:07:30 rpmi: libyajl-2.1.0-alt1 1399891591 installed
<13>Feb 18 09:07:30 rpmi: libkate-0.4.1-alt1.4 1389855560 installed
<13>Feb 18 09:07:30 rpmi: liblash-1:0.5.4-alt1_35 sisyphus.218825.100 1546185270 installed
<13>Feb 18 09:07:30 rpmi: libfaad2-2.7-alt5 1501250816 installed
<13>Feb 18 09:07:30 rpmi: libdvdcss-1.3.0-alt1 1414269644 installed
<13>Feb 18 09:07:30 rpmi: libdvdnav-5.0.1-alt1 1414229735 installed
<13>Feb 18 09:07:30 rpmi: libdca0-0.0.5-alt4.qa1 sisyphus.214780.100 1539613452 installed
<13>Feb 18 09:07:30 rpmi: libbs2b-3.1.0-alt1.3 1327614927 installed
<13>Feb 18 09:07:30 rpmi: libenca-1.19-alt1 1473338980 installed
<13>Feb 18 09:07:30 rpmi: libass5-0.12.1-alt2 sisyphus+220287.300.2.1 1548929539 installed
<13>Feb 18 09:07:30 rpmi: libsoundtouch-2.1.2-alt1 sisyphus.218548.100 1545687501 installed
<13>Feb 18 09:07:30 rpmi: openexr22-common-2.2.0-alt3 sisyphus+221267.100.1.2 1549944972 installed
<13>Feb 18 09:07:30 rpmi: libilmimf22-2.2.0-alt3 sisyphus+221267.100.1.2 1549944972 installed
<13>Feb 18 09:07:31 rpmi: libtag-1.11.1-alt1 1479892963 installed
<13>Feb 18 09:07:31 rpmi: libasyncns-0.8-alt2.qa1 1365949820 installed
<13>Feb 18 09:07:31 rpmi: libpulseaudio-12.2-alt1 1535623585 installed
<13>Feb 18 09:07:31 rpmi: libfluidsynth-2.0.3-alt1 sisyphus+219546.100.13.2 1548036806 installed
<13>Feb 18 09:07:31 rpmi: libSDL-1.2.14-alt7 1483707272 installed
<13>Feb 18 09:07:31 rpmi: libmjpegtools2.1-2.1.0-alt2 1529665044 installed
<13>Feb 18 09:07:31 rpmi: libmpg123-1.25.10-alt1 1519934031 installed
<13>Feb 18 09:07:31 rpmi: libwayland-cursor-1.16.0-alt1 1535614871 installed
<13>Feb 18 09:07:31 rpmi: libgdk-pixbuf-locales-2.38.0-alt4 sisyphus.219229.400 1547220196 installed
<13>Feb 18 09:07:31 rpmi: libepoxy-1.5.3-alt1 sisyphus.214119.100 1538723829 installed
<13>Feb 18 09:07:31 rpmi: libavahi-0.6.32-alt1 1500485702 installed
<13>Feb 18 09:07:31 rpmi: gtk+3-themes-incompatible-3.20-alt3 1461944560 installed
<13>Feb 18 09:07:31 rpmi: perl-Try-Tiny-0.30-alt1 1514318058 installed
<13>Feb 18 09:07:31 rpmi: perl-IO-Socket-IP-0.39-alt1 1494508514 installed
<13>Feb 18 09:07:31 rpmi: perl-Compress-Raw-Bzip2-2.084-alt1.1 sisyphus+219907.1000.1.1 1548343668 installed
<13>Feb 18 09:07:31 rpmi: perl-HTML-Tagset-3.20-alt2 1317725093 installed
<13>Feb 18 09:07:31 rpmi: perl-Term-ANSIColor-4.06-alt1 1479407083 installed
<13>Feb 18 09:07:31 rpmi: perl-Data-Dump-1.23-alt1 1444601978 installed
<13>Feb 18 09:07:31 rpmi: perl-Filter-1.59-alt1.1 sisyphus+219907.400.1.1 1548343389 installed
<13>Feb 18 09:07:31 rpmi: perl-Encode-3.00-alt1 sisyphus+220447.100.1.1 1549145397 installed
<13>Feb 18 09:07:31 rpmi: perl-URI-1.76-alt1 sisyphus+220243.100.1.1 1548863244 installed
<13>Feb 18 09:07:31 rpmi: perl-IO-Compress-2.084-alt1 sisyphus+219744.100.2.1 1548168679 installed
<13>Feb 18 09:07:31 rpmi: perl-Net-HTTP-6.18-alt1 1526560501 installed
<13>Feb 18 09:07:31 rpmi: perl-HTML-Parser-3.72-alt1.2 sisyphus+219907.600.1.1 1548343581 installed
<13>Feb 18 09:07:31 rpmi: perl-WWW-RobotRules-6.02-alt1 1329756211 installed
<13>Feb 18 09:07:31 rpmi: perl-Encode-Locale-1.05-alt1 1444608613 installed
<13>Feb 18 09:07:31 rpmi: perl-IO-HTML-1.001-alt1 1404821752 installed
<13>Feb 18 09:07:31 rpmi: perl-HTTP-Message-6.18-alt1 1528288416 installed
<13>Feb 18 09:07:31 rpmi: perl-HTTP-Cookies-6.04-alt1 1504116575 installed
<13>Feb 18 09:07:31 rpmi: perl-HTTP-Negotiate-6.01-alt1 1329760563 installed
<13>Feb 18 09:07:31 rpmi: perl-libwww-6.36-alt1 sisyphus.215515.100 1540400896 installed
<13>Feb 18 09:07:31 rpmi: perl-XML-LibXML-2.0134-alt1 sisyphus+221347.100.1.1 1549969058 installed
<13>Feb 18 09:07:31 rpmi: perl-XML-SAX-1.00-alt1 1519094959 installed
<13>Feb 18 09:07:31 rpmi: perl-XML-Simple-2.25-alt1 1521437714 installed
<13>Feb 18 09:07:31 rpmi: icon-naming-utils-0.8.90-alt1 1236573102 installed
<13>Feb 18 09:07:32 rpmi: icon-theme-adwaita-3.30.1-alt1 sisyphus.216736.100 1542889653 installed
<13>Feb 18 09:07:32 rpmi: libvisual0.4-0.4.0-alt3 1301290260 installed
<13>Feb 18 09:07:32 rpmi: libdatrie-0.2.9-alt1_6 1511686676 installed
<13>Feb 18 09:07:32 rpmi: libthai-0.1.28-alt1_1 sisyphus.214516.100 1539257851 installed
<13>Feb 18 09:07:32 rpmi: libcdparanoia-1:10.2-alt6 1501248110 installed
<13>Feb 18 09:07:32 rpmi: libpixman-3:0.38.0-alt1 sisyphus+221327.100.1.1 1549959657 installed
<13>Feb 18 09:07:32 rpmi: libcairo-1:1.16.0-alt1 sisyphus.215566.100 1540457683 installed
<13>Feb 18 09:07:32 rpmi: libpango-1.42.4-alt1 1534787259 installed
<13>Feb 18 09:07:32 rpmi: libcairo-gobject-1:1.16.0-alt1 sisyphus.215566.100 1540457683 installed
<13>Feb 18 09:07:32 rpmi: libucil-0.9.8-alt4.1 1349410514 installed
<13>Feb 18 09:07:32 rpmi: qt5-multimedia-common-5.11.3-alt1 sisyphus.217836.600 1545188274 installed
<13>Feb 18 09:07:32 rpmi: qt5-serialport-common-5.11.3-alt1 sisyphus.217836.700 1545131634 installed
<13>Feb 18 09:07:32 rpmi: libqt5-serialport-5.11.3-alt1 sisyphus.217836.700 1545131691 installed
<13>Feb 18 09:07:32 rpmi: libqt5-positioning-5.11.3-alt1 sisyphus.217836.1000 1545132113 installed
<13>Feb 18 09:07:32 rpmi: libqt5-positioningquick-5.11.3-alt1 sisyphus.217836.1000 1545132113 installed
<13>Feb 18 09:07:32 rpmi: libqt5-location-5.11.3-alt1 sisyphus.217836.1000 1545132113 installed
<13>Feb 18 09:07:32 rpmi: python-module-enum34-1.1.6-alt3 1527251693 installed
<13>Feb 18 09:07:32 rpmi: python-modules-curses-2.7.15-alt1 sisyphus.217364.100 1544022423 installed
<13>Feb 18 09:07:32 rpmi: rpm-macros-cmake-3.13.4-alt1 sisyphus+220827.100.1.2 1549497636 installed
<13>Feb 18 09:07:32 rpmi: cmake-modules-3.13.4-alt1 sisyphus+220827.100.1.2 1549497610 installed
<13>Feb 18 09:07:32 rpmi: libuv-1.23.2-alt1 sisyphus.217108.100 1543612230 installed
<13>Feb 18 09:07:32 rpmi: librhash-1.3.5-alt2 1505156279 installed
<13>Feb 18 09:07:32 rpmi: libjsoncpp19-1.8.4-alt2.S1 1518769525 installed
<13>Feb 18 09:07:32 rpmi: publicsuffix-list-dafsa-20181106-alt1 sisyphus.216228.100 1541611754 installed
<13>Feb 18 09:07:32 rpmi: libpsl-0.20.2-alt2 sisyphus.216228.200 1541611889 installed
<13>Feb 18 09:07:32 rpmi: libnghttp2-1.34.0-alt1 sisyphus.214524.100 1539249634 installed
<13>Feb 18 09:07:32 rpmi: libbrotlicommon-1.0.7-alt1 sisyphus.215491.100 1540428597 installed
<13>Feb 18 09:07:32 rpmi: libbrotlidec-1.0.7-alt1 sisyphus.215491.100 1540428597 installed
<13>Feb 18 09:07:33 rpmi: llvm7.0-libs-7.0.1-alt3.rel sisyphus+219771.100.1.2 1548121134 installed
<13>Feb 18 09:07:34 rpmi: clang7.0-libs-7.0.1-alt3.rel sisyphus+219771.100.1.2 1548121134 installed
<13>Feb 18 09:07:34 rpmi: libverto-0.3.0-alt1_5 1525957714 installed
<13>Feb 18 09:07:34 rpmi: libkeyutils-1.6-alt2 sisyphus.217337.100 1544003161 installed
<13>Feb 18 09:07:34 rpmi: libcom_err-1.44.5-alt1 sisyphus.218838.100 1546206118 installed
<86>Feb 18 09:07:34 groupadd[122270]: group added to /etc/group: name=_keytab, GID=498
<86>Feb 18 09:07:34 groupadd[122270]: group added to /etc/gshadow: name=_keytab
<86>Feb 18 09:07:34 groupadd[122270]: new group: name=_keytab, GID=498
<13>Feb 18 09:07:34 rpmi: libkrb5-1.16.3-alt1 sisyphus.219042.100 1547045815 installed
<13>Feb 18 09:07:34 rpmi: libcups-2.2.6-alt1 1510070343 installed
<13>Feb 18 09:07:34 rpmi: libqt5-printsupport-5.11.3-alt2 sisyphus+221574.100.1.2 1550273545 installed
<13>Feb 18 09:07:34 rpmi: libqt5-webkitwidgets-5.212.0-alt10 sisyphus.217836.1340 1545135211 installed
<13>Feb 18 09:07:34 rpmi: libtirpc-1.0.3-alt1 1532008017 installed
<13>Feb 18 09:07:34 rpmi: libnsl2-1.1.0-alt1_1 1511548749 installed
<13>Feb 18 09:07:34 rpmi: python-modules-encodings-2.7.15-alt1 sisyphus.217364.100 1544022423 installed
<13>Feb 18 09:07:34 rpmi: python-modules-compiler-2.7.15-alt1 sisyphus.217364.100 1544022423 installed
<13>Feb 18 09:07:34 rpmi: python-modules-email-2.7.15-alt1 sisyphus.217364.100 1544022423 installed
<13>Feb 18 09:07:34 rpmi: python-modules-unittest-2.7.15-alt1 sisyphus.217364.100 1544022423 installed
<13>Feb 18 09:07:34 rpmi: python-modules-nis-2.7.15-alt1 sisyphus.217364.100 1544022423 installed
<13>Feb 18 09:07:34 rpmi: python-modules-2.7.15-alt1 sisyphus.217364.100 1544022423 installed
<13>Feb 18 09:07:34 rpmi: python-modules-xml-2.7.15-alt1 sisyphus.217364.100 1544022423 installed
<13>Feb 18 09:07:38 rpmi: clang7.0-7.0.1-alt3.rel sisyphus+219771.100.1.2 1548121134 installed
<13>Feb 18 09:07:38 rpmi: python-modules-ctypes-2.7.15-alt1 sisyphus.217364.100 1544022423 installed
<13>Feb 18 09:07:38 rpmi: python-modules-multiprocessing-2.7.15-alt1 sisyphus.217364.100 1544022423 installed
<13>Feb 18 09:07:38 rpmi: python-modules-logging-2.7.15-alt1 sisyphus.217364.100 1544022423 installed
<13>Feb 18 09:07:38 rpmi: python-module-clang-5.0-alt1 1521632966 installed
<13>Feb 18 09:07:38 rpmi: clang7.0-devel-7.0.1-alt3.rel sisyphus+219771.100.1.2 1548121134 installed
<13>Feb 18 09:07:38 rpmi: python-modules-hotshot-2.7.15-alt1 sisyphus.217364.100 1544022423 installed
<13>Feb 18 09:07:38 rpmi: python-modules-bsddb-2.7.15-alt1 sisyphus.217364.100 1544022423 installed
<13>Feb 18 09:07:38 rpmi: python-2.7.15-alt1 sisyphus.217364.100 1544022423 installed
<13>Feb 18 09:07:38 rpmi: python-strict-2.7.15-alt1 sisyphus.217364.100 1544022396 installed
<13>Feb 18 09:07:38 rpmi: python-module-sip-4.19.13-alt1 sisyphus+220458.100.5.2 1549537022 installed
<13>Feb 18 09:07:38 rpmi: python-module-PyQt5-sip-4.19.13-alt1 sisyphus+220458.100.5.2 1549537022 installed
<13>Feb 18 09:07:38 rpmi: python-modules-distutils-2.7.15-alt1 sisyphus.217364.100 1544022423 installed
<13>Feb 18 09:07:38 rpmi: python-modules-json-2.7.15-alt1 sisyphus.217364.100 1544022423 installed
<13>Feb 18 09:07:39 rpmi: qt5-base-devel-5.11.3-alt2 sisyphus+221574.100.1.2 1550273545 installed
<86>Feb 18 09:07:39 groupadd[2192]: group added to /etc/group: name=sasl, GID=497
<86>Feb 18 09:07:39 groupadd[2192]: group added to /etc/gshadow: name=sasl
<86>Feb 18 09:07:39 groupadd[2192]: new group: name=sasl, GID=497
<13>Feb 18 09:07:39 rpmi: libsasl2-3-2.1.27-alt1 sisyphus.218476.200 1545647755 installed
<13>Feb 18 09:07:39 rpmi: libldap-2.4.46-alt1.1 sisyphus+219907.4400.1.1 1548349979 installed
<13>Feb 18 09:07:39 rpmi: libcurl-7.64.0-alt1 sisyphus+220787.100.1.1 1549439379 installed
<13>Feb 18 09:07:39 rpmi: cmake-3.13.4-alt1 sisyphus+220827.100.1.2 1549497636 installed
<13>Feb 18 09:07:39 rpmi: libraptor2-2.0.15-alt1 1417013332 installed
<13>Feb 18 09:07:39 rpmi: liblrdf-0.6.1-alt1 1493047570 installed
<13>Feb 18 09:07:39 rpmi: libneon-0.30.2-alt1 sisyphus.212930.100 1536828931 installed
<13>Feb 18 09:07:39 rpmi: libmetis-5.1.0-alt1.1 1465299656 installed
<13>Feb 18 09:07:39 rpmi: libxblas-1.0.248-alt1.1 1496143682 installed
<13>Feb 18 09:07:39 rpmi: libquadmath0-8.2.1-alt5 sisyphus+219286.200.2.1 1549854113 installed
<13>Feb 18 09:07:39 rpmi: libgfortran5-8.2.1-alt5 sisyphus+219286.200.2.1 1549854113 installed
<13>Feb 18 09:07:39 rpmi: liblapack-1:3.8.0-alt3 sisyphus+221521.100.1.1 1550134903 installed
<13>Feb 18 09:07:39 rpmi: libsuitesparse-5.1.2-alt2 sisyphus.217149.100 1543595939 installed
<13>Feb 18 09:07:40 rpmi: ceres-solver-1.13.0-alt1_8 sisyphus.217991.100 1545069210 installed
<13>Feb 18 09:07:40 rpmi: libatk-locales-2.30.0-alt1 sisyphus.212779.100 1536768328 installed
<13>Feb 18 09:07:40 rpmi: libatk-2.30.0-alt1 sisyphus.212779.100 1536768334 installed
<13>Feb 18 09:07:40 rpmi: shared-mime-info-1.12-alt1 sisyphus+219597.100.2.2 1548057005 installed
<13>Feb 18 09:07:40 rpmi: gsettings-desktop-schemas-data-3.28.1-alt1 sisyphus.212587.100 1536082062 installed
<13>Feb 18 09:07:40 rpmi: libgio-2.58.3-alt1 sisyphus+219722.100.1.1 1548088777 installed
<13>Feb 18 09:07:40 rpmi: gsettings-desktop-schemas-3.28.1-alt1 sisyphus.212587.100 1536082066 installed
<13>Feb 18 09:07:40 rpmi: libgstreamer1.0-1.14.4-alt1 sisyphus.214120.2200 1538778557 installed
<13>Feb 18 09:07:40 rpmi: libgst-plugins1.0-1.14.4-alt3 sisyphus.216849.100 1543144442 installed
<13>Feb 18 09:07:40 rpmi: libgdk-pixbuf-2.38.0-alt4 sisyphus.219229.400 1547220208 installed
<13>Feb 18 09:07:40 rpmi: gstreamer1.0-1.14.4-alt1 sisyphus.214120.2200 1538778557 installed
<13>Feb 18 09:07:40 rpmi: librsvg-1:2.44.13-alt1 sisyphus+221672.100.1.1 1550309867 installed
<13>Feb 18 09:07:41 rpmi: libavcodec58-2:4.1-alt1 sisyphus.216261.100 1541676633 installed
<13>Feb 18 09:07:41 rpmi: libavformat58-2:4.1-alt1 sisyphus.216261.100 1541676633 installed
<13>Feb 18 09:07:44 rpmi: libqt5-webenginecore-5.11.3-alt2 sisyphus+221310.200.3.1 1550062879 installed
<13>Feb 18 09:07:44 rpmi: libgusb-0.3.0-alt1 1518891735 installed
<13>Feb 18 09:07:44 rpmi: libcolord-1.4.3-alt1 1524052018 installed
<13>Feb 18 09:07:44 rpmi: gobject-introspection-1.58.3-alt1 sisyphus.218857.100 1546259916 installed
<13>Feb 18 09:07:44 rpmi: libgstreamer1.0-gir-1.14.4-alt1 sisyphus.214120.2200 1538778557 installed
<13>Feb 18 09:07:44 rpmi: libgst-plugins1.0-gir-1.14.4-alt3 sisyphus.216849.100 1543144442 installed
<13>Feb 18 09:07:44 rpmi: libqt5-webengine-5.11.3-alt2 sisyphus+221310.200.3.1 1550062879 installed
<13>Feb 18 09:07:44 rpmi: libqt5-webenginewidgets-5.11.3-alt2 sisyphus+221310.200.3.1 1550062879 installed
<13>Feb 18 09:07:44 rpmi: gst-plugins-base1.0-1.14.4-alt3 sisyphus.216849.100 1543144442 installed
<13>Feb 18 09:07:44 rpmi: gst-plugins-ugly1.0-1.14.4-alt1 sisyphus.214120.2600 1538779890 installed
<13>Feb 18 09:07:44 rpmi: gtk-update-icon-cache-3.24.5-alt1 sisyphus+220558.100.1.1 1549311199 installed
<13>Feb 18 09:07:45 rpmi: gst-libav-1.14.4-alt2 sisyphus.218252.100 1545339228 installed
<13>Feb 18 09:07:45 rpmi: glib-networking-2.58.0-alt1 sisyphus.212651.1500 1536648953 installed
<13>Feb 18 09:07:45 rpmi: libsoup-2.64.2-alt1 sisyphus.215425.140 1540400356 installed
<13>Feb 18 09:07:45 rpmi: libgssdp-1.0.3-alt1 sisyphus+219951.100.1.1 1548401423 installed
<13>Feb 18 09:07:45 rpmi: libgupnp-1.0.3-alt1 1533039280 installed
<13>Feb 18 09:07:45 rpmi: libgupnp-igd-0.2.5-alt2 sisyphus.219028.100 1546851305 installed
<13>Feb 18 09:07:45 rpmi: libnice-0.1.15-alt1 sisyphus+219789.200.2.1 1548152890 installed
<13>Feb 18 09:07:45 rpmi: libsoup-gnome-2.64.2-alt1 sisyphus.215425.140 1540400356 installed
<13>Feb 18 09:07:45 rpmi: librest-0.8.1-alt1 1508266400 installed
<13>Feb 18 09:07:45 rpmi: at-spi2-core-2.30.0-alt1 sisyphus.212651.600 1536647587 installed
<13>Feb 18 09:07:45 rpmi: at-spi2-atk-2.30.0-alt2 sisyphus.213822.100 1538377854 installed
<13>Feb 18 09:07:45 rpmi: libdconf-0.30.1-alt1 sisyphus.215477.100 1540419162 installed
<13>Feb 18 09:07:45 rpmi: dconf-0.30.1-alt1 sisyphus.215477.100 1540419162 installed
<13>Feb 18 09:07:45 rpmi: libgtk+3-schemas-3.24.5-alt1 sisyphus+220558.100.1.1 1549311168 installed
<13>Feb 18 09:07:45 rpmi: libpolkit-0.115-alt5 sisyphus.219065.100 1547027030 installed
<86>Feb 18 09:07:45 groupadd[15894]: group added to /etc/group: name=colord, GID=496
<86>Feb 18 09:07:45 groupadd[15894]: group added to /etc/gshadow: name=colord
<86>Feb 18 09:07:45 groupadd[15894]: new group: name=colord, GID=496
<86>Feb 18 09:07:45 useradd[15974]: new user: name=colord, UID=498, GID=496, home=/var/colord, shell=/dev/null
<13>Feb 18 09:07:45 rpmi: colord-1.4.3-alt1 1524052018 installed
<13>Feb 18 09:07:45 rpmi: libjson-glib-1.4.4-alt1 sisyphus.213175.100 1537249589 installed
<13>Feb 18 09:07:46 rpmi: libgtk+3-3.24.5-alt1 sisyphus+220558.100.1.1 1549311199 installed
<13>Feb 18 09:07:46 rpmi: gst-plugins-good1.0-1.14.4-alt1 sisyphus.214120.2400 1538779173 installed
<13>Feb 18 09:07:47 rpmi: libopencv3.4-1:3.4.5-alt1 sisyphus+219877.200.2.1 1548321563 installed
<13>Feb 18 09:07:47 rpmi: gst-plugins-bad1.0-1.14.4-alt5 sisyphus+219952.100.1.1 1548405714 installed
<13>Feb 18 09:07:47 rpmi: libqt5-multimedia-5.11.3-alt1 sisyphus.217836.600 1545188305 installed
<13>Feb 18 09:07:48 rpmi: python-module-PyQt5-5.11.3-alt2 sisyphus+221310.300.3.1 1550065648 installed
<13>Feb 18 09:07:48 rpmi: extra-cmake-modules-5.55.0-alt1 sisyphus+221265.100.3.1 1549956261 installed
<13>Feb 18 09:07:48 rpmi: qt5-x11extras-devel-5.11.3-alt1 sisyphus.217836.1600 1545135961 installed
Building target platforms: i586
Building for target i586
Wrote: /usr/src/in/nosrpm/kf5-kidletime-5.55.0-alt1.nosrc.rpm
Installing kf5-kidletime-5.55.0-alt1.src.rpm
Building target platforms: i586
Building for target i586
Executing(%prep): /bin/sh -e /usr/src/tmp/rpm-tmp.13635
+ umask 022
+ /bin/mkdir -p /usr/src/RPM/BUILD
+ cd /usr/src/RPM/BUILD
+ cd /usr/src/RPM/BUILD
+ rm -rf kidletime-5.55.0
+ echo 'Source #0 (kidletime-5.55.0.tar):'
Source #0 (kidletime-5.55.0.tar):
+ /bin/tar -xf /usr/src/RPM/SOURCES/kidletime-5.55.0.tar
+ cd kidletime-5.55.0
+ /bin/chmod -c -Rf u+rwX,go-w .
+ exit 0
Executing(%build): /bin/sh -e /usr/src/tmp/rpm-tmp.13635
+ umask 022
+ /bin/mkdir -p /usr/src/RPM/BUILD
+ cd /usr/src/RPM/BUILD
+ cd kidletime-5.55.0
+ __kf5_build
+ mkdir -p BUILD
+ __kf5_cmake
+ export PATH=/usr/lib/kf5/bin:/usr/src/bin:/bin:/usr/bin:/usr/X11R6/bin:/usr/games
+ PATH=/usr/lib/kf5/bin:/usr/src/bin:/bin:/usr/bin:/usr/X11R6/bin:/usr/games
+ export QTDIR=/usr/share/qt5
+ QTDIR=/usr/share/qt5
+ export 'CFLAGS=-pipe -frecord-gcc-switches -Wall -g -O2 -march=i586 -mtune=generic'
+ CFLAGS='-pipe -frecord-gcc-switches -Wall -g -O2 -march=i586 -mtune=generic'
+ export 'CXXFLAGS=-pipe -frecord-gcc-switches -Wall -g -O2 -march=i586 -mtune=generic'
+ CXXFLAGS='-pipe -frecord-gcc-switches -Wall -g -O2 -march=i586 -mtune=generic'
+ pushd BUILD
~/RPM/BUILD/kidletime-5.55.0/BUILD ~/RPM/BUILD/kidletime-5.55.0
+ cmake .. -DCMAKE_USE_RELATIVE_PATHS:BOOL=ON -DCMAKE_VERBOSE_MAKEFILE:BOOL=ON -DCMAKE_SKIP_RPATH:BOOL=ON -DBUILD_TESTING:BOOL=FALSE -DKDE_INSTALL_USE_QT_SYS_PATHS:BOOL=ON -DCMAKE_BUILD_TYPE=Release '-DCMAKE_EXE_LINKER_FLAGS:STRING=-L/usr/lib -L/usr/lib/kf5/devel' '-DCMAKE_MODULE_LINKER_FLAGS:STRING=-L/usr/lib -L/usr/lib/kf5/devel' '-DCMAKE_SHARED_LINKER_FLAGS:STRING=-L/usr/lib -L/usr/lib/kf5/devel' '-DCMAKE_LIBRARY_PATH=/usr/lib/kf5/devel;/usr/lib;/lib' '-DCMAKE_INCLUDE_PATH=/usr/include/KF5;/usr/include' -DCMAKE_INSTALL_PREFIX=/usr -DCMAKE_PREFIX_PATH=/usr -DCMAKE_INSTALL_BINDIR=/usr/lib/kf5/bin -DCMAKE_INSTALL_FULL_BINDIR=/usr/lib/kf5/bin -DBIN_INSTALL_DIR:PATH=/usr/lib/kf5/bin -DCMAKE_INSTALL_SBINDIR=/usr/lib/kf5/sbin -DCMAKE_INSTALL_FULL_SBINDIR=/usr/lib/kf5/sbin -DSBIN_INSTALL_DIR:PATH=/usr/lib/kf5/sbin -DLIBEXEC_INSTALL_DIR:PATH=/usr/libexec -DINCLUDE_INSTALL_DIR:PATH=/usr/include -DCMAKE_INSTALL_INCLUDEDIR_KF5=/usr/include/KF5 -DDATA_INSTALL_DIR:PATH=/usr/share -DCONFIG_INSTALL_DIR:PATH=/etc/kf5/xdg -DSERVICES_INSTALL_DIR:PATH=/usr/share/kservices5 -DSERVICETYPES_INSTALL_DIR:PATH=/usr/share/kservicetypes5 -DKNOTIFYRC_INSTALL_DIR:PATH=/usr/share/knotifications5 -DKXMLGUI_INSTALL_DIR:PATH=/usr/share/kxmlgui5 -DLIB_INSTALL_DIR:PATH=/usr/lib -DLIB_DESTINATION=lib -DLIB_SUFFIX= -DSYSCONF_INSTALL_DIR:PATH=/etc -DAUTOSTART_INSTALL_DIR=/etc/kf5/xdg/autostart -DHTML_INSTALL_DIR=/usr/share/kf5/doc/HTML -DICON_INSTALL_DIR=/usr/share/kf5/icons -DXDG_MIME_INSTALL_DIR=/usr/share/mime/packages -DXDG_APPS_INSTALL_DIR=/usr/share/kf5/applications/kf5 -DECM_MKSPECS_INSTALL_DIR:PATH=/usr/lib/qt5/mkspecs/modules -DKCFG_INSTALL_DIR:PATH=/usr/share/kf5/config.kcfg -DPLUGIN_INSTALL_DIR:PATH=/usr/lib/qt5/plugins -DQT_PLUGIN_INSTALL_DIR:PATH=/usr/lib/qt5/plugins -DQML_INSTALL_DIR:PATH=/usr/lib/qt5/qml -DIMPORTS_INSTALL_DIR:PATH=/usr/lib/qt5/imports -DDBUS_INTERFACES_INSTALL_DIR=/usr/share/kf5/dbus-1/interfaces -DDBUS_SERVICES_INSTALL_DIR=/usr/share/kf5/dbus-1/services -DDBUS_SYSTEM_SERVICES_INSTALL_DIR=/lib/dbus-1/system-services
-- The C compiler identification is GNU 8.2.1
-- The CXX compiler identification is GNU 8.2.1
-- Check for working C compiler: /usr/bin/cc
-- Check for working C compiler: /usr/bin/cc -- works
-- Detecting C compiler ABI info
-- Detecting C compiler ABI info - done
-- Detecting C compile features
-- Detecting C compile features - done
-- Check for working CXX compiler: /usr/bin/c++
-- Check for working CXX compiler: /usr/bin/c++ -- works
-- Detecting CXX compiler ABI info
-- Detecting CXX compiler ABI info - done
-- Detecting CXX compile features
-- Detecting CXX compile features - done
--
CMake Deprecation Warning at /usr/share/ECM/kde-modules/KDEInstallDirs.cmake:345 (message):
BIN_INSTALL_DIR is deprecated, use KDE_INSTALL_BINDIR instead.
Call Stack (most recent call first):
/usr/share/ECM/kde-modules/KDEInstallDirs.cmake:433 (_define_relative)
CMakeLists.txt:29 (include)
CMake Deprecation Warning at /usr/share/ECM/kde-modules/KDEInstallDirs.cmake:345 (message):
SBIN_INSTALL_DIR is deprecated, use KDE_INSTALL_SBINDIR instead.
Call Stack (most recent call first):
/usr/share/ECM/kde-modules/KDEInstallDirs.cmake:436 (_define_relative)
CMakeLists.txt:29 (include)
CMake Deprecation Warning at /usr/share/ECM/kde-modules/KDEInstallDirs.cmake:345 (message):
LIB_INSTALL_DIR is deprecated, use KDE_INSTALL_LIBDIR instead.
Call Stack (most recent call first):
/usr/share/ECM/kde-modules/KDEInstallDirs.cmake:439 (_define_relative)
CMakeLists.txt:29 (include)
CMake Deprecation Warning at /usr/share/ECM/kde-modules/KDEInstallDirs.cmake:345 (message):
LIBEXEC_INSTALL_DIR is deprecated, use KDE_INSTALL_LIBEXECDIR instead.
Call Stack (most recent call first):
/usr/share/ECM/kde-modules/KDEInstallDirs.cmake:449 (_define_relative)
CMakeLists.txt:29 (include)
CMake Deprecation Warning at /usr/share/ECM/kde-modules/KDEInstallDirs.cmake:345 (message):
QT_PLUGIN_INSTALL_DIR is deprecated, use KDE_INSTALL_QTPLUGINDIR instead.
Call Stack (most recent call first):
/usr/share/ECM/kde-modules/KDEInstallDirs.cmake:400 (_define_relative)
/usr/share/ECM/kde-modules/KDEInstallDirs.cmake:477 (_define_absolute)
CMakeLists.txt:29 (include)
CMake Deprecation Warning at /usr/share/ECM/kde-modules/KDEInstallDirs.cmake:345 (message):
IMPORTS_INSTALL_DIR is deprecated, use KDE_INSTALL_QTQUICKIMPORTSDIR
instead.
Call Stack (most recent call first):
/usr/share/ECM/kde-modules/KDEInstallDirs.cmake:400 (_define_relative)
/usr/share/ECM/kde-modules/KDEInstallDirs.cmake:483 (_define_absolute)
CMakeLists.txt:29 (include)
CMake Deprecation Warning at /usr/share/ECM/kde-modules/KDEInstallDirs.cmake:345 (message):
QML_INSTALL_DIR is deprecated, use KDE_INSTALL_QMLDIR instead.
Call Stack (most recent call first):
/usr/share/ECM/kde-modules/KDEInstallDirs.cmake:400 (_define_relative)
/usr/share/ECM/kde-modules/KDEInstallDirs.cmake:489 (_define_absolute)
CMakeLists.txt:29 (include)
CMake Deprecation Warning at /usr/share/ECM/kde-modules/KDEInstallDirs.cmake:345 (message):
PLUGIN_INSTALL_DIR is deprecated, use KDE_INSTALL_PLUGINDIR instead.
Call Stack (most recent call first):
/usr/share/ECM/kde-modules/KDEInstallDirs.cmake:511 (_define_relative)
CMakeLists.txt:29 (include)
CMake Deprecation Warning at /usr/share/ECM/kde-modules/KDEInstallDirs.cmake:345 (message):
INCLUDE_INSTALL_DIR is deprecated, use KDE_INSTALL_INCLUDEDIR instead.
Call Stack (most recent call first):
/usr/share/ECM/kde-modules/KDEInstallDirs.cmake:400 (_define_relative)
/usr/share/ECM/kde-modules/KDEInstallDirs.cmake:515 (_define_absolute)
CMakeLists.txt:29 (include)
CMake Deprecation Warning at /usr/share/ECM/kde-modules/KDEInstallDirs.cmake:345 (message):
DATA_INSTALL_DIR is deprecated, use KDE_INSTALL_DATADIR instead.
Call Stack (most recent call first):
/usr/share/ECM/kde-modules/KDEInstallDirs.cmake:541 (_define_relative)
CMakeLists.txt:29 (include)
CMake Deprecation Warning at /usr/share/ECM/kde-modules/KDEInstallDirs.cmake:345 (message):
HTML_INSTALL_DIR is deprecated, use KDE_INSTALL_DOCBUNDLEDIR instead.
Call Stack (most recent call first):
/usr/share/ECM/kde-modules/KDEInstallDirs.cmake:562 (_define_relative)
CMakeLists.txt:29 (include)
CMake Deprecation Warning at /usr/share/ECM/kde-modules/KDEInstallDirs.cmake:345 (message):
KCFG_INSTALL_DIR is deprecated, use KDE_INSTALL_KCFGDIR instead.
Call Stack (most recent call first):
/usr/share/ECM/kde-modules/KDEInstallDirs.cmake:565 (_define_relative)
CMakeLists.txt:29 (include)
CMake Deprecation Warning at /usr/share/ECM/kde-modules/KDEInstallDirs.cmake:345 (message):
SERVICES_INSTALL_DIR is deprecated, use KDE_INSTALL_KSERVICES5DIR instead.
Call Stack (most recent call first):
/usr/share/ECM/kde-modules/KDEInstallDirs.cmake:571 (_define_relative)
CMakeLists.txt:29 (include)
CMake Deprecation Warning at /usr/share/ECM/kde-modules/KDEInstallDirs.cmake:345 (message):
SERVICETYPES_INSTALL_DIR is deprecated, use KDE_INSTALL_KSERVICETYPES5DIR
instead.
Call Stack (most recent call first):
/usr/share/ECM/kde-modules/KDEInstallDirs.cmake:574 (_define_relative)
CMakeLists.txt:29 (include)
CMake Deprecation Warning at /usr/share/ECM/kde-modules/KDEInstallDirs.cmake:345 (message):
KNOTIFYRC_INSTALL_DIR is deprecated, use KDE_INSTALL_KNOTIFY5RCDIR instead.
Call Stack (most recent call first):
/usr/share/ECM/kde-modules/KDEInstallDirs.cmake:577 (_define_relative)
CMakeLists.txt:29 (include)
CMake Deprecation Warning at /usr/share/ECM/kde-modules/KDEInstallDirs.cmake:345 (message):
KXMLGUI_INSTALL_DIR is deprecated, use KDE_INSTALL_KXMLGUI5DIR instead.
Call Stack (most recent call first):
/usr/share/ECM/kde-modules/KDEInstallDirs.cmake:580 (_define_relative)
CMakeLists.txt:29 (include)
CMake Deprecation Warning at /usr/share/ECM/kde-modules/KDEInstallDirs.cmake:345 (message):
ICON_INSTALL_DIR is deprecated, use KDE_INSTALL_ICONDIR instead.
Call Stack (most recent call first):
/usr/share/ECM/kde-modules/KDEInstallDirs.cmake:587 (_define_relative)
CMakeLists.txt:29 (include)
CMake Deprecation Warning at /usr/share/ECM/kde-modules/KDEInstallDirs.cmake:345 (message):
XDG_APPS_INSTALL_DIR is deprecated, use KDE_INSTALL_APPDIR instead.
Call Stack (most recent call first):
/usr/share/ECM/kde-modules/KDEInstallDirs.cmake:602 (_define_relative)
CMakeLists.txt:29 (include)
CMake Deprecation Warning at /usr/share/ECM/kde-modules/KDEInstallDirs.cmake:345 (message):
XDG_MIME_INSTALL_DIR is deprecated, use KDE_INSTALL_MIMEDIR instead.
Call Stack (most recent call first):
/usr/share/ECM/kde-modules/KDEInstallDirs.cmake:608 (_define_relative)
CMakeLists.txt:29 (include)
CMake Deprecation Warning at /usr/share/ECM/kde-modules/KDEInstallDirs.cmake:345 (message):
DBUS_INTERFACES_INSTALL_DIR is deprecated, use KDE_INSTALL_DBUSINTERFACEDIR
instead.
Call Stack (most recent call first):
/usr/share/ECM/kde-modules/KDEInstallDirs.cmake:622 (_define_relative)
CMakeLists.txt:29 (include)
CMake Deprecation Warning at /usr/share/ECM/kde-modules/KDEInstallDirs.cmake:345 (message):
DBUS_SERVICES_INSTALL_DIR is deprecated, use KDE_INSTALL_DBUSSERVICEDIR
instead.
Call Stack (most recent call first):
/usr/share/ECM/kde-modules/KDEInstallDirs.cmake:625 (_define_relative)
CMakeLists.txt:29 (include)
CMake Deprecation Warning at /usr/share/ECM/kde-modules/KDEInstallDirs.cmake:345 (message):
DBUS_SYSTEM_SERVICES_INSTALL_DIR is deprecated, use
KDE_INSTALL_DBUSSYSTEMSERVICEDIR instead.
Call Stack (most recent call first):
/usr/share/ECM/kde-modules/KDEInstallDirs.cmake:628 (_define_relative)
CMakeLists.txt:29 (include)
CMake Deprecation Warning at /usr/share/ECM/kde-modules/KDEInstallDirs.cmake:345 (message):
SYSCONF_INSTALL_DIR is deprecated, use KDE_INSTALL_SYSCONFDIR instead.
Call Stack (most recent call first):
/usr/share/ECM/kde-modules/KDEInstallDirs.cmake:400 (_define_relative)
/usr/share/ECM/kde-modules/KDEInstallDirs.cmake:641 (_define_absolute)
CMakeLists.txt:29 (include)
CMake Deprecation Warning at /usr/share/ECM/kde-modules/KDEInstallDirs.cmake:345 (message):
CONFIG_INSTALL_DIR is deprecated, use KDE_INSTALL_CONFDIR instead.
Call Stack (most recent call first):
/usr/share/ECM/kde-modules/KDEInstallDirs.cmake:644 (_define_relative)
CMakeLists.txt:29 (include)
CMake Deprecation Warning at /usr/share/ECM/kde-modules/KDEInstallDirs.cmake:345 (message):
AUTOSTART_INSTALL_DIR is deprecated, use KDE_INSTALL_AUTOSTARTDIR instead.
Call Stack (most recent call first):
/usr/share/ECM/kde-modules/KDEInstallDirs.cmake:647 (_define_relative)
CMakeLists.txt:29 (include)
-- Looking for __GLIBC__
-- Looking for __GLIBC__ - found
-- Performing Test _OFFT_IS_64BIT
-- Performing Test _OFFT_IS_64BIT - Failed
-- Performing Test HAVE_DATE_TIME
-- Performing Test HAVE_DATE_TIME - Success
-- Looking for XOpenDisplay in /usr/lib/libX11.so;/usr/lib/libXext.so
-- Looking for XOpenDisplay in /usr/lib/libX11.so;/usr/lib/libXext.so - found
-- Looking for gethostbyname
-- Looking for gethostbyname - found
-- Looking for connect
-- Looking for connect - found
-- Looking for remove
-- Looking for remove - found
-- Looking for shmat
-- Looking for shmat - found
-- Looking for IceConnectionNumber in ICE
-- Looking for IceConnectionNumber in ICE - found
-- Found X11: /usr/lib/libX11.so
-- Found PkgConfig: /usr/bin/pkg-config (found version "0.29.2")
-- Found XCB_XCB: /usr/lib/libxcb.so (found version "1.13.1")
-- Found XCB: /usr/lib/libxcb.so (found version "1.13.1") found components: XCB
-- Found XCB_SYNC: /usr/lib/libxcb-sync.so (found version "1.13.1")
-- Found XCB: /usr/lib/libxcb.so;/usr/lib/libxcb-sync.so (found version "1.13.1") found components: XCB SYNC
-- Found X11_XCB: /usr/lib/libX11-xcb.so (found version "1.6.7")
-- Performing Test COMPILER_HAS_HIDDEN_VISIBILITY
-- Performing Test COMPILER_HAS_HIDDEN_VISIBILITY - Success
-- Performing Test COMPILER_HAS_HIDDEN_INLINE_VISIBILITY
-- Performing Test COMPILER_HAS_HIDDEN_INLINE_VISIBILITY - Success
-- Performing Test COMPILER_HAS_DEPRECATED_ATTR
-- Performing Test COMPILER_HAS_DEPRECATED_ATTR - Success
-- The following features have been enabled:
* libXext, required for X-Sync based poller
* libX11-xcb, required for X-Sync based poller
* libxcb, required for X-Sync based poller
* libxcb-sync, required for X-Sync based poller
* X-Sync based poller, efficient operation of KIdleTime. STRONGLY RECOMMENDED (requires libXext, libX11-xcb, libxcb and libxcb-sync)
* X-Screensaver based poller, KIdleTime fallback mode (libXss)
-- The following OPTIONAL packages have been found:
* X11
* XCB, X protocol C-language Binding,
* PkgConfig
* X11_XCB, A compatibility library for code that translates Xlib API calls into XCB calls,
-- The following REQUIRED packages have been found:
* ECM (required version >= 5.55.0), Extra CMake Modules.,
* Qt5Gui (required version >= 5.11.3)
* Qt5Widgets
* Qt5X11Extras
* Qt5DBus
* Qt5 (required version >= 5.10.0)
-- The following features have been disabled:
* QCH, API documentation in QCH format (for e.g. Qt Assistant, Qt Creator & KDevelop)
-- Configuring done
-- Generating done
CMake Warning:
Manually-specified variables were not used by the project:
CMAKE_USE_RELATIVE_PATHS
LIB_DESTINATION
LIB_SUFFIX
-- Build files have been written to: /usr/src/RPM/BUILD/kidletime-5.55.0/BUILD
+ popd
~/RPM/BUILD/kidletime-5.55.0
+ __kf5_make
+ pushd BUILD
~/RPM/BUILD/kidletime-5.55.0/BUILD ~/RPM/BUILD/kidletime-5.55.0
+ make -j8
make: Entering directory '/usr/src/RPM/BUILD/kidletime-5.55.0/BUILD'
/usr/bin/cmake -S/usr/src/RPM/BUILD/kidletime-5.55.0 -B/usr/src/RPM/BUILD/kidletime-5.55.0/BUILD --check-build-system CMakeFiles/Makefile.cmake 0
make: Leaving directory '/usr/src/RPM/BUILD/kidletime-5.55.0/BUILD'
make: Entering directory '/usr/src/RPM/BUILD/kidletime-5.55.0/BUILD'
/usr/bin/cmake -E cmake_progress_start /usr/src/RPM/BUILD/kidletime-5.55.0/BUILD/CMakeFiles /usr/src/RPM/BUILD/kidletime-5.55.0/BUILD/CMakeFiles/progress.marks
make: Leaving directory '/usr/src/RPM/BUILD/kidletime-5.55.0/BUILD'
make -f CMakeFiles/Makefile2 all
make -f src/CMakeFiles/KF5IdleTime_autogen.dir/build.make src/CMakeFiles/KF5IdleTime_autogen.dir/depend
make[2]: Entering directory '/usr/src/RPM/BUILD/kidletime-5.55.0/BUILD'
cd /usr/src/RPM/BUILD/kidletime-5.55.0/BUILD && /usr/bin/cmake -E cmake_depends "Unix Makefiles" /usr/src/RPM/BUILD/kidletime-5.55.0 /usr/src/RPM/BUILD/kidletime-5.55.0/src /usr/src/RPM/BUILD/kidletime-5.55.0/BUILD /usr/src/RPM/BUILD/kidletime-5.55.0/BUILD/src /usr/src/RPM/BUILD/kidletime-5.55.0/BUILD/src/CMakeFiles/KF5IdleTime_autogen.dir/DependInfo.cmake --color=
Scanning dependencies of target KF5IdleTime_autogen
make[2]: Leaving directory '/usr/src/RPM/BUILD/kidletime-5.55.0/BUILD'
make -f src/CMakeFiles/KF5IdleTime_autogen.dir/build.make src/CMakeFiles/KF5IdleTime_autogen.dir/build
make[2]: Entering directory '/usr/src/RPM/BUILD/kidletime-5.55.0/BUILD'
[ 4%] Automatic MOC for target KF5IdleTime
cd /usr/src/RPM/BUILD/kidletime-5.55.0/BUILD/src && /usr/bin/cmake -E cmake_autogen /usr/src/RPM/BUILD/kidletime-5.55.0/BUILD/src/CMakeFiles/KF5IdleTime_autogen.dir/AutogenInfo.cmake Release
make[2]: Leaving directory '/usr/src/RPM/BUILD/kidletime-5.55.0/BUILD'
make[1]: Entering directory '/usr/src/RPM/BUILD/kidletime-5.55.0/BUILD'
[ 4%] Built target KF5IdleTime_autogen
make[1]: Leaving directory '/usr/src/RPM/BUILD/kidletime-5.55.0/BUILD'
make -f src/CMakeFiles/KF5IdleTime.dir/build.make src/CMakeFiles/KF5IdleTime.dir/depend
make[2]: Entering directory '/usr/src/RPM/BUILD/kidletime-5.55.0/BUILD'
cd /usr/src/RPM/BUILD/kidletime-5.55.0/BUILD && /usr/bin/cmake -E cmake_depends "Unix Makefiles" /usr/src/RPM/BUILD/kidletime-5.55.0 /usr/src/RPM/BUILD/kidletime-5.55.0/src /usr/src/RPM/BUILD/kidletime-5.55.0/BUILD /usr/src/RPM/BUILD/kidletime-5.55.0/BUILD/src /usr/src/RPM/BUILD/kidletime-5.55.0/BUILD/src/CMakeFiles/KF5IdleTime.dir/DependInfo.cmake --color=
Scanning dependencies of target KF5IdleTime
make[2]: Leaving directory '/usr/src/RPM/BUILD/kidletime-5.55.0/BUILD'
make -f src/CMakeFiles/KF5IdleTime.dir/build.make src/CMakeFiles/KF5IdleTime.dir/build
make[2]: Entering directory '/usr/src/RPM/BUILD/kidletime-5.55.0/BUILD'
[ 12%] Building CXX object src/CMakeFiles/KF5IdleTime.dir/abstractsystempoller.cpp.o
cd /usr/src/RPM/BUILD/kidletime-5.55.0/BUILD/src && /usr/bin/c++ -DKF5IdleTime_EXPORTS -DQT_CORE_LIB -DQT_GUI_LIB -DQT_NO_CAST_FROM_ASCII -DQT_NO_CAST_FROM_BYTEARRAY -DQT_NO_CAST_TO_ASCII -DQT_NO_DEBUG -DQT_NO_NARROWING_CONVERSIONS_IN_CONNECT -DQT_NO_SIGNALS_SLOTS_KEYWORDS -DQT_NO_URL_CAST_FROM_STRING -DQT_USE_QSTRINGBUILDER -DQT_WIDGETS_LIB -D_FILE_OFFSET_BITS=64 -D_GNU_SOURCE -D_LARGEFILE64_SOURCE -I/usr/src/RPM/BUILD/kidletime-5.55.0/BUILD/src -I/usr/src/RPM/BUILD/kidletime-5.55.0/src -I/usr/src/RPM/BUILD/kidletime-5.55.0/BUILD/src/KF5IdleTime_autogen/include -isystem /usr/include/qt5 -isystem /usr/include/qt5/QtCore -isystem /usr/share/qt5/../../lib/qt5/mkspecs/linux-g++ -isystem /usr/include/qt5/QtWidgets -isystem /usr/include/qt5/QtGui -pipe -frecord-gcc-switches -Wall -g -O2 -march=i586 -mtune=generic -std=c++0x -fno-operator-names -fno-exceptions -Wall -Wextra -Wcast-align -Wchar-subscripts -Wformat-security -Wno-long-long -Wpointer-arith -Wundef -Wnon-virtual-dtor -Woverloaded-virtual -Werror=return-type -Wvla -Wdate-time -Wsuggest-override -Wlogical-op -pedantic -Wzero-as-null-pointer-constant -O2 -DNDEBUG -fPIC -fvisibility=hidden -fvisibility-inlines-hidden -fPIC -std=gnu++11 -o CMakeFiles/KF5IdleTime.dir/abstractsystempoller.cpp.o -c /usr/src/RPM/BUILD/kidletime-5.55.0/src/abstractsystempoller.cpp
make[2]: Leaving directory '/usr/src/RPM/BUILD/kidletime-5.55.0/BUILD'
make[2]: Entering directory '/usr/src/RPM/BUILD/kidletime-5.55.0/BUILD'
[ 24%] Building CXX object src/CMakeFiles/KF5IdleTime.dir/KF5IdleTime_autogen/mocs_compilation.cpp.o
cd /usr/src/RPM/BUILD/kidletime-5.55.0/BUILD/src && /usr/bin/c++ -DKF5IdleTime_EXPORTS -DQT_CORE_LIB -DQT_GUI_LIB -DQT_NO_CAST_FROM_ASCII -DQT_NO_CAST_FROM_BYTEARRAY -DQT_NO_CAST_TO_ASCII -DQT_NO_DEBUG -DQT_NO_NARROWING_CONVERSIONS_IN_CONNECT -DQT_NO_SIGNALS_SLOTS_KEYWORDS -DQT_NO_URL_CAST_FROM_STRING -DQT_USE_QSTRINGBUILDER -DQT_WIDGETS_LIB -D_FILE_OFFSET_BITS=64 -D_GNU_SOURCE -D_LARGEFILE64_SOURCE -I/usr/src/RPM/BUILD/kidletime-5.55.0/BUILD/src -I/usr/src/RPM/BUILD/kidletime-5.55.0/src -I/usr/src/RPM/BUILD/kidletime-5.55.0/BUILD/src/KF5IdleTime_autogen/include -isystem /usr/include/qt5 -isystem /usr/include/qt5/QtCore -isystem /usr/share/qt5/../../lib/qt5/mkspecs/linux-g++ -isystem /usr/include/qt5/QtWidgets -isystem /usr/include/qt5/QtGui -pipe -frecord-gcc-switches -Wall -g -O2 -march=i586 -mtune=generic -std=c++0x -fno-operator-names -fno-exceptions -Wall -Wextra -Wcast-align -Wchar-subscripts -Wformat-security -Wno-long-long -Wpointer-arith -Wundef -Wnon-virtual-dtor -Woverloaded-virtual -Werror=return-type -Wvla -Wdate-time -Wsuggest-override -Wlogical-op -pedantic -Wzero-as-null-pointer-constant -O2 -DNDEBUG -fPIC -fvisibility=hidden -fvisibility-inlines-hidden -fPIC -std=gnu++11 -o CMakeFiles/KF5IdleTime.dir/KF5IdleTime_autogen/mocs_compilation.cpp.o -c /usr/src/RPM/BUILD/kidletime-5.55.0/BUILD/src/KF5IdleTime_autogen/mocs_compilation.cpp
make[2]: Leaving directory '/usr/src/RPM/BUILD/kidletime-5.55.0/BUILD'
make[2]: Entering directory '/usr/src/RPM/BUILD/kidletime-5.55.0/BUILD'
[ 20%] Building CXX object src/CMakeFiles/KF5IdleTime.dir/logging.cpp.o
cd /usr/src/RPM/BUILD/kidletime-5.55.0/BUILD/src && /usr/bin/c++ -DKF5IdleTime_EXPORTS -DQT_CORE_LIB -DQT_GUI_LIB -DQT_NO_CAST_FROM_ASCII -DQT_NO_CAST_FROM_BYTEARRAY -DQT_NO_CAST_TO_ASCII -DQT_NO_DEBUG -DQT_NO_NARROWING_CONVERSIONS_IN_CONNECT -DQT_NO_SIGNALS_SLOTS_KEYWORDS -DQT_NO_URL_CAST_FROM_STRING -DQT_USE_QSTRINGBUILDER -DQT_WIDGETS_LIB -D_FILE_OFFSET_BITS=64 -D_GNU_SOURCE -D_LARGEFILE64_SOURCE -I/usr/src/RPM/BUILD/kidletime-5.55.0/BUILD/src -I/usr/src/RPM/BUILD/kidletime-5.55.0/src -I/usr/src/RPM/BUILD/kidletime-5.55.0/BUILD/src/KF5IdleTime_autogen/include -isystem /usr/include/qt5 -isystem /usr/include/qt5/QtCore -isystem /usr/share/qt5/../../lib/qt5/mkspecs/linux-g++ -isystem /usr/include/qt5/QtWidgets -isystem /usr/include/qt5/QtGui -pipe -frecord-gcc-switches -Wall -g -O2 -march=i586 -mtune=generic -std=c++0x -fno-operator-names -fno-exceptions -Wall -Wextra -Wcast-align -Wchar-subscripts -Wformat-security -Wno-long-long -Wpointer-arith -Wundef -Wnon-virtual-dtor -Woverloaded-virtual -Werror=return-type -Wvla -Wdate-time -Wsuggest-override -Wlogical-op -pedantic -Wzero-as-null-pointer-constant -O2 -DNDEBUG -fPIC -fvisibility=hidden -fvisibility-inlines-hidden -fPIC -std=gnu++11 -o CMakeFiles/KF5IdleTime.dir/logging.cpp.o -c /usr/src/RPM/BUILD/kidletime-5.55.0/BUILD/src/logging.cpp
make[2]: Leaving directory '/usr/src/RPM/BUILD/kidletime-5.55.0/BUILD'
make[2]: Entering directory '/usr/src/RPM/BUILD/kidletime-5.55.0/BUILD'
[ 16%] Building CXX object src/CMakeFiles/KF5IdleTime.dir/widgetbasedpoller.cpp.o
cd /usr/src/RPM/BUILD/kidletime-5.55.0/BUILD/src && /usr/bin/c++ -DKF5IdleTime_EXPORTS -DQT_CORE_LIB -DQT_GUI_LIB -DQT_NO_CAST_FROM_ASCII -DQT_NO_CAST_FROM_BYTEARRAY -DQT_NO_CAST_TO_ASCII -DQT_NO_DEBUG -DQT_NO_NARROWING_CONVERSIONS_IN_CONNECT -DQT_NO_SIGNALS_SLOTS_KEYWORDS -DQT_NO_URL_CAST_FROM_STRING -DQT_USE_QSTRINGBUILDER -DQT_WIDGETS_LIB -D_FILE_OFFSET_BITS=64 -D_GNU_SOURCE -D_LARGEFILE64_SOURCE -I/usr/src/RPM/BUILD/kidletime-5.55.0/BUILD/src -I/usr/src/RPM/BUILD/kidletime-5.55.0/src -I/usr/src/RPM/BUILD/kidletime-5.55.0/BUILD/src/KF5IdleTime_autogen/include -isystem /usr/include/qt5 -isystem /usr/include/qt5/QtCore -isystem /usr/share/qt5/../../lib/qt5/mkspecs/linux-g++ -isystem /usr/include/qt5/QtWidgets -isystem /usr/include/qt5/QtGui -pipe -frecord-gcc-switches -Wall -g -O2 -march=i586 -mtune=generic -std=c++0x -fno-operator-names -fno-exceptions -Wall -Wextra -Wcast-align -Wchar-subscripts -Wformat-security -Wno-long-long -Wpointer-arith -Wundef -Wnon-virtual-dtor -Woverloaded-virtual -Werror=return-type -Wvla -Wdate-time -Wsuggest-override -Wlogical-op -pedantic -Wzero-as-null-pointer-constant -O2 -DNDEBUG -fPIC -fvisibility=hidden -fvisibility-inlines-hidden -fPIC -std=gnu++11 -o CMakeFiles/KF5IdleTime.dir/widgetbasedpoller.cpp.o -c /usr/src/RPM/BUILD/kidletime-5.55.0/src/widgetbasedpoller.cpp
make[2]: Leaving directory '/usr/src/RPM/BUILD/kidletime-5.55.0/BUILD'
make[2]: Entering directory '/usr/src/RPM/BUILD/kidletime-5.55.0/BUILD'
[ 8%] Building CXX object src/CMakeFiles/KF5IdleTime.dir/kidletime.cpp.o
cd /usr/src/RPM/BUILD/kidletime-5.55.0/BUILD/src && /usr/bin/c++ -DKF5IdleTime_EXPORTS -DQT_CORE_LIB -DQT_GUI_LIB -DQT_NO_CAST_FROM_ASCII -DQT_NO_CAST_FROM_BYTEARRAY -DQT_NO_CAST_TO_ASCII -DQT_NO_DEBUG -DQT_NO_NARROWING_CONVERSIONS_IN_CONNECT -DQT_NO_SIGNALS_SLOTS_KEYWORDS -DQT_NO_URL_CAST_FROM_STRING -DQT_USE_QSTRINGBUILDER -DQT_WIDGETS_LIB -D_FILE_OFFSET_BITS=64 -D_GNU_SOURCE -D_LARGEFILE64_SOURCE -I/usr/src/RPM/BUILD/kidletime-5.55.0/BUILD/src -I/usr/src/RPM/BUILD/kidletime-5.55.0/src -I/usr/src/RPM/BUILD/kidletime-5.55.0/BUILD/src/KF5IdleTime_autogen/include -isystem /usr/include/qt5 -isystem /usr/include/qt5/QtCore -isystem /usr/share/qt5/../../lib/qt5/mkspecs/linux-g++ -isystem /usr/include/qt5/QtWidgets -isystem /usr/include/qt5/QtGui -pipe -frecord-gcc-switches -Wall -g -O2 -march=i586 -mtune=generic -std=c++0x -fno-operator-names -fno-exceptions -Wall -Wextra -Wcast-align -Wchar-subscripts -Wformat-security -Wno-long-long -Wpointer-arith -Wundef -Wnon-virtual-dtor -Woverloaded-virtual -Werror=return-type -Wvla -Wdate-time -Wsuggest-override -Wlogical-op -pedantic -Wzero-as-null-pointer-constant -O2 -DNDEBUG -fPIC -fvisibility=hidden -fvisibility-inlines-hidden -fPIC -std=gnu++11 -o CMakeFiles/KF5IdleTime.dir/kidletime.cpp.o -c /usr/src/RPM/BUILD/kidletime-5.55.0/src/kidletime.cpp
make[2]: Leaving directory '/usr/src/RPM/BUILD/kidletime-5.55.0/BUILD'
make[2]: Entering directory '/usr/src/RPM/BUILD/kidletime-5.55.0/BUILD'
[ 28%] Linking CXX shared library ../bin/libKF5IdleTime.so
cd /usr/src/RPM/BUILD/kidletime-5.55.0/BUILD/src && /usr/bin/cmake -E cmake_link_script CMakeFiles/KF5IdleTime.dir/link.txt --verbose=1
/usr/bin/c++ -fPIC -pipe -frecord-gcc-switches -Wall -g -O2 -march=i586 -mtune=generic -std=c++0x -fno-operator-names -fno-exceptions -Wall -Wextra -Wcast-align -Wchar-subscripts -Wformat-security -Wno-long-long -Wpointer-arith -Wundef -Wnon-virtual-dtor -Woverloaded-virtual -Werror=return-type -Wvla -Wdate-time -Wsuggest-override -Wlogical-op -pedantic -Wzero-as-null-pointer-constant -O2 -DNDEBUG -Wl,--no-undefined -Wl,--fatal-warnings -Wl,--enable-new-dtags -L/usr/lib -L/usr/lib/kf5/devel -shared -Wl,-soname,libKF5IdleTime.so.5 -o ../bin/libKF5IdleTime.so.5.55.0 CMakeFiles/KF5IdleTime.dir/kidletime.cpp.o CMakeFiles/KF5IdleTime.dir/abstractsystempoller.cpp.o CMakeFiles/KF5IdleTime.dir/widgetbasedpoller.cpp.o CMakeFiles/KF5IdleTime.dir/logging.cpp.o CMakeFiles/KF5IdleTime.dir/KF5IdleTime_autogen/mocs_compilation.cpp.o /usr/lib/libQt5Widgets.so.5.11.3 /usr/lib/libQt5Gui.so.5.11.3 /usr/lib/libQt5Core.so.5.11.3
cd /usr/src/RPM/BUILD/kidletime-5.55.0/BUILD/src && /usr/bin/cmake -E cmake_symlink_library ../bin/libKF5IdleTime.so.5.55.0 ../bin/libKF5IdleTime.so.5 ../bin/libKF5IdleTime.so
make[2]: Leaving directory '/usr/src/RPM/BUILD/kidletime-5.55.0/BUILD'
make[1]: Entering directory '/usr/src/RPM/BUILD/kidletime-5.55.0/BUILD'
[ 28%] Built target KF5IdleTime
make[1]: Leaving directory '/usr/src/RPM/BUILD/kidletime-5.55.0/BUILD'
make -f src/plugins/xscreensaver/CMakeFiles/KF5IdleTimeXcbPlugin1_autogen.dir/build.make src/plugins/xscreensaver/CMakeFiles/KF5IdleTimeXcbPlugin1_autogen.dir/depend
make -f src/plugins/xsync/CMakeFiles/KF5IdleTimeXcbPlugin0_autogen.dir/build.make src/plugins/xsync/CMakeFiles/KF5IdleTimeXcbPlugin0_autogen.dir/depend
make -f examples/CMakeFiles/kidletime_example_autogen.dir/build.make examples/CMakeFiles/kidletime_example_autogen.dir/depend
make[2]: Entering directory '/usr/src/RPM/BUILD/kidletime-5.55.0/BUILD'
cd /usr/src/RPM/BUILD/kidletime-5.55.0/BUILD && /usr/bin/cmake -E cmake_depends "Unix Makefiles" /usr/src/RPM/BUILD/kidletime-5.55.0 /usr/src/RPM/BUILD/kidletime-5.55.0/src/plugins/xscreensaver /usr/src/RPM/BUILD/kidletime-5.55.0/BUILD /usr/src/RPM/BUILD/kidletime-5.55.0/BUILD/src/plugins/xscreensaver /usr/src/RPM/BUILD/kidletime-5.55.0/BUILD/src/plugins/xscreensaver/CMakeFiles/KF5IdleTimeXcbPlugin1_autogen.dir/DependInfo.cmake --color=
Scanning dependencies of target KF5IdleTimeXcbPlugin1_autogen
make[2]: Leaving directory '/usr/src/RPM/BUILD/kidletime-5.55.0/BUILD'
make -f src/plugins/xscreensaver/CMakeFiles/KF5IdleTimeXcbPlugin1_autogen.dir/build.make src/plugins/xscreensaver/CMakeFiles/KF5IdleTimeXcbPlugin1_autogen.dir/build
make[2]: Entering directory '/usr/src/RPM/BUILD/kidletime-5.55.0/BUILD'
cd /usr/src/RPM/BUILD/kidletime-5.55.0/BUILD && /usr/bin/cmake -E cmake_depends "Unix Makefiles" /usr/src/RPM/BUILD/kidletime-5.55.0 /usr/src/RPM/BUILD/kidletime-5.55.0/examples /usr/src/RPM/BUILD/kidletime-5.55.0/BUILD /usr/src/RPM/BUILD/kidletime-5.55.0/BUILD/examples /usr/src/RPM/BUILD/kidletime-5.55.0/BUILD/examples/CMakeFiles/kidletime_example_autogen.dir/DependInfo.cmake --color=
Scanning dependencies of target kidletime_example_autogen
make[2]: Leaving directory '/usr/src/RPM/BUILD/kidletime-5.55.0/BUILD'
make -f examples/CMakeFiles/kidletime_example_autogen.dir/build.make examples/CMakeFiles/kidletime_example_autogen.dir/build
make[2]: Entering directory '/usr/src/RPM/BUILD/kidletime-5.55.0/BUILD'
cd /usr/src/RPM/BUILD/kidletime-5.55.0/BUILD && /usr/bin/cmake -E cmake_depends "Unix Makefiles" /usr/src/RPM/BUILD/kidletime-5.55.0 /usr/src/RPM/BUILD/kidletime-5.55.0/src/plugins/xsync /usr/src/RPM/BUILD/kidletime-5.55.0/BUILD /usr/src/RPM/BUILD/kidletime-5.55.0/BUILD/src/plugins/xsync /usr/src/RPM/BUILD/kidletime-5.55.0/BUILD/src/plugins/xsync/CMakeFiles/KF5IdleTimeXcbPlugin0_autogen.dir/DependInfo.cmake --color=
Scanning dependencies of target KF5IdleTimeXcbPlugin0_autogen
make[2]: Leaving directory '/usr/src/RPM/BUILD/kidletime-5.55.0/BUILD'
make -f src/plugins/xsync/CMakeFiles/KF5IdleTimeXcbPlugin0_autogen.dir/build.make src/plugins/xsync/CMakeFiles/KF5IdleTimeXcbPlugin0_autogen.dir/build
make[2]: Entering directory '/usr/src/RPM/BUILD/kidletime-5.55.0/BUILD'
[ 36%] Automatic MOC for target kidletime_example
cd /usr/src/RPM/BUILD/kidletime-5.55.0/BUILD/examples && /usr/bin/cmake -E cmake_autogen /usr/src/RPM/BUILD/kidletime-5.55.0/BUILD/examples/CMakeFiles/kidletime_example_autogen.dir/AutogenInfo.cmake Release
make[2]: Leaving directory '/usr/src/RPM/BUILD/kidletime-5.55.0/BUILD'
make[1]: Entering directory '/usr/src/RPM/BUILD/kidletime-5.55.0/BUILD'
[ 40%] Built target kidletime_example_autogen
make[1]: Leaving directory '/usr/src/RPM/BUILD/kidletime-5.55.0/BUILD'
make -f examples/CMakeFiles/kidletime_example.dir/build.make examples/CMakeFiles/kidletime_example.dir/depend
make[2]: Entering directory '/usr/src/RPM/BUILD/kidletime-5.55.0/BUILD'
cd /usr/src/RPM/BUILD/kidletime-5.55.0/BUILD && /usr/bin/cmake -E cmake_depends "Unix Makefiles" /usr/src/RPM/BUILD/kidletime-5.55.0 /usr/src/RPM/BUILD/kidletime-5.55.0/examples /usr/src/RPM/BUILD/kidletime-5.55.0/BUILD /usr/src/RPM/BUILD/kidletime-5.55.0/BUILD/examples /usr/src/RPM/BUILD/kidletime-5.55.0/BUILD/examples/CMakeFiles/kidletime_example.dir/DependInfo.cmake --color=
Scanning dependencies of target kidletime_example
make[2]: Leaving directory '/usr/src/RPM/BUILD/kidletime-5.55.0/BUILD'
make -f examples/CMakeFiles/kidletime_example.dir/build.make examples/CMakeFiles/kidletime_example.dir/build
make[2]: Entering directory '/usr/src/RPM/BUILD/kidletime-5.55.0/BUILD'
[ 32%] Automatic MOC for target KF5IdleTimeXcbPlugin1
cd /usr/src/RPM/BUILD/kidletime-5.55.0/BUILD/src/plugins/xscreensaver && /usr/bin/cmake -E cmake_autogen /usr/src/RPM/BUILD/kidletime-5.55.0/BUILD/src/plugins/xscreensaver/CMakeFiles/KF5IdleTimeXcbPlugin1_autogen.dir/AutogenInfo.cmake Release
make[2]: Leaving directory '/usr/src/RPM/BUILD/kidletime-5.55.0/BUILD'
make[1]: Entering directory '/usr/src/RPM/BUILD/kidletime-5.55.0/BUILD'
[ 52%] Built target KF5IdleTimeXcbPlugin1_autogen
make[1]: Leaving directory '/usr/src/RPM/BUILD/kidletime-5.55.0/BUILD'
make -f src/plugins/xscreensaver/CMakeFiles/KF5IdleTimeXcbPlugin1.dir/build.make src/plugins/xscreensaver/CMakeFiles/KF5IdleTimeXcbPlugin1.dir/depend
make[2]: Entering directory '/usr/src/RPM/BUILD/kidletime-5.55.0/BUILD'
[ 40%] Automatic MOC for target KF5IdleTimeXcbPlugin0
cd /usr/src/RPM/BUILD/kidletime-5.55.0/BUILD/src/plugins/xsync && /usr/bin/cmake -E cmake_autogen /usr/src/RPM/BUILD/kidletime-5.55.0/BUILD/src/plugins/xsync/CMakeFiles/KF5IdleTimeXcbPlugin0_autogen.dir/AutogenInfo.cmake Release
make[2]: Leaving directory '/usr/src/RPM/BUILD/kidletime-5.55.0/BUILD'
make[2]: Entering directory '/usr/src/RPM/BUILD/kidletime-5.55.0/BUILD'
[ 56%] Generating screensaver_interface.cpp, screensaver_interface.h
cd /usr/src/RPM/BUILD/kidletime-5.55.0/BUILD/src/plugins/xscreensaver && /usr/share/qt5/bin/qdbusxml2cpp -m -p screensaver_interface /usr/src/RPM/BUILD/kidletime-5.55.0/src/plugins/xscreensaver/org.freedesktop.ScreenSaver.xml
make[2]: Leaving directory '/usr/src/RPM/BUILD/kidletime-5.55.0/BUILD'
make[1]: Entering directory '/usr/src/RPM/BUILD/kidletime-5.55.0/BUILD'
[ 56%] Built target KF5IdleTimeXcbPlugin0_autogen
make[1]: Leaving directory '/usr/src/RPM/BUILD/kidletime-5.55.0/BUILD'
make -f src/plugins/xsync/CMakeFiles/KF5IdleTimeXcbPlugin0.dir/build.make src/plugins/xsync/CMakeFiles/KF5IdleTimeXcbPlugin0.dir/depend
make[2]: Entering directory '/usr/src/RPM/BUILD/kidletime-5.55.0/BUILD'
[ 60%] Generating screensaver_interface.moc
cd /usr/src/RPM/BUILD/kidletime-5.55.0/BUILD/src/plugins/xscreensaver && /usr/share/qt5/bin/moc @/usr/src/RPM/BUILD/kidletime-5.55.0/BUILD/src/plugins/xscreensaver/screensaver_interface.moc_parameters
make[2]: Leaving directory '/usr/src/RPM/BUILD/kidletime-5.55.0/BUILD'
make[2]: Entering directory '/usr/src/RPM/BUILD/kidletime-5.55.0/BUILD'
cd /usr/src/RPM/BUILD/kidletime-5.55.0/BUILD && /usr/bin/cmake -E cmake_depends "Unix Makefiles" /usr/src/RPM/BUILD/kidletime-5.55.0 /usr/src/RPM/BUILD/kidletime-5.55.0/src/plugins/xsync /usr/src/RPM/BUILD/kidletime-5.55.0/BUILD /usr/src/RPM/BUILD/kidletime-5.55.0/BUILD/src/plugins/xsync /usr/src/RPM/BUILD/kidletime-5.55.0/BUILD/src/plugins/xsync/CMakeFiles/KF5IdleTimeXcbPlugin0.dir/DependInfo.cmake --color=
Scanning dependencies of target KF5IdleTimeXcbPlugin0
make[2]: Leaving directory '/usr/src/RPM/BUILD/kidletime-5.55.0/BUILD'
make -f src/plugins/xsync/CMakeFiles/KF5IdleTimeXcbPlugin0.dir/build.make src/plugins/xsync/CMakeFiles/KF5IdleTimeXcbPlugin0.dir/build
make[2]: Entering directory '/usr/src/RPM/BUILD/kidletime-5.55.0/BUILD'
cd /usr/src/RPM/BUILD/kidletime-5.55.0/BUILD && /usr/bin/cmake -E cmake_depends "Unix Makefiles" /usr/src/RPM/BUILD/kidletime-5.55.0 /usr/src/RPM/BUILD/kidletime-5.55.0/src/plugins/xscreensaver /usr/src/RPM/BUILD/kidletime-5.55.0/BUILD /usr/src/RPM/BUILD/kidletime-5.55.0/BUILD/src/plugins/xscreensaver /usr/src/RPM/BUILD/kidletime-5.55.0/BUILD/src/plugins/xscreensaver/CMakeFiles/KF5IdleTimeXcbPlugin1.dir/DependInfo.cmake --color=
Scanning dependencies of target KF5IdleTimeXcbPlugin1
make[2]: Leaving directory '/usr/src/RPM/BUILD/kidletime-5.55.0/BUILD'
make -f src/plugins/xscreensaver/CMakeFiles/KF5IdleTimeXcbPlugin1.dir/build.make src/plugins/xscreensaver/CMakeFiles/KF5IdleTimeXcbPlugin1.dir/build
make[2]: Entering directory '/usr/src/RPM/BUILD/kidletime-5.55.0/BUILD'
[ 52%] Building CXX object examples/CMakeFiles/kidletime_example.dir/kidletime_example_autogen/mocs_compilation.cpp.o
cd /usr/src/RPM/BUILD/kidletime-5.55.0/BUILD/examples && /usr/bin/c++ -DQT_CORE_LIB -DQT_GUI_LIB -DQT_NO_CAST_FROM_ASCII -DQT_NO_CAST_FROM_BYTEARRAY -DQT_NO_CAST_TO_ASCII -DQT_NO_DEBUG -DQT_NO_NARROWING_CONVERSIONS_IN_CONNECT -DQT_NO_SIGNALS_SLOTS_KEYWORDS -DQT_NO_URL_CAST_FROM_STRING -DQT_USE_QSTRINGBUILDER -DQT_WIDGETS_LIB -D_FILE_OFFSET_BITS=64 -D_GNU_SOURCE -D_LARGEFILE64_SOURCE -I/usr/src/RPM/BUILD/kidletime-5.55.0/BUILD/examples -I/usr/src/RPM/BUILD/kidletime-5.55.0/examples -I/usr/src/RPM/BUILD/kidletime-5.55.0/BUILD/examples/kidletime_example_autogen/include -I/usr/src/RPM/BUILD/kidletime-5.55.0/BUILD/src -I/usr/src/RPM/BUILD/kidletime-5.55.0/src -isystem /usr/include/qt5 -isystem /usr/include/qt5/QtCore -isystem /usr/share/qt5/../../lib/qt5/mkspecs/linux-g++ -isystem /usr/include/qt5/QtWidgets -isystem /usr/include/qt5/QtGui -pipe -frecord-gcc-switches -Wall -g -O2 -march=i586 -mtune=generic -std=c++0x -fno-operator-names -fno-exceptions -Wall -Wextra -Wcast-align -Wchar-subscripts -Wformat-security -Wno-long-long -Wpointer-arith -Wundef -Wnon-virtual-dtor -Woverloaded-virtual -Werror=return-type -Wvla -Wdate-time -Wsuggest-override -Wlogical-op -pedantic -Wzero-as-null-pointer-constant -O2 -DNDEBUG -fvisibility=hidden -fvisibility-inlines-hidden -fPIC -std=gnu++11 -o CMakeFiles/kidletime_example.dir/kidletime_example_autogen/mocs_compilation.cpp.o -c /usr/src/RPM/BUILD/kidletime-5.55.0/BUILD/examples/kidletime_example_autogen/mocs_compilation.cpp
make[2]: Leaving directory '/usr/src/RPM/BUILD/kidletime-5.55.0/BUILD'
make[2]: Entering directory '/usr/src/RPM/BUILD/kidletime-5.55.0/BUILD'
[ 48%] Building CXX object examples/CMakeFiles/kidletime_example.dir/KIdleTest.cpp.o
cd /usr/src/RPM/BUILD/kidletime-5.55.0/BUILD/examples && /usr/bin/c++ -DQT_CORE_LIB -DQT_GUI_LIB -DQT_NO_CAST_FROM_ASCII -DQT_NO_CAST_FROM_BYTEARRAY -DQT_NO_CAST_TO_ASCII -DQT_NO_DEBUG -DQT_NO_NARROWING_CONVERSIONS_IN_CONNECT -DQT_NO_SIGNALS_SLOTS_KEYWORDS -DQT_NO_URL_CAST_FROM_STRING -DQT_USE_QSTRINGBUILDER -DQT_WIDGETS_LIB -D_FILE_OFFSET_BITS=64 -D_GNU_SOURCE -D_LARGEFILE64_SOURCE -I/usr/src/RPM/BUILD/kidletime-5.55.0/BUILD/examples -I/usr/src/RPM/BUILD/kidletime-5.55.0/examples -I/usr/src/RPM/BUILD/kidletime-5.55.0/BUILD/examples/kidletime_example_autogen/include -I/usr/src/RPM/BUILD/kidletime-5.55.0/BUILD/src -I/usr/src/RPM/BUILD/kidletime-5.55.0/src -isystem /usr/include/qt5 -isystem /usr/include/qt5/QtCore -isystem /usr/share/qt5/../../lib/qt5/mkspecs/linux-g++ -isystem /usr/include/qt5/QtWidgets -isystem /usr/include/qt5/QtGui -pipe -frecord-gcc-switches -Wall -g -O2 -march=i586 -mtune=generic -std=c++0x -fno-operator-names -fno-exceptions -Wall -Wextra -Wcast-align -Wchar-subscripts -Wformat-security -Wno-long-long -Wpointer-arith -Wundef -Wnon-virtual-dtor -Woverloaded-virtual -Werror=return-type -Wvla -Wdate-time -Wsuggest-override -Wlogical-op -pedantic -Wzero-as-null-pointer-constant -O2 -DNDEBUG -fvisibility=hidden -fvisibility-inlines-hidden -fPIC -std=gnu++11 -o CMakeFiles/kidletime_example.dir/KIdleTest.cpp.o -c /usr/src/RPM/BUILD/kidletime-5.55.0/examples/KIdleTest.cpp
make[2]: Leaving directory '/usr/src/RPM/BUILD/kidletime-5.55.0/BUILD'
make[2]: Entering directory '/usr/src/RPM/BUILD/kidletime-5.55.0/BUILD'
[ 44%] Building CXX object examples/CMakeFiles/kidletime_example.dir/main.cpp.o
cd /usr/src/RPM/BUILD/kidletime-5.55.0/BUILD/examples && /usr/bin/c++ -DQT_CORE_LIB -DQT_GUI_LIB -DQT_NO_CAST_FROM_ASCII -DQT_NO_CAST_FROM_BYTEARRAY -DQT_NO_CAST_TO_ASCII -DQT_NO_DEBUG -DQT_NO_NARROWING_CONVERSIONS_IN_CONNECT -DQT_NO_SIGNALS_SLOTS_KEYWORDS -DQT_NO_URL_CAST_FROM_STRING -DQT_USE_QSTRINGBUILDER -DQT_WIDGETS_LIB -D_FILE_OFFSET_BITS=64 -D_GNU_SOURCE -D_LARGEFILE64_SOURCE -I/usr/src/RPM/BUILD/kidletime-5.55.0/BUILD/examples -I/usr/src/RPM/BUILD/kidletime-5.55.0/examples -I/usr/src/RPM/BUILD/kidletime-5.55.0/BUILD/examples/kidletime_example_autogen/include -I/usr/src/RPM/BUILD/kidletime-5.55.0/BUILD/src -I/usr/src/RPM/BUILD/kidletime-5.55.0/src -isystem /usr/include/qt5 -isystem /usr/include/qt5/QtCore -isystem /usr/share/qt5/../../lib/qt5/mkspecs/linux-g++ -isystem /usr/include/qt5/QtWidgets -isystem /usr/include/qt5/QtGui -pipe -frecord-gcc-switches -Wall -g -O2 -march=i586 -mtune=generic -std=c++0x -fno-operator-names -fno-exceptions -Wall -Wextra -Wcast-align -Wchar-subscripts -Wformat-security -Wno-long-long -Wpointer-arith -Wundef -Wnon-virtual-dtor -Woverloaded-virtual -Werror=return-type -Wvla -Wdate-time -Wsuggest-override -Wlogical-op -pedantic -Wzero-as-null-pointer-constant -O2 -DNDEBUG -fvisibility=hidden -fvisibility-inlines-hidden -fPIC -std=gnu++11 -o CMakeFiles/kidletime_example.dir/main.cpp.o -c /usr/src/RPM/BUILD/kidletime-5.55.0/examples/main.cpp
make[2]: Leaving directory '/usr/src/RPM/BUILD/kidletime-5.55.0/BUILD'
make[2]: Entering directory '/usr/src/RPM/BUILD/kidletime-5.55.0/BUILD'
[ 64%] Building CXX object src/plugins/xsync/CMakeFiles/KF5IdleTimeXcbPlugin0.dir/__/__/logging.cpp.o
cd /usr/src/RPM/BUILD/kidletime-5.55.0/BUILD/src/plugins/xsync && /usr/bin/c++ -DKF5IdleTimeXcbPlugin0_EXPORTS -DQT_CORE_LIB -DQT_GUI_LIB -DQT_NO_CAST_FROM_ASCII -DQT_NO_CAST_FROM_BYTEARRAY -DQT_NO_CAST_TO_ASCII -DQT_NO_DEBUG -DQT_NO_NARROWING_CONVERSIONS_IN_CONNECT -DQT_NO_SIGNALS_SLOTS_KEYWORDS -DQT_NO_URL_CAST_FROM_STRING -DQT_USE_QSTRINGBUILDER -DQT_X11EXTRAS_LIB -D_FILE_OFFSET_BITS=64 -D_GNU_SOURCE -D_LARGEFILE64_SOURCE -I/usr/src/RPM/BUILD/kidletime-5.55.0/BUILD/src/plugins/xsync -I/usr/src/RPM/BUILD/kidletime-5.55.0/src/plugins/xsync -I/usr/src/RPM/BUILD/kidletime-5.55.0/BUILD/src/plugins/xsync/KF5IdleTimeXcbPlugin0_autogen/include -I/usr/src/RPM/BUILD/kidletime-5.55.0/BUILD/src -I/usr/src/RPM/BUILD/kidletime-5.55.0/src -isystem /usr/include/qt5 -isystem /usr/include/qt5/QtCore -isystem /usr/share/qt5/../../lib/qt5/mkspecs/linux-g++ -isystem /usr/include/qt5/QtX11Extras -isystem /usr/include/qt5/QtGui -pipe -frecord-gcc-switches -Wall -g -O2 -march=i586 -mtune=generic -std=c++0x -fno-operator-names -fno-exceptions -Wall -Wextra -Wcast-align -Wchar-subscripts -Wformat-security -Wno-long-long -Wpointer-arith -Wundef -Wnon-virtual-dtor -Woverloaded-virtual -Werror=return-type -Wvla -Wdate-time -Wsuggest-override -Wlogical-op -pedantic -Wzero-as-null-pointer-constant -O2 -DNDEBUG -fPIC -fvisibility=hidden -fvisibility-inlines-hidden -fPIC -std=gnu++11 -o CMakeFiles/KF5IdleTimeXcbPlugin0.dir/__/__/logging.cpp.o -c /usr/src/RPM/BUILD/kidletime-5.55.0/BUILD/src/logging.cpp
make[2]: Leaving directory '/usr/src/RPM/BUILD/kidletime-5.55.0/BUILD'
make[2]: Entering directory '/usr/src/RPM/BUILD/kidletime-5.55.0/BUILD'
[ 72%] Building CXX object src/plugins/xsync/CMakeFiles/KF5IdleTimeXcbPlugin0.dir/xsync_logging.cpp.o
cd /usr/src/RPM/BUILD/kidletime-5.55.0/BUILD/src/plugins/xsync && /usr/bin/c++ -DKF5IdleTimeXcbPlugin0_EXPORTS -DQT_CORE_LIB -DQT_GUI_LIB -DQT_NO_CAST_FROM_ASCII -DQT_NO_CAST_FROM_BYTEARRAY -DQT_NO_CAST_TO_ASCII -DQT_NO_DEBUG -DQT_NO_NARROWING_CONVERSIONS_IN_CONNECT -DQT_NO_SIGNALS_SLOTS_KEYWORDS -DQT_NO_URL_CAST_FROM_STRING -DQT_USE_QSTRINGBUILDER -DQT_X11EXTRAS_LIB -D_FILE_OFFSET_BITS=64 -D_GNU_SOURCE -D_LARGEFILE64_SOURCE -I/usr/src/RPM/BUILD/kidletime-5.55.0/BUILD/src/plugins/xsync -I/usr/src/RPM/BUILD/kidletime-5.55.0/src/plugins/xsync -I/usr/src/RPM/BUILD/kidletime-5.55.0/BUILD/src/plugins/xsync/KF5IdleTimeXcbPlugin0_autogen/include -I/usr/src/RPM/BUILD/kidletime-5.55.0/BUILD/src -I/usr/src/RPM/BUILD/kidletime-5.55.0/src -isystem /usr/include/qt5 -isystem /usr/include/qt5/QtCore -isystem /usr/share/qt5/../../lib/qt5/mkspecs/linux-g++ -isystem /usr/include/qt5/QtX11Extras -isystem /usr/include/qt5/QtGui -pipe -frecord-gcc-switches -Wall -g -O2 -march=i586 -mtune=generic -std=c++0x -fno-operator-names -fno-exceptions -Wall -Wextra -Wcast-align -Wchar-subscripts -Wformat-security -Wno-long-long -Wpointer-arith -Wundef -Wnon-virtual-dtor -Woverloaded-virtual -Werror=return-type -Wvla -Wdate-time -Wsuggest-override -Wlogical-op -pedantic -Wzero-as-null-pointer-constant -O2 -DNDEBUG -fPIC -fvisibility=hidden -fvisibility-inlines-hidden -fPIC -std=gnu++11 -o CMakeFiles/KF5IdleTimeXcbPlugin0.dir/xsync_logging.cpp.o -c /usr/src/RPM/BUILD/kidletime-5.55.0/BUILD/src/plugins/xsync/xsync_logging.cpp
make[2]: Leaving directory '/usr/src/RPM/BUILD/kidletime-5.55.0/BUILD'
make[2]: Entering directory '/usr/src/RPM/BUILD/kidletime-5.55.0/BUILD'
[ 68%] Building CXX object src/plugins/xsync/CMakeFiles/KF5IdleTimeXcbPlugin0.dir/xsyncbasedpoller.cpp.o
cd /usr/src/RPM/BUILD/kidletime-5.55.0/BUILD/src/plugins/xsync && /usr/bin/c++ -DKF5IdleTimeXcbPlugin0_EXPORTS -DQT_CORE_LIB -DQT_GUI_LIB -DQT_NO_CAST_FROM_ASCII -DQT_NO_CAST_FROM_BYTEARRAY -DQT_NO_CAST_TO_ASCII -DQT_NO_DEBUG -DQT_NO_NARROWING_CONVERSIONS_IN_CONNECT -DQT_NO_SIGNALS_SLOTS_KEYWORDS -DQT_NO_URL_CAST_FROM_STRING -DQT_USE_QSTRINGBUILDER -DQT_X11EXTRAS_LIB -D_FILE_OFFSET_BITS=64 -D_GNU_SOURCE -D_LARGEFILE64_SOURCE -I/usr/src/RPM/BUILD/kidletime-5.55.0/BUILD/src/plugins/xsync -I/usr/src/RPM/BUILD/kidletime-5.55.0/src/plugins/xsync -I/usr/src/RPM/BUILD/kidletime-5.55.0/BUILD/src/plugins/xsync/KF5IdleTimeXcbPlugin0_autogen/include -I/usr/src/RPM/BUILD/kidletime-5.55.0/BUILD/src -I/usr/src/RPM/BUILD/kidletime-5.55.0/src -isystem /usr/include/qt5 -isystem /usr/include/qt5/QtCore -isystem /usr/share/qt5/../../lib/qt5/mkspecs/linux-g++ -isystem /usr/include/qt5/QtX11Extras -isystem /usr/include/qt5/QtGui -pipe -frecord-gcc-switches -Wall -g -O2 -march=i586 -mtune=generic -std=c++0x -fno-operator-names -fno-exceptions -Wall -Wextra -Wcast-align -Wchar-subscripts -Wformat-security -Wno-long-long -Wpointer-arith -Wundef -Wnon-virtual-dtor -Woverloaded-virtual -Werror=return-type -Wvla -Wdate-time -Wsuggest-override -Wlogical-op -pedantic -Wzero-as-null-pointer-constant -O2 -DNDEBUG -fPIC -fvisibility=hidden -fvisibility-inlines-hidden -fPIC -std=gnu++11 -o CMakeFiles/KF5IdleTimeXcbPlugin0.dir/xsyncbasedpoller.cpp.o -c /usr/src/RPM/BUILD/kidletime-5.55.0/src/plugins/xsync/xsyncbasedpoller.cpp
make[2]: Leaving directory '/usr/src/RPM/BUILD/kidletime-5.55.0/BUILD'
make[2]: Entering directory '/usr/src/RPM/BUILD/kidletime-5.55.0/BUILD'
[ 92%] Linking CXX executable ../bin/kidletime_example
cd /usr/src/RPM/BUILD/kidletime-5.55.0/BUILD/examples && /usr/bin/cmake -E cmake_link_script CMakeFiles/kidletime_example.dir/link.txt --verbose=1
/usr/bin/c++ -pipe -frecord-gcc-switches -Wall -g -O2 -march=i586 -mtune=generic -std=c++0x -fno-operator-names -fno-exceptions -Wall -Wextra -Wcast-align -Wchar-subscripts -Wformat-security -Wno-long-long -Wpointer-arith -Wundef -Wnon-virtual-dtor -Woverloaded-virtual -Werror=return-type -Wvla -Wdate-time -Wsuggest-override -Wlogical-op -pedantic -Wzero-as-null-pointer-constant -O2 -DNDEBUG -Wl,--enable-new-dtags -L/usr/lib -L/usr/lib/kf5/devel CMakeFiles/kidletime_example.dir/main.cpp.o CMakeFiles/kidletime_example.dir/KIdleTest.cpp.o CMakeFiles/kidletime_example.dir/kidletime_example_autogen/mocs_compilation.cpp.o -o ../bin/kidletime_example ../bin/libKF5IdleTime.so.5.55.0 /usr/lib/libQt5Widgets.so.5.11.3 /usr/lib/libQt5Gui.so.5.11.3 /usr/lib/libQt5Core.so.5.11.3
make[2]: Leaving directory '/usr/src/RPM/BUILD/kidletime-5.55.0/BUILD'
make[1]: Entering directory '/usr/src/RPM/BUILD/kidletime-5.55.0/BUILD'
[ 92%] Built target kidletime_example
make[1]: Leaving directory '/usr/src/RPM/BUILD/kidletime-5.55.0/BUILD'
make[2]: Entering directory '/usr/src/RPM/BUILD/kidletime-5.55.0/BUILD'
[ 76%] Building CXX object src/plugins/xsync/CMakeFiles/KF5IdleTimeXcbPlugin0.dir/KF5IdleTimeXcbPlugin0_autogen/mocs_compilation.cpp.o
cd /usr/src/RPM/BUILD/kidletime-5.55.0/BUILD/src/plugins/xsync && /usr/bin/c++ -DKF5IdleTimeXcbPlugin0_EXPORTS -DQT_CORE_LIB -DQT_GUI_LIB -DQT_NO_CAST_FROM_ASCII -DQT_NO_CAST_FROM_BYTEARRAY -DQT_NO_CAST_TO_ASCII -DQT_NO_DEBUG -DQT_NO_NARROWING_CONVERSIONS_IN_CONNECT -DQT_NO_SIGNALS_SLOTS_KEYWORDS -DQT_NO_URL_CAST_FROM_STRING -DQT_USE_QSTRINGBUILDER -DQT_X11EXTRAS_LIB -D_FILE_OFFSET_BITS=64 -D_GNU_SOURCE -D_LARGEFILE64_SOURCE -I/usr/src/RPM/BUILD/kidletime-5.55.0/BUILD/src/plugins/xsync -I/usr/src/RPM/BUILD/kidletime-5.55.0/src/plugins/xsync -I/usr/src/RPM/BUILD/kidletime-5.55.0/BUILD/src/plugins/xsync/KF5IdleTimeXcbPlugin0_autogen/include -I/usr/src/RPM/BUILD/kidletime-5.55.0/BUILD/src -I/usr/src/RPM/BUILD/kidletime-5.55.0/src -isystem /usr/include/qt5 -isystem /usr/include/qt5/QtCore -isystem /usr/share/qt5/../../lib/qt5/mkspecs/linux-g++ -isystem /usr/include/qt5/QtX11Extras -isystem /usr/include/qt5/QtGui -pipe -frecord-gcc-switches -Wall -g -O2 -march=i586 -mtune=generic -std=c++0x -fno-operator-names -fno-exceptions -Wall -Wextra -Wcast-align -Wchar-subscripts -Wformat-security -Wno-long-long -Wpointer-arith -Wundef -Wnon-virtual-dtor -Woverloaded-virtual -Werror=return-type -Wvla -Wdate-time -Wsuggest-override -Wlogical-op -pedantic -Wzero-as-null-pointer-constant -O2 -DNDEBUG -fPIC -fvisibility=hidden -fvisibility-inlines-hidden -fPIC -std=gnu++11 -o CMakeFiles/KF5IdleTimeXcbPlugin0.dir/KF5IdleTimeXcbPlugin0_autogen/mocs_compilation.cpp.o -c /usr/src/RPM/BUILD/kidletime-5.55.0/BUILD/src/plugins/xsync/KF5IdleTimeXcbPlugin0_autogen/mocs_compilation.cpp
make[2]: Leaving directory '/usr/src/RPM/BUILD/kidletime-5.55.0/BUILD'
make[2]: Entering directory '/usr/src/RPM/BUILD/kidletime-5.55.0/BUILD'
[ 96%] Linking CXX shared module ../../../bin/KF5IdleTimeXcbPlugin0.so
cd /usr/src/RPM/BUILD/kidletime-5.55.0/BUILD/src/plugins/xsync && /usr/bin/cmake -E cmake_link_script CMakeFiles/KF5IdleTimeXcbPlugin0.dir/link.txt --verbose=1
/usr/bin/c++ -fPIC -pipe -frecord-gcc-switches -Wall -g -O2 -march=i586 -mtune=generic -std=c++0x -fno-operator-names -fno-exceptions -Wall -Wextra -Wcast-align -Wchar-subscripts -Wformat-security -Wno-long-long -Wpointer-arith -Wundef -Wnon-virtual-dtor -Woverloaded-virtual -Werror=return-type -Wvla -Wdate-time -Wsuggest-override -Wlogical-op -pedantic -Wzero-as-null-pointer-constant -O2 -DNDEBUG -Wl,--no-undefined -Wl,--fatal-warnings -Wl,--enable-new-dtags -L/usr/lib -L/usr/lib/kf5/devel -shared -o ../../../bin/KF5IdleTimeXcbPlugin0.so CMakeFiles/KF5IdleTimeXcbPlugin0.dir/xsyncbasedpoller.cpp.o CMakeFiles/KF5IdleTimeXcbPlugin0.dir/__/__/logging.cpp.o CMakeFiles/KF5IdleTimeXcbPlugin0.dir/xsync_logging.cpp.o CMakeFiles/KF5IdleTimeXcbPlugin0.dir/KF5IdleTimeXcbPlugin0_autogen/mocs_compilation.cpp.o ../../../bin/libKF5IdleTime.so.5.55.0 /usr/lib/libQt5X11Extras.so.5.11.3 /usr/lib/libxcb.so /usr/lib/libxcb-sync.so /usr/lib/libX11-xcb.so /usr/lib/libSM.so /usr/lib/libICE.so /usr/lib/libX11.so /usr/lib/libXext.so /usr/lib/libXext.so /usr/lib/libQt5Gui.so.5.11.3 /usr/lib/libQt5Core.so.5.11.3 /usr/lib/libxcb.so
make[2]: Leaving directory '/usr/src/RPM/BUILD/kidletime-5.55.0/BUILD'
make[1]: Entering directory '/usr/src/RPM/BUILD/kidletime-5.55.0/BUILD'
[ 96%] Built target KF5IdleTimeXcbPlugin0
make[1]: Leaving directory '/usr/src/RPM/BUILD/kidletime-5.55.0/BUILD'
make[2]: Entering directory '/usr/src/RPM/BUILD/kidletime-5.55.0/BUILD'
[ 80%] Building CXX object src/plugins/xscreensaver/CMakeFiles/KF5IdleTimeXcbPlugin1.dir/xscreensaverbasedpoller.cpp.o
cd /usr/src/RPM/BUILD/kidletime-5.55.0/BUILD/src/plugins/xscreensaver && /usr/bin/c++ -DKF5IdleTimeXcbPlugin1_EXPORTS -DQT_CORE_LIB -DQT_DBUS_LIB -DQT_GUI_LIB -DQT_NO_CAST_FROM_ASCII -DQT_NO_CAST_FROM_BYTEARRAY -DQT_NO_CAST_TO_ASCII -DQT_NO_DEBUG -DQT_NO_NARROWING_CONVERSIONS_IN_CONNECT -DQT_NO_SIGNALS_SLOTS_KEYWORDS -DQT_NO_URL_CAST_FROM_STRING -DQT_USE_QSTRINGBUILDER -DQT_X11EXTRAS_LIB -D_FILE_OFFSET_BITS=64 -D_GNU_SOURCE -D_LARGEFILE64_SOURCE -I/usr/src/RPM/BUILD/kidletime-5.55.0/BUILD/src/plugins/xscreensaver -I/usr/src/RPM/BUILD/kidletime-5.55.0/src/plugins/xscreensaver -I/usr/src/RPM/BUILD/kidletime-5.55.0/BUILD/src/plugins/xscreensaver/KF5IdleTimeXcbPlugin1_autogen/include -I/usr/src/RPM/BUILD/kidletime-5.55.0/BUILD/src -I/usr/src/RPM/BUILD/kidletime-5.55.0/src -isystem /usr/include/qt5 -isystem /usr/include/qt5/QtCore -isystem /usr/share/qt5/../../lib/qt5/mkspecs/linux-g++ -isystem /usr/include/qt5/QtDBus -isystem /usr/include/qt5/QtX11Extras -isystem /usr/include/qt5/QtGui -pipe -frecord-gcc-switches -Wall -g -O2 -march=i586 -mtune=generic -std=c++0x -fno-operator-names -fno-exceptions -Wall -Wextra -Wcast-align -Wchar-subscripts -Wformat-security -Wno-long-long -Wpointer-arith -Wundef -Wnon-virtual-dtor -Woverloaded-virtual -Werror=return-type -Wvla -Wdate-time -Wsuggest-override -Wlogical-op -pedantic -Wzero-as-null-pointer-constant -O2 -DNDEBUG -fPIC -fvisibility=hidden -fvisibility-inlines-hidden -fPIC -std=gnu++11 -o CMakeFiles/KF5IdleTimeXcbPlugin1.dir/xscreensaverbasedpoller.cpp.o -c /usr/src/RPM/BUILD/kidletime-5.55.0/src/plugins/xscreensaver/xscreensaverbasedpoller.cpp
make[2]: Leaving directory '/usr/src/RPM/BUILD/kidletime-5.55.0/BUILD'
make[2]: Entering directory '/usr/src/RPM/BUILD/kidletime-5.55.0/BUILD'
[ 88%] Building CXX object src/plugins/xscreensaver/CMakeFiles/KF5IdleTimeXcbPlugin1.dir/KF5IdleTimeXcbPlugin1_autogen/mocs_compilation.cpp.o
cd /usr/src/RPM/BUILD/kidletime-5.55.0/BUILD/src/plugins/xscreensaver && /usr/bin/c++ -DKF5IdleTimeXcbPlugin1_EXPORTS -DQT_CORE_LIB -DQT_DBUS_LIB -DQT_GUI_LIB -DQT_NO_CAST_FROM_ASCII -DQT_NO_CAST_FROM_BYTEARRAY -DQT_NO_CAST_TO_ASCII -DQT_NO_DEBUG -DQT_NO_NARROWING_CONVERSIONS_IN_CONNECT -DQT_NO_SIGNALS_SLOTS_KEYWORDS -DQT_NO_URL_CAST_FROM_STRING -DQT_USE_QSTRINGBUILDER -DQT_X11EXTRAS_LIB -D_FILE_OFFSET_BITS=64 -D_GNU_SOURCE -D_LARGEFILE64_SOURCE -I/usr/src/RPM/BUILD/kidletime-5.55.0/BUILD/src/plugins/xscreensaver -I/usr/src/RPM/BUILD/kidletime-5.55.0/src/plugins/xscreensaver -I/usr/src/RPM/BUILD/kidletime-5.55.0/BUILD/src/plugins/xscreensaver/KF5IdleTimeXcbPlugin1_autogen/include -I/usr/src/RPM/BUILD/kidletime-5.55.0/BUILD/src -I/usr/src/RPM/BUILD/kidletime-5.55.0/src -isystem /usr/include/qt5 -isystem /usr/include/qt5/QtCore -isystem /usr/share/qt5/../../lib/qt5/mkspecs/linux-g++ -isystem /usr/include/qt5/QtDBus -isystem /usr/include/qt5/QtX11Extras -isystem /usr/include/qt5/QtGui -pipe -frecord-gcc-switches -Wall -g -O2 -march=i586 -mtune=generic -std=c++0x -fno-operator-names -fno-exceptions -Wall -Wextra -Wcast-align -Wchar-subscripts -Wformat-security -Wno-long-long -Wpointer-arith -Wundef -Wnon-virtual-dtor -Woverloaded-virtual -Werror=return-type -Wvla -Wdate-time -Wsuggest-override -Wlogical-op -pedantic -Wzero-as-null-pointer-constant -O2 -DNDEBUG -fPIC -fvisibility=hidden -fvisibility-inlines-hidden -fPIC -std=gnu++11 -o CMakeFiles/KF5IdleTimeXcbPlugin1.dir/KF5IdleTimeXcbPlugin1_autogen/mocs_compilation.cpp.o -c /usr/src/RPM/BUILD/kidletime-5.55.0/BUILD/src/plugins/xscreensaver/KF5IdleTimeXcbPlugin1_autogen/mocs_compilation.cpp
make[2]: Leaving directory '/usr/src/RPM/BUILD/kidletime-5.55.0/BUILD'
make[2]: Entering directory '/usr/src/RPM/BUILD/kidletime-5.55.0/BUILD'
[ 84%] Building CXX object src/plugins/xscreensaver/CMakeFiles/KF5IdleTimeXcbPlugin1.dir/screensaver_interface.cpp.o
cd /usr/src/RPM/BUILD/kidletime-5.55.0/BUILD/src/plugins/xscreensaver && /usr/bin/c++ -DKF5IdleTimeXcbPlugin1_EXPORTS -DQT_CORE_LIB -DQT_DBUS_LIB -DQT_GUI_LIB -DQT_NO_CAST_FROM_ASCII -DQT_NO_CAST_FROM_BYTEARRAY -DQT_NO_CAST_TO_ASCII -DQT_NO_DEBUG -DQT_NO_NARROWING_CONVERSIONS_IN_CONNECT -DQT_NO_SIGNALS_SLOTS_KEYWORDS -DQT_NO_URL_CAST_FROM_STRING -DQT_USE_QSTRINGBUILDER -DQT_X11EXTRAS_LIB -D_FILE_OFFSET_BITS=64 -D_GNU_SOURCE -D_LARGEFILE64_SOURCE -I/usr/src/RPM/BUILD/kidletime-5.55.0/BUILD/src/plugins/xscreensaver -I/usr/src/RPM/BUILD/kidletime-5.55.0/src/plugins/xscreensaver -I/usr/src/RPM/BUILD/kidletime-5.55.0/BUILD/src/plugins/xscreensaver/KF5IdleTimeXcbPlugin1_autogen/include -I/usr/src/RPM/BUILD/kidletime-5.55.0/BUILD/src -I/usr/src/RPM/BUILD/kidletime-5.55.0/src -isystem /usr/include/qt5 -isystem /usr/include/qt5/QtCore -isystem /usr/share/qt5/../../lib/qt5/mkspecs/linux-g++ -isystem /usr/include/qt5/QtDBus -isystem /usr/include/qt5/QtX11Extras -isystem /usr/include/qt5/QtGui -pipe -frecord-gcc-switches -Wall -g -O2 -march=i586 -mtune=generic -std=c++0x -fno-operator-names -fno-exceptions -Wall -Wextra -Wcast-align -Wchar-subscripts -Wformat-security -Wno-long-long -Wpointer-arith -Wundef -Wnon-virtual-dtor -Woverloaded-virtual -Werror=return-type -Wvla -Wdate-time -Wsuggest-override -Wlogical-op -pedantic -Wzero-as-null-pointer-constant -O2 -DNDEBUG -fPIC -fvisibility=hidden -fvisibility-inlines-hidden -fPIC -std=gnu++11 -o CMakeFiles/KF5IdleTimeXcbPlugin1.dir/screensaver_interface.cpp.o -c /usr/src/RPM/BUILD/kidletime-5.55.0/BUILD/src/plugins/xscreensaver/screensaver_interface.cpp
make[2]: Leaving directory '/usr/src/RPM/BUILD/kidletime-5.55.0/BUILD'
make[2]: Entering directory '/usr/src/RPM/BUILD/kidletime-5.55.0/BUILD'
[100%] Linking CXX shared module ../../../bin/KF5IdleTimeXcbPlugin1.so
cd /usr/src/RPM/BUILD/kidletime-5.55.0/BUILD/src/plugins/xscreensaver && /usr/bin/cmake -E cmake_link_script CMakeFiles/KF5IdleTimeXcbPlugin1.dir/link.txt --verbose=1
/usr/bin/c++ -fPIC -pipe -frecord-gcc-switches -Wall -g -O2 -march=i586 -mtune=generic -std=c++0x -fno-operator-names -fno-exceptions -Wall -Wextra -Wcast-align -Wchar-subscripts -Wformat-security -Wno-long-long -Wpointer-arith -Wundef -Wnon-virtual-dtor -Woverloaded-virtual -Werror=return-type -Wvla -Wdate-time -Wsuggest-override -Wlogical-op -pedantic -Wzero-as-null-pointer-constant -O2 -DNDEBUG -Wl,--no-undefined -Wl,--fatal-warnings -Wl,--enable-new-dtags -L/usr/lib -L/usr/lib/kf5/devel -shared -o ../../../bin/KF5IdleTimeXcbPlugin1.so CMakeFiles/KF5IdleTimeXcbPlugin1.dir/xscreensaverbasedpoller.cpp.o CMakeFiles/KF5IdleTimeXcbPlugin1.dir/screensaver_interface.cpp.o CMakeFiles/KF5IdleTimeXcbPlugin1.dir/KF5IdleTimeXcbPlugin1_autogen/mocs_compilation.cpp.o ../../../bin/libKF5IdleTime.so.5.55.0 /usr/lib/libQt5DBus.so.5.11.3 /usr/lib/libQt5X11Extras.so.5.11.3 /usr/lib/libSM.so /usr/lib/libICE.so /usr/lib/libX11.so /usr/lib/libXext.so /usr/lib/libXss.so /usr/lib/libQt5Gui.so.5.11.3 /usr/lib/libQt5Core.so.5.11.3
make[2]: Leaving directory '/usr/src/RPM/BUILD/kidletime-5.55.0/BUILD'
make[1]: Entering directory '/usr/src/RPM/BUILD/kidletime-5.55.0/BUILD'
[100%] Built target KF5IdleTimeXcbPlugin1
make[1]: Leaving directory '/usr/src/RPM/BUILD/kidletime-5.55.0/BUILD'
make: Entering directory '/usr/src/RPM/BUILD/kidletime-5.55.0/BUILD'
/usr/bin/cmake -E cmake_progress_start /usr/src/RPM/BUILD/kidletime-5.55.0/BUILD/CMakeFiles 0
make: Leaving directory '/usr/src/RPM/BUILD/kidletime-5.55.0/BUILD'
+ popd
~/RPM/BUILD/kidletime-5.55.0
+ exit 0
Executing(%install): /bin/sh -e /usr/src/tmp/rpm-tmp.72866
+ umask 022
+ /bin/mkdir -p /usr/src/RPM/BUILD
+ cd /usr/src/RPM/BUILD
+ /bin/chmod -Rf u+rwX -- /usr/src/tmp/kf5-kidletime-buildroot
+ :
+ /bin/rm -rf -- /usr/src/tmp/kf5-kidletime-buildroot
+ cd kidletime-5.55.0
+ __kf5_install
+ make -C BUILD DESTDIR=/usr/src/tmp/kf5-kidletime-buildroot install
make: Entering directory '/usr/src/RPM/BUILD/kidletime-5.55.0/BUILD'
/usr/bin/cmake -S/usr/src/RPM/BUILD/kidletime-5.55.0 -B/usr/src/RPM/BUILD/kidletime-5.55.0/BUILD --check-build-system CMakeFiles/Makefile.cmake 0
/usr/bin/cmake -E cmake_progress_start /usr/src/RPM/BUILD/kidletime-5.55.0/BUILD/CMakeFiles /usr/src/RPM/BUILD/kidletime-5.55.0/BUILD/CMakeFiles/progress.marks
make -f CMakeFiles/Makefile2 all
make[1]: Entering directory '/usr/src/RPM/BUILD/kidletime-5.55.0/BUILD'
make -f src/CMakeFiles/KF5IdleTime_autogen.dir/build.make src/CMakeFiles/KF5IdleTime_autogen.dir/depend
make[2]: Entering directory '/usr/src/RPM/BUILD/kidletime-5.55.0/BUILD'
cd /usr/src/RPM/BUILD/kidletime-5.55.0/BUILD && /usr/bin/cmake -E cmake_depends "Unix Makefiles" /usr/src/RPM/BUILD/kidletime-5.55.0 /usr/src/RPM/BUILD/kidletime-5.55.0/src /usr/src/RPM/BUILD/kidletime-5.55.0/BUILD /usr/src/RPM/BUILD/kidletime-5.55.0/BUILD/src /usr/src/RPM/BUILD/kidletime-5.55.0/BUILD/src/CMakeFiles/KF5IdleTime_autogen.dir/DependInfo.cmake --color=
make[2]: Leaving directory '/usr/src/RPM/BUILD/kidletime-5.55.0/BUILD'
make -f src/CMakeFiles/KF5IdleTime_autogen.dir/build.make src/CMakeFiles/KF5IdleTime_autogen.dir/build
make[2]: Entering directory '/usr/src/RPM/BUILD/kidletime-5.55.0/BUILD'
[ 4%] Automatic MOC for target KF5IdleTime
cd /usr/src/RPM/BUILD/kidletime-5.55.0/BUILD/src && /usr/bin/cmake -E cmake_autogen /usr/src/RPM/BUILD/kidletime-5.55.0/BUILD/src/CMakeFiles/KF5IdleTime_autogen.dir/AutogenInfo.cmake Release
make[2]: Leaving directory '/usr/src/RPM/BUILD/kidletime-5.55.0/BUILD'
[ 4%] Built target KF5IdleTime_autogen
make -f src/CMakeFiles/KF5IdleTime.dir/build.make src/CMakeFiles/KF5IdleTime.dir/depend
make[2]: Entering directory '/usr/src/RPM/BUILD/kidletime-5.55.0/BUILD'
cd /usr/src/RPM/BUILD/kidletime-5.55.0/BUILD && /usr/bin/cmake -E cmake_depends "Unix Makefiles" /usr/src/RPM/BUILD/kidletime-5.55.0 /usr/src/RPM/BUILD/kidletime-5.55.0/src /usr/src/RPM/BUILD/kidletime-5.55.0/BUILD /usr/src/RPM/BUILD/kidletime-5.55.0/BUILD/src /usr/src/RPM/BUILD/kidletime-5.55.0/BUILD/src/CMakeFiles/KF5IdleTime.dir/DependInfo.cmake --color=
make[2]: Leaving directory '/usr/src/RPM/BUILD/kidletime-5.55.0/BUILD'
make -f src/CMakeFiles/KF5IdleTime.dir/build.make src/CMakeFiles/KF5IdleTime.dir/build
make[2]: Entering directory '/usr/src/RPM/BUILD/kidletime-5.55.0/BUILD'
make[2]: Nothing to be done for 'src/CMakeFiles/KF5IdleTime.dir/build'.
make[2]: Leaving directory '/usr/src/RPM/BUILD/kidletime-5.55.0/BUILD'
[ 28%] Built target KF5IdleTime
make -f src/plugins/xscreensaver/CMakeFiles/KF5IdleTimeXcbPlugin1_autogen.dir/build.make src/plugins/xscreensaver/CMakeFiles/KF5IdleTimeXcbPlugin1_autogen.dir/depend
make[2]: Entering directory '/usr/src/RPM/BUILD/kidletime-5.55.0/BUILD'
cd /usr/src/RPM/BUILD/kidletime-5.55.0/BUILD && /usr/bin/cmake -E cmake_depends "Unix Makefiles" /usr/src/RPM/BUILD/kidletime-5.55.0 /usr/src/RPM/BUILD/kidletime-5.55.0/src/plugins/xscreensaver /usr/src/RPM/BUILD/kidletime-5.55.0/BUILD /usr/src/RPM/BUILD/kidletime-5.55.0/BUILD/src/plugins/xscreensaver /usr/src/RPM/BUILD/kidletime-5.55.0/BUILD/src/plugins/xscreensaver/CMakeFiles/KF5IdleTimeXcbPlugin1_autogen.dir/DependInfo.cmake --color=
make[2]: Leaving directory '/usr/src/RPM/BUILD/kidletime-5.55.0/BUILD'
make -f src/plugins/xscreensaver/CMakeFiles/KF5IdleTimeXcbPlugin1_autogen.dir/build.make src/plugins/xscreensaver/CMakeFiles/KF5IdleTimeXcbPlugin1_autogen.dir/build
make[2]: Entering directory '/usr/src/RPM/BUILD/kidletime-5.55.0/BUILD'
[ 32%] Automatic MOC for target KF5IdleTimeXcbPlugin1
cd /usr/src/RPM/BUILD/kidletime-5.55.0/BUILD/src/plugins/xscreensaver && /usr/bin/cmake -E cmake_autogen /usr/src/RPM/BUILD/kidletime-5.55.0/BUILD/src/plugins/xscreensaver/CMakeFiles/KF5IdleTimeXcbPlugin1_autogen.dir/AutogenInfo.cmake Release
make[2]: Leaving directory '/usr/src/RPM/BUILD/kidletime-5.55.0/BUILD'
[ 32%] Built target KF5IdleTimeXcbPlugin1_autogen
make -f src/plugins/xscreensaver/CMakeFiles/KF5IdleTimeXcbPlugin1.dir/build.make src/plugins/xscreensaver/CMakeFiles/KF5IdleTimeXcbPlugin1.dir/depend
make[2]: Entering directory '/usr/src/RPM/BUILD/kidletime-5.55.0/BUILD'
cd /usr/src/RPM/BUILD/kidletime-5.55.0/BUILD && /usr/bin/cmake -E cmake_depends "Unix Makefiles" /usr/src/RPM/BUILD/kidletime-5.55.0 /usr/src/RPM/BUILD/kidletime-5.55.0/src/plugins/xscreensaver /usr/src/RPM/BUILD/kidletime-5.55.0/BUILD /usr/src/RPM/BUILD/kidletime-5.55.0/BUILD/src/plugins/xscreensaver /usr/src/RPM/BUILD/kidletime-5.55.0/BUILD/src/plugins/xscreensaver/CMakeFiles/KF5IdleTimeXcbPlugin1.dir/DependInfo.cmake --color=
make[2]: Leaving directory '/usr/src/RPM/BUILD/kidletime-5.55.0/BUILD'
make -f src/plugins/xscreensaver/CMakeFiles/KF5IdleTimeXcbPlugin1.dir/build.make src/plugins/xscreensaver/CMakeFiles/KF5IdleTimeXcbPlugin1.dir/build
make[2]: Entering directory '/usr/src/RPM/BUILD/kidletime-5.55.0/BUILD'
make[2]: Nothing to be done for 'src/plugins/xscreensaver/CMakeFiles/KF5IdleTimeXcbPlugin1.dir/build'.
make[2]: Leaving directory '/usr/src/RPM/BUILD/kidletime-5.55.0/BUILD'
[ 56%] Built target KF5IdleTimeXcbPlugin1
make -f src/plugins/xsync/CMakeFiles/KF5IdleTimeXcbPlugin0_autogen.dir/build.make src/plugins/xsync/CMakeFiles/KF5IdleTimeXcbPlugin0_autogen.dir/depend
make[2]: Entering directory '/usr/src/RPM/BUILD/kidletime-5.55.0/BUILD'
cd /usr/src/RPM/BUILD/kidletime-5.55.0/BUILD && /usr/bin/cmake -E cmake_depends "Unix Makefiles" /usr/src/RPM/BUILD/kidletime-5.55.0 /usr/src/RPM/BUILD/kidletime-5.55.0/src/plugins/xsync /usr/src/RPM/BUILD/kidletime-5.55.0/BUILD /usr/src/RPM/BUILD/kidletime-5.55.0/BUILD/src/plugins/xsync /usr/src/RPM/BUILD/kidletime-5.55.0/BUILD/src/plugins/xsync/CMakeFiles/KF5IdleTimeXcbPlugin0_autogen.dir/DependInfo.cmake --color=
make[2]: Leaving directory '/usr/src/RPM/BUILD/kidletime-5.55.0/BUILD'
make -f src/plugins/xsync/CMakeFiles/KF5IdleTimeXcbPlugin0_autogen.dir/build.make src/plugins/xsync/CMakeFiles/KF5IdleTimeXcbPlugin0_autogen.dir/build
make[2]: Entering directory '/usr/src/RPM/BUILD/kidletime-5.55.0/BUILD'
[ 60%] Automatic MOC for target KF5IdleTimeXcbPlugin0
cd /usr/src/RPM/BUILD/kidletime-5.55.0/BUILD/src/plugins/xsync && /usr/bin/cmake -E cmake_autogen /usr/src/RPM/BUILD/kidletime-5.55.0/BUILD/src/plugins/xsync/CMakeFiles/KF5IdleTimeXcbPlugin0_autogen.dir/AutogenInfo.cmake Release
make[2]: Leaving directory '/usr/src/RPM/BUILD/kidletime-5.55.0/BUILD'
[ 60%] Built target KF5IdleTimeXcbPlugin0_autogen
make -f src/plugins/xsync/CMakeFiles/KF5IdleTimeXcbPlugin0.dir/build.make src/plugins/xsync/CMakeFiles/KF5IdleTimeXcbPlugin0.dir/depend
make[2]: Entering directory '/usr/src/RPM/BUILD/kidletime-5.55.0/BUILD'
cd /usr/src/RPM/BUILD/kidletime-5.55.0/BUILD && /usr/bin/cmake -E cmake_depends "Unix Makefiles" /usr/src/RPM/BUILD/kidletime-5.55.0 /usr/src/RPM/BUILD/kidletime-5.55.0/src/plugins/xsync /usr/src/RPM/BUILD/kidletime-5.55.0/BUILD /usr/src/RPM/BUILD/kidletime-5.55.0/BUILD/src/plugins/xsync /usr/src/RPM/BUILD/kidletime-5.55.0/BUILD/src/plugins/xsync/CMakeFiles/KF5IdleTimeXcbPlugin0.dir/DependInfo.cmake --color=
make[2]: Leaving directory '/usr/src/RPM/BUILD/kidletime-5.55.0/BUILD'
make -f src/plugins/xsync/CMakeFiles/KF5IdleTimeXcbPlugin0.dir/build.make src/plugins/xsync/CMakeFiles/KF5IdleTimeXcbPlugin0.dir/build
make[2]: Entering directory '/usr/src/RPM/BUILD/kidletime-5.55.0/BUILD'
make[2]: Nothing to be done for 'src/plugins/xsync/CMakeFiles/KF5IdleTimeXcbPlugin0.dir/build'.
make[2]: Leaving directory '/usr/src/RPM/BUILD/kidletime-5.55.0/BUILD'
[ 80%] Built target KF5IdleTimeXcbPlugin0
make -f examples/CMakeFiles/kidletime_example_autogen.dir/build.make examples/CMakeFiles/kidletime_example_autogen.dir/depend
make[2]: Entering directory '/usr/src/RPM/BUILD/kidletime-5.55.0/BUILD'
cd /usr/src/RPM/BUILD/kidletime-5.55.0/BUILD && /usr/bin/cmake -E cmake_depends "Unix Makefiles" /usr/src/RPM/BUILD/kidletime-5.55.0 /usr/src/RPM/BUILD/kidletime-5.55.0/examples /usr/src/RPM/BUILD/kidletime-5.55.0/BUILD /usr/src/RPM/BUILD/kidletime-5.55.0/BUILD/examples /usr/src/RPM/BUILD/kidletime-5.55.0/BUILD/examples/CMakeFiles/kidletime_example_autogen.dir/DependInfo.cmake --color=
make[2]: Leaving directory '/usr/src/RPM/BUILD/kidletime-5.55.0/BUILD'
make -f examples/CMakeFiles/kidletime_example_autogen.dir/build.make examples/CMakeFiles/kidletime_example_autogen.dir/build
make[2]: Entering directory '/usr/src/RPM/BUILD/kidletime-5.55.0/BUILD'
[ 84%] Automatic MOC for target kidletime_example
cd /usr/src/RPM/BUILD/kidletime-5.55.0/BUILD/examples && /usr/bin/cmake -E cmake_autogen /usr/src/RPM/BUILD/kidletime-5.55.0/BUILD/examples/CMakeFiles/kidletime_example_autogen.dir/AutogenInfo.cmake Release
make[2]: Leaving directory '/usr/src/RPM/BUILD/kidletime-5.55.0/BUILD'
[ 84%] Built target kidletime_example_autogen
make -f examples/CMakeFiles/kidletime_example.dir/build.make examples/CMakeFiles/kidletime_example.dir/depend
make[2]: Entering directory '/usr/src/RPM/BUILD/kidletime-5.55.0/BUILD'
cd /usr/src/RPM/BUILD/kidletime-5.55.0/BUILD && /usr/bin/cmake -E cmake_depends "Unix Makefiles" /usr/src/RPM/BUILD/kidletime-5.55.0 /usr/src/RPM/BUILD/kidletime-5.55.0/examples /usr/src/RPM/BUILD/kidletime-5.55.0/BUILD /usr/src/RPM/BUILD/kidletime-5.55.0/BUILD/examples /usr/src/RPM/BUILD/kidletime-5.55.0/BUILD/examples/CMakeFiles/kidletime_example.dir/DependInfo.cmake --color=
make[2]: Leaving directory '/usr/src/RPM/BUILD/kidletime-5.55.0/BUILD'
make -f examples/CMakeFiles/kidletime_example.dir/build.make examples/CMakeFiles/kidletime_example.dir/build
make[2]: Entering directory '/usr/src/RPM/BUILD/kidletime-5.55.0/BUILD'
make[2]: Nothing to be done for 'examples/CMakeFiles/kidletime_example.dir/build'.
make[2]: Leaving directory '/usr/src/RPM/BUILD/kidletime-5.55.0/BUILD'
[100%] Built target kidletime_example
make[1]: Leaving directory '/usr/src/RPM/BUILD/kidletime-5.55.0/BUILD'
/usr/bin/cmake -E cmake_progress_start /usr/src/RPM/BUILD/kidletime-5.55.0/BUILD/CMakeFiles 0
make -f CMakeFiles/Makefile2 preinstall
make[1]: Entering directory '/usr/src/RPM/BUILD/kidletime-5.55.0/BUILD'
make[1]: Nothing to be done for 'preinstall'.
make[1]: Leaving directory '/usr/src/RPM/BUILD/kidletime-5.55.0/BUILD'
Install the project...
/usr/bin/cmake -P cmake_install.cmake
-- Install configuration: "Release"
-- Installing: /usr/src/tmp/kf5-kidletime-buildroot/usr/lib/cmake/KF5IdleTime/KF5IdleTimeConfig.cmake
-- Installing: /usr/src/tmp/kf5-kidletime-buildroot/usr/lib/cmake/KF5IdleTime/KF5IdleTimeConfigVersion.cmake
-- Installing: /usr/src/tmp/kf5-kidletime-buildroot/usr/lib/cmake/KF5IdleTime/KF5IdleTimeTargets.cmake
-- Installing: /usr/src/tmp/kf5-kidletime-buildroot/usr/lib/cmake/KF5IdleTime/KF5IdleTimeTargets-release.cmake
-- Installing: /usr/src/tmp/kf5-kidletime-buildroot/usr/include/KF5/kidletime_version.h
-- Installing: /usr/src/tmp/kf5-kidletime-buildroot/etc/kf5/xdg/kidletime.categories
-- Installing: /usr/src/tmp/kf5-kidletime-buildroot/usr/include/KF5/KIdleTime/kidletime_export.h
-- Installing: /usr/src/tmp/kf5-kidletime-buildroot/usr/include/KF5/KIdleTime/KIdleTime
-- Installing: /usr/src/tmp/kf5-kidletime-buildroot/usr/include/KF5/KIdleTime/kidletime.h
-- Installing: /usr/src/tmp/kf5-kidletime-buildroot/usr/include/KF5/KIdleTime/private/abstractsystempoller.h
-- Installing: /usr/src/tmp/kf5-kidletime-buildroot/usr/lib/libKF5IdleTime.so.5.55.0
-- Installing: /usr/src/tmp/kf5-kidletime-buildroot/usr/lib/libKF5IdleTime.so.5
-- Installing: /usr/src/tmp/kf5-kidletime-buildroot/usr/lib/libKF5IdleTime.so
-- Installing: /usr/src/tmp/kf5-kidletime-buildroot/usr/lib/qt5/mkspecs/modules/qt_KIdleTime.pri
-- Installing: /usr/src/tmp/kf5-kidletime-buildroot/usr/lib/qt5/plugins/kf5/org.kde.kidletime.platforms/KF5IdleTimeXcbPlugin1.so
-- Installing: /usr/src/tmp/kf5-kidletime-buildroot/usr/lib/qt5/plugins/kf5/org.kde.kidletime.platforms/KF5IdleTimeXcbPlugin0.so
make: Leaving directory '/usr/src/RPM/BUILD/kidletime-5.55.0/BUILD'
+ '[' -d /usr/src/tmp/kf5-kidletime-buildroot//usr/share ']'
+ '[' -d /usr/src/tmp/kf5-kidletime-buildroot//usr/share/kf5/lib64 ']'
+ '[' -d /usr/src/tmp/kf5-kidletime-buildroot//usr/share/kf5/lib ']'
+ ls -1 /usr/src/tmp/kf5-kidletime-buildroot//usr/lib/libKF5IdleTime.so
+ read p
+ '[' -L /usr/src/tmp/kf5-kidletime-buildroot//usr/lib/libKF5IdleTime.so ']'
+ mkdir -p /usr/src/tmp/kf5-kidletime-buildroot//usr/lib/kf5/devel
++ readlink /usr/src/tmp/kf5-kidletime-buildroot//usr/lib/libKF5IdleTime.so
+ f=libKF5IdleTime.so.5
++ basename /usr/src/tmp/kf5-kidletime-buildroot//usr/lib/libKF5IdleTime.so
+ l=libKF5IdleTime.so
++ relative /usr/src/tmp/kf5-kidletime-buildroot//usr/lib/libKF5IdleTime.so.5 /usr/src/tmp/kf5-kidletime-buildroot//usr/lib/kf5/devel/libKF5IdleTime.so.5
+ ln -sf ../../libKF5IdleTime.so.5 /usr/src/tmp/kf5-kidletime-buildroot//usr/lib/kf5/devel/libKF5IdleTime.so
+ rm -f /usr/src/tmp/kf5-kidletime-buildroot//usr/lib/libKF5IdleTime.so
+ read p
+ '[' -d /usr/src/tmp/kf5-kidletime-buildroot//usr/share/kf5/bin ']'
+ '[' -d /usr/src/tmp/kf5-kidletime-buildroot//usr/share/kf5/include ']'
+ '[' -d /usr/src/tmp/kf5-kidletime-buildroot//usr/lib/kf5/bin -a true == true ']'
+ read s
+ ls -1 '/usr/src/tmp/kf5-kidletime-buildroot//usr/share/kf5/dbus-1/services/*5*.service'
+ '[' -d /usr/src/tmp/kf5-kidletime-buildroot//usr/share/akonadi ']'
+ '[' -d /usr/src/tmp/kf5-kidletime-buildroot//usr/share/kf5/akonadi ']'
+ '[' -d /usr/src/tmp/kf5-kidletime-buildroot//usr/share/man -a remove == remove ']'
+ '[' -d /usr/src/tmp/kf5-kidletime-buildroot//usr/share/appdata -a keep == remove ']'
+ '[' -d /usr/src/tmp/kf5-kidletime-buildroot//usr/share/metainfo -a keep == remove ']'
+ '[' -d /usr/src/tmp/kf5-kidletime-buildroot//usr/lib/cmake/ ']'
+ read f
+ find /usr/src/tmp/kf5-kidletime-buildroot//usr/lib/cmake/ -type f -name '*.cmake'
+ sed -i -e 's|\(set(.*\)${PACKAGE_PREFIX_DIR}//usr/|\1${PACKAGE_PREFIX_DIR}/|' /usr/src/tmp/kf5-kidletime-buildroot//usr/lib/cmake/KF5IdleTime/KF5IdleTimeTargets-release.cmake
+ sed -i -e 's|/usr//usr/|/usr/|' /usr/src/tmp/kf5-kidletime-buildroot//usr/lib/cmake/KF5IdleTime/KF5IdleTimeTargets-release.cmake
+ read f
+ sed -i -e 's|\(set(.*\)${PACKAGE_PREFIX_DIR}//usr/|\1${PACKAGE_PREFIX_DIR}/|' /usr/src/tmp/kf5-kidletime-buildroot//usr/lib/cmake/KF5IdleTime/KF5IdleTimeTargets.cmake
+ sed -i -e 's|/usr//usr/|/usr/|' /usr/src/tmp/kf5-kidletime-buildroot//usr/lib/cmake/KF5IdleTime/KF5IdleTimeTargets.cmake
+ read f
+ sed -i -e 's|\(set(.*\)${PACKAGE_PREFIX_DIR}//usr/|\1${PACKAGE_PREFIX_DIR}/|' /usr/src/tmp/kf5-kidletime-buildroot//usr/lib/cmake/KF5IdleTime/KF5IdleTimeConfigVersion.cmake
+ sed -i -e 's|/usr//usr/|/usr/|' /usr/src/tmp/kf5-kidletime-buildroot//usr/lib/cmake/KF5IdleTime/KF5IdleTimeConfigVersion.cmake
+ read f
+ sed -i -e 's|\(set(.*\)${PACKAGE_PREFIX_DIR}//usr/|\1${PACKAGE_PREFIX_DIR}/|' /usr/src/tmp/kf5-kidletime-buildroot//usr/lib/cmake/KF5IdleTime/KF5IdleTimeConfig.cmake
+ sed -i -e 's|/usr//usr/|/usr/|' /usr/src/tmp/kf5-kidletime-buildroot//usr/lib/cmake/KF5IdleTime/KF5IdleTimeConfig.cmake
+ read f
+ /usr/lib/rpm/find-lang kf5-kidletime --all-name
+ rpm-build-kf5-find-qtlang kf5-kidletime --all-name
+ /usr/lib/rpm/brp-alt
Cleaning files in /usr/src/tmp/kf5-kidletime-buildroot (auto)
mode of './usr/lib/qt5/plugins/kf5/org.kde.kidletime.platforms/KF5IdleTimeXcbPlugin0.so' changed from 0755 (rwxr-xr-x) to 0644 (rw-r--r--)
mode of './usr/lib/qt5/plugins/kf5/org.kde.kidletime.platforms/KF5IdleTimeXcbPlugin1.so' changed from 0755 (rwxr-xr-x) to 0644 (rw-r--r--)
mode of './usr/lib/libKF5IdleTime.so.5.55.0' changed from 0755 (rwxr-xr-x) to 0644 (rw-r--r--)
Verifying and fixing files in /usr/src/tmp/kf5-kidletime-buildroot (binconfig,pkgconfig,libtool,desktop)
Checking contents of files in /usr/src/tmp/kf5-kidletime-buildroot/ (default)
Compressing files in /usr/src/tmp/kf5-kidletime-buildroot (auto)
Adjusting library links in /usr/src/tmp/kf5-kidletime-buildroot
./usr/lib:
libKF5IdleTime.so.5 -> libKF5IdleTime.so.5.55.0
Verifying ELF objects in /usr/src/tmp/kf5-kidletime-buildroot (arch=normal,fhs=normal,lfs=relaxed,lint=relaxed,rpath=normal,stack=normal,textrel=normal,unresolved=normal)
Hardlinking identical .pyc and .pyo files
Processing files: kf5-kidletime-common-5.55.0-alt1
Executing(%doc): /bin/sh -e /usr/src/tmp/rpm-tmp.20
+ umask 022
+ /bin/mkdir -p /usr/src/RPM/BUILD
+ cd /usr/src/RPM/BUILD
+ cd kidletime-5.55.0
+ DOCDIR=/usr/src/tmp/kf5-kidletime-buildroot/usr/share/doc/kf5-kidletime-common-5.55.0
+ export DOCDIR
+ rm -rf /usr/src/tmp/kf5-kidletime-buildroot/usr/share/doc/kf5-kidletime-common-5.55.0
+ /bin/mkdir -p /usr/src/tmp/kf5-kidletime-buildroot/usr/share/doc/kf5-kidletime-common-5.55.0
+ cp -prL COPYING.LIB README.md /usr/src/tmp/kf5-kidletime-buildroot/usr/share/doc/kf5-kidletime-common-5.55.0
+ chmod -R go-w /usr/src/tmp/kf5-kidletime-buildroot/usr/share/doc/kf5-kidletime-common-5.55.0
+ chmod -R a+rX /usr/src/tmp/kf5-kidletime-buildroot/usr/share/doc/kf5-kidletime-common-5.55.0
+ exit 0
Finding Provides (using /usr/lib/rpm/find-provides)
Executing: /bin/sh -e /usr/src/tmp/rpm-tmp.Az34eg
find-provides: running scripts (alternatives,debuginfo,gir,lib,pam,perl,pkgconfig,python,qml,shell,typelib)
Finding Requires (using /usr/lib/rpm/find-requires)
Executing: /bin/sh -e /usr/src/tmp/rpm-tmp.SJ7zIz
find-requires: running scripts (cpp,debuginfo,files,gir-js,gir-python,gir,lib,pam,perl,pkgconfig,pkgconfiglib,python,qml,rpmlib,shebang,shell,static,symlinks,typelib)
Requires: kf5-filesystem
Processing files: kf5-kidletime-devel-5.55.0-alt1
Finding Provides (using /usr/lib/rpm/find-provides)
Executing: /bin/sh -e /usr/src/tmp/rpm-tmp.vfq6hf
find-provides: running scripts (alternatives,debuginfo,gir,lib,pam,perl,pkgconfig,python,qml,shell,typelib)
Finding Requires (using /usr/lib/rpm/find-requires)
Executing: /bin/sh -e /usr/src/tmp/rpm-tmp.NEO2T9
find-requires: running scripts (cpp,debuginfo,files,gir-js,gir-python,gir,lib,pam,perl,pkgconfig,pkgconfiglib,python,qml,rpmlib,shebang,shell,static,symlinks,typelib)
/usr/src/tmp/kf5-kidletime-buildroot/usr/include/KF5/KIdleTime/kidletime.h:22:10: fatal error: QObject: No such file or directory
#include
^~~~~~~~~
compilation terminated.
cpp.req: /usr/src/tmp/kf5-kidletime-buildroot/usr/include/KF5/KIdleTime/kidletime.h: cpp failed, trying c++ mode
/usr/src/tmp/kf5-kidletime-buildroot/usr/include/KF5/KIdleTime/kidletime.h:22:10: fatal error: QObject: No such file or directory
#include
^~~~~~~~~
compilation terminated.
cpp.req: WARNING: /usr/src/tmp/kf5-kidletime-buildroot/usr/include/KF5/KIdleTime/kidletime.h: cpp failed
/usr/src/tmp/kf5-kidletime-buildroot/usr/include/KF5/KIdleTime/private/abstractsystempoller.h:24:10: fatal error: QObject: No such file or directory
#include
^~~~~~~~~
compilation terminated.
cpp.req: /usr/src/tmp/kf5-kidletime-buildroot/usr/include/KF5/KIdleTime/private/abstractsystempoller.h: cpp failed, trying c++ mode
/usr/src/tmp/kf5-kidletime-buildroot/usr/include/KF5/KIdleTime/private/abstractsystempoller.h:24:10: fatal error: QObject: No such file or directory
#include
^~~~~~~~~
compilation terminated.
cpp.req: WARNING: /usr/src/tmp/kf5-kidletime-buildroot/usr/include/KF5/KIdleTime/private/abstractsystempoller.h: cpp failed
Requires: /usr/lib/libKF5IdleTime.so.5
Finding debuginfo files (using /usr/lib/rpm/find-debuginfo-files)
Executing: /bin/sh -e /usr/src/tmp/rpm-tmp.fIr3Sc
Processing files: libkf5idletime-5.55.0-alt1
Finding Provides (using /usr/lib/rpm/find-provides)
Executing: /bin/sh -e /usr/src/tmp/rpm-tmp.c2xvyy
find-provides: running scripts (alternatives,debuginfo,gir,lib,pam,perl,pkgconfig,python,qml,shell,typelib)
lib.prov: /usr/src/tmp/kf5-kidletime-buildroot/usr/lib/libKF5IdleTime.so.5: 64 symbols, 16 bpp
Finding Requires (using /usr/lib/rpm/find-requires)
Executing: /bin/sh -e /usr/src/tmp/rpm-tmp.iDmJKd
find-requires: running scripts (cpp,debuginfo,files,gir-js,gir-python,gir,lib,pam,perl,pkgconfig,pkgconfiglib,python,qml,rpmlib,shebang,shell,static,symlinks,typelib)
Provides: libKF5IdleTime.so.5 = set:jc2zqqys70e5sHExqMYSFPqr7LEL3niX1s8KoIEo9FNO6yXa30pDH6W3P9DmUNJ0e1igeGZHQUkA7IJEDeHVVj9Z0cWgakQ6lK0J0g7G54cFIBsAn2WxdQOZcBipId1
Requires: kf5-kidletime-common = 5.55.0-alt1, libQt5Core.so.5 >= set:qjWAjoIrgM825WpkZzUawlYJjfn2puZhQEkYlHZhG0QcS4SJRIqbK1sVOBogQ5shHVEsVOQSZ5UCa7gJCNK7P1m1vjy8lCjak8MZhjxRP1kXEKscSNorRtis1Kb2Zvl6JTpXLqyJX8qOY8OQ2vmJZlnkqZvWNVLa1MzW7neMZyGYZbIU3ZoALjZhDCudZyTLk3N67x26VyFrVJ6pUrfou2pdEQKEYOC2ytwgATf4FOZe85txy1ubhrdxXhm2rm6c9UNSv130ZvZm0, libQt5Core.so.5(Qt_5), libQt5Core.so.5(Qt_5.11), libQt5DBus.so.5 >= set:mhL330UbxdTP30MgZbBEjJBF2YP7mn3doiZgKlK49Ec3Z8X0, libQt5DBus.so.5(Qt_5), libQt5Gui.so.5 >= set:qpZJa80, libQt5Gui.so.5(Qt_5), libQt5Widgets.so.5 >= set:rnzDzmPSV6P5Z7f1STv76QjH99WuZiT2dY7, libQt5Widgets.so.5(Qt_5), libQt5X11Extras.so.5 >= set:ihqAa, libQt5X11Extras.so.5(Qt_5), libX11-xcb.so.1 >= set:edp7, libX11.so.6 >= set:omNQNZ0EPrQf0, libXext.so.6 >= set:lhnnxLbmf0iijQ9ZKo0L2aHGORWyqn60, libXss.so.1 >= set:hfK9V87, libc.so.6(GLIBC_2.0), libc.so.6(GLIBC_2.1.3), libstdc++.so.6(CXXABI_1.3), libstdc++.so.6(GLIBCXX_3.4), libxcb-sync.so.1 >= set:kjOcj, libxcb.so.1 >= set:nmCri2, rtld(GNU_HASH)
Requires(rpmlib): rpmlib(SetVersions)
Finding debuginfo files (using /usr/lib/rpm/find-debuginfo-files)
Executing: /bin/sh -e /usr/src/tmp/rpm-tmp.zzuBid
Creating libkf5idletime-debuginfo package
Processing files: libkf5idletime-debuginfo-5.55.0-alt1
Finding Provides (using /usr/lib/rpm/find-provides)
Executing: /bin/sh -e /usr/src/tmp/rpm-tmp.aD7bNn
find-provides: running scripts (debuginfo)
Finding Requires (using /usr/lib/rpm/find-requires)
Executing: /bin/sh -e /usr/src/tmp/rpm-tmp.4WbfQT
find-requires: running scripts (debuginfo)
Provides: debug(libKF5IdleTime.so.5)
Requires: libkf5idletime = 5.55.0-alt1, debug(libQt5Core.so.5), debug(libQt5DBus.so.5), debug(libQt5Gui.so.5), debug(libQt5Widgets.so.5), debug(libQt5X11Extras.so.5), debug(libX11-xcb.so.1), debug(libX11.so.6), debug(libXext.so.6), debug(libXss.so.1), debug(libc.so.6), debug(libstdc++.so.6), debug(libxcb-sync.so.1), debug(libxcb.so.1)
Adding to kf5-kidletime-devel a strict dependency on libkf5idletime
Removing 1 extra deps from kf5-kidletime-devel due to dependency on libkf5idletime
Wrote: /usr/src/RPM/RPMS/noarch/kf5-kidletime-common-5.55.0-alt1.noarch.rpm
Wrote: /usr/src/RPM/RPMS/i586/kf5-kidletime-devel-5.55.0-alt1.i586.rpm
Wrote: /usr/src/RPM/RPMS/i586/libkf5idletime-5.55.0-alt1.i586.rpm
Wrote: /usr/src/RPM/RPMS/i586/libkf5idletime-debuginfo-5.55.0-alt1.i586.rpm
25.78user 3.93system 0:32.07elapsed 92%CPU (0avgtext+0avgdata 165736maxresident)k
0inputs+0outputs (0major+1484219minor)pagefaults 0swaps
64.07user 9.79system 1:23.34elapsed 88%CPU (0avgtext+0avgdata 165736maxresident)k
0inputs+0outputs (0major+2328712minor)pagefaults 0swaps
--- kf5-kidletime-common-5.55.0-alt1.noarch.rpm.repo 2019-02-13 00:24:44.000000000 +0000
+++ kf5-kidletime-common-5.55.0-alt1.noarch.rpm.hasher 2019-02-18 09:08:26.862126424 +0000
@@ -6,2 +6,2 @@
Requires: rpmlib(PayloadIsLzma)
-Provides: kf5-kidletime-common = 5.55.0-alt1:sisyphus+221265.1200.3.2
+Provides: kf5-kidletime-common = 5.55.0-alt1
--- kf5-kidletime-devel-5.55.0-alt1.i586.rpm.repo 2019-02-13 00:25:38.000000000 +0000
+++ kf5-kidletime-devel-5.55.0-alt1.i586.rpm.hasher 2019-02-18 09:08:26.873126514 +0000
@@ -14,4 +14,4 @@
/usr/lib/qt5/mkspecs/modules/qt_KIdleTime.pri 100644
-Requires: libkf5idletime = 5.55.0-alt1:sisyphus+221265.1200.3.2
+Requires: libkf5idletime = 5.55.0-alt1
Requires: rpmlib(PayloadIsLzma)
-Provides: kf5-kidletime-devel = 5.55.0-alt1:sisyphus+221265.1200.3.2
+Provides: kf5-kidletime-devel = 5.55.0-alt1
--- libkf5idletime-5.55.0-alt1.i586.rpm.repo 2019-02-13 00:25:38.000000000 +0000
+++ libkf5idletime-5.55.0-alt1.i586.rpm.hasher 2019-02-18 09:08:26.885126613 +0000
@@ -5,2 +5,3 @@
/usr/lib/qt5/plugins/kf5/org.kde.kidletime.platforms/KF5IdleTimeXcbPlugin1.so 100644
+Requires: kf5-kidletime-common = 5.55.0-alt1
Requires: libQt5Core.so.5 >= set:qjWAjoIrgM825WpkZzUawlYJjfn2puZhQEkYlHZhG0QcS4SJRIqbK1sVOBogQ5shHVEsVOQSZ5UCa7gJCNK7P1m1vjy8lCjak8MZhjxRP1kXEKscSNorRtis1Kb2Zvl6JTpXLqyJX8qOY8OQ2vmJZlnkqZvWNVLa1MzW7neMZyGYZbIU3ZoALjZhDCudZyTLk3N67x26VyFrVJ6pUrfou2pdEQKEYOC2ytwgATf4FOZe85txy1ubhrdxXhm2rm6c9UNSv130ZvZm0
@@ -28,5 +29,4 @@
Requires: rtld(GNU_HASH)
-Requires: kf5-kidletime-common = 5.55.0-alt1:sisyphus+221265.1200.3.2
Requires: rpmlib(PayloadIsLzma)
Provides: libKF5IdleTime.so.5 = set:jc2zqqys70e5sHExqMYSFPqr7LEL3niX1s8KoIEo9FNO6yXa30pDH6W3P9DmUNJ0e1igeGZHQUkA7IJEDeHVVj9Z0cWgakQ6lK0J0g7G54cFIBsAn2WxdQOZcBipId1
-Provides: libkf5idletime = 5.55.0-alt1:sisyphus+221265.1200.3.2
+Provides: libkf5idletime = 5.55.0-alt1
--- libkf5idletime-debuginfo-5.55.0-alt1.i586.rpm.repo 2019-02-13 00:25:38.000000000 +0000
+++ libkf5idletime-debuginfo-5.55.0-alt1.i586.rpm.hasher 2019-02-18 09:08:26.906126785 +0000
@@ -48,2 +48,3 @@
/usr/src/debug/kidletime-5.55.0/src/widgetbasedpoller.h 100644
+Requires: libkf5idletime = 5.55.0-alt1
Requires: debug(libQt5Core.so.5)
@@ -61,5 +62,4 @@
Requires: debug(libxcb.so.1)
-Requires: libkf5idletime = 5.55.0-alt1:sisyphus+221265.1200.3.2
Requires: rpmlib(PayloadIsLzma)
Provides: debug(libKF5IdleTime.so.5)
-Provides: libkf5idletime-debuginfo = 5.55.0-alt1:sisyphus+221265.1200.3.2
+Provides: libkf5idletime-debuginfo = 5.55.0-alt1