<86>Jan  4 00:06:09 userdel[3545133]: delete user 'rooter'
<86>Jan  4 00:06:09 userdel[3545133]: removed group 'rooter' owned by 'rooter'
<86>Jan  4 00:06:09 userdel[3545133]: removed shadow group 'rooter' owned by 'rooter'
<86>Jan  4 00:06:09 groupadd[3545150]: group added to /etc/group: name=rooter, GID=1820
<86>Jan  4 00:06:09 groupadd[3545150]: group added to /etc/gshadow: name=rooter
<86>Jan  4 00:06:09 groupadd[3545150]: new group: name=rooter, GID=1820
<86>Jan  4 00:06:09 useradd[3545166]: new user: name=rooter, UID=1820, GID=1820, home=/root, shell=/bin/bash, from=none
<86>Jan  4 00:06:09 userdel[3545192]: delete user 'builder'
<86>Jan  4 00:06:09 userdel[3545192]: removed group 'builder' owned by 'builder'
<86>Jan  4 00:06:09 userdel[3545192]: removed shadow group 'builder' owned by 'builder'
<86>Jan  4 00:06:09 groupadd[3545209]: group added to /etc/group: name=builder, GID=1821
<86>Jan  4 00:06:09 groupadd[3545209]: group added to /etc/gshadow: name=builder
<86>Jan  4 00:06:09 groupadd[3545209]: new group: name=builder, GID=1821
<86>Jan  4 00:06:09 useradd[3545222]: new user: name=builder, UID=1821, GID=1821, home=/usr/src, shell=/bin/bash, from=none
<13>Jan  4 00:06:13 rpmi: rpm-build-licenses-3.0.0-alt1 sisyphus+241804.100.1.1 1574868053 installed
<13>Jan  4 00:06:14 rpmi: libnspr-1:4.35-alt1 sisyphus+308164.100.1.1 1665397040 installed
<13>Jan  4 00:06:14 rpmi: libnspr-devel-1:4.35-alt1 sisyphus+308164.100.1.1 1665397040 installed
<13>Jan  4 00:06:14 rpmi: libreadline-devel-8.2.10-alt1 sisyphus+338911.100.4.1 1706717067 installed
Building target platforms: x86_64
Building for target x86_64
Wrote: /usr/src/in/nosrpm/js-1.7.0-alt10.nosrc.rpm (w1.gzdio)
Installing js-1.7.0-alt10.src.rpm
Building target platforms: x86_64
Building for target x86_64
Executing(%prep): /bin/sh -e /usr/src/tmp/rpm-tmp.22345
+ umask 022
+ /bin/mkdir -p /usr/src/RPM/BUILD
+ cd /usr/src/RPM/BUILD
+ cd /usr/src/RPM/BUILD
+ rm -rf js-1.7.0
+ /bin/mkdir -p js-1.7.0
+ cd js-1.7.0
+ echo 'Source #0 (js-1.7.0.tar):'
Source #0 (js-1.7.0.tar):
+ /bin/tar -xf /usr/src/RPM/SOURCES/js-1.7.0.tar
+ /bin/chmod -c -Rf u+rwX,go-w .
+ cd js
+ echo 'Patch #0 (js-1.7.0-alt10.patch):'
Patch #0 (js-1.7.0-alt10.patch):
+ /usr/bin/patch -p1
patching file src/Makefile.ref
patching file src/config/Linux_All.mk
patching file src/rules.mk
+ sed -E -i '/^LIBDIR\s*:=/ s,\w+$,lib64,' src/config.mk
+ exit 0
Executing(%build): /bin/sh -e /usr/src/tmp/rpm-tmp.22345
+ umask 022
+ /bin/mkdir -p /usr/src/RPM/BUILD
+ cd /usr/src/RPM/BUILD
+ cd js-1.7.0
+ export CFLAGS=-DJS_C_STRINGS_ARE_UTF8
+ CFLAGS=-DJS_C_STRINGS_ARE_UTF8
++ nspr-config --cflags
+ make -C js/src -f Makefile.ref LD=gcc 'XCFLAGS=-pipe -frecord-gcc-switches -Wall -g -O2 -flto=auto -ffat-lto-objects -fPIC -DPIC -I/usr/include/nspr' BUILD_OPT=1 JS_HAS_FILE_OBJECT=1 JS_NO_THIN_LOCKS=1 JS_THREADSAFE=1 JS_HAS_XML_SUPPORT=1 JS_READLINE=1 XMKSHLIBOPTS=-Wl,-soname,libjs.so.1 VERSION=1.7.0 all export
make: Entering directory '/usr/src/RPM/BUILD/js-1.7.0/js/src'
cat: ../../dist/Linux_All_OPT.OBJ/nspr/Version: No such file or directory
make: Leaving directory '/usr/src/RPM/BUILD/js-1.7.0/js/src'
make: Entering directory '/usr/src/RPM/BUILD/js-1.7.0/js/src'
make -f Makefile.ref  Linux_All_OPT.OBJ/libjs.a Linux_All_OPT.OBJ/libjs.so Linux_All_OPT.OBJ/js  Linux_All_OPT.OBJ/jsautocfg.h Linux_All_OPT.OBJ/jscpucfg Linux_All_OPT.OBJ/jscpucfg.o
make[1]: Entering directory '/usr/src/RPM/BUILD/js-1.7.0/js/src'
cat: ../../dist/Linux_All_OPT.OBJ/nspr/Version: No such file or directory
make[1]: Leaving directory '/usr/src/RPM/BUILD/js-1.7.0/js/src'
make[1]: Entering directory '/usr/src/RPM/BUILD/js-1.7.0/js/src'
make[1]: Circular jscpucfg.h <- Linux_All_OPT.OBJ/jsautocfg.h dependency dropped.
gcc -o Linux_All_OPT.OBJ/jscpucfg.o -c -DJS_C_STRINGS_ARE_UTF8 -Wall -Wno-format -O -DXP_UNIX -DSVR4 -DSYSV -D_BSD_SOURCE -DPOSIX_SOURCE -DHAVE_LOCALTIME_R -DHAVE_VA_COPY -DVA_COPY=va_copy -DPIC -fPIC -UDEBUG -DNDEBUG -UDEBUG_builder -DJS_THREADSAFE -DJS_USE_ONLY_NSPR_LOCKS -DJS_HAS_FILE_OBJECT -DEDITLINE -ILinux_All_OPT.OBJ -I./../../dist/include/nspr -pipe -frecord-gcc-switches -Wall -g -O2 -flto=auto -ffat-lto-objects -fPIC -DPIC -I/usr/include/nspr -Wall -Wno-format -O -DXP_UNIX -DSVR4 -DSYSV -D_BSD_SOURCE -DPOSIX_SOURCE -DHAVE_LOCALTIME_R -DHAVE_VA_COPY -DVA_COPY=va_copy -DPIC -fPIC -UDEBUG -DNDEBUG -UDEBUG_builder -DJS_THREADSAFE -DJS_USE_ONLY_NSPR_LOCKS -DJS_HAS_FILE_OBJECT -DEDITLINE -ILinux_All_OPT.OBJ -I./../../dist/include/nspr -pipe -frecord-gcc-switches -Wall -g -O2 -flto=auto -ffat-lto-objects -fPIC -DPIC -I/usr/include/nspr jscpucfg.c
In file included from /usr/include/bits/libc-header-start.h:33,
                 from /usr/include/stdio.h:27,
                 from jscpucfg.c:44:
/usr/include/features.h:196:3: warning: #warning "_BSD_SOURCE and _SVID_SOURCE are deprecated, use _DEFAULT_SOURCE" [-Wcpp]
  196 | # warning "_BSD_SOURCE and _SVID_SOURCE are deprecated, use _DEFAULT_SOURCE"
      |   ^~~~~~~
gcc -o Linux_All_OPT.OBJ/jscpucfg Linux_All_OPT.OBJ/jscpucfg.o
make[1]: Circular Linux_All_OPT.OBJ/jsautocfg.h <- Linux_All_OPT.OBJ/jsautocfg.h dependency dropped.
rm -f Linux_All_OPT.OBJ/jsautocfg.h
Linux_All_OPT.OBJ/jscpucfg > Linux_All_OPT.OBJ/jsautocfg.h
gcc -o Linux_All_OPT.OBJ/jsapi.o -c -DJS_C_STRINGS_ARE_UTF8 -Wall -Wno-format -O -DXP_UNIX -DSVR4 -DSYSV -D_BSD_SOURCE -DPOSIX_SOURCE -DHAVE_LOCALTIME_R -DHAVE_VA_COPY -DVA_COPY=va_copy -DPIC -fPIC -UDEBUG -DNDEBUG -UDEBUG_builder -DJS_THREADSAFE -DJS_USE_ONLY_NSPR_LOCKS -DJS_HAS_FILE_OBJECT -DEDITLINE -ILinux_All_OPT.OBJ -I./../../dist/include/nspr -pipe -frecord-gcc-switches -Wall -g -O2 -flto=auto -ffat-lto-objects -fPIC -DPIC -I/usr/include/nspr -Wall -Wno-format -O -DXP_UNIX -DSVR4 -DSYSV -D_BSD_SOURCE -DPOSIX_SOURCE -DHAVE_LOCALTIME_R -DHAVE_VA_COPY -DVA_COPY=va_copy -DPIC -fPIC -UDEBUG -DNDEBUG -UDEBUG_builder -DJS_THREADSAFE -DJS_USE_ONLY_NSPR_LOCKS -DJS_HAS_FILE_OBJECT -DEDITLINE -ILinux_All_OPT.OBJ -I./../../dist/include/nspr -pipe -frecord-gcc-switches -Wall -g -O2 -flto=auto -ffat-lto-objects -fPIC -DPIC -I/usr/include/nspr jsapi.c
In file included from /usr/include/ctype.h:25,
                 from jsapi.c:45:
/usr/include/features.h:196:3: warning: #warning "_BSD_SOURCE and _SVID_SOURCE are deprecated, use _DEFAULT_SOURCE" [-Wcpp]
  196 | # warning "_BSD_SOURCE and _SVID_SOURCE are deprecated, use _DEFAULT_SOURCE"
      |   ^~~~~~~
jsapi.c: In function 'JS_ConvertArgumentsVA':
jsapi.c:96:35: error: passing argument 5 of 'TryArgumentFormatter' from incompatible pointer type [-Wincompatible-pointer-types]
   96 | #define JS_ADDRESSOF_VA_LIST(ap) (&(ap))
      |                                  ~^~~~~~
      |                                   |
      |                                   __va_list_tag **
jsapi.c:267:39: note: in expansion of macro 'JS_ADDRESSOF_VA_LIST'
  267 |                                       JS_ADDRESSOF_VA_LIST(ap))) {
      |                                       ^~~~~~~~~~~~~~~~~~~~
jsapi.c:137:44: note: expected '__va_list_tag (*)[1]' but argument is of type '__va_list_tag **'
  137 |                      jsval **vpp, va_list *app)
      |                                   ~~~~~~~~~^~~
jsapi.c: In function 'JS_PushArgumentsVA':
jsapi.c:96:35: error: passing argument 5 of 'TryArgumentFormatter' from incompatible pointer type [-Wincompatible-pointer-types]
   96 | #define JS_ADDRESSOF_VA_LIST(ap) (&(ap))
      |                                  ~^~~~~~
      |                                   |
      |                                   __va_list_tag **
jsapi.c:370:39: note: in expansion of macro 'JS_ADDRESSOF_VA_LIST'
  370 |                                       JS_ADDRESSOF_VA_LIST(ap))) {
      |                                       ^~~~~~~~~~~~~~~~~~~~
jsapi.c:137:44: note: expected '__va_list_tag (*)[1]' but argument is of type '__va_list_tag **'
  137 |                      jsval **vpp, va_list *app)
      |                                   ~~~~~~~~~^~~
make[1]: *** [rules.mk:78: Linux_All_OPT.OBJ/jsapi.o] Error 1
make[1]: Leaving directory '/usr/src/RPM/BUILD/js-1.7.0/js/src'
make: *** [rules.mk:66: all] Error 2
make: Leaving directory '/usr/src/RPM/BUILD/js-1.7.0/js/src'
error: Bad exit status from /usr/src/tmp/rpm-tmp.22345 (%build)


RPM build errors:
    Bad exit status from /usr/src/tmp/rpm-tmp.22345 (%build)
Command exited with non-zero status 1
0.32user 0.17system 0:00.48elapsed 102%CPU (0avgtext+0avgdata 28988maxresident)k
0inputs+0outputs (0major+27567minor)pagefaults 0swaps
hsh-rebuild: rebuild of `js-1.7.0-alt10.src.rpm' failed.
Command exited with non-zero status 1
5.00user 3.67system 0:12.34elapsed 70%CPU (0avgtext+0avgdata 137792maxresident)k
24inputs+0outputs (0major+272850minor)pagefaults 0swaps