<86>Dec 23 01:50:51 userdel[883079]: delete user 'rooter'
<86>Dec 23 01:50:51 userdel[883079]: removed group 'rooter' owned by 'rooter'
<86>Dec 23 01:50:51 userdel[883079]: removed shadow group 'rooter' owned by 'rooter'
<86>Dec 23 01:50:51 groupadd[883114]: group added to /etc/group: name=rooter, GID=1853
<86>Dec 23 01:50:51 groupadd[883114]: group added to /etc/gshadow: name=rooter
<86>Dec 23 01:50:51 groupadd[883114]: new group: name=rooter, GID=1853
<86>Dec 23 01:50:51 useradd[883150]: new user: name=rooter, UID=1853, GID=1853, home=/root, shell=/bin/bash, from=none
<86>Dec 23 01:50:51 userdel[883203]: delete user 'builder'
<86>Dec 23 01:50:51 userdel[883203]: removed group 'builder' owned by 'builder'
<86>Dec 23 01:50:51 userdel[883203]: removed shadow group 'builder' owned by 'builder'
<86>Dec 23 01:50:51 groupadd[883241]: group added to /etc/group: name=builder, GID=1854
<86>Dec 23 01:50:51 groupadd[883241]: group added to /etc/gshadow: name=builder
<86>Dec 23 01:50:51 groupadd[883241]: new group: name=builder, GID=1854
<86>Dec 23 01:50:51 useradd[883272]: new user: name=builder, UID=1854, GID=1854, home=/usr/src, shell=/bin/bash, from=none
<13>Dec 23 01:50:54 rpmi: libogg-1.3.5-alt1 sisyphus+278100.3400.1.1 1626058929 installed
<13>Dec 23 01:50:54 rpmi: libvorbis-1.3.7-alt1 sisyphus+275738.100.1.1 1624751601 installed
<13>Dec 23 01:50:54 rpmi: libogg-devel-1.3.5-alt1 sisyphus+278100.3400.1.1 1626058929 installed
<13>Dec 23 01:50:54 rpmi: alsa-ucm-conf-1.2.12-alt1 sisyphus+352670.100.1.1 1720712327 installed
<13>Dec 23 01:50:54 rpmi: alsa-topology-conf-1.2.5.1-alt1 sisyphus+274777.100.1.1 1624089141 installed
<13>Dec 23 01:50:55 rpmi: libalsa-1:1.2.12-alt1 sisyphus+352670.200.1.1 1720712401 installed
<13>Dec 23 01:50:55 rpmi: libalsa-devel-1:1.2.12-alt1 sisyphus+352670.200.1.1 1720712401 installed
<13>Dec 23 01:50:55 rpmi: libvorbis-devel-1.3.7-alt1 sisyphus+275738.100.1.1 1624751601 installed
<13>Dec 23 01:50:55 rpmi: flex-2.6.4.0.88.9801-alt2 sisyphus+346193.200.3.2 1716466857 installed
Building target platforms: x86_64
Building for target x86_64
Wrote: /usr/src/in/nosrpm/gt-0.4-alt1_41.nosrc.rpm (w1.gzdio)
Installing gt-0.4-alt1_41.src.rpm
Building target platforms: x86_64
Building for target x86_64
Executing(%prep): /bin/sh -e /usr/src/tmp/rpm-tmp.12612
+ umask 022
+ /bin/mkdir -p /usr/src/RPM/BUILD
+ cd /usr/src/RPM/BUILD
+ cd /usr/src/RPM/BUILD
+ rm -rf gt-0.4
+ echo 'Source #0 (gt-0.4-clean.tar.gz):'
Source #0 (gt-0.4-clean.tar.gz):
+ /usr/bin/gzip -dc /usr/src/RPM/SOURCES/gt-0.4-clean.tar.gz
+ /bin/tar -xf -
+ cd gt-0.4
+ /bin/chmod -c -Rf u+rwX,go-w .
+ echo 'Patch #0 (gt-0.4-noac3.patch):'
Patch #0 (gt-0.4-noac3.patch):
+ /usr/bin/patch -p1
patching file src/Makefile.in
patching file src/Makefile.am
patching file src/output.c
+ echo 'Patch #1 (gt-0.4-compile-fix.patch):'
Patch #1 (gt-0.4-compile-fix.patch):
+ /usr/bin/patch -p1
patching file src/instrum.c
+ echo 'Patch #2 (gt-0.4-optflags.patch):'
Patch #2 (gt-0.4-optflags.patch):
+ /usr/bin/patch -p1
patching file src/Makefile.in
patching file src/Makefile.am
+ echo 'Patch #3 (gt-0.4-config-default-velocity-layer.patch):'
Patch #3 (gt-0.4-config-default-velocity-layer.patch):
+ /usr/bin/patch -p1
patching file utils/unsf.c
patching file utils/unsf.man
+ echo 'Patch #4 (gt-0.4-ppc-compile-fix.patch):'
Patch #4 (gt-0.4-ppc-compile-fix.patch):
+ /usr/bin/patch -p1
patching file src/sfz2pat.c
patching file src/sfz2pat.l
+ echo 'Patch #5 (gt-0.4-unsf-bigendian-fix.patch):'
Patch #5 (gt-0.4-unsf-bigendian-fix.patch):
+ /usr/bin/patch -p1
patching file utils/unsf.c
+ echo 'Patch #6 (gt-0.4-unsf-tremolo.patch):'
Patch #6 (gt-0.4-unsf-tremolo.patch):
+ /usr/bin/patch -p1
patching file utils/unsf.c
+ echo 'Patch #7 (gt-0.4-gcc10.patch):'
Patch #7 (gt-0.4-gcc10.patch):
+ /usr/bin/patch -p1
patching file src/playmidi.c
+ cp -p src/README README.timidity
+ exit 0
Executing(%build): /bin/sh -e /usr/src/tmp/rpm-tmp.12612
+ umask 022
+ /bin/mkdir -p /usr/src/RPM/BUILD
+ cd /usr/src/RPM/BUILD
+ cd gt-0.4
+ CFLAGS='-pipe -frecord-gcc-switches -Wall -g -O2 -flto=auto'
+ export CFLAGS
+ CXXFLAGS='-pipe -frecord-gcc-switches -Wall -g -O2 -flto=auto'
+ export CXXFLAGS
+ FFLAGS='-pipe -frecord-gcc-switches -Wall -g -O2 -flto=auto'
+ export FFLAGS
+ FCFLAGS='-pipe -frecord-gcc-switches -Wall -g -O2 -flto=auto'
+ export FCFLAGS
+ '[' -n '' ']'
++ printf %s '-pipe -frecord-gcc-switches -Wall -g -O2 -flto=auto'
++ sed -r 's/(^|[[:space:]]+)-[^m][^[:space:]]*//g'
+ ASFLAGS=
+ export ASFLAGS
+ export lt_cv_deplibs_check_method=pass_all
+ lt_cv_deplibs_check_method=pass_all
+ readlink -e -- ./configure
+ xargs -ri dirname -- '{}'
+ xargs -ri find '{}' -type f '(' -name config.sub -or -name config.guess ')' -printf '%h/\n'
+ sort -u
+ xargs -rn1 install -pm755 -- /usr/share/gnu-config/config.sub /usr/share/gnu-config/config.guess
+ configure_runstatedir_flags=
+ grep -qF runstatedir=DIR ./configure
+ echo 'rpm-build: warning: ./configure script does not support --runstatedir'
rpm-build: warning: ./configure script does not support --runstatedir
+ ./configure --build=x86_64-alt-linux --host=x86_64-alt-linux --prefix=/usr --exec-prefix=/usr --bindir=/usr/bin --sbindir=/usr/sbin --sysconfdir=/etc --datadir=/usr/share --includedir=/usr/include --libdir=/usr/lib64 --libexecdir=/usr/lib --localstatedir=/var --sharedstatedir=/var/lib --mandir=/usr/share/man --infodir=/usr/share/info --disable-dependency-tracking --disable-silent-rules --without-included-gettext
checking for a BSD-compatible install... /usr/bin/ginstall -c
checking whether build environment is sane... yes
checking for gawk... gawk
checking whether make sets $(MAKE)... yes
checking for x86_64-alt-linux-gcc... x86_64-alt-linux-gcc
checking for C compiler default output file name... a.out
checking whether the C compiler works... yes
checking whether we are cross compiling... no
checking for suffix of executables... 
checking for suffix of object files... o
checking whether we are using the GNU C compiler... yes
checking whether x86_64-alt-linux-gcc accepts -g... yes
checking for x86_64-alt-linux-gcc option to accept ANSI C... none needed
checking for style of include used by make... GNU
checking dependency style of x86_64-alt-linux-gcc... none
checking for a BSD-compatible install... /usr/bin/ginstall -c
checking how to run the C preprocessor... x86_64-alt-linux-gcc -E
checking for egrep... grep -E
checking whether x86_64-alt-linux-gcc needs -traditional... no
checking for ANSI C header files... no
checking for sys/types.h... yes
checking for sys/stat.h... yes
checking for stdlib.h... yes
checking for string.h... yes
checking for memory.h... yes
checking for strings.h... yes
checking for inttypes.h... yes
checking for stdint.h... yes
checking for unistd.h... yes
checking for stdlib.h... (cached) yes
checking for GNU libc compatible malloc... yes
checking for dirent.h that defines DIR... yes
checking for library containing opendir... none required
checking for ANSI C header files... (cached) no
checking for ALSA CFLAGS... 
checking for ALSA LDFLAGS...  -lasound -lm -ldl -lpthread
checking for libasound headers version >= 1.0.0... found.
checking for snd_ctl_open in -lasound... yes
configure: checking "location of ncurses.h file"...
checking for Vorbis... yes
checking fcntl.h usability... yes
checking fcntl.h presence... yes
checking for fcntl.h... yes
checking sys/time.h usability... yes
checking sys/time.h presence... yes
checking for sys/time.h... yes
checking for unistd.h... (cached) yes
checking for string.h... (cached) yes
checking math.h usability... yes
checking math.h presence... yes
checking for math.h... yes
checking sys/mman.h usability... yes
checking sys/mman.h presence... yes
checking for sys/mman.h... yes
checking whether time.h and sys/time.h may both be included... yes
configure: creating ./config.status
config.status: creating Makefile
config.status: creating src/Makefile
config.status: creating utils/Makefile
config.status: creating src/config.h
config.status: executing depfiles commands
+ make
make: Entering directory '/usr/src/RPM/BUILD/gt-0.4'
Making all in src
make[1]: Entering directory '/usr/src/RPM/BUILD/gt-0.4/src'
make  all-am
make[2]: Entering directory '/usr/src/RPM/BUILD/gt-0.4/src'
x86_64-alt-linux-gcc -DHAVE_CONFIG_H -I. -I. -I.    -DDEFAULT_PATH=\"/usr/share/timidity\"  -Wall -W -Wshadow -Wpointer-arith -Wcast-align  -I/usr/include -pipe -frecord-gcc-switches -Wall -g -O2 -flto=auto -c `test -f 'timidity.c' || echo './'`timidity.c
x86_64-alt-linux-gcc -DHAVE_CONFIG_H -I. -I. -I.    -DDEFAULT_PATH=\"/usr/share/timidity\"  -Wall -W -Wshadow -Wpointer-arith -Wcast-align  -I/usr/include -pipe -frecord-gcc-switches -Wall -g -O2 -flto=auto -c `test -f 'common.c' || echo './'`common.c
common.c: In function 'close_file':
common.c:268:9: warning: pointer 'fp_4(D)' may be used after 'pclose' [-Wuse-after-free]
  268 |         fclose (fp);
      |         ^~~~~~~~~~~
common.c:266:9: note: call to 'pclose' here
  266 |     if (pclose (fp))            /* Any better ideas? */
      |         ^~~~~~~~~~~
x86_64-alt-linux-gcc -DHAVE_CONFIG_H -I. -I. -I.    -DDEFAULT_PATH=\"/usr/share/timidity\"  -Wall -W -Wshadow -Wpointer-arith -Wcast-align  -I/usr/include -pipe -frecord-gcc-switches -Wall -g -O2 -flto=auto -c `test -f 'readmidi.c' || echo './'`readmidi.c
readmidi.c: In function 'read_midi_file':
readmidi.c:2386:9: warning: ignoring return value of 'fread' declared with attribute 'warn_unused_result' [-Wunused-result]
 2386 |         fread (tmp, 1, 12, fp);
      |         ^~~~~~~~~~~~~~~~~~~~~~
readmidi.c: In function 'read_midi_event':
readmidi.c:1380:25: warning: ignoring return value of 'fread' declared with attribute 'warn_unused_result' [-Wunused-result]
 1380 |                         fread (&midi_port_number, 1, 1, fp);
      |                         ^~~~~~~~~~~~~~~~~~~~~~~~~~~~~~~~~~~
readmidi.c: In function 'sysex':
readmidi.c:517:15: warning: pointer 's_477' used after 'free' [-Wuse-after-free]
  517 |         *sysb = s[5];
      |         ~~~~~~^~~~~~
readmidi.c:515:9: note: call to 'free' here
  515 |         free (s);
      |         ^~~~~~~~
readmidi.c:516:15: warning: pointer 's_477' used after 'free' [-Wuse-after-free]
  516 |         *sysa = s[4];
      |         ~~~~~~^~~~~~
readmidi.c:515:9: note: call to 'free' here
  515 |         free (s);
      |         ^~~~~~~~
readmidi.c:527:19: warning: pointer 's_477' used after 'free' [-Wuse-after-free]
  527 |         *sysb = (s[0] == 0x7f);
      |                  ~^~~
readmidi.c:525:9: note: call to 'free' here
  525 |         free (s);
      |         ^~~~~~~~
readmidi.c:526:32: warning: pointer 's_477' used after 'free' [-Wuse-after-free]
  526 |         *sysa = s[4] - 0x40 + s[5] * 16;
      |                                ^
readmidi.c:525:9: note: call to 'free' here
  525 |         free (s);
      |         ^~~~~~~~
readmidi.c:526:18: warning: pointer 's_477' used after 'free' [-Wuse-after-free]
  526 |         *sysa = s[4] - 0x40 + s[5] * 16;
      |                  ^
readmidi.c:525:9: note: call to 'free' here
  525 |         free (s);
      |         ^~~~~~~~
x86_64-alt-linux-gcc -DHAVE_CONFIG_H -I. -I. -I.    -DDEFAULT_PATH=\"/usr/share/timidity\"  -Wall -W -Wshadow -Wpointer-arith -Wcast-align  -I/usr/include -pipe -frecord-gcc-switches -Wall -g -O2 -flto=auto -c `test -f 'playmidi.c' || echo './'`playmidi.c
playmidi.c: In function 'select_sample':
playmidi.c:284:29: warning: variable 'midfreq' set but not used [-Wunused-but-set-variable]
  284 |     int32   f, cdiff, diff, midfreq;
      |                             ^~~~~~~
playmidi.c: In function 'clone_voice':
playmidi.c:1033:39: warning: variable 'chorus_feedback' set but not used [-Wunused-but-set-variable]
 1033 |     int     lfo_frequency, lfo_depth, chorus_feedback;
      |                                       ^~~~~~~~~~~~~~~
playmidi.c:1033:28: warning: variable 'lfo_depth' set but not used [-Wunused-but-set-variable]
 1033 |     int     lfo_frequency, lfo_depth, chorus_feedback;
      |                            ^~~~~~~~~
playmidi.c:1033:13: warning: variable 'lfo_frequency' set but not used [-Wunused-but-set-variable]
 1033 |     int     lfo_frequency, lfo_depth, chorus_feedback;
      |             ^~~~~~~~~~~~~
playmidi.c:1026:48: warning: variable 'milli' set but not used [-Wunused-but-set-variable]
 1026 |     int     w, k, played_note, chorus, reverb, milli;
      |                                                ^~~~~
x86_64-alt-linux-gcc -DHAVE_CONFIG_H -I. -I. -I.    -DDEFAULT_PATH=\"/usr/share/timidity\"  -Wall -W -Wshadow -Wpointer-arith -Wcast-align  -I/usr/include -pipe -frecord-gcc-switches -Wall -g -O2 -flto=auto -c `test -f 'mix.c' || echo './'`mix.c
x86_64-alt-linux-gcc -DHAVE_CONFIG_H -I. -I. -I.    -DDEFAULT_PATH=\"/usr/share/timidity\"  -Wall -W -Wshadow -Wpointer-arith -Wcast-align  -I/usr/include -pipe -frecord-gcc-switches -Wall -g -O2 -flto=auto -c `test -f 'instrum.c' || echo './'`instrum.c
x86_64-alt-linux-gcc -DHAVE_CONFIG_H -I. -I. -I.    -DDEFAULT_PATH=\"/usr/share/timidity\"  -Wall -W -Wshadow -Wpointer-arith -Wcast-align  -I/usr/include -pipe -frecord-gcc-switches -Wall -g -O2 -flto=auto -c `test -f 'tables.c' || echo './'`tables.c
x86_64-alt-linux-gcc -DHAVE_CONFIG_H -I. -I. -I.    -DDEFAULT_PATH=\"/usr/share/timidity\"  -Wall -W -Wshadow -Wpointer-arith -Wcast-align  -I/usr/include -pipe -frecord-gcc-switches -Wall -g -O2 -flto=auto -c `test -f 'controls.c' || echo './'`controls.c
x86_64-alt-linux-gcc -DHAVE_CONFIG_H -I. -I. -I.    -DDEFAULT_PATH=\"/usr/share/timidity\"  -Wall -W -Wshadow -Wpointer-arith -Wcast-align  -I/usr/include -pipe -frecord-gcc-switches -Wall -g -O2 -flto=auto -c `test -f 'output.c' || echo './'`output.c
x86_64-alt-linux-gcc -DHAVE_CONFIG_H -I. -I. -I.    -DDEFAULT_PATH=\"/usr/share/timidity\"  -Wall -W -Wshadow -Wpointer-arith -Wcast-align  -I/usr/include -pipe -frecord-gcc-switches -Wall -g -O2 -flto=auto -c `test -f 'filter.c' || echo './'`filter.c
x86_64-alt-linux-gcc -DHAVE_CONFIG_H -I. -I. -I.    -DDEFAULT_PATH=\"/usr/share/timidity\"  -Wall -W -Wshadow -Wpointer-arith -Wcast-align  -I/usr/include -pipe -frecord-gcc-switches -Wall -g -O2 -flto=auto -c `test -f 'wave_a.c' || echo './'`wave_a.c
wave_a.c: In function 'update_header':
wave_a.c:223:5: warning: ignoring return value of 'write' declared with attribute 'warn_unused_result' [-Wunused-result]
  223 |     write (dpm.fd, &tmp, 4);
      |     ^~~~~~~~~~~~~~~~~~~~~~~
wave_a.c: In function 'open_output':
wave_a.c:184:5: warning: ignoring return value of 'write' declared with attribute 'warn_unused_result' [-Wunused-result]
  184 |     write (dpm.fd, RIFFheader, 44);
      |     ^~~~~~~~~~~~~~~~~~~~~~~~~~~~~~
x86_64-alt-linux-gcc -DHAVE_CONFIG_H -I. -I. -I.    -DDEFAULT_PATH=\"/usr/share/timidity\"  -Wall -W -Wshadow -Wpointer-arith -Wcast-align  -I/usr/include -pipe -frecord-gcc-switches -Wall -g -O2 -flto=auto -c `test -f 'dumb_c.c' || echo './'`dumb_c.c
dumb_c.c: In function 'ctl_master_volume':
dumb_c.c:159:24: warning: parameter 'mv' set but not used [-Wunused-but-set-parameter]
  159 | ctl_master_volume (int mv)
      |                    ~~~~^~
dumb_c.c: In function 'ctl_note':
dumb_c.c:200:15: warning: parameter 'v' set but not used [-Wunused-but-set-parameter]
  200 | ctl_note (int v)
      |           ~~~~^
dumb_c.c: In function 'ctl_program':
dumb_c.c:206:18: warning: parameter 'ch' set but not used [-Wunused-but-set-parameter]
  206 | ctl_program (int ch, int val, const char *name)
      |              ~~~~^~
dumb_c.c:206:43: warning: parameter 'name' set but not used [-Wunused-but-set-parameter]
  206 | ctl_program (int ch, int val, const char *name)
      |                               ~~~~~~~~~~~~^~~~
dumb_c.c: In function 'ctl_bank':
dumb_c.c:213:15: warning: parameter 'ch' set but not used [-Wunused-but-set-parameter]
  213 | ctl_bank (int ch, int val, int var, const char *name)
      |           ~~~~^~
dumb_c.c:213:49: warning: parameter 'name' set but not used [-Wunused-but-set-parameter]
  213 | ctl_bank (int ch, int val, int var, const char *name)
      |                                     ~~~~~~~~~~~~^~~~
dumb_c.c: In function 'ctl_volume':
dumb_c.c:220:17: warning: parameter 'ch' set but not used [-Wunused-but-set-parameter]
  220 | ctl_volume (int ch, int val)
      |             ~~~~^~
dumb_c.c: In function 'ctl_expression':
dumb_c.c:226:21: warning: parameter 'ch' set but not used [-Wunused-but-set-parameter]
  226 | ctl_expression (int ch, int val)
      |                 ~~~~^~
dumb_c.c: In function 'ctl_panning':
dumb_c.c:232:18: warning: parameter 'ch' set but not used [-Wunused-but-set-parameter]
  232 | ctl_panning (int ch, int val)
      |              ~~~~^~
dumb_c.c: In function 'ctl_sustain':
dumb_c.c:238:18: warning: parameter 'ch' set but not used [-Wunused-but-set-parameter]
  238 | ctl_sustain (int ch, int val, int letter)
      |              ~~~~^~
dumb_c.c: In function 'ctl_pitch_bend':
dumb_c.c:244:41: warning: parameter 'mod' set but not used [-Wunused-but-set-parameter]
  244 | ctl_pitch_bend (int ch, int val, uint32 mod)
      |                                  ~~~~~~~^~~
dumb_c.c: In function 'ctl_misc_controller':
dumb_c.c:320:25: warning: parameter 'ch' set but not used [-Wunused-but-set-parameter]
  320 | ctl_misc_controller(int ch, int val, int col, int letter, int use_color)
      |                     ~~~~^~
x86_64-alt-linux-gcc -DHAVE_CONFIG_H -I. -I. -I.    -DDEFAULT_PATH=\"/usr/share/timidity\"  -Wall -W -Wshadow -Wpointer-arith -Wcast-align  -I/usr/include -pipe -frecord-gcc-switches -Wall -g -O2 -flto=auto -c `test -f 'sndfont.c' || echo './'`sndfont.c
sndfont.c: In function 'load_one_side':
sndfont.c:608:13: warning: variable 'samplerate_save' set but not used [-Wunused-but-set-variable]
  608 |     uint32  samplerate_save;
      |             ^~~~~~~~~~~~~~~
sndfont.c: In function 'convert_volume_envelope':
sndfont.c:1778:44: warning: parameter 'preset' set but not used [-Wunused-but-set-parameter]
 1778 |                          int banknum , int preset)
      |                                        ~~~~^~~~~~
sndfont.c: In function 'convert_modulation_envelope':
sndfont.c:1897:34: warning: parameter 'banknum' set but not used [-Wunused-but-set-parameter]
 1897 |                              int banknum, int preset)
      |                              ~~~~^~~~~~~
sndfont.c: At top level:
sndfont.c:1098:1: warning: 'intersect_rvec' defined but not used [-Wunused-function]
 1098 | intersect_rvec (int lr, int kr)
      | ^~~~~~~~~~~~~~
sndfont.c:1087:1: warning: 'subset_rvec' defined but not used [-Wunused-function]
 1087 | subset_rvec (int lr, int kr)
      | ^~~~~~~~~~~
sndfont.c:1077:1: warning: 'union_rvec' defined but not used [-Wunused-function]
 1077 | union_rvec (int lr, int kr)
      | ^~~~~~~~~~
sndfont.c:1069:1: warning: 'clear_rvec' defined but not used [-Wunused-function]
 1069 | clear_rvec ()
      | ^~~~~~~~~~
sndfont.c:1055:1: warning: 'intersect_vvec' defined but not used [-Wunused-function]
 1055 | intersect_vvec (int lr, int vr)
      | ^~~~~~~~~~~~~~
sndfont.c:1044:1: warning: 'union_vvec' defined but not used [-Wunused-function]
 1044 | union_vvec (int lr, int vr)
      | ^~~~~~~~~~
sndfont.c:1036:1: warning: 'clear_vvec' defined but not used [-Wunused-function]
 1036 | clear_vvec ()
      | ^~~~~~~~~~
sndfont.c:1022:1: warning: 'subset_kvec' defined but not used [-Wunused-function]
 1022 | subset_kvec (int lr, int kr)
      | ^~~~~~~~~~~
sndfont.c:1011:1: warning: 'intersect_kvec' defined but not used [-Wunused-function]
 1011 | intersect_kvec (int lr, int kr)
      | ^~~~~~~~~~~~~~
sndfont.c:1000:1: warning: 'union_kvec' defined but not used [-Wunused-function]
 1000 | union_kvec (int lr, int kr)
      | ^~~~~~~~~~
sndfont.c:992:1: warning: 'new_kvec' defined but not used [-Wunused-function]
  992 | new_kvec (int lr)
      | ^~~~~~~~
sndfont.c:984:1: warning: 'clear_kvec' defined but not used [-Wunused-function]
  984 | clear_kvec ()
      | ^~~~~~~~~~
x86_64-alt-linux-gcc -DHAVE_CONFIG_H -I. -I. -I.    -DDEFAULT_PATH=\"/usr/share/timidity\"  -Wall -W -Wshadow -Wpointer-arith -Wcast-align  -I/usr/include -pipe -frecord-gcc-switches -Wall -g -O2 -flto=auto -c `test -f 'readsbk.c' || echo './'`readsbk.c
readsbk.c: In function 'load_sbk':
readsbk.c:145:13: warning: pointer targets in passing argument 1 of 'READDW' differ in signedness [-Wpointer-sign]
  145 |     READDW (&sf->sbkh.size, fd);
      |             ^~~~~~~~~~~~~~
      |             |
      |             int32 * {aka int *}
readsbk.c:28:17: note: expected 'uint32 *' {aka 'unsigned int *'} but argument is of type 'int32 *' {aka 'int *'}
   28 | READDW (uint32 *vp, FILE * fd)
      |         ~~~~~~~~^~
readsbk.c:153:21: warning: pointer targets in passing argument 1 of 'READDW' differ in signedness [-Wpointer-sign]
  153 |             READDW (&chunk.size, fd);
      |                     ^~~~~~~~~~~
      |                     |
      |                     int32 * {aka int *}
readsbk.c:28:17: note: expected 'uint32 *' {aka 'unsigned int *'} but argument is of type 'int32 *' {aka 'int *'}
   28 | READDW (uint32 *vp, FILE * fd)
      |         ~~~~~~~~^~
readsbk.c:64:25: warning: ignoring return value of 'fread' declared with attribute 'warn_unused_result' [-Wunused-result]
   64 | #define READID(var,fd)  fread(var, 1, 4, fd)
      |                         ^~~~~~~~~~~~~~~~~~~~
readsbk.c:144:5: note: in expansion of macro 'READID'
  144 |     READID (sf->sbkh.riff, fd);
      |     ^~~~~~
readsbk.c:64:25: warning: ignoring return value of 'fread' declared with attribute 'warn_unused_result' [-Wunused-result]
   64 | #define READID(var,fd)  fread(var, 1, 4, fd)
      |                         ^~~~~~~~~~~~~~~~~~~~
readsbk.c:146:5: note: in expansion of macro 'READID'
  146 |     READID (sf->sbkh.sfbk, fd);
      |     ^~~~~~
readsbk.c:64:25: warning: ignoring return value of 'fread' declared with attribute 'warn_unused_result' [-Wunused-result]
   64 | #define READID(var,fd)  fread(var, 1, 4, fd)
      |                         ^~~~~~~~~~~~~~~~~~~~
readsbk.c:150:9: note: in expansion of macro 'READID'
  150 |         READID (chunk.id, fd);
      |         ^~~~~~
readsbk.c:64:25: warning: ignoring return value of 'fread' declared with attribute 'warn_unused_result' [-Wunused-result]
   64 | #define READID(var,fd)  fread(var, 1, 4, fd)
      |                         ^~~~~~~~~~~~~~~~~~~~
readsbk.c:154:13: note: in expansion of macro 'READID'
  154 |             READID (subchunk.id, fd);
      |             ^~~~~~
readsbk.c: In function 'load_sample_names':
readsbk.c:45:25: warning: ignoring return value of 'fread' declared with attribute 'warn_unused_result' [-Wunused-result]
   45 | #define READSTR(var,fd) fread(var, 20, 1, fd)
      |                         ^~~~~~~~~~~~~~~~~~~~~
readsbk.c:252:9: note: in expansion of macro 'READSTR'
  252 |         READSTR (sf->samplenames[i].name, fd);
      |         ^~~~~~~
readsbk.c: In function 'load_preset_header':
readsbk.c:45:25: warning: ignoring return value of 'fread' declared with attribute 'warn_unused_result' [-Wunused-result]
   45 | #define READSTR(var,fd) fread(var, 20, 1, fd)
      |                         ^~~~~~~~~~~~~~~~~~~~~
readsbk.c:264:9: note: in expansion of macro 'READSTR'
  264 |         READSTR (sf->presethdr[i].name, fd);
      |         ^~~~~~~
readsbk.c:68:40: warning: ignoring return value of 'fread' declared with attribute 'warn_unused_result' [-Wunused-result]
   68 | #define SKIPDW(fd)      {uint32 dummy; fread(&dummy, 4, 1, fd);}
      |                                        ^~~~~~~~~~~~~~~~~~~~~~~
readsbk.c:270:9: note: in expansion of macro 'SKIPDW'
  270 |         SKIPDW (fd);            /* lib */
      |         ^~~~~~
readsbk.c:68:40: warning: ignoring return value of 'fread' declared with attribute 'warn_unused_result' [-Wunused-result]
   68 | #define SKIPDW(fd)      {uint32 dummy; fread(&dummy, 4, 1, fd);}
      |                                        ^~~~~~~~~~~~~~~~~~~~~~~
readsbk.c:271:9: note: in expansion of macro 'SKIPDW'
  271 |         SKIPDW (fd);            /* genre */
      |         ^~~~~~
readsbk.c:68:40: warning: ignoring return value of 'fread' declared with attribute 'warn_unused_result' [-Wunused-result]
   68 | #define SKIPDW(fd)      {uint32 dummy; fread(&dummy, 4, 1, fd);}
      |                                        ^~~~~~~~~~~~~~~~~~~~~~~
readsbk.c:272:9: note: in expansion of macro 'SKIPDW'
  272 |         SKIPDW (fd);            /* morph */
      |         ^~~~~~
readsbk.c: In function 'load_inst_header':
readsbk.c:45:25: warning: ignoring return value of 'fread' declared with attribute 'warn_unused_result' [-Wunused-result]
   45 | #define READSTR(var,fd) fread(var, 20, 1, fd)
      |                         ^~~~~~~~~~~~~~~~~~~~~
readsbk.c:284:9: note: in expansion of macro 'READSTR'
  284 |         READSTR (sf->insthdr[i].name, fd);
      |         ^~~~~~~
readsbk.c: In function 'load_bag':
readsbk.c:67:40: warning: ignoring return value of 'fread' declared with attribute 'warn_unused_result' [-Wunused-result]
   67 | #define SKIPW(fd)       {uint16 dummy; fread(&dummy, 2, 1, fd);}
      |                                        ^~~~~~~~~~~~~~~~~~~~~~~
readsbk.c:301:9: note: in expansion of macro 'SKIPW'
  301 |         SKIPW (fd);             /* mod */
      |         ^~~~~
readsbk.c: In function 'load_sample_info':
readsbk.c:45:25: warning: ignoring return value of 'fread' declared with attribute 'warn_unused_result' [-Wunused-result]
   45 | #define READSTR(var,fd) fread(var, 20, 1, fd)
      |                         ^~~~~~~~~~~~~~~~~~~~~
readsbk.c:344:13: note: in expansion of macro 'READSTR'
  344 |             READSTR (sf->samplenames[i].name, fd);
      |             ^~~~~~~
readsbk.c:65:25: warning: ignoring return value of 'fread' declared with attribute 'warn_unused_result' [-Wunused-result]
   65 | #define READB(var,fd)   fread(var, 1, 1, fd)
      |                         ^~~~~~~~~~~~~~~~~~~~
readsbk.c:351:13: note: in expansion of macro 'READB'
  351 |             READB (&sf->sampleinfo[i].originalPitch, fd);
      |             ^~~~~
readsbk.c:65:25: warning: ignoring return value of 'fread' declared with attribute 'warn_unused_result' [-Wunused-result]
   65 | #define READB(var,fd)   fread(var, 1, 1, fd)
      |                         ^~~~~~~~~~~~~~~~~~~~
readsbk.c:352:13: note: in expansion of macro 'READB'
  352 |             READB (&sf->sampleinfo[i].pitchCorrection, fd);
      |             ^~~~~
x86_64-alt-linux-gcc -DHAVE_CONFIG_H -I. -I. -I.    -DDEFAULT_PATH=\"/usr/share/timidity\"  -Wall -W -Wshadow -Wpointer-arith -Wcast-align  -I/usr/include -pipe -frecord-gcc-switches -Wall -g -O2 -flto=auto -c `test -f 'sfz.c' || echo './'`sfz.c
In file included from sfz.c:2:
./sfz2pat.l: In function 'read_sample':
./sfz2pat.l:1686:26: warning: pointer targets in passing argument 2 of 'ov_read' differ in signedness [-Wpointer-sign]
 1686 |     if (ret == 0) {
      |                          ^         
      |                          |
      |                          unsigned char *
In file included from ./sfz2pat.l:44:
/usr/include/vorbis/vorbisfile.h:193:46: note: expected 'char *' but argument is of type 'unsigned char *'
  193 | extern long ov_read(OggVorbis_File *vf,char *buffer,int length,
      |                                        ~~~~~~^~~~~~
./sfz2pat.l:1488:37: warning: variable 'all_length' set but not used [-Wunused-but-set-variable]
 1488 |         int32 aiff_offset=-1, aiff_blocksize=-1, aiff_numsamples=-1, samplesize = 16;
      |                                     ^~~~~~~~~~
sfz2pat.c: At top level:
sfz2pat.c:2115:16: warning: 'input' defined but not used [-Wunused-function]
 2115 |     static int input  (void)
      |                ^~~~~
x86_64-alt-linux-gcc -DHAVE_CONFIG_H -I. -I. -I.    -DDEFAULT_PATH=\"/usr/share/timidity\"  -Wall -W -Wshadow -Wpointer-arith -Wcast-align  -I/usr/include -pipe -frecord-gcc-switches -Wall -g -O2 -flto=auto -c `test -f 'resample.c' || echo './'`resample.c
resample.c: In function 'porta_resample_voice':
resample.c:1141:9: warning: variable 'loop' set but not used [-Wunused-but-set-variable]
 1141 |     int loop;
      |         ^~~~
x86_64-alt-linux-gcc -DHAVE_CONFIG_H -I. -I. -I.    -DDEFAULT_PATH=\"/usr/share/timidity\"  -Wall -W -Wshadow -Wpointer-arith -Wcast-align  -I/usr/include -pipe -frecord-gcc-switches -Wall -g -O2 -flto=auto -c `test -f 'resample32.c' || echo './'`resample32.c
resample32.c: In function 'porta_resample_voice':
resample32.c:1041:9: warning: variable 'loop' set but not used [-Wunused-but-set-variable]
 1041 |     int loop;
      |         ^~~~
x86_64-alt-linux-gcc -DHAVE_CONFIG_H -I. -I. -I.    -DDEFAULT_PATH=\"/usr/share/timidity\"  -Wall -W -Wshadow -Wpointer-arith -Wcast-align  -I/usr/include -pipe -frecord-gcc-switches -Wall -g -O2 -flto=auto -c `test -f 'resample_l.c' || echo './'`resample_l.c
resample_l.c: In function 'porta_resample_voice':
resample_l.c:1018:9: warning: variable 'loop' set but not used [-Wunused-but-set-variable]
 1018 |     int loop;
      |         ^~~~
x86_64-alt-linux-gcc -DHAVE_CONFIG_H -I. -I. -I.    -DDEFAULT_PATH=\"/usr/share/timidity\"  -Wall -W -Wshadow -Wpointer-arith -Wcast-align  -I/usr/include -pipe -frecord-gcc-switches -Wall -g -O2 -flto=auto -c `test -f 'resample_f.c' || echo './'`resample_f.c
resample_f.c: In function 'porta_resample_voice':
resample_f.c:4994:9: warning: variable 'loop' set but not used [-Wunused-but-set-variable]
 4994 |     int loop;
      |         ^~~~
x86_64-alt-linux-gcc -DHAVE_CONFIG_H -I. -I. -I.    -DDEFAULT_PATH=\"/usr/share/timidity\"  -Wall -W -Wshadow -Wpointer-arith -Wcast-align  -I/usr/include -pipe -frecord-gcc-switches -Wall -g -O2 -flto=auto -c `test -f 'resample_s.c' || echo './'`resample_s.c
resample_s.c: In function 'porta_resample_voice':
resample_s.c:11549:9: warning: variable 'loop' set but not used [-Wunused-but-set-variable]
11549 |     int loop;
      |         ^~~~
x86_64-alt-linux-gcc -DHAVE_CONFIG_H -I. -I. -I.    -DDEFAULT_PATH=\"/usr/share/timidity\"  -Wall -W -Wshadow -Wpointer-arith -Wcast-align  -I/usr/include -pipe -frecord-gcc-switches -Wall -g -O2 -flto=auto -c `test -f 'resample_m.c' || echo './'`resample_m.c
resample_m.c: In function 'porta_resample_voice':
resample_m.c:11336:9: warning: variable 'loop' set but not used [-Wunused-but-set-variable]
11336 |     int loop;
      |         ^~~~
x86_64-alt-linux-gcc -DHAVE_CONFIG_H -I. -I. -I.    -DDEFAULT_PATH=\"/usr/share/timidity\"  -Wall -W -Wshadow -Wpointer-arith -Wcast-align  -I/usr/include -pipe -frecord-gcc-switches -Wall -g -O2 -flto=auto -c `test -f 'cfg.c' || echo './'`cfg.c
cfg.c:2591:16: warning: 'input' defined but not used [-Wunused-function]
 2591 |     static int input  (void)
      |                ^~~~~
x86_64-alt-linux-gcc -DHAVE_CONFIG_H -I. -I. -I.    -DDEFAULT_PATH=\"/usr/share/timidity\"  -Wall -W -Wshadow -Wpointer-arith -Wcast-align  -I/usr/include -pipe -frecord-gcc-switches -Wall -g -O2 -flto=auto -c `test -f 'alsa_a.c' || echo './'`alsa_a.c
alsa_a.c: In function 'open_output':
alsa_a.c:441:40: warning: pointer targets in passing argument 2 of 'snd_pcm_hw_params_get_rate' differ in signedness [-Wpointer-sign]
  441 |     snd_pcm_hw_params_get_rate (pinfo, &tmp, &dir);
      |                                        ^~~~
      |                                        |
      |                                        int *
In file included from /usr/include/alsa/asoundlib.h:56,
                 from alsa_a.c:42:
/usr/include/alsa/pcm.h:825:81: note: expected 'unsigned int *' but argument is of type 'int *'
  825 | int snd_pcm_hw_params_get_rate(const snd_pcm_hw_params_t *params, unsigned int *val, int *dir);
      |                                                                   ~~~~~~~~~~~~~~^~~
alsa_a.c: In function 'output_pause':
alsa_a.c:795:1: warning: control reaches end of non-void function [-Wreturn-type]
  795 | }
      | ^
x86_64-alt-linux-gcc -DDEFAULT_PATH=\"/usr/share/timidity\"  -Wall -W -Wshadow -Wpointer-arith -Wcast-align  -I/usr/include -pipe -frecord-gcc-switches -Wall -g -O2 -flto=auto   -o gt  timidity.o common.o readmidi.o playmidi.o mix.o instrum.o tables.o controls.o output.o filter.o wave_a.o dumb_c.o  sndfont.o readsbk.o sfz.o resample.o resample32.o resample_l.o resample_f.o resample_s.o resample_m.o cfg.o alsa_a.o -lasound -lm -ldl -lpthread  -lvorbisfile -L/usr/lib -lvorbis -lm 
In function 'fread',
    inlined from 'read_midi_file' at readmidi.c:2386:2,
    inlined from 'play_midi_file' at playmidi.c:4363:13,
    inlined from 'dumb_pass_playing_list' at playmidi.c:4402:10,
    inlined from 'dumb_pass_playing_list' at playmidi.c:4394:1:
/usr/include/bits/stdio2.h:213:12: warning: call to '__fread_chk_warn' declared with attribute warning: fread called with bigger size * nmemb than length of destination buffer [-Wattribute-warning]
  213 |     return __fread_chk_warn (__ptr, sz, __size, __n, __stream);
      |            ^
x86_64-alt-linux-gcc -DHAVE_CONFIG_H -I. -I. -I.    -DDEFAULT_PATH=\"/usr/share/timidity\"  -Wall -W -Wshadow -Wpointer-arith -Wcast-align  -I/usr/include -pipe -frecord-gcc-switches -Wall -g -O2 -flto=auto -c `test -f 'sf2cfg.c' || echo './'`sf2cfg.c
x86_64-alt-linux-gcc -DDEFAULT_PATH=\"/usr/share/timidity\"  -Wall -W -Wshadow -Wpointer-arith -Wcast-align  -I/usr/include -pipe -frecord-gcc-switches -Wall -g -O2 -flto=auto   -o sf2cfg  sf2cfg.o readsbk.o  
x86_64-alt-linux-gcc -DHAVE_CONFIG_H -I. -I. -I.    -DDEFAULT_PATH=\"/usr/share/timidity\"  -Wall -W -Wshadow -Wpointer-arith -Wcast-align  -I/usr/include -pipe -frecord-gcc-switches -Wall -g -O2 -flto=auto -c `test -f 'wav2pat.c' || echo './'`wav2pat.c
wav2pat.c: In function 'main':
wav2pat.c:255:10: warning: pointer targets in passing argument 1 of 'strcpy' differ in signedness [-Wpointer-sign]
  255 |   strcpy(point, "Copyleft 1995 EWE&U Conductions and one Retreated Gravi\032");
      |          ^~~~~
      |          |
      |          unsigned char *
In file included from /usr/include/features.h:503,
                 from /usr/include/bits/libc-header-start.h:33,
                 from /usr/include/stdio.h:27,
                 from wav2pat.c:26:
/usr/include/bits/string_fortified.h:77:1: note: expected 'char *' but argument is of type 'unsigned char *'
   77 | __NTH (strcpy (char *__restrict __dest, const char *__restrict __src))
      | ^~~~~
wav2pat.c:267:10: warning: pointer targets in passing argument 1 of 'strcpy' differ in signedness [-Wpointer-sign]
  267 |   strcpy(point, "Bleahnoise"); /* instrument name */
      |          ^~~~~
      |          |
      |          unsigned char *
/usr/include/bits/string_fortified.h:77:1: note: expected 'char *' but argument is of type 'unsigned char *'
   77 | __NTH (strcpy (char *__restrict __dest, const char *__restrict __src))
      | ^~~~~
wav2pat.c:279:10: warning: pointer targets in passing argument 1 of 'strcpy' differ in signedness [-Wpointer-sign]
  279 |   strcpy(point, "bleah"); /* wave name */
      |          ^~~~~
      |          |
      |          unsigned char *
/usr/include/bits/string_fortified.h:77:1: note: expected 'char *' but argument is of type 'unsigned char *'
   77 | __NTH (strcpy (char *__restrict __dest, const char *__restrict __src))
      | ^~~~~
wav2pat.c:319:3: warning: ignoring return value of 'write' declared with attribute 'warn_unused_result' [-Wunused-result]
  319 |   write(STDOUT_FILENO, thing, 335);
      |   ^~~~~~~~~~~~~~~~~~~~~~~~~~~~~~~~
wav2pat.c:331:7: warning: ignoring return value of 'write' declared with attribute 'warn_unused_result' [-Wunused-result]
  331 |       write(STDOUT_FILENO, thing, c);
      |       ^~~~~~~~~~~~~~~~~~~~~~~~~~~~~~
x86_64-alt-linux-gcc -DDEFAULT_PATH=\"/usr/share/timidity\"  -Wall -W -Wshadow -Wpointer-arith -Wcast-align  -I/usr/include -pipe -frecord-gcc-switches -Wall -g -O2 -flto=auto   -o wav2pat  wav2pat.o  
x86_64-alt-linux-gcc -DHAVE_CONFIG_H -I. -I. -I.    -DDEFAULT_PATH=\"/usr/share/timidity\"  -Wall -W -Wshadow -Wpointer-arith -Wcast-align  -I/usr/include -pipe -frecord-gcc-switches -Wall -g -O2 -flto=auto -c `test -f 'sfz2pat.c' || echo './'`sfz2pat.c
./sfz2pat.l: In function 'read_sample':
./sfz2pat.l:1686:26: warning: pointer targets in passing argument 2 of 'ov_read' differ in signedness [-Wpointer-sign]
 1686 |     if (ret == 0) {
      |                          ^         
      |                          |
      |                          unsigned char *
In file included from ./sfz2pat.l:44:
/usr/include/vorbis/vorbisfile.h:193:46: note: expected 'char *' but argument is of type 'unsigned char *'
  193 | extern long ov_read(OggVorbis_File *vf,char *buffer,int length,
      |                                        ~~~~~~^~~~~~
./sfz2pat.l:1488:37: warning: variable 'all_length' set but not used [-Wunused-but-set-variable]
 1488 |         int32 aiff_offset=-1, aiff_blocksize=-1, aiff_numsamples=-1, samplesize = 16;
      |                                     ^~~~~~~~~~
./sfz2pat.l: In function 'make_pat':
./sfz2pat.l:2254:2: warning: ignoring return value of 'write' declared with attribute 'warn_unused_result' [-Wunused-result]
 2254 | 
      |  ^                                    
./sfz2pat.l:2258:10: warning: ignoring return value of 'write' declared with attribute 'warn_unused_result' [-Wunused-result]
 2258 |         else
      |          ^~~                                                                
./sfz2pat.l:2260:3: warning: ignoring return value of 'write' declared with attribute 'warn_unused_result' [-Wunused-result]
 2260 | 
      |   ^                                                                   
sfz2pat.c: At top level:
sfz2pat.c:2115:16: warning: 'input' defined but not used [-Wunused-function]
 2115 |     static int input  (void)
      |                ^~~~~
x86_64-alt-linux-gcc -DDEFAULT_PATH=\"/usr/share/timidity\"  -Wall -W -Wshadow -Wpointer-arith -Wcast-align  -I/usr/include -pipe -frecord-gcc-switches -Wall -g -O2 -flto=auto   -o sfz2pat  sfz2pat.o tables.o -lvorbisfile -L/usr/lib -lvorbis -lm 
make[2]: Leaving directory '/usr/src/RPM/BUILD/gt-0.4/src'
make[1]: Leaving directory '/usr/src/RPM/BUILD/gt-0.4/src'
Making all in utils
make[1]: Entering directory '/usr/src/RPM/BUILD/gt-0.4/utils'
x86_64-alt-linux-gcc -DHAVE_CONFIG_H -I. -I. -I../src     -pipe -frecord-gcc-switches -Wall -g -O2 -flto=auto -c `test -f 'unsf.c' || echo './'`unsf.c
unsf.c: In function 'grab_soundfont_sample':
unsf.c:1562:8: warning: variable 'mod_delay' set but not used [-Wunused-but-set-variable]
 1562 |    int mod_delay, mod_attack, mod_hold, mod_decay, mod_release, mod_sustain;
      |        ^~~~~~~~~
unsf.c: In function 'grab_soundfont':
unsf.c:2131:30: error: implicit declaration of function 'isspace' [-Wimplicit-function-declaration]
 2131 |          while ((i >= 0) && (isspace(s[i]))) {
      |                              ^~~~~~~
unsf.c:69:1: note: include '<ctype.h>' or provide a declaration of 'isspace'
   68 | #include <sys/stat.h>
  +++ |+#include <ctype.h>
   69 | #include <sys/types.h>
unsf.c:2083:8: warning: variable 'global_pzone_index' set but not used [-Wunused-but-set-variable]
 2083 |    int global_pzone_index;
      |        ^~~~~~~~~~~~~~~~~~
unsf.c:2081:8: warning: variable 'global_izone_index' set but not used [-Wunused-but-set-variable]
 2081 |    int global_izone_index;
      |        ^~~~~~~~~~~~~~~~~~
unsf.c: In function 'grab_soundfont_banks':
unsf.c:2522:32: warning: unused variable 'num' [-Wunused-variable]
 2522 |    int pnum, inum, jnum, lnum, num, drum;
      |                                ^~~
unsf.c: In function 'shorten_drum_names':
unsf.c:2790:19: warning: variable 'velcount' set but not used [-Wunused-but-set-variable]
 2790 |         int i, j, velcount, right_patches;
      |                   ^~~~~~~~
unsf.c: In function 'make_patch_files':
unsf.c:3018:18: warning: unused variable 'rcode' [-Wunused-variable]
 3018 |     int i, j, k, rcode, velcount, right_patches;
      |                  ^~~~~
unsf.c: In function 'add_soundfont_patches':
unsf.c:3352:31: warning: ignoring return value of 'fread' declared with attribute 'warn_unused_result' [-Wunused-result]
 3352 |                               fread(sf_presets[i].achPresetName, 20, 1, f);
      |                               ^~~~~~~~~~~~~~~~~~~~~~~~~~~~~~~~~~~~~~~~~~~~
unsf.c:3405:31: warning: ignoring return value of 'fread' declared with attribute 'warn_unused_result' [-Wunused-result]
 3405 |                               fread(sf_instruments[i].achInstName, 20, 1, f);
      |                               ^~~~~~~~~~~~~~~~~~~~~~~~~~~~~~~~~~~~~~~~~~~~~~
unsf.c:3453:31: warning: ignoring return value of 'fread' declared with attribute 'warn_unused_result' [-Wunused-result]
 3453 |                               fread(sf_samples[i].achSampleName, 20, 1, f);
      |                               ^~~~~~~~~~~~~~~~~~~~~~~~~~~~~~~~~~~~~~~~~~~~
unsf.c: At top level:
unsf.c:1120:12: warning: 'key2freq' defined but not used [-Wunused-function]
 1120 | static int key2freq(int note, int cents)
      |            ^~~~~~~~
make[1]: *** [Makefile:250: unsf.o] Error 1
make[1]: Leaving directory '/usr/src/RPM/BUILD/gt-0.4/utils'
make: *** [Makefile:167: all-recursive] Error 1
make: Leaving directory '/usr/src/RPM/BUILD/gt-0.4'
error: Bad exit status from /usr/src/tmp/rpm-tmp.12612 (%build)


RPM build errors:
    Bad exit status from /usr/src/tmp/rpm-tmp.12612 (%build)
Command exited with non-zero status 1
11.25user 2.45system 0:07.94elapsed 172%CPU (0avgtext+0avgdata 78836maxresident)k
0inputs+0outputs (0major+570425minor)pagefaults 0swaps
hsh-rebuild: rebuild of `gt-0.4-alt1_41.src.rpm' failed.
Command exited with non-zero status 1
3.22user 2.70system 0:16.58elapsed 35%CPU (0avgtext+0avgdata 137612maxresident)k
0inputs+0outputs (0major+202036minor)pagefaults 0swaps