86>Dec 18 03:31:49 userdel[3568392]: delete user 'rooter'
<86>Dec 18 03:31:49 userdel[3568392]: removed group 'rooter' owned by 'rooter'
<86>Dec 18 03:31:49 userdel[3568392]: removed shadow group 'rooter' owned by 'rooter'
<86>Dec 18 03:31:49 groupadd[3568418]: group added to /etc/group: name=rooter, GID=1844
<86>Dec 18 03:31:49 groupadd[3568418]: group added to /etc/gshadow: name=rooter
<86>Dec 18 03:31:49 groupadd[3568418]: new group: name=rooter, GID=1844
<86>Dec 18 03:31:49 useradd[3568433]: new user: name=rooter, UID=1844, GID=1844, home=/root, shell=/bin/bash, from=none
<86>Dec 18 03:31:49 userdel[3568468]: delete user 'builder'
<86>Dec 18 03:31:49 userdel[3568468]: removed group 'builder' owned by 'builder'
<86>Dec 18 03:31:49 userdel[3568468]: removed shadow group 'builder' owned by 'builder'
<86>Dec 18 03:31:49 groupadd[3568502]: group added to /etc/group: name=builder, GID=1845
<86>Dec 18 03:31:49 groupadd[3568502]: group added to /etc/gshadow: name=builder
<86>Dec 18 03:31:49 groupadd[3568502]: new group: name=builder, GID=1845
<86>Dec 18 03:31:49 useradd[3568543]: new user: name=builder, UID=1845, GID=1845, home=/usr/src, shell=/bin/bash, from=none
warning: Macro %_xdgmimedir not found
<13>Dec 18 03:31:57 rpmi: libwayland-client-1.23.1-alt1.1 sisyphus+356019.140.3.1 1724572111 installed
<13>Dec 18 03:31:57 rpmi: libjpeg-2:3.0.2-alt2.1 sisyphus+340135.100.1.1 1707449145 installed
<13>Dec 18 03:31:57 rpmi: libexpat-2.5.0-alt1 sisyphus+346180.200.2.1 1716349835 installed
<13>Dec 18 03:31:57 rpmi: libpng16-1.6.42-alt2 sisyphus+339555.100.1.1 1706781682 installed
<13>Dec 18 03:31:57 rpmi: libfribidi-1.0.16-alt1 sisyphus+358393.100.1.1 1727333692 installed
<13>Dec 18 03:31:57 rpmi: libgomp1-14.2.1-alt1 sisyphus+360995.100.1.1 1730131018 installed
<13>Dec 18 03:31:57 rpmi: xorg-proto-devel-2024.1-alt1 sisyphus+343583.40.1.1 1711440649 installed
<13>Dec 18 03:31:57 rpmi: libsuitesparseconfig7-7.7.0-alt2 sisyphus+348694.100.1.1 1716437881 installed
<13>Dec 18 03:31:57 rpmi: vapi-common-0.56.17-alt1 sisyphus+345617.100.1.1 1713782341 installed
<13>Dec 18 03:31:57 rpmi: libwebp7-1.4.0-alt1 sisyphus+345159.200.1.1 1713168663 installed
<13>Dec 18 03:31:57 rpmi: libopus-1.5.2-alt1 sisyphus+347834.100.1.1 1715455356 installed
<13>Dec 18 03:31:57 rpmi: libogg-1.3.5-alt1 sisyphus+278100.3400.1.1 1626058929 installed
<13>Dec 18 03:31:57 rpmi: libusb-1.0.27-alt1 sisyphus+347412.100.1.1 1714739651 installed
<13>Dec 18 03:31:57 rpmi: libatk-2.54.0-alt1 sisyphus+357735.600.3.1 1726642126 installed
<13>Dec 18 03:31:57 rpmi: libvorbis-1.3.7-alt1 sisyphus+275738.100.1.1 1624751601 installed
<13>Dec 18 03:31:57 rpmi: libwayland-egl-4:18.1.0-alt1.1 sisyphus+356019.140.3.1 1724572111 installed
<13>Dec 18 03:31:57 rpmi: libgraphene-1.10.8-alt1 sisyphus+296855.100.1.1 1647633383 installed
<13>Dec 18 03:31:58 rpmi: libopenblas-0.3.28-alt1 sisyphus+356644.100.1.1 1725289674 installed
<13>Dec 18 03:31:58 rpmi: libsqlite3-3.46.0-alt1 sisyphus+352354.100.2.1 1721980422 installed
<13>Dec 18 03:31:58 rpmi: liblcms2-2.16-alt1 sisyphus+335676.100.1.1 1701682597 installed
<13>Dec 18 03:31:58 rpmi: perl-HTTP-Date-6.06-alt1 sisyphus+324527.100.1.1 1688834564 installed
<13>Dec 18 03:31:58 rpmi: perl-XML-NamespaceSupport-1.12-alt1 1491296348 installed
<13>Dec 18 03:31:58 rpmi: libserd-0.32.2-alt1 sisyphus+341428.200.1.1 1708949158 installed
<13>Dec 18 03:31:58 rpmi: libgsm-1.0.17-alt1 sisyphus+275359.100.2.1 1624907612 installed
<13>Dec 18 03:31:58 rpmi: libraw1394-11-2.1.2-alt1 sisyphus+278262.100.1.1 1626081867 installed
<13>Dec 18 03:31:58 rpmi: libgudev-1:238-alt1 sisyphus+324364.100.1.1 1688646144 installed
<13>Dec 18 03:31:58 rpmi: libidn2-2.3.7-alt1 sisyphus+339505.100.1.2 1706718968 installed
<13>Dec 18 03:31:58 rpmi: libnettle8-3.9.1-alt1 sisyphus+322548.100.1.2 1686176879 installed
<13>Dec 18 03:31:58 rpmi: libopenjpeg2.0-2.5.3-alt1 sisyphus+364601.100.1.1 1733825032 installed
<13>Dec 18 03:31:58 rpmi: libicu74-1:7.4.2-alt1 sisyphus+336372.200.1.1 1702423005 installed
<13>Dec 18 03:31:58 rpmi: zlib-devel-1.3.1-alt1 sisyphus+342532.100.1.1 1710232285 installed
<13>Dec 18 03:31:58 rpmi: libdc1394-22-2.2.5-alt1.1 sisyphus+311484.100.1.1 1670647146 installed
<13>Dec 18 03:31:58 rpmi: libwayland-cursor-1.23.1-alt1.1 sisyphus+356019.140.3.1 1724572111 installed
<13>Dec 18 03:31:58 rpmi: vulkan-filesystem-1.3.296-alt1 sisyphus+365035.1000.5.1 1734354968 installed
<13>Dec 18 03:31:58 rpmi: libvulkan1-1.3.296-alt1 sisyphus+365035.1000.5.1 1734354968 installed
<13>Dec 18 03:31:58 rpmi: libgflags-2.2.2-alt3 sisyphus+319790.100.1.1 1683117277 installed
<13>Dec 18 03:31:58 rpmi: libvpl2-2.13.0-alt1 sisyphus+357848.100.2.1 1726737480 installed
<13>Dec 18 03:31:58 rpmi: libopenh264_7-2.5.0-alt1 sisyphus+362019.100.1.1 1731073174 installed
<13>Dec 18 03:31:59 rpmi: libdav1d_7-1.5.0-alt1 sisyphus+365203.100.1.1 1734367592 installed
<13>Dec 18 03:31:59 rpmi: libxkbcommon-1.7.0-alt1.1 sisyphus+343672.100.1.1 1711490810 installed
<13>Dec 18 03:31:59 rpmi: libepoxy-1.5.10-alt1 sisyphus+296853.200.2.1 1647631866 installed
<13>Dec 18 03:31:59 rpmi: perl-LWP-MediaTypes-6.04-alt1 sisyphus+225468.100.1.1 1553186684 installed
<13>Dec 18 03:31:59 rpmi: perl-Compress-Raw-Zlib-2.206-alt1 sisyphus+335067.600.1.1 1700901499 installed
<13>Dec 18 03:31:59 rpmi: perl-libnet-1:3.15-alt1 sisyphus+317310.100.1.1 1679580208 installed
<13>Dec 18 03:31:59 rpmi: perl-XML-SAX-Base-1.09-alt1 1494364363 installed
<13>Dec 18 03:31:59 rpmi: libwebrtc-audio-processing-1.3-alt2 sisyphus+332026.100.1.1 1697579361 installed
<13>Dec 18 03:31:59 rpmi: libsbc1-2.0-alt2 sisyphus+322708.100.1.1 1686327806 installed
<13>Dec 18 03:31:59 rpmi: libzix-0.4.2-alt1 sisyphus+341428.100.1.1 1708949131 installed
<13>Dec 18 03:31:59 rpmi: libsord-0.16.16-alt1 sisyphus+341428.300.1.1 1708949185 installed
<13>Dec 18 03:31:59 rpmi: liblc3-1.1.1-alt1 sisyphus+347780.100.1.1 1715374023 installed
<13>Dec 18 03:31:59 rpmi: libfreeaptx-0.1.1-alt1 sisyphus+282022.100.1.1 1628182661 installed
<13>Dec 18 03:31:59 rpmi: liblame-3.100-alt1 sisyphus+346342.200.2.2 1716474674 installed
<13>Dec 18 03:31:59 rpmi: libSDL2-2.30.10-alt1 sisyphus+364560.100.1.1 1733772087 installed
<13>Dec 18 03:31:59 rpmi: libfdk-aac2-2.0.3-alt0.1 sisyphus+338863.100.1.1 1706094241 installed
<13>Dec 18 03:31:59 rpmi: libdvdread8-6.1.3-alt1 sisyphus+302642.100.1.1 1656163148 installed
<13>Dec 18 03:31:59 rpmi: libaom3-3.9.1-alt2 sisyphus+354446.100.1.1 1722877371 installed
<13>Dec 18 03:31:59 rpmi: libimath29-3.1.6-alt4 sisyphus+360827.100.1.1 1729946609 installed
<13>Dec 18 03:31:59 rpmi: libiex30-3.1.5-alt2.2 sisyphus+324124.100.1.1 1688379858 installed
<13>Dec 18 03:31:59 rpmi: liborc-0.4.40-alt1 sisyphus+357575.100.1.1 1726413203 installed
<13>Dec 18 03:31:59 rpmi: libglvnd-7:1.7.0-alt1 sisyphus+330949.100.1.1 1696424893 installed
<13>Dec 18 03:31:59 rpmi: libwayland-server-1.23.1-alt1.1 sisyphus+356019.140.3.1 1724572111 installed
<13>Dec 18 03:31:59 rpmi: libnghttp2-1.64.0-alt1 sisyphus+363795.200.2.1 1733118555 installed
<13>Dec 18 03:31:59 rpmi: libgraphite2-1.3.14-alt2.1 sisyphus+279571.100.1.2 1626605111 installed
<13>Dec 18 03:31:59 rpmi: xml-utils-1:2.12.9-alt1 sisyphus+355784.100.1.1 1724333686 installed
<13>Dec 18 03:31:59 rpmi: libp11-kit-1:0.25.5-alt1 sisyphus+352553.100.1.1 1720622573 installed
<13>Dec 18 03:31:59 rpmi: libtasn1-4.19.0-alt3 sisyphus+327816.100.1.1 1692802615 installed
<13>Dec 18 03:31:59 rpmi: libXau-1.0.11-alt1 sisyphus+311428.100.1.1 1670577439 installed
<13>Dec 18 03:31:59 rpmi: liblz4-1:1.9.4-alt1 sisyphus+309416.100.1.1 1667412981 installed
<13>Dec 18 03:31:59 rpmi: libsystemd-1:255.13-alt1 sisyphus+359453.100.2.1 1728651180 installed
<13>Dec 18 03:31:59 rpmi: libdbus-1.14.10-alt1 sisyphus+327286.5700.14.1 1711487401 installed
<13>Dec 18 03:31:59 rpmi: libavahi-0.8-alt4 sisyphus+344258.100.1.1 1712133856 installed
<13>Dec 18 03:31:59 rpmi: dbus-tools-1.14.10-alt1 sisyphus+327286.5700.14.1 1711487401 installed
<86>Dec 18 03:31:59 groupadd[3621615]: group added to /etc/group: name=messagebus, GID=999
<86>Dec 18 03:31:59 groupadd[3621615]: group added to /etc/gshadow: name=messagebus
<86>Dec 18 03:31:59 groupadd[3621615]: new group: name=messagebus, GID=999
<86>Dec 18 03:31:59 useradd[3621677]: new user: name=messagebus, UID=999, GID=999, home=/run/dbus, shell=/dev/null, from=none
<13>Dec 18 03:31:59 rpmi: dbus-1.14.10-alt1 sisyphus+327286.5700.14.1 1711487401 installed
<13>Dec 18 03:31:59 rpmi: libXau-devel-1.0.11-alt1 sisyphus+311428.100.1.1 1670577439 installed
<13>Dec 18 03:31:59 rpmi: rpm-build-gir-0.7.3-alt3.1 sisyphus+319393.100.1.1 1682538783 installed
<13>Dec 18 03:31:59 rpmi: libgraphite2-devel-1.3.14-alt2.1 sisyphus+279571.100.1.2 1626605111 installed
<13>Dec 18 03:31:59 rpmi: libilmthread30-3.1.5-alt2.2 sisyphus+324124.100.1.1 1688379858 installed
<13>Dec 18 03:31:59 rpmi: libopenexr30-3.1.5-alt2.2 sisyphus+324124.100.1.1 1688379858 installed
<13>Dec 18 03:31:59 rpmi: libdvdnav-6.1.1-alt1 sisyphus+279367.100.1.1 1626478896 installed
<13>Dec 18 03:31:59 rpmi: libsratom-0.6.16-alt1 sisyphus+341428.400.1.1 1708949212 installed
<13>Dec 18 03:31:59 rpmi: liblilv-0.24.24-alt2 sisyphus+341494.100.1.1 1709024102 installed
<13>Dec 18 03:31:59 rpmi: libpng-devel-1.6.42-alt2 sisyphus+339555.100.1.1 1706781682 installed
<13>Dec 18 03:31:59 rpmi: icu-utils-1:7.4.2-alt1 sisyphus+336372.200.1.1 1702423005 installed
<13>Dec 18 03:31:59 rpmi: libicu-devel-1:7.4.2-alt1 sisyphus+336372.200.1.1 1702423005 installed
<13>Dec 18 03:31:59 rpmi: libhogweed6-3.9.1-alt1 sisyphus+322548.100.1.2 1686176879 installed
<13>Dec 18 03:31:59 rpmi: libgnutls30-3.8.8-alt2 sisyphus+364832.100.1.1 1734007749 installed
<13>Dec 18 03:31:59 rpmi: libngtcp2.16-1.9.1-alt1 sisyphus+363819.100.1.1 1733129254 installed
<13>Dec 18 03:31:59 rpmi: libngtcp2_crypto_gnutls8-1.9.1-alt1 sisyphus+363819.100.1.1 1733129254 installed
<13>Dec 18 03:31:59 rpmi: libiec61883-1.2.0-alt1.qa1 sisyphus+275365.100.1.2 1624491850 installed
<13>Dec 18 03:31:59 rpmi: perl-File-Listing-6.16-alt1 sisyphus+325783.100.1.1 1690559356 installed
<13>Dec 18 03:31:59 rpmi: libflac12-1.4.3-alt2 sisyphus+343354.100.1.1 1711118098 installed
<13>Dec 18 03:31:59 rpmi: libtheora-2:1.1.1-alt6 sisyphus+277967.100.1.1 1625928129 installed
<13>Dec 18 03:31:59 rpmi: libamd3-7.7.0-alt2 sisyphus+348694.100.1.1 1716437881 installed
<13>Dec 18 03:31:59 rpmi: libcamd3-7.7.0-alt2 sisyphus+348694.100.1.1 1716437881 installed
<13>Dec 18 03:31:59 rpmi: libcolamd3-7.7.0-alt2 sisyphus+348694.100.1.1 1716437881 installed
<13>Dec 18 03:31:59 rpmi: libccolamd3-7.7.0-alt2 sisyphus+348694.100.1.1 1716437881 installed
<13>Dec 18 03:31:59 rpmi: libsoundtouch-2.3.3-alt1 sisyphus+344043.100.1.1 1711799526 installed
<13>Dec 18 03:31:59 rpmi: wayland-devel-1.23.1-alt1.1 sisyphus+356019.140.3.1 1724572111 installed
<13>Dec 18 03:31:59 rpmi: libwayland-client-devel-1.23.1-alt1.1 sisyphus+356019.140.3.1 1724572111 installed
<13>Dec 18 03:31:59 rpmi: libv4l-1.28.1-alt1 sisyphus+353586.100.1.1 1721897959 installed
<13>Dec 18 03:31:59 rpmi: rpm-build-vala-0.3-alt1 sisyphus+277005.100.1.2 1625345329 installed
<13>Dec 18 03:32:00 rpmi: vulkan-headers-1.3.296-alt1 sisyphus+365035.500.5.1 1734354669 installed
<13>Dec 18 03:32:00 rpmi: iso-codes-4.17.0-alt1 sisyphus+357584.100.1.1 1726430044 installed
<13>Dec 18 03:32:00 rpmi: libvo-amrwbenc-0.1.3-alt1 sisyphus+275410.100.1.2 1624504610 installed
<13>Dec 18 03:32:00 rpmi: libvo-aacenc-0.1.3-alt2 sisyphus+285812.100.1.1 1632410909 installed
<13>Dec 18 03:32:00 rpmi: libsrtp2-2.6.0-alt1 sisyphus+341594.100.1.1 1709111211 installed
<13>Dec 18 03:32:00 rpmi: libtbb-2021.13.0-alt1 sisyphus+351726.100.1.1 1719561727 installed
<13>Dec 18 03:32:00 rpmi: libprotobuf32-3.21.12-alt5 sisyphus+353063.24400.30.1 1723234273 installed
<13>Dec 18 03:32:00 rpmi: libunwind-1.7.0-alt2 sisyphus+335269.100.1.1 1701110934 installed
<13>Dec 18 03:32:00 rpmi: libglog2-0.7.1-alt1 sisyphus+350246.140.8.1 1724736246 installed
<13>Dec 18 03:32:00 rpmi: libxblas-1.0.248-alt2 sisyphus+285045.40.2.1 1631388330 installed
<13>Dec 18 03:32:00 rpmi: libzeromq-4.3.4-alt3 sisyphus+326735.200.2.1 1691482840 installed
<13>Dec 18 03:32:00 rpmi: libgme-0.6.3-alt2 sisyphus+293048.100.1.1 1641452306 installed
<13>Dec 18 03:32:00 rpmi: libudfread-1.1.2-alt2 sisyphus+286325.100.1.1 1633263312 installed
<13>Dec 18 03:32:00 rpmi: libsoxr-0.1.3-alt1.1 sisyphus+317908.100.1.1 1680415073 installed
<13>Dec 18 03:32:00 rpmi: libxvid-1.3.7-alt1 sisyphus+292833.100.1.1 1640949610 installed
<13>Dec 18 03:32:00 rpmi: libnuma-2.0.19-alt1 sisyphus+363830.100.1.1 1733131852 installed
<13>Dec 18 03:32:00 rpmi: libx265-199-3.5-alt1.1 sisyphus+277560.100.1.1 1625697230 installed
<13>Dec 18 03:32:00 rpmi: libx264-164-alt1.1 sisyphus+322210.100.1.1 1685494917 installed
<13>Dec 18 03:32:01 rpmi: libvpx9-1.14.1-alt1 sisyphus+351742.40.3.1 1719836000 installed
<13>Dec 18 03:32:01 rpmi: libtwolame-0.4.0-alt1 sisyphus+277783.100.1.1 1625798476 installed
<13>Dec 18 03:32:01 rpmi: libspeex-1.2.1-alt1 sisyphus+339763.100.1.1 1707113839 installed
<13>Dec 18 03:32:01 rpmi: libsnappy-1.1.7-alt1 sisyphus+276400.100.1.2 1625016393 installed
<13>Dec 18 03:32:01 rpmi: libopencore-amrwb0-0.1.6-alt1 sisyphus+307923.100.1.1 1665032483 installed
<13>Dec 18 03:32:01 rpmi: libopencore-amrnb0-0.1.6-alt1 sisyphus+307923.100.1.1 1665032483 installed
<13>Dec 18 03:32:01 rpmi: libcodec2_1.2-1.2.0-alt1 sisyphus+340564.40.2.1 1707820763 installed
<13>Dec 18 03:32:01 rpmi: libopenal1-1.22.2-alt2 sisyphus+331513.100.1.2 1697028598 installed
<13>Dec 18 03:32:01 rpmi: libmodplug-0.8.9.0-alt1 sisyphus+275375.100.2.2 1624495419 installed
<13>Dec 18 03:32:01 rpmi: libdv-1.0.0-alt6 sisyphus+286805.100.2.1 1633968015 installed
<13>Dec 18 03:32:01 rpmi: libyajl-2.1.0-alt3 sisyphus+322972.100.1.1 1686724493 installed
<13>Dec 18 03:32:01 rpmi: libxslt-1.1.39-alt1 sisyphus+349406.100.1.1 1716751806 installed
<13>Dec 18 03:32:01 rpmi: libdatrie-0.2.13-alt1_7 sisyphus+328221.100.1.1 1693336966 installed
<13>Dec 18 03:32:01 rpmi: libthai-0.1.29-alt1_6 sisyphus+328230.100.1.2 1693348044 installed
<13>Dec 18 03:32:01 rpmi: usbids-20240206-alt1 sisyphus+339943.100.1.1 1707270512 installed
<13>Dec 18 03:32:01 rpmi: pciids-20241129-alt1 sisyphus+363612.100.1.1 1732846470 installed
<13>Dec 18 03:32:01 rpmi: hwdata-0.384-alt1 sisyphus+354460.100.1.1 1722898493 installed
<13>Dec 18 03:32:01 rpmi: gtk+3-themes-incompatible-3.20-alt3 1461944560 installed
<13>Dec 18 03:32:01 rpmi: perl-Try-Tiny-0.31-alt1 sisyphus+290597.100.1.1 1637915507 installed
<13>Dec 18 03:32:01 rpmi: perl-IO-Socket-IP-0.42-alt1 sisyphus+325815.100.1.2 1690571193 installed
<13>Dec 18 03:32:01 rpmi: perl-Module-Load-0.36-alt1 sisyphus+258992.100.1.1 1601543407 installed
<13>Dec 18 03:32:01 rpmi: perl-Compress-Raw-Bzip2-2.210-alt1 sisyphus+343108.100.1.3 1710881036 installed
<13>Dec 18 03:32:01 rpmi: perl-IO-Compress-Brotli-2:0.004001-alt3 sisyphus+335067.1200.1.1 1700901589 installed
<13>Dec 18 03:32:01 rpmi: perl-Clone-0.46-alt1 sisyphus+335067.1100.1.1 1700901562 installed
<13>Dec 18 03:32:01 rpmi: perl-HTML-Tagset-3.24-alt1 sisyphus+343117.100.1.3 1710883587 installed
<13>Dec 18 03:32:01 rpmi: perl-Term-ANSIColor-5.01-alt1 sisyphus+244783.100.1.2 1579747505 installed
<13>Dec 18 03:32:01 rpmi: perl-Data-Dump-1.25-alt1 sisyphus+276551.100.1.1 1625126880 installed
<13>Dec 18 03:32:01 rpmi: perl-Filter-1.64-alt1 sisyphus+335067.400.1.1 1700901412 installed
<13>Dec 18 03:32:01 rpmi: perl-Encode-3.21-alt1 sisyphus+343095.100.1.1 1710875477 installed
<13>Dec 18 03:32:01 rpmi: perl-URI-5.27-alt1 sisyphus+340901.100.1.1 1708180683 installed
<13>Dec 18 03:32:01 rpmi: perl-IO-Compress-2.206-alt1 sisyphus+325819.100.1.1 1690563199 installed
<13>Dec 18 03:32:01 rpmi: perl-Net-HTTP-6.23-alt1 sisyphus+323470.100.1.1 1687422469 installed
<13>Dec 18 03:32:01 rpmi: perl-HTML-Parser-3.82-alt1 sisyphus+343116.100.1.3 1710883258 installed
<13>Dec 18 03:32:01 rpmi: perl-WWW-RobotRules-6.02-alt1 1329756211 installed
<13>Dec 18 03:32:01 rpmi: perl-Encode-Locale-1.05-alt1 1444608613 installed
<13>Dec 18 03:32:01 rpmi: perl-IO-HTML-1.004-alt1 sisyphus+258983.100.1.1 1601542619 installed
<13>Dec 18 03:32:01 rpmi: perl-HTTP-Message-6.45-alt1 sisyphus+330728.100.1.1 1696162276 installed
<13>Dec 18 03:32:01 rpmi: perl-HTTP-Negotiate-6.01-alt1 1329760563 installed
<13>Dec 18 03:32:01 rpmi: perl-libwww-6.77-alt1 sisyphus+343120.100.1.2 1710884405 installed
<13>Dec 18 03:32:01 rpmi: perl-XML-LibXML-2.0210-alt8 sisyphus+355798.100.1.1 1724340088 installed
<13>Dec 18 03:32:01 rpmi: perl-XML-SAX-1.02-alt1 sisyphus+232322.100.1.1 1560758406 installed
<13>Dec 18 03:32:01 rpmi: perl-XML-Simple-2.25-alt2 sisyphus+257498.100.1.1 1599324034 installed
<13>Dec 18 03:32:01 rpmi: icon-naming-utils-0.8.90-alt1 sisyphus+276851.100.1.1 1625243947 installed
<13>Dec 18 03:32:01 rpmi: icon-theme-adwaita-47.0-alt1 sisyphus+357735.1000.3.1 1726642413 installed
<13>Dec 18 03:32:01 rpmi: libgdk-pixbuf-locales-2.42.12-alt1 sisyphus+348142.100.1.1 1715791856 installed
<13>Dec 18 03:32:01 rpmi: libmysofa-1.3.3-alt1 sisyphus+360234.100.1.1 1729426691 installed
<13>Dec 18 03:32:01 rpmi: libldac2-2.0.2.3-alt0.1 sisyphus+278007.100.1.2 1625973044 installed
<13>Dec 18 03:32:01 rpmi: libsigc++2-2.12.1-alt1 sisyphus+331046.200.2.1 1696511642 installed
<13>Dec 18 03:32:01 rpmi: libconfig-c++11-1.7.3-alt1 sisyphus+356893.2177.17.1 1725864292 installed
<13>Dec 18 03:32:01 rpmi: libtdb-1.4.10-alt1 sisyphus+342425.100.8.1 1714748986 installed
<13>Dec 18 03:32:01 rpmi: libltdl7-2.4.7-alt5 sisyphus+341963.200.3.1 1711659208 installed
<13>Dec 18 03:32:01 rpmi: libasyncns-0.8-alt2.qa1 sisyphus+275091.100.1.1 1624402241 installed
<13>Dec 18 03:32:01 rpmi: sound-theme-freedesktop-0.8-alt1 sisyphus+277010.100.1.2 1625346634 installed
<13>Dec 18 03:32:01 rpmi: libyaml2-0.2.5-alt1 sisyphus+278391.100.1.1 1626094928 installed
<13>Dec 18 03:32:01 rpmi: libdeflate-1.22-alt1 sisyphus+359192.100.1.1 1728330316 installed
<13>Dec 18 03:32:01 rpmi: libtiff5-4.4.0-alt4 sisyphus+322581.100.1.2 1686180089 installed
<13>Dec 18 03:32:01 rpmi: libgtest-1.15.2-alt1 sisyphus+364140.100.8.1 1733730026 installed
<13>Dec 18 03:32:01 rpmi: libbluez-5.79-alt1 sisyphus+362585.400.4.1 1731678491 installed
<13>Dec 18 03:32:01 rpmi: libmpg123-1:1.32.10-alt1 sisyphus+365072.100.1.1 1734226035 installed
<13>Dec 18 03:32:01 rpmi: libsndfile-1.1.0-alt1 sisyphus+339776.7300.6.2 1707350065 installed
<13>Dec 18 03:32:01 rpmi: libinstpatch-1.1.6-alt1.1 sisyphus+279572.100.1.2 1626605094 installed
<13>Dec 18 03:32:01 rpmi: libfaad2-2.11.1-alt1 sisyphus+338260.100.2.2 1705755212 installed
<13>Dec 18 03:32:01 rpmi: libfaac0-1.28-alt2 sisyphus+346184.200.2.1 1716351469 installed
<13>Dec 18 03:32:01 rpmi: libdca0-0.0.5-alt4.qa1 sisyphus+275349.100.1.2 1624487408 installed
<13>Dec 18 03:32:01 rpmi: libfftw3-common-3.3.10-alt2 sisyphus+363193.200.2.1 1732292771 installed
<13>Dec 18 03:32:01 rpmi: libfftw3-3.3.10-alt2 sisyphus+363193.200.2.1 1732292771 installed
<13>Dec 18 03:32:01 rpmi: libchromaprint1-1.5.1-alt1 sisyphus+346100.200.2.1 1716252063 installed
<13>Dec 18 03:32:01 rpmi: libbs2b-3.1.0-alt1.4 sisyphus+346078.200.2.1 1716241402 installed
<13>Dec 18 03:32:02 rpmi: libzxing-cpp-2.2.1-alt1 sisyphus+336233.100.1.1 1702264522 installed
<13>Dec 18 03:32:02 rpmi: libxshmfence-1.3.2-alt1 sisyphus+311428.400.1.1 1670577525 installed
<13>Dec 18 03:32:02 rpmi: libsensors3-3.6.0-alt3 sisyphus+308579.100.1.1 1666035267 installed
<13>Dec 18 03:32:02 rpmi: libspirv-tools0-1:2024.4-alt0.1 sisyphus+365035.200.5.1 1734354502 installed
<13>Dec 18 03:32:02 rpmi: llvm18.1-filesystem-18.1.8-alt0.4 sisyphus+364551.100.1.1 1733763186 installed
<13>Dec 18 03:32:02 rpmi: llvm18.1-polly-18.1.8-alt0.4 sisyphus+364551.100.1.1 1733763186 installed
<13>Dec 18 03:32:02 rpmi: libedit3-3.1.20230828-alt1 sisyphus+330914.200.3.1 1696922743 installed
<13>Dec 18 03:32:02 rpmi: llvm18.1-gold-18.1.8-alt0.4 sisyphus+364551.100.1.1 1733763186 installed
<13>Dec 18 03:32:04 rpmi: llvm18.1-libs-18.1.8-alt0.4 sisyphus+364551.100.1.1 1733763186 installed
<13>Dec 18 03:32:04 rpmi: libpciaccess-1:0.18.1-alt1 sisyphus+343583.300.1.1 1711440789 installed
<13>Dec 18 03:32:04 rpmi: libdrm-1:2.4.124-alt1 sisyphus+364215.100.1.1 1733469813 installed
<13>Dec 18 03:32:04 rpmi: libgbm-4:24.3.1-alt1 sisyphus+364215.200.1.1 1733470187 installed
<13>Dec 18 03:32:04 rpmi: gobject-introspection-1.82.0-alt1 sisyphus+357735.200.3.1 1726641712 installed
<13>Dec 18 03:32:04 rpmi: libduktape207-2.7.0-alt3 sisyphus+352341.100.1.1 1720324462 installed
<13>Dec 18 03:32:04 rpmi: publicsuffix-list-dafsa-20240911-alt1 sisyphus+357399.100.1.1 1726160479 installed
<13>Dec 18 03:32:04 rpmi: libpsl-0.21.5-alt1 sisyphus+338474.100.1.1 1705684769 installed
<13>Dec 18 03:32:04 rpmi: libnghttp3.9-1.6.0-alt1 sisyphus+363819.40.1.1 1733129194 installed
<13>Dec 18 03:32:04 rpmi: openldap-common-2.6.9-alt1 sisyphus+364781.100.1.1 1733971238 installed
<13>Dec 18 03:32:04 rpmi: libntlm-1.5-alt1 sisyphus+278100.3300.1.1 1626058899 installed
<13>Dec 18 03:32:04 rpmi: libidn-1.37-alt2 sisyphus+300849.100.1.1 1653769687 installed
<13>Dec 18 03:32:04 rpmi: libverto-0.3.2-alt1_1 sisyphus+321176.2200.10.2 1684803947 installed
<13>Dec 18 03:32:04 rpmi: liblmdb-0.9.33-alt1 sisyphus+360625.100.1.1 1729819640 installed
<13>Dec 18 03:32:04 rpmi: libkeyutils-1.6.3-alt1 sisyphus+346336.200.2.2 1716472658 installed
<13>Dec 18 03:32:04 rpmi: libcom_err-1.47.1.0.10.ad56-alt2 sisyphus+363497.200.3.1 1732729908 installed
<13>Dec 18 03:32:04 rpmi: libjson-c5-0.18-alt1 sisyphus+358387.100.1.1 1727298142 installed
<13>Dec 18 03:32:04 rpmi: libCharLS2-2.0.0-alt1_3 sisyphus+346001.100.2.1 1716202266 installed
<13>Dec 18 03:32:04 rpmi: libpixman-3:0.44.2-alt1 sisyphus+364211.100.1.1 1733467622 installed
<13>Dec 18 03:32:04 rpmi: libbrotlicommon-1.1.0-alt1 sisyphus+328501.100.1.1 1693598419 installed
<13>Dec 18 03:32:04 rpmi: libbrotlidec-1.1.0-alt1 sisyphus+328501.100.1.1 1693598419 installed
<13>Dec 18 03:32:04 rpmi: libharfbuzz-10.1.0-alt1 sisyphus+361773.100.1.1 1730824042 installed
<13>Dec 18 03:32:04 rpmi: libfreetype-2.13.3-alt1 sisyphus+355656.100.1.1 1724221064 installed
<13>Dec 18 03:32:04 rpmi: libfontconfig1-2.15.0-alt1 sisyphus+355771.100.2.3 1724337298 installed
<13>Dec 18 03:32:04 rpmi: fontconfig-2.15.0-alt1 sisyphus+355771.100.2.3 1724337298 installed
Updating fonts cache: <29>Dec 18 03:32:05 fontconfig: Updating fonts cache: succeeded
[ DONE ]
<13>Dec 18 03:32:05 rpmi: libass9-0.17.3-alt1 sisyphus+352066.100.1.1 1720008822 installed
<13>Dec 18 03:32:05 rpmi: libbluray-1.3.4-alt1 sisyphus+310888.100.1.1 1669800489 installed
<13>Dec 18 03:32:05 rpmi: libharfbuzz-icu-10.1.0-alt1 sisyphus+361773.100.1.1 1730824042 installed
<13>Dec 18 03:32:05 rpmi: libharfbuzz-gobject-10.1.0-alt1 sisyphus+361773.100.1.1 1730824042 installed
<13>Dec 18 03:32:05 rpmi: libmpdec3-2.5.1-alt3 sisyphus+314490.500.5.1 1675432004 installed
<13>Dec 18 03:32:05 rpmi: libgdbm-1.8.3-alt10 sisyphus+346222.200.3.2 1716468404 installed
<13>Dec 18 03:32:05 rpmi: libb2-0.98.1-alt1_1 sisyphus+291614.100.1.1 1638962877 installed
<13>Dec 18 03:32:05 rpmi: libquadmath0-14.2.1-alt1 sisyphus+360995.100.1.1 1730131018 installed
<13>Dec 18 03:32:05 rpmi: libgfortran5-14.2.1-alt1 sisyphus+360995.100.1.1 1730131018 installed
<13>Dec 18 03:32:05 rpmi: liblapack-1:3.8.0-alt7 sisyphus+340675.300.1.1 1707908338 installed
<13>Dec 18 03:32:05 rpmi: libcholmod5-7.7.0-alt2 sisyphus+348694.100.1.1 1716437881 installed
<13>Dec 18 03:32:05 rpmi: libspqr4-7.7.0-alt2 sisyphus+348694.100.1.1 1716437881 installed
<13>Dec 18 03:32:05 rpmi: flexiblas-3.4.4-alt3 sisyphus+355796.100.1.1 1724340590 installed
<13>Dec 18 03:32:05 rpmi: libflexiblas.3-3.4.4-alt3 sisyphus+355796.100.1.1 1724340590 installed
<13>Dec 18 03:32:06 rpmi: flexiblas-netlib-3.4.4-alt3 sisyphus+355796.100.1.1 1724340590 installed
<13>Dec 18 03:32:06 rpmi: libceres4-2.2.0-alt2 sisyphus+350246.370.8.1 1724736407 installed
<13>Dec 18 03:32:06 rpmi: libdevmapper-1.02.202-alt1 sisyphus+361775.200.5.1 1730990757 installed
<13>Dec 18 03:32:06 rpmi: mount-2.39.2-alt1 sisyphus+327286.4500.14.1 1711486324 installed
<13>Dec 18 03:32:06 rpmi: losetup-2.39.2-alt1 sisyphus+327286.4500.14.1 1711486324 installed
<13>Dec 18 03:32:06 rpmi: lsblk-2.39.2-alt1 sisyphus+327286.4500.14.1 1711486324 installed
<13>Dec 18 03:32:06 rpmi: dconf-profile-0.1-alt1 sisyphus+325633.340.3.1 1690415358 installed
<13>Dec 18 03:32:06 rpmi: desktop-file-utils-0.26-alt6 sisyphus+331944.100.1.3 1697550026 installed
<13>Dec 18 03:32:06 rpmi: shared-mime-info-2.4-alt1 sisyphus+334259.100.1.1 1699787316 installed
<13>Dec 18 03:32:06 rpmi: gsettings-desktop-schemas-data-47.1-alt1 sisyphus+357735.300.3.1 1726641752 installed
<13>Dec 18 03:32:06 rpmi: libgio-2.82.4-alt1 sisyphus+364807.100.1.1 1733991592 installed
<13>Dec 18 03:32:06 rpmi: gsettings-desktop-schemas-47.1-alt1 sisyphus+357735.300.3.1 1726641752 installed
<13>Dec 18 03:32:06 rpmi: libgstreamer1.0-1.24.10-alt1 sisyphus+364070.100.1.1 1733315992 installed
<13>Dec 18 03:32:06 rpmi: libgdk-pixbuf-2.42.12-alt1 sisyphus+348142.100.1.1 1715791856 installed
<13>Dec 18 03:32:06 rpmi: gtk4-update-icon-cache-4.16.7-alt1 sisyphus+363301.100.1.1 1732451644 installed
<13>Dec 18 03:32:06 rpmi: libgstreamer1.0-gir-1.24.10-alt1 sisyphus+364070.100.1.1 1733315992 installed
<13>Dec 18 03:32:06 rpmi: libglibmm-2.66.7-alt1 sisyphus+344717.100.1.1 1712649439 installed
<13>Dec 18 03:32:06 rpmi: libjson-glib-1.10.6-alt1 sisyphus+364645.100.1.1 1733849752 installed
<13>Dec 18 03:32:06 rpmi: libgusb-0.4.9-alt1 sisyphus+345693.100.1.1 1713857461 installed
<13>Dec 18 03:32:06 rpmi: libcolord-1.4.7-alt1.1 sisyphus+338793.100.1.1 1706039016 installed
<13>Dec 18 03:32:06 rpmi: libxml++2-2.42.3-alt1 sisyphus+338062.100.1.2 1705656007 installed
<13>Dec 18 03:32:06 rpmi: libffado-2.4.9-alt1 sisyphus+359940.100.1.1 1729093015 installed
<13>Dec 18 03:32:06 rpmi: gstreamer1.0-1.24.10-alt1 sisyphus+364070.100.1.1 1733315992 installed
<13>Dec 18 03:32:06 rpmi: libdconf-0.40.0-alt3 sisyphus+325650.100.1.1 1690417205 installed
<13>Dec 18 03:32:06 rpmi: dconf-0.40.0-alt3 sisyphus+325650.100.1.1 1690417205 installed
<13>Dec 18 03:32:06 rpmi: libgtk+3-schemas-3.24.43-alt1 sisyphus+352627.100.1.1 1720700731 installed
<13>Dec 18 03:32:06 rpmi: libpolkit-124-alt3 sisyphus+351454.100.1.1 1719236630 installed
<13>Dec 18 03:32:06 rpmi: libnice-0.1.22-alt1 sisyphus+342031.100.1.1 1709629225 installed
<13>Dec 18 03:32:06 rpmi: libcloudproviders-0.3.6-alt1 sisyphus+343189.100.1.1 1710944485 installed
<13>Dec 18 03:32:06 rpmi: systemd-modules-common-1:255.13-alt1 sisyphus+359453.100.2.1 1728651180 installed
<13>Dec 18 03:32:06 rpmi: systemd-sysctl-common-1:255.13-alt1 sisyphus+359453.100.2.1 1728651180 installed
<13>Dec 18 03:32:06 rpmi: systemd-tmpfiles-common-1:255.13-alt1 sisyphus+359453.100.2.1 1728651180 installed
<13>Dec 18 03:32:06 rpmi: systemd-utils-filetriggers-1:255.13-alt1 sisyphus+359453.100.2.1 1728651180 installed
<13>Dec 18 03:32:06 rpmi: libfdisk-2.39.2-alt1 sisyphus+327286.4500.14.1 1711486324 installed
<13>Dec 18 03:32:06 rpmi: libX11-locales-3:1.8.10-alt1 sisyphus+353866.100.1.1 1722240771 installed
<13>Dec 18 03:32:06 rpmi: libXdmcp-1.1.5-alt1 sisyphus+343583.700.1.1 1711441061 installed
<13>Dec 18 03:32:06 rpmi: libxcb-1.17.0-alt1 sisyphus+345308.200.1.1 1713342004 installed
<13>Dec 18 03:32:06 rpmi: libX11-3:1.8.10-alt1 sisyphus+353866.100.1.1 1722240771 installed
<13>Dec 18 03:32:06 rpmi: libXext-1.3.6-alt1 sisyphus+343583.1000.1.1 1711441101 installed
<13>Dec 18 03:32:06 rpmi: libXrender-0.9.11-alt1 sisyphus+308841.100.1.1 1666436130 installed
<13>Dec 18 03:32:07 rpmi: libcairo-1:1.18.2-alt1 sisyphus+357195.100.1.1 1725948391 installed
<13>Dec 18 03:32:07 rpmi: libcairo-gobject-1:1.18.2-alt1 sisyphus+357195.100.1.1 1725948391 installed
<13>Dec 18 03:32:07 rpmi: libXfixes-6.0.1-alt1 sisyphus+331490.300.1.1 1697023233 installed
<13>Dec 18 03:32:07 rpmi: libpulseaudio-17.0-alt2 sisyphus+339257.100.1.1 1706519226 installed
<13>Dec 18 03:32:07 rpmi: libXrandr-1.5.4-alt1 sisyphus+330992.100.1.1 1696485400 installed
<13>Dec 18 03:32:07 rpmi: libXi-1.8-alt1 sisyphus+285490.200.1.1 1632124174 installed
<13>Dec 18 03:32:07 rpmi: libat-spi2-core-2.54.0-alt1 sisyphus+357735.600.3.1 1726642126 installed
<13>Dec 18 03:32:07 rpmi: libXcursor-1.2.2-alt1 sisyphus+343583.600.1.1 1711441025 installed
<13>Dec 18 03:32:07 rpmi: libXft-2.3.8-alt1 sisyphus+331490.400.1.1 1697023269 installed
<13>Dec 18 03:32:07 rpmi: libpango-1.55.0-alt1 sisyphus+364011.100.1.1 1733245601 installed
<13>Dec 18 03:32:07 rpmi: librsvg-1:2.59.2-alt1 sisyphus+361144.100.1.1 1730276750 installed
<13>Dec 18 03:32:07 rpmi: libXinerama-1.1.5-alt1 sisyphus+309287.100.1.1 1667213208 installed
<13>Dec 18 03:32:07 rpmi: libXdamage-1.1.6-alt1 sisyphus+311188.300.1.1 1670233711 installed
<13>Dec 18 03:32:07 rpmi: libzvbi-0.2.35-alt2 sisyphus+275416.100.1.3 1624507095 installed
<13>Dec 18 03:32:09 rpmi: libxcb-devel-1.17.0-alt1 sisyphus+345308.200.1.1 1713342004 installed
<13>Dec 18 03:32:09 rpmi: libX11-devel-3:1.8.10-alt1 sisyphus+353866.100.1.1 1722240771 installed
<13>Dec 18 03:32:09 rpmi: libXrender-devel-0.9.11-alt1 sisyphus+308841.100.1.1 1666436130 installed
<13>Dec 18 03:32:09 rpmi: libXext-devel-1.3.6-alt1 sisyphus+343583.1000.1.1 1711441101 installed
<13>Dec 18 03:32:09 rpmi: at-spi2-atk-2.54.0-alt1 sisyphus+357735.600.3.1 1726642126 installed
<13>Dec 18 03:32:09 rpmi: libharfbuzz-cairo-10.1.0-alt1 sisyphus+361773.100.1.1 1730824042 installed
<13>Dec 18 03:32:09 rpmi: libXtst-1.2.4-alt1 sisyphus+308663.1300.1.1 1666168495 installed
<13>Dec 18 03:32:09 rpmi: libXxf86vm-1.1.5-alt1 sisyphus+308663.1400.1.1 1666168523 installed
<13>Dec 18 03:32:10 rpmi: libGLX-mesa-4:24.3.1-alt1 sisyphus+364215.200.1.1 1733470187 installed
<13>Dec 18 03:32:10 rpmi: libGLX-7:1.7.0-alt1 sisyphus+330949.100.1.1 1696424893 installed
<13>Dec 18 03:32:10 rpmi: libGL-7:1.7.0-alt1 sisyphus+330949.100.1.1 1696424893 installed
<13>Dec 18 03:32:10 rpmi: libva-2.22.0-alt1 sisyphus+351641.100.2.1 1719561314 installed
<13>Dec 18 03:32:10 rpmi: libEGL-mesa-4:24.3.1-alt1 sisyphus+364215.200.1.1 1733470187 installed
<13>Dec 18 03:32:10 rpmi: libEGL-7:1.7.0-alt1 sisyphus+330949.100.1.1 1696424893 installed
<13>Dec 18 03:32:10 rpmi: libgst-plugins1.0-1.24.10-alt1 sisyphus+364070.200.1.1 1733316107 installed
<13>Dec 18 03:32:10 rpmi: libgst-plugins1.0-gir-1.24.10-alt1 sisyphus+364070.200.1.1 1733316107 installed
<13>Dec 18 03:32:10 rpmi: libvdpau-1:1.5-alt1 sisyphus+298034.100.1.1 1649336822 installed
<13>Dec 18 03:32:10 rpmi: libavutil59-2:7.1-alt1 sisyphus+348582.1076.15.2 1733949254 installed
<13>Dec 18 03:32:10 rpmi: libswresample5-2:7.1-alt1 sisyphus+348582.1076.15.2 1733949254 installed
<13>Dec 18 03:32:10 rpmi: libavcodec61-2:7.1-alt1 sisyphus+348582.1076.15.2 1733949254 installed
<13>Dec 18 03:32:10 rpmi: libswscale8-2:7.1-alt1 sisyphus+348582.1076.15.2 1733949254 installed
<13>Dec 18 03:32:10 rpmi: libXv-1.0.12-alt1 sisyphus+311188.600.1.1 1670233799 installed
<13>Dec 18 03:32:10 rpmi: libzbar-0.23.93-alt1 sisyphus+350305.100.1.1 1717507821 installed
<13>Dec 18 03:32:10 rpmi: dbus-tools-gui-1.14.10-alt1 sisyphus+327286.5700.14.1 1711487401 installed
<13>Dec 18 03:32:10 rpmi: xprop-1.2.5-alt1 sisyphus+279025.100.1.1 1626354198 installed
<13>Dec 18 03:32:10 rpmi: libXcomposite-0.4.6-alt1 sisyphus+311188.200.1.1 1670233682 installed
<13>Dec 18 03:32:10 rpmi: rpm-macros-alternatives-0.5.2-alt2 sisyphus+315270.200.2.1 1676457367 installed
<13>Dec 18 03:32:10 rpmi: alternatives-0.5.2-alt2 sisyphus+315270.200.2.1 1676457367 installed
<13>Dec 18 03:32:10 rpmi: ca-certificates-2024.12.10-alt1 sisyphus+364633.200.3.1 1733918603 installed
<13>Dec 18 03:32:10 rpmi: ca-trust-0.2.0-alt1 sisyphus+344843.100.1.1 1712743326 installed
<13>Dec 18 03:32:10 rpmi: p11-kit-trust-1:0.25.5-alt1 sisyphus+352553.100.1.1 1720622573 installed
<13>Dec 18 03:32:10 rpmi: libcrypto3-3.1.7-alt2 sisyphus+359910.100.1.1 1729080439 installed
<13>Dec 18 03:32:10 rpmi: libssl3-3.1.7-alt2 sisyphus+359910.100.1.1 1729080439 installed
<13>Dec 18 03:32:11 rpmi: python3-3.12.8-alt1 sisyphus+364336.100.1.1 1733526854 installed
<13>Dec 18 03:32:11 rpmi: python3-base-3.12.8-alt1 sisyphus+364336.100.1.1 1733526854 installed
<13>Dec 18 03:32:12 rpmi: glib2-devel-2.82.4-alt1 sisyphus+364807.100.1.1 1733991592 installed
<86>Dec 18 03:32:12 groupadd[3692058]: group added to /etc/group: name=_keytab, GID=998
<86>Dec 18 03:32:12 groupadd[3692058]: group added to /etc/gshadow: name=_keytab
<86>Dec 18 03:32:12 groupadd[3692058]: new group: name=_keytab, GID=998
<13>Dec 18 03:32:12 rpmi: libkrb5-1.21.3-alt2 sisyphus+351857.100.1.1 1719735141 installed
<13>Dec 18 03:32:12 rpmi: libgio-devel-2.82.4-alt1 sisyphus+364807.100.1.1 1733991592 installed
<13>Dec 18 03:32:12 rpmi: libkmod-32-alt1 sisyphus+357452.100.2.1 1727718007 installed
<13>Dec 18 03:32:12 rpmi: libgdk-pixbuf-devel-2.42.12-alt1 sisyphus+348142.100.1.1 1715791856 installed
<13>Dec 18 03:32:12 rpmi: libcups-2.4.11-alt1 sisyphus+359120.200.2.1 1728202635 installed
<13>Dec 18 03:32:12 rpmi: libssh-0.10.6-alt1 sisyphus+338050.100.1.2 1705656358 installed
<13>Dec 18 03:32:12 rpmi: libcairo-devel-1:1.18.2-alt1 sisyphus+357195.100.1.1 1725948391 installed
<13>Dec 18 03:32:12 rpmi: fontconfig-devel-2.15.0-alt1 sisyphus+355771.100.2.3 1724337298 installed
<13>Dec 18 03:32:12 rpmi: libfreetype-devel-2.13.3-alt1 sisyphus+355656.100.1.1 1724221064 installed
<13>Dec 18 03:32:12 rpmi: libharfbuzz-devel-10.1.0-alt1 sisyphus+361773.100.1.1 1730824042 installed
<13>Dec 18 03:32:12 rpmi: libcairo-gobject-devel-1:1.18.2-alt1 sisyphus+357195.100.1.1 1725948391 installed
<13>Dec 18 03:32:12 rpmi: gtk-builder-convert-2.24.33-alt2 sisyphus+361465.100.1.1 1730475121 installed
<13>Dec 18 03:32:12 rpmi: libXft-devel-2.3.8-alt1 sisyphus+331490.400.1.1 1697023269 installed
<13>Dec 18 03:32:12 rpmi: libpango-devel-1.55.0-alt1 sisyphus+364011.100.1.1 1733245601 installed
<13>Dec 18 03:32:12 rpmi: systemd-utils-standalone-1:255.13-alt1 sisyphus+359453.100.2.1 1728651180 installed
<13>Dec 18 03:32:12 rpmi: at-spi2-core-2.54.0-alt1 sisyphus+357735.600.3.1 1726642126 installed
<13>Dec 18 03:32:12 rpmi: kmod-32-alt1 sisyphus+357452.100.2.1 1727718007 installed
<13>Dec 18 03:32:12 rpmi: dmsetup-1.02.202-alt1 sisyphus+361775.200.5.1 1730990757 installed
<86>Dec 18 03:32:12 groupadd[3694463]: group added to /etc/group: name=tape, GID=997
<86>Dec 18 03:32:12 groupadd[3694463]: group added to /etc/gshadow: name=tape
<86>Dec 18 03:32:12 groupadd[3694463]: new group: name=tape, GID=997
<86>Dec 18 03:32:12 groupadd[3694486]: group added to /etc/group: name=dialout, GID=996
<86>Dec 18 03:32:12 groupadd[3694486]: group added to /etc/gshadow: name=dialout
<86>Dec 18 03:32:12 groupadd[3694486]: new group: name=dialout, GID=996
<86>Dec 18 03:32:12 groupadd[3694528]: group added to /etc/group: name=input, GID=995
<86>Dec 18 03:32:12 groupadd[3694528]: group added to /etc/gshadow: name=input
<86>Dec 18 03:32:12 groupadd[3694528]: new group: name=input, GID=995
<86>Dec 18 03:32:12 groupadd[3694569]: group added to /etc/group: name=video, GID=994
<86>Dec 18 03:32:12 groupadd[3694569]: group added to /etc/gshadow: name=video
<86>Dec 18 03:32:12 groupadd[3694569]: new group: name=video, GID=994
<86>Dec 18 03:32:12 groupadd[3694600]: group added to /etc/group: name=render, GID=993
<86>Dec 18 03:32:12 groupadd[3694600]: group added to /etc/gshadow: name=render
<86>Dec 18 03:32:12 groupadd[3694600]: new group: name=render, GID=993
<86>Dec 18 03:32:12 groupadd[3694645]: group added to /etc/group: name=sgx, GID=992
<86>Dec 18 03:32:12 groupadd[3694645]: group added to /etc/gshadow: name=sgx
<86>Dec 18 03:32:12 groupadd[3694645]: new group: name=sgx, GID=992
<13>Dec 18 03:32:12 rpmi: udev-1:255.13-alt1 sisyphus+359453.100.2.1 1728651180 installed
<86>Dec 18 03:32:13 groupadd[3697131]: group added to /etc/group: name=colord, GID=991
<86>Dec 18 03:32:13 groupadd[3697131]: new group: name=colord, GID=991
<86>Dec 18 03:32:13 useradd[3697278]: new user: name=colord, UID=998, GID=991, home=/var/colord, shell=/dev/null, from=none
<13>Dec 18 03:32:13 rpmi: colord-1.4.7-alt1.1 sisyphus+338793.100.1.1 1706039016 installed
<13>Dec 18 03:32:14 rpmi: libgtk+3-3.24.43-alt1 sisyphus+352627.100.1.1 1720700731 installed
<13>Dec 18 03:32:14 rpmi: libgsasl18-2.2.1-alt2 sisyphus+359713.200.2.1 1728905430 installed
<86>Dec 18 03:32:14 groupadd[3699871]: group added to /etc/group: name=sasl, GID=990
<86>Dec 18 03:32:14 groupadd[3699871]: group added to /etc/gshadow: name=sasl
<86>Dec 18 03:32:14 groupadd[3699871]: new group: name=sasl, GID=990
<13>Dec 18 03:32:14 rpmi: libsasl2-3-2.1.28-alt2 sisyphus+343335.100.1.1 1711112544 installed
<13>Dec 18 03:32:14 rpmi: libldap2-2.6.9-alt1 sisyphus+364781.100.1.1 1733971238 installed
<13>Dec 18 03:32:14 rpmi: libneon-0.32.5-alt1 sisyphus+337867.100.1.2 1705641062 installed
<13>Dec 18 03:32:14 rpmi: libatk-devel-2.54.0-alt1 sisyphus+357735.600.3.1 1726642126 installed
<13>Dec 18 03:32:14 rpmi: libgtk+3-devel-3.24.43-alt1 sisyphus+352627.100.1.1 1720700731 installed
<13>Dec 18 03:32:14 rpmi: libgraphene-devel-1.10.8-alt1 sisyphus+296855.100.1.1 1647633383 installed
<13>Dec 18 03:32:14 rpmi: python3-module-markupsafe-1:3.0.2-alt1 sisyphus+360209.100.1.1 1729323052 installed
<13>Dec 18 03:32:14 rpmi: python3-module-jinja2-3.1.4-alt1 sisyphus+348267.100.1.1 1715939549 installed
<13>Dec 18 03:32:14 rpmi: python3-module-railroad-diagrams-3.0.1-alt1 sisyphus+358318.100.1.1 1727257812 installed
<13>Dec 18 03:32:14 rpmi: python3-module-pyparsing-3.2.0-alt1 sisyphus+359723.100.2.1 1728989647 installed
<13>Dec 18 03:32:14 rpmi: vulkan-registry-1.3.296-alt1 sisyphus+365035.500.5.1 1734354669 installed
<13>Dec 18 03:32:14 rpmi: libvulkan-devel-1.3.296-alt1 sisyphus+365035.1000.5.1 1734354968 installed
<13>Dec 18 03:32:14 rpmi: libevent2.1-2.1.12-alt1 sisyphus+324359.3500.11.1 1689364661 installed
<13>Dec 18 03:32:14 rpmi: libcamera-1:0.3.2-alt1 sisyphus+364140.300.8.1 1733730394 installed
<13>Dec 18 03:32:14 rpmi: librabbitmq-c4-0.15.0-alt1 sisyphus+363621.100.1.1 1732865039 installed
<13>Dec 18 03:32:14 rpmi: libavformat61-2:7.1-alt1 sisyphus+348582.1076.15.2 1733949254 installed
<13>Dec 18 03:32:14 rpmi: gdcm-3.0.21-alt1 sisyphus+364864.1000.3.1 1734089745 installed
<13>Dec 18 03:32:15 rpmi: libopencv4.10-1:4.10.0-alt2 sisyphus+348582.3500.15.2 1733952016 installed
<13>Dec 18 03:32:15 rpmi: libssh2-1.11.0-alt2 sisyphus+339356.100.1.1 1706593137 installed
<13>Dec 18 03:32:15 rpmi: libcurl-8.11.1-alt1 sisyphus+364692.100.1.1 1733905204 installed
<13>Dec 18 03:32:15 rpmi: libproxy-0.5.9-alt1 sisyphus+360721.100.1.1 1729865346 installed
<13>Dec 18 03:32:15 rpmi: glib-networking-2.80.0-alt1 sisyphus+342825.100.1.1 1710537082 installed
<13>Dec 18 03:32:15 rpmi: libsoup-2.74.3-alt1.1 sisyphus+318260.100.1.1 1680994685 installed
<13>Dec 18 03:32:15 rpmi: libsoup3.0-3.6.1-alt1 sisyphus+363265.100.1.1 1732359334 installed
<13>Dec 18 03:32:15 rpmi: libsoup-devel-2.74.3-alt1.1 sisyphus+318260.100.1.1 1680994685 installed
<13>Dec 18 03:32:15 rpmi: vala-0.56.17-alt1 sisyphus+345617.100.1.1 1713782341 installed
<13>Dec 18 03:32:15 rpmi: libsoup3.0-devel-3.6.1-alt1 sisyphus+363265.100.1.1 1732359334 installed
<13>Dec 18 03:32:15 rpmi: libraptor2-2.0.16-alt1 sisyphus+337177.100.1.1 1703495659 installed
<13>Dec 18 03:32:15 rpmi: liblrdf-0.6.1-alt1 sisyphus+278205.100.1.1 1626077040 installed
<13>Dec 18 03:32:15 rpmi: alsa-ucm-conf-1.2.12-alt1 sisyphus+352670.100.1.1 1720712327 installed
<13>Dec 18 03:32:15 rpmi: alsa-topology-conf-1.2.5.1-alt1 sisyphus+274777.100.1.1 1624089141 installed
<13>Dec 18 03:32:16 rpmi: libalsa-1:1.2.12-alt1 sisyphus+352670.200.1.1 1720712401 installed
<13>Dec 18 03:32:16 rpmi: libcanberra-0.30-alt3 sisyphus+275093.100.2.3 1624562350 installed
<13>Dec 18 03:32:16 rpmi: pipewire-libs-1.2.7-alt1 sisyphus+363440.100.1.1 1732632760 installed
<13>Dec 18 03:32:16 rpmi: pipewire-jack-libs-1.2.7-alt1 sisyphus+363440.100.1.1 1732632760 installed
<13>Dec 18 03:32:16 rpmi: libfluidsynth-2.4.1-alt1 sisyphus+363783.100.1.1 1733082177 installed
<13>Dec 18 03:32:16 rpmi: libSDL-1.2.14-alt10 sisyphus+346015.200.2.1 1716212609 installed
<13>Dec 18 03:32:16 rpmi: libmjpegtools2.1-2.2.1-alt2 sisyphus+332812.400.2.1 1698405785 installed
<13>Dec 18 03:32:16 rpmi: gst-plugins-bad1.0-1.24.10-alt1 sisyphus+364070.400.1.1 1733316428 installed
<13>Dec 18 03:32:17 rpmi: libgtk4-4.16.7-alt1 sisyphus+363301.100.1.1 1732451644 installed
<13>Dec 18 03:32:17 rpmi: libgtk4-devel-4.16.7-alt1 sisyphus+363301.100.1.1 1732451644 installed
<13>Dec 18 03:32:17 rpmi: libvte3-0.78.2-alt1 sisyphus+363301.200.1.1 1732451788 installed
<13>Dec 18 03:32:17 rpmi: libvte3-devel-0.78.2-alt1 sisyphus+363301.200.1.1 1732451788 installed
<13>Dec 18 03:32:17 rpmi: libssh-devel-0.10.6-alt1 sisyphus+338050.100.1.2 1705656358 installed
<13>Dec 18 03:32:17 rpmi: libssl-devel-3.1.7-alt2 sisyphus+359910.100.1.1 1729080439 installed
<13>Dec 18 03:32:17 rpmi: rpm-build-xdg-0.2-alt1 1250461503 installed
Building target platforms: x86_64
Building for target x86_64
Wrote: /usr/src/in/nosrpm/lterm-1.5.1-alt2.nosrc.rpm (w1.gzdio)
Installing lterm-1.5.1-alt2.src.rpm
Building target platforms: x86_64
Building for target x86_64
Executing(%prep): /bin/sh -e /usr/src/tmp/rpm-tmp.5598
+ umask 022
+ /bin/mkdir -p /usr/src/RPM/BUILD
+ cd /usr/src/RPM/BUILD
+ cd /usr/src/RPM/BUILD
+ rm -rf lterm-1.5.1
+ echo 'Source #0 (lterm-1.5.1.tar):'
Source #0 (lterm-1.5.1.tar):
+ /bin/tar -xf /usr/src/RPM/SOURCES/lterm-1.5.1.tar
+ cd lterm-1.5.1
+ /bin/chmod -c -Rf u+rwX,go-w .
+ echo 'Patch #1 (lterm-no-ssh_threads.patch):'
Patch #1 (lterm-no-ssh_threads.patch):
+ /usr/bin/patch -p2
patching file configure.ac
+ exit 0
Executing(%build): /bin/sh -e /usr/src/tmp/rpm-tmp.4503
+ umask 022
+ /bin/mkdir -p /usr/src/RPM/BUILD
+ cd /usr/src/RPM/BUILD
+ cd lterm-1.5.1
+ autoreconf -fisv
autoreconf-default: export WARNINGS=
autoreconf-default: Entering directory '.'
autoreconf-default: configure.ac: not using Gettext
autoreconf-default: running: aclocal --force
autoreconf-default: configure.ac: tracing
autoreconf-default: configure.ac: not using Libtool
autoreconf-default: configure.ac: not using Intltool
autoreconf-default: configure.ac: not using Gtkdoc
autoreconf-default: running: /usr/bin/autoconf-2.71 --force
configure.ac:8: warning: 'AM_CONFIG_HEADER': this macro is obsolete.
configure.ac:8: You should use the 'AC_CONFIG_HEADERS' macro instead.
./lib/autoconf/general.m4:2434: AC_DIAGNOSE is expanded from...
aclocal.m4:1236: AM_CONFIG_HEADER is expanded from...
configure.ac:8: the top level
configure.ac:20: warning: The macro `AC_HELP_STRING' is obsolete.
configure.ac:20: You should run autoupdate.
./lib/autoconf/general.m4:204: AC_HELP_STRING is expanded from...
configure.ac:20: the top level
configure.ac:33: warning: The macro `AC_HELP_STRING' is obsolete.
configure.ac:33: You should run autoupdate.
./lib/autoconf/general.m4:204: AC_HELP_STRING is expanded from...
configure.ac:33: the top level
configure.ac:44: warning: The macro `AC_HELP_STRING' is obsolete.
configure.ac:44: You should run autoupdate.
./lib/autoconf/general.m4:204: AC_HELP_STRING is expanded from...
configure.ac:44: the top level
configure.ac:71: warning: The macro `AC_HELP_STRING' is obsolete.
configure.ac:71: You should run autoupdate.
./lib/autoconf/general.m4:204: AC_HELP_STRING is expanded from...
configure.ac:71: the top level
configure.ac:201: warning: GTK_CHECK_BACKEND is deprecated, use PKG_CHECK_MODULES([GTK_X11], [gtk+-x11-3.0]) or similar instead
aclocal.m4:216: GTK_CHECK_BACKEND is expanded from...
configure.ac:201: the top level
autoreconf-default: running: /usr/bin/autoheader-2.71 --force
autoheader-2.71: warning: WARNING: Using auxiliary files such as 'acconfig.h', 'config.h.bot'
autoheader-2.71: WARNING: and 'config.h.top', to define templates for 'config.h.in'
autoheader-2.71: WARNING: is deprecated and discouraged.
autoheader-2.71:
autoheader-2.71: WARNING: Using the third argument of 'AC_DEFINE_UNQUOTED' and
autoheader-2.71: WARNING: 'AC_DEFINE' allows one to define a template without
autoheader-2.71: WARNING: 'acconfig.h':
autoheader-2.71:
autoheader-2.71: WARNING: AC_DEFINE([NEED_FUNC_MAIN], 1,
autoheader-2.71: [Define if a function 'main' is needed.])
autoheader-2.71:
autoheader-2.71: WARNING: More sophisticated templates can also be produced, see the
autoheader-2.71: WARNING: documentation.
autoreconf-default: running: automake --add-missing --force-missing
autoreconf-default: Leaving directory '.'
+ CFLAGS='-pipe -frecord-gcc-switches -Wall -g -O2 -flto=auto -fcommon'
+ export CFLAGS
+ CXXFLAGS='-pipe -frecord-gcc-switches -Wall -g -O2 -flto=auto -fcommon'
+ export CXXFLAGS
+ FFLAGS='-pipe -frecord-gcc-switches -Wall -g -O2 -flto=auto -fcommon'
+ export FFLAGS
+ FCFLAGS='-pipe -frecord-gcc-switches -Wall -g -O2 -flto=auto -fcommon'
+ export FCFLAGS
+ '[' -n '' ']'
++ printf %s '-pipe -frecord-gcc-switches -Wall -g -O2 -flto=auto -fcommon'
++ sed -r 's/(^|[[:space:]]+)-[^m][^[:space:]]*//g'
+ ASFLAGS=
+ export ASFLAGS
+ export lt_cv_deplibs_check_method=pass_all
+ lt_cv_deplibs_check_method=pass_all
+ readlink -e -- ./configure
+ xargs -ri dirname -- '{}'
+ xargs -ri find '{}' -type f '(' -name config.sub -or -name config.guess ')' -printf '%h/\n'
+ sort -u
+ xargs -rn1 install -pm755 -- /usr/share/gnu-config/config.sub /usr/share/gnu-config/config.guess
+ configure_runstatedir_flags=
+ grep -qF runstatedir=DIR ./configure
+ configure_runstatedir_flags=--runstatedir=/var/run
+ ./configure --build=x86_64-alt-linux --host=x86_64-alt-linux --prefix=/usr --exec-prefix=/usr --bindir=/usr/bin --sbindir=/usr/sbin --sysconfdir=/etc --datadir=/usr/share --includedir=/usr/include --libdir=/usr/lib64 --libexecdir=/usr/lib --localstatedir=/var/lib --sharedstatedir=/var/lib --mandir=/usr/share/man --infodir=/usr/share/info --disable-dependency-tracking --disable-silent-rules --runstatedir=/var/run --without-included-gettext
configure: WARNING: unrecognized options: --without-included-gettext
checking for a BSD-compatible install... /usr/bin/ginstall -c
checking whether build environment is sane... yes
checking for a race-free mkdir -p... /usr/bin/mkdir -p
checking for gawk... gawk
checking whether make sets $(MAKE)... yes
checking whether make supports nested variables... yes
checking for x86_64-alt-linux-gcc... x86_64-alt-linux-gcc
checking whether the C compiler works... yes
checking for C compiler default output file name... a.out
checking for suffix of executables...
checking whether we are cross compiling... no
checking for suffix of object files... o
checking whether the compiler supports GNU C... yes
checking whether x86_64-alt-linux-gcc accepts -g... yes
checking for x86_64-alt-linux-gcc option to enable C11 features... none needed
checking whether x86_64-alt-linux-gcc understands -c and -o together... yes
checking whether make supports the include directive... yes (GNU style)
checking dependency style of x86_64-alt-linux-gcc... none
checking for xmlcatalog... /usr/bin/xmlcatalog
checking for update-desktop-database... /usr/bin/update-desktop-database
checking for update-mime-database... /usr/bin/update-mime-database
checking for gtk libs... found gtk 3.0
checking for vte emulator widget... found vte-2.91
checking for openssl lib... yes
checking for libssh... yes
checking for x86_64-alt-linux-pkg-config... no
checking for pkg-config... /usr/bin/pkg-config
checking pkg-config is at least version 0.16... yes
no
checking for stdio.h... yes
checking for stdlib.h... yes
checking for string.h... yes
checking for inttypes.h... yes
checking for stdint.h... yes
checking for strings.h... yes
checking for sys/stat.h... yes
checking for sys/types.h... yes
checking for unistd.h... yes
checking for sys/time.h... yes
checking for fcntl.h... yes
checking for libintl.h... yes
checking for locale.h... yes
checking for stdlib.h... (cached) yes
checking for string.h... (cached) yes
checking for size_t... yes
checking build system type... x86_64-alt-linux-gnu
checking host system type... x86_64-alt-linux-gnu
checking for GNU libc compatible malloc... yes
checking for alarm... yes
checking for working mktime... yes
checking for memset... yes
checking for mkdir... yes
checking for regcomp... yes
checking for setlocale... yes
checking for strcasecmp... yes
checking for strchr... yes
checking for strncasecmp... yes
checking for strrchr... yes
checking that generated files are newer than configure... done
configure: creating ./config.status
config.status: creating Makefile
config.status: creating src/Makefile
config.status: creating img/Makefile
config.status: creating img/types/Makefile
config.status: creating data/Makefile
config.status: creating src/config.h
config.status: executing depfiles commands
configure: WARNING: unrecognized options: --without-included-gettext
+ make -j16
Making all in src
make all-am
make[2]: Entering directory '/usr/src/RPM/BUILD/lterm-1.5.1/src'
x86_64-alt-linux-gcc -DLOCALEDIR=\"/usr/share/locale\" -DIMGDIR=\"/usr/share/lterm/img\" -DPKGDATADIR=\"/usr/share/lterm/data\" -DHAVE_CONFIG_H -I. -pipe -frecord-gcc-switches -Wall -g -O2 -flto=auto -fcommon -pthread -I/usr/include/gtk-3.0 -I/usr/include/gio-unix-2.0 -I/usr/include/pango-1.0 -I/usr/include/harfbuzz -I/usr/include/pango-1.0 -I/usr/include/atk-1.0 -I/usr/include/cairo -I/usr/include/freetype2 -I/usr/include/harfbuzz -I/usr/include/gdk-pixbuf-2.0 -I/usr/include/libpng16 -I/usr/include/glib-2.0 -I/usr/lib64/glib-2.0/include -pthread -I/usr/include/vte-2.91 -I/usr/include/gtk-3.0 -I/usr/include/gio-unix-2.0 -I/usr/include/pango-1.0 -I/usr/include/harfbuzz -I/usr/include/pango-1.0 -I/usr/include/atk-1.0 -I/usr/include/cairo -I/usr/include/freetype2 -I/usr/include/harfbuzz -I/usr/include/gdk-pixbuf-2.0 -I/usr/include/libpng16 -I/usr/include/glib-2.0 -I/usr/lib64/glib-2.0/include -c -o terminal.o terminal.c
In file included from terminal.c:36:
utils.h:47:1: error: parameter names (without types) in function declaration [-Wdeclaration-missing-parameter-type]
47 | char *readFile (filename);
| ^~~~
terminal.c: In function 'terminal_new':
terminal.c:97:3: warning: 'vte_terminal_spawn_sync' is deprecated [-Wdeprecated-declarations]
97 | success = vte_terminal_spawn_sync (VTE_TERMINAL (p_connection_tab->vte), VTE_PTY_DEFAULT, NULL, av, NULL,
| ^~~~~~~
In file included from /usr/include/vte-2.91/vte/vte.h:38,
from terminal.c:25:
/usr/include/vte-2.91/vte/vtedeprecated.h:91:10: note: declared here
91 | gboolean vte_terminal_spawn_sync(VteTerminal *terminal,
| ^~~~~~~~~~~~~~~~~~~~~~~
terminal.c:55:7: warning: variable 'rc' set but not used [-Wunused-but-set-variable]
55 | int rc;
| ^~
terminal.c:51:20: warning: unused variable 'p_prot' [-Wunused-variable]
51 | struct Protocol *p_prot;
| ^~~~~~
terminal.c: In function 'log_on':
terminal.c:402:7: warning: 'vte_terminal_spawn_sync' is deprecated [-Wdeprecated-declarations]
402 | success = vte_terminal_spawn_sync (VTE_TERMINAL (p_conn_tab->vte), VTE_PTY_DEFAULT, NULL, p_params, NULL,
| ^~~~~~~
/usr/include/vte-2.91/vte/vtedeprecated.h:91:10: note: declared here
91 | gboolean vte_terminal_spawn_sync(VteTerminal *terminal,
| ^~~~~~~~~~~~~~~~~~~~~~~
terminal.c:159:7: warning: unused variable 'i' [-Wunused-variable]
159 | int i, ret;
| ^
terminal.c: In function 'get_remote_directory_from_vte_title':
terminal.c:542:3: warning: 'vte_terminal_get_window_title' is deprecated [-Wdeprecated-declarations]
542 | title = (char *) vte_terminal_get_window_title (VTE_TERMINAL(vte));
| ^~~~~
/usr/include/vte-2.91/vte/vtedeprecated.h:217:13: note: declared here
217 | const char *vte_terminal_get_window_title(VteTerminal *terminal) _VTE_CXX_NOEXCEPT _VTE_GNUC_NONNULL(1);
| ^~~~~~~~~~~~~~~~~~~~~~~~~~~~~
terminal.c: In function 'asked_for_user':
terminal.c:629:16: warning: variable 'vteterminal' set but not used [-Wunused-but-set-variable]
629 | VteTerminal *vteterminal;
| ^~~~~~~~~~~
terminal.c: In function 'asked_for_password':
terminal.c:653:16: warning: variable 'vteterminal' set but not used [-Wunused-but-set-variable]
653 | VteTerminal *vteterminal;
| ^~~~~~~~~~~
terminal.c: In function 'load_session_file':
terminal.c:828:26: warning: unused variable 'cl' [-Wunused-variable]
828 | struct Connection_List cl;
| ^~
terminal.c:827:25: warning: unused variable 'p_ct' [-Wunused-variable]
827 | struct ConnectionTab *p_ct;
| ^~~~
terminal.c:826:9: warning: unused variable 'fp' [-Wunused-variable]
826 | FILE *fp;
| ^~
terminal.c:824:7: warning: unused variable 'rc' [-Wunused-variable]
824 | int rc;
| ^~
terminal.c: In function 'save_session_file':
terminal.c:903:7: warning: unused variable 'len' [-Wunused-variable]
903 | int len, rc = 0;
| ^~~
terminal.c:902:9: warning: unused variable 'p_enc_b64' [-Wunused-variable]
902 | char *p_enc_b64;
| ^~~~~~~~~
terminal.c:901:9: warning: unused variable 'p_enc' [-Wunused-variable]
901 | char *p_enc;
| ^~~~~
terminal.c:900:26: warning: unused variable 'cl' [-Wunused-variable]
900 | struct Connection_List cl;
| ^~
terminal.c:899:25: warning: unused variable 'p_ct' [-Wunused-variable]
899 | struct ConnectionTab *p_ct;
| ^~~~
terminal.c:898:28: warning: unused variable 'addedConn' [-Wunused-variable]
898 | struct Connection conn, *addedConn;
| ^~~~~~~~~
terminal.c:898:21: warning: unused variable 'conn' [-Wunused-variable]
898 | struct Connection conn, *addedConn;
| ^~~~
terminal.c:897:9: warning: unused variable 'fp' [-Wunused-variable]
897 | FILE *fp;
| ^~
terminal.c:896:10: warning: unused variable 'item' [-Wunused-variable]
896 | GList *item;
| ^~~~
terminal.c: In function 'terminal_set_search_expr':
terminal.c:1027:3: warning: 'vte_terminal_search_set_gregex' is deprecated [-Wdeprecated-declarations]
1027 | vte_terminal_search_set_gregex (VTE_TERMINAL(p_current_connection_tab->vte), regex, 0);
| ^~~~~~~~~~~~~~~~~~~~~~~~~~~~~~
/usr/include/vte-2.91/vte/vtedeprecated.h:79:11: note: declared here
79 | void vte_terminal_search_set_gregex (VteTerminal *terminal,
| ^~~~~~~~~~~~~~~~~~~~~~~~~~~~~~
terminal.c: In function 'terminal_set_encoding':
terminal.c:1057:3: warning: 'vte_terminal_set_encoding' is deprecated [-Wdeprecated-declarations]
1057 | vte_terminal_set_encoding (VTE_TERMINAL(pTab->vte), codeset, &error);
| ^~~~~~~~~~~~~~~~~~~~~~~~~
/usr/include/vte-2.91/vte/vtedeprecated.h:133:10: note: declared here
133 | gboolean vte_terminal_set_encoding(VteTerminal *terminal,
| ^~~~~~~~~~~~~~~~~~~~~~~~~
make[2]: *** [Makefile:428: terminal.o] Error 1
make[2]: Leaving directory '/usr/src/RPM/BUILD/lterm-1.5.1/src'
make[2]: *** Waiting for unfinished jobs....
make[2]: Entering directory '/usr/src/RPM/BUILD/lterm-1.5.1/src'
x86_64-alt-linux-gcc -DLOCALEDIR=\"/usr/share/locale\" -DIMGDIR=\"/usr/share/lterm/img\" -DPKGDATADIR=\"/usr/share/lterm/data\" -DHAVE_CONFIG_H -I. -pipe -frecord-gcc-switches -Wall -g -O2 -flto=auto -fcommon -pthread -I/usr/include/gtk-3.0 -I/usr/include/gio-unix-2.0 -I/usr/include/pango-1.0 -I/usr/include/harfbuzz -I/usr/include/pango-1.0 -I/usr/include/atk-1.0 -I/usr/include/cairo -I/usr/include/freetype2 -I/usr/include/harfbuzz -I/usr/include/gdk-pixbuf-2.0 -I/usr/include/libpng16 -I/usr/include/glib-2.0 -I/usr/lib64/glib-2.0/include -pthread -I/usr/include/vte-2.91 -I/usr/include/gtk-3.0 -I/usr/include/gio-unix-2.0 -I/usr/include/pango-1.0 -I/usr/include/harfbuzz -I/usr/include/pango-1.0 -I/usr/include/atk-1.0 -I/usr/include/cairo -I/usr/include/freetype2 -I/usr/include/harfbuzz -I/usr/include/gdk-pixbuf-2.0 -I/usr/include/libpng16 -I/usr/include/glib-2.0 -I/usr/lib64/glib-2.0/include -c -o protocol.o protocol.c
In file included from protocol.c:25:
utils.h:47:1: error: parameter names (without types) in function declaration [-Wdeclaration-missing-parameter-type]
47 | char *readFile (filename);
| ^~~~
protocol.c: In function 'load_protocols_from_file_xml':
protocol.c:282:15: warning: suggest parentheses around assignment used as truth value [-Wparentheses]
282 | if (child = xml_node_get_child (node, "command"))
| ^~~~~
protocol.c:285:15: warning: suggest parentheses around assignment used as truth value [-Wparentheses]
285 | if (child = xml_node_get_child (node, "port"))
| ^~~~~
protocol.c:292:15: warning: suggest parentheses around assignment used as truth value [-Wparentheses]
292 | if (child = xml_node_get_child (node, "arguments"))
| ^~~~~
protocol.c:295:15: warning: suggest parentheses around assignment used as truth value [-Wparentheses]
295 | if (node_2 = xml_node_get_child (node, "flags"))
| ^~~~~~
protocol.c:297:19: warning: suggest parentheses around assignment used as truth value [-Wparentheses]
297 | if (child = xml_node_get_child (node_2, "askuser"))
| ^~~~~
protocol.c:305:19: warning: suggest parentheses around assignment used as truth value [-Wparentheses]
305 | if (child = xml_node_get_child (node_2, "askpassword"))
| ^~~~~
protocol.c:313:19: warning: suggest parentheses around assignment used as truth value [-Wparentheses]
313 | if (child = xml_node_get_child (node_2, "disconnectclose"))
| ^~~~~
protocol.c:228:20: warning: unused variable 'pc' [-Wunused-variable]
228 | char tmp_s[32], *pc;
| ^~
protocol.c:225:7: warning: unused variable 'rc' [-Wunused-variable]
225 | int rc = 0;
| ^~
protocol.c: In function 'save_protocols_to_file_xml':
protocol.c:341:8: warning: unused variable 's_flags' [-Wunused-variable]
341 | char s_flags[1024];
| ^~~~~~~
protocol.c:340:8: warning: unused variable 'line' [-Wunused-variable]
340 | char line[1024];
| ^~~~
protocol.c: In function 'query_name_new_protocol':
protocol.c:454:41: warning: 'GtkStock' is deprecated [-Wdeprecated-declarations]
454 | GTK_STOCK_CANCEL,
| ^~~~~~~~~~~~~~~~
protocol.c:456:41: warning: 'GtkStock' is deprecated [-Wdeprecated-declarations]
456 | GTK_STOCK_OK,
| ^~~~~~~~~~~~
protocol.c:472:3: warning: 'gtk_alignment_new' is deprecated [-Wdeprecated-declarations]
472 | l_align = gtk_alignment_new (0, 0, 0, 0);
| ^~~~~~~
In file included from /usr/include/gtk-3.0/gtk/gtk.h:255,
from protocol.c:21:
/usr/include/gtk-3.0/gtk/deprecated/gtkalignment.h:79:12: note: declared here
79 | GtkWidget* gtk_alignment_new (gfloat xalign,
| ^~~~~~~~~~~~~~~~~
protocol.c: In function 'prot_save_clicked_cb':
protocol.c:569:8: warning: unused variable 's_port' [-Wunused-variable]
569 | char s_port[256];
| ^~~~~~
protocol.c: In function 'refresh_protocols':
protocol.c:663:7: warning: unused variable 'i' [-Wunused-variable]
663 | int i;
| ^
protocol.c: In function 'manage_protocols':
protocol.c:810:3: warning: 'gtk_button_new_from_stock' is deprecated: Use 'gtk_button_new_with_label' instead [-Wdeprecated-declarations]
810 | GtkWidget *new_button = gtk_button_new_from_stock (GTK_STOCK_NEW);
| ^~~~~~~~~
In file included from /usr/include/gtk-3.0/gtk/gtk.h:54:
/usr/include/gtk-3.0/gtk/gtkbutton.h:103:16: note: declared here
103 | GtkWidget* gtk_button_new_from_stock (const gchar *stock_id);
| ^~~~~~~~~~~~~~~~~~~~~~~~~
protocol.c:810:3: warning: 'GtkStock' is deprecated [-Wdeprecated-declarations]
810 | GtkWidget *new_button = gtk_button_new_from_stock (GTK_STOCK_NEW);
| ^~~~~~~~~
protocol.c:814:3: warning: 'gtk_button_new_from_stock' is deprecated: Use 'gtk_button_new_with_label' instead [-Wdeprecated-declarations]
814 | GtkWidget *save_button = gtk_button_new_from_stock (GTK_STOCK_SAVE);
| ^~~~~~~~~
/usr/include/gtk-3.0/gtk/gtkbutton.h:103:16: note: declared here
103 | GtkWidget* gtk_button_new_from_stock (const gchar *stock_id);
| ^~~~~~~~~~~~~~~~~~~~~~~~~
protocol.c:814:3: warning: 'GtkStock' is deprecated [-Wdeprecated-declarations]
814 | GtkWidget *save_button = gtk_button_new_from_stock (GTK_STOCK_SAVE);
| ^~~~~~~~~
protocol.c:818:3: warning: 'gtk_button_new_from_stock' is deprecated: Use 'gtk_button_new_with_label' instead [-Wdeprecated-declarations]
818 | GtkWidget *revert_button = gtk_button_new_from_stock (GTK_STOCK_REVERT_TO_SAVED);
| ^~~~~~~~~
/usr/include/gtk-3.0/gtk/gtkbutton.h:103:16: note: declared here
103 | GtkWidget* gtk_button_new_from_stock (const gchar *stock_id);
| ^~~~~~~~~~~~~~~~~~~~~~~~~
protocol.c:818:3: warning: 'GtkStock' is deprecated [-Wdeprecated-declarations]
818 | GtkWidget *revert_button = gtk_button_new_from_stock (GTK_STOCK_REVERT_TO_SAVED);
| ^~~~~~~~~
protocol.c:822:3: warning: 'gtk_button_new_from_stock' is deprecated: Use 'gtk_button_new_with_label' instead [-Wdeprecated-declarations]
822 | GtkWidget *delete_button = gtk_button_new_from_stock (GTK_STOCK_DELETE);
| ^~~~~~~~~
/usr/include/gtk-3.0/gtk/gtkbutton.h:103:16: note: declared here
103 | GtkWidget* gtk_button_new_from_stock (const gchar *stock_id);
| ^~~~~~~~~~~~~~~~~~~~~~~~~
protocol.c:822:3: warning: 'GtkStock' is deprecated [-Wdeprecated-declarations]
822 | GtkWidget *delete_button = gtk_button_new_from_stock (GTK_STOCK_DELETE);
| ^~~~~~~~~
protocol.c:832:3: warning: 'gtk_alignment_new' is deprecated [-Wdeprecated-declarations]
832 | GtkWidget *status_align = gtk_alignment_new (0, 0, 0, 0);
| ^~~~~~~~~
/usr/include/gtk-3.0/gtk/deprecated/gtkalignment.h:79:12: note: declared here
79 | GtkWidget* gtk_alignment_new (gfloat xalign,
| ^~~~~~~~~~~~~~~~~
protocol.c:874:3: warning: 'gtk_alignment_new' is deprecated [-Wdeprecated-declarations]
874 | GtkWidget *variables_align = gtk_alignment_new (0, 0, 0, 0);
| ^~~~~~~~~
/usr/include/gtk-3.0/gtk/deprecated/gtkalignment.h:79:12: note: declared here
79 | GtkWidget* gtk_alignment_new (gfloat xalign,
| ^~~~~~~~~~~~~~~~~
protocol.c:893:3: warning: 'GtkStock' is deprecated [-Wdeprecated-declarations]
893 | ok_button = gtk_dialog_add_button (GTK_DIALOG (dialog), GTK_STOCK_CLOSE, GTK_RESPONSE_OK);
| ^~~~~~~~~
protocol.c:713:8: warning: variable 'result' set but not used [-Wunused-but-set-variable]
713 | gint result;
| ^~~~~~
protocol.c:712:20: warning: unused variable 'p' [-Wunused-variable]
712 | struct Protocol *p;
| ^
protocol.c:711:10: warning: unused variable 'client_glist' [-Wunused-variable]
711 | GList *client_glist = NULL;
| ^~~~~~~~~~~~
protocol.c:710:30: warning: variable 'ok_button' set but not used [-Wunused-but-set-variable]
710 | GtkWidget *cancel_button, *ok_button;
| ^~~~~~~~~
protocol.c:710:14: warning: unused variable 'cancel_button' [-Wunused-variable]
710 | GtkWidget *cancel_button, *ok_button;
| ^~~~~~~~~~~~~
make[2]: *** [Makefile:428: protocol.o] Error 1
make[2]: Leaving directory '/usr/src/RPM/BUILD/lterm-1.5.1/src'
make[2]: Entering directory '/usr/src/RPM/BUILD/lterm-1.5.1/src'
x86_64-alt-linux-gcc -DLOCALEDIR=\"/usr/share/locale\" -DIMGDIR=\"/usr/share/lterm/img\" -DPKGDATADIR=\"/usr/share/lterm/data\" -DHAVE_CONFIG_H -I. -pipe -frecord-gcc-switches -Wall -g -O2 -flto=auto -fcommon -pthread -I/usr/include/gtk-3.0 -I/usr/include/gio-unix-2.0 -I/usr/include/pango-1.0 -I/usr/include/harfbuzz -I/usr/include/pango-1.0 -I/usr/include/atk-1.0 -I/usr/include/cairo -I/usr/include/freetype2 -I/usr/include/harfbuzz -I/usr/include/gdk-pixbuf-2.0 -I/usr/include/libpng16 -I/usr/include/glib-2.0 -I/usr/lib64/glib-2.0/include -pthread -I/usr/include/vte-2.91 -I/usr/include/gtk-3.0 -I/usr/include/gio-unix-2.0 -I/usr/include/pango-1.0 -I/usr/include/harfbuzz -I/usr/include/pango-1.0 -I/usr/include/atk-1.0 -I/usr/include/cairo -I/usr/include/freetype2 -I/usr/include/harfbuzz -I/usr/include/gdk-pixbuf-2.0 -I/usr/include/libpng16 -I/usr/include/glib-2.0 -I/usr/lib64/glib-2.0/include -c -o connection_list.o connection_list.c
In file included from connection_list.c:30:
utils.h:47:1: error: parameter names (without types) in function declaration [-Wdeclaration-missing-parameter-type]
47 | char *readFile (filename);
| ^~~~
connection_list.c: In function 'cl_check':
connection_list.c:240:31: warning: unused variable 'pc' [-Wunused-variable]
240 | struct Connection *p_conn, *pc;
| ^~
make[2]: *** [Makefile:428: connection_list.o] Error 1
make[2]: Leaving directory '/usr/src/RPM/BUILD/lterm-1.5.1/src'
make[2]: Entering directory '/usr/src/RPM/BUILD/lterm-1.5.1/src'
x86_64-alt-linux-gcc -DLOCALEDIR=\"/usr/share/locale\" -DIMGDIR=\"/usr/share/lterm/img\" -DPKGDATADIR=\"/usr/share/lterm/data\" -DHAVE_CONFIG_H -I. -pipe -frecord-gcc-switches -Wall -g -O2 -flto=auto -fcommon -pthread -I/usr/include/gtk-3.0 -I/usr/include/gio-unix-2.0 -I/usr/include/pango-1.0 -I/usr/include/harfbuzz -I/usr/include/pango-1.0 -I/usr/include/atk-1.0 -I/usr/include/cairo -I/usr/include/freetype2 -I/usr/include/harfbuzz -I/usr/include/gdk-pixbuf-2.0 -I/usr/include/libpng16 -I/usr/include/glib-2.0 -I/usr/lib64/glib-2.0/include -pthread -I/usr/include/vte-2.91 -I/usr/include/gtk-3.0 -I/usr/include/gio-unix-2.0 -I/usr/include/pango-1.0 -I/usr/include/harfbuzz -I/usr/include/pango-1.0 -I/usr/include/atk-1.0 -I/usr/include/cairo -I/usr/include/freetype2 -I/usr/include/harfbuzz -I/usr/include/gdk-pixbuf-2.0 -I/usr/include/libpng16 -I/usr/include/glib-2.0 -I/usr/lib64/glib-2.0/include -c -o ssh.o ssh.c
In file included from ssh.c:31:
utils.h:47:1: error: parameter names (without types) in function declaration [-Wdeclaration-missing-parameter-type]
47 | char *readFile (filename);
| ^~~~
ssh.c: In function 'ssh_list_dump':
ssh.c:159:15: warning: suggest parentheses around assignment used as truth value [-Wparentheses]
159 | if (c = ssh_node_open_channel (node))
| ^
ssh.c: In function 'ssh_node_connect':
ssh.c:212:7: warning: suggest parentheses around assignment used as truth value [-Wparentheses]
212 | if (p_node = ssh_list_search (p_ssh_list, p_auth->host, p_auth->user))
| ^~~~~~
ssh.c:234:15: warning: suggest parentheses around assignment used as truth value [-Wparentheses]
234 | if (c = ssh_node_open_channel (p_node))
| ^
ssh.c: In function 'lt_ssh_connect':
ssh.c:809:3: error: implicit declaration of function 'lockSSH'; did you mean 'lockf'? [-Wimplicit-function-declaration]
809 | lockSSH (__func__, TRUE);
| ^~~~~~~
| lockf
make[2]: *** [Makefile:428: ssh.o] Error 1
make[2]: Leaving directory '/usr/src/RPM/BUILD/lterm-1.5.1/src'
make[2]: Entering directory '/usr/src/RPM/BUILD/lterm-1.5.1/src'
x86_64-alt-linux-gcc -DLOCALEDIR=\"/usr/share/locale\" -DIMGDIR=\"/usr/share/lterm/img\" -DPKGDATADIR=\"/usr/share/lterm/data\" -DHAVE_CONFIG_H -I. -pipe -frecord-gcc-switches -Wall -g -O2 -flto=auto -fcommon -pthread -I/usr/include/gtk-3.0 -I/usr/include/gio-unix-2.0 -I/usr/include/pango-1.0 -I/usr/include/harfbuzz -I/usr/include/pango-1.0 -I/usr/include/atk-1.0 -I/usr/include/cairo -I/usr/include/freetype2 -I/usr/include/harfbuzz -I/usr/include/gdk-pixbuf-2.0 -I/usr/include/libpng16 -I/usr/include/glib-2.0 -I/usr/lib64/glib-2.0/include -pthread -I/usr/include/vte-2.91 -I/usr/include/gtk-3.0 -I/usr/include/gio-unix-2.0 -I/usr/include/pango-1.0 -I/usr/include/harfbuzz -I/usr/include/pango-1.0 -I/usr/include/atk-1.0 -I/usr/include/cairo -I/usr/include/freetype2 -I/usr/include/harfbuzz -I/usr/include/gdk-pixbuf-2.0 -I/usr/include/libpng16 -I/usr/include/glib-2.0 -I/usr/lib64/glib-2.0/include -c -o profile.o profile.c
In file included from profile.c:29:
utils.h:47:1: error: parameter names (without types) in function declaration [-Wdeclaration-missing-parameter-type]
47 | char *readFile (filename);
| ^~~~
profile.c: In function 'profile_get_name_param':
profile.c:45:10: warning: unused variable 'nmatch' [-Wunused-variable]
45 | size_t nmatch;
| ^~~~~~
profile.c: In function 'profile_load_int':
profile.c:162:8: warning: unused variable 'buffer' [-Wunused-variable]
162 | char buffer[33];
| ^~~~~~
profile.c: In function 'profile_modify_string':
profile.c:182:10: warning: unused variable 'nmatch' [-Wunused-variable]
182 | size_t nmatch;
| ^~~~~~
profile.c: In function 'profile_delete_section':
profile.c:403:10: warning: suggest parentheses around assignment used as truth value [-Wparentheses]
403 | while (pl = fgets (line, 1024, fp))
| ^~
profile.c: In function 'load_profiles':
profile.c:687:15: warning: suggest parentheses around assignment used as truth value [-Wparentheses]
687 | if (child = xml_node_get_child (node, "fg-color"))
| ^~~~~
profile.c:690:15: warning: suggest parentheses around assignment used as truth value [-Wparentheses]
690 | if (node_2 = xml_node_get_child (node, "fonts"))
| ^~~~~~
profile.c:692:19: warning: suggest parentheses around assignment used as truth value [-Wparentheses]
692 | if (child = xml_node_get_child (node_2, "use-system"))
| ^~~~~
profile.c:699:19: warning: suggest parentheses around assignment used as truth value [-Wparentheses]
699 | if (child = xml_node_get_child (node_2, "font"))
| ^~~~~
profile.c:703:15: warning: suggest parentheses around assignment used as truth value [-Wparentheses]
703 | if (node_2 = xml_node_get_child (node, "background"))
| ^~~~~~
profile.c:705:19: warning: suggest parentheses around assignment used as truth value [-Wparentheses]
705 | if (child = xml_node_get_child (node_2, "color"))
| ^~~~~
profile.c:708:19: warning: suggest parentheses around assignment used as truth value [-Wparentheses]
708 | if (child = xml_node_get_child (node_2, "alpha"))
| ^~~~~
profile.c:719:15: warning: suggest parentheses around assignment used as truth value [-Wparentheses]
719 | if (node_2 = xml_node_get_child (node, "cursor"))
| ^~~~~~
profile.c:721:19: warning: suggest parentheses around assignment used as truth value [-Wparentheses]
721 | if (child = xml_node_get_child (node_2, "shape"))
| ^~~~~
profile.c:729:19: warning: suggest parentheses around assignment used as truth value [-Wparentheses]
729 | if (child = xml_node_get_child (node_2, "blinking"))
| ^~~~~
profile.c:738:15: warning: suggest parentheses around assignment used as truth value [-Wparentheses]
738 | if (node_2 = xml_node_get_child (node, "bell"))
| ^~~~~~
profile.c:740:19: warning: suggest parentheses around assignment used as truth value [-Wparentheses]
740 | if (child = xml_node_get_child (node_2, "audible"))
| ^~~~~
profile.c:748:19: warning: suggest parentheses around assignment used as truth value [-Wparentheses]
748 | if (child = xml_node_get_child (node_2, "visible"))
| ^~~~~
profile.c:626:20: warning: unused variable 'pc' [-Wunused-variable]
626 | char tmp_s[32], *pc;
| ^~
make[2]: *** [Makefile:428: profile.o] Error 1
make[2]: Leaving directory '/usr/src/RPM/BUILD/lterm-1.5.1/src'
make[2]: Entering directory '/usr/src/RPM/BUILD/lterm-1.5.1/src'
x86_64-alt-linux-gcc -DLOCALEDIR=\"/usr/share/locale\" -DIMGDIR=\"/usr/share/lterm/img\" -DPKGDATADIR=\"/usr/share/lterm/data\" -DHAVE_CONFIG_H -I. -pipe -frecord-gcc-switches -Wall -g -O2 -flto=auto -fcommon -pthread -I/usr/include/gtk-3.0 -I/usr/include/gio-unix-2.0 -I/usr/include/pango-1.0 -I/usr/include/harfbuzz -I/usr/include/pango-1.0 -I/usr/include/atk-1.0 -I/usr/include/cairo -I/usr/include/freetype2 -I/usr/include/harfbuzz -I/usr/include/gdk-pixbuf-2.0 -I/usr/include/libpng16 -I/usr/include/glib-2.0 -I/usr/lib64/glib-2.0/include -pthread -I/usr/include/vte-2.91 -I/usr/include/gtk-3.0 -I/usr/include/gio-unix-2.0 -I/usr/include/pango-1.0 -I/usr/include/harfbuzz -I/usr/include/pango-1.0 -I/usr/include/atk-1.0 -I/usr/include/cairo -I/usr/include/freetype2 -I/usr/include/harfbuzz -I/usr/include/gdk-pixbuf-2.0 -I/usr/include/libpng16 -I/usr/include/glib-2.0 -I/usr/lib64/glib-2.0/include -c -o transfer_window.o transfer_window.c
In file included from transfer_window.c:26:
utils.h:47:1: error: parameter names (without types) in function declaration [-Wdeclaration-missing-parameter-type]
47 | char *readFile (filename);
| ^~~~
transfer_window.c: In function 'transfer_details':
transfer_window.c:113:3: warning: 'GtkStock' is deprecated [-Wdeprecated-declarations]
113 | GtkWidget *ok_button = gtk_dialog_add_button (GTK_DIALOG (dialog), GTK_STOCK_OK, GTK_RESPONSE_OK);
| ^~~~~~~~~
transfer_window.c:124:11: warning: format '%lld' expects argument of type 'long long int', but argument 7 has type 'uint64_t' {aka 'long unsigned int'} [-Wformat=]
124 | "Action: %s\n"
| ^~~~~~~~~~~~~~~~~~~~~
......
137 | bytes_to_human_readable (pTi->size, tmpSize), pTi->size,
| ~~~~~~~~~
| |
| uint64_t {aka long unsigned int}
transfer_window.c:127:32: note: format string is defined here
127 | "Size: %s (%lld bytes)\n"
| ~~~^
| |
| long long int
| %ld
transfer_window.c:124:11: warning: format '%lld' expects argument of type 'long long int', but argument 9 has type 'uint64_t' {aka 'long unsigned int'} [-Wformat=]
124 | "Action: %s\n"
| ^~~~~~~~~~~~~~~~~~~~~
......
138 | bytes_to_human_readable (pTi->worked, tmpWorked), pTi->worked,
| ~~~~~~~~~~~
| |
| uint64_t {aka long unsigned int}
transfer_window.c:128:39: note: format string is defined here
128 | "Transferred: %s (%lld bytes)\n"
| ~~~^
| |
| long long int
| %ld
transfer_window.c:153:7: warning: unused variable 'result' [-Wunused-variable]
153 | int result = gtk_dialog_run (GTK_DIALOG (dialog));
| ^~~~~~
transfer_window.c:113:14: warning: unused variable 'ok_button' [-Wunused-variable]
113 | GtkWidget *ok_button = gtk_dialog_add_button (GTK_DIALOG (dialog), GTK_STOCK_OK, GTK_RESPONSE_OK);
| ^~~~~~~~~
transfer_window.c: In function 'transfer_cancel':
transfer_window.c:176:3: error: implicit declaration of function 'lockSFTPQueue' [-Wimplicit-function-declaration]
176 | lockSFTPQueue (__func__, TRUE);
| ^~~~~~~~~~~~~
transfer_window.c:170:21: warning: unused variable 'iter' [-Wunused-variable]
170 | GtkTreeIter iter;
| ^~~~
transfer_window.c:169:21: warning: unused variable 'model' [-Wunused-variable]
169 | GtkTreeModel *model;
| ^~~~~
transfer_window.c:168:21: warning: unused variable 'selection' [-Wunused-variable]
168 | GtkTreeSelection *selection;
| ^~~~~~~~~
transfer_window.c: In function 'transfer_remove_completed':
transfer_window.c:207:7: warning: unused variable 'i' [-Wunused-variable]
207 | int i, nDel = 0;
| ^
transfer_window.c: In function 'transfer_popup_menu':
transfer_window.c:260:3: warning: 'gtk_action_group_new' is deprecated [-Wdeprecated-declarations]
260 | action_group = gtk_action_group_new ("TransferWindowPopupMenu");
| ^~~~~~~~~~~~
In file included from /usr/include/gtk-3.0/gtk/gtk.h:254,
from transfer_window.c:23:
/usr/include/gtk-3.0/gtk/deprecated/gtkactiongroup.h:175:17: note: declared here
175 | GtkActionGroup *gtk_action_group_new (const gchar *name);
| ^~~~~~~~~~~~~~~~~~~~
transfer_window.c:261:3: warning: 'gtk_action_group_add_actions' is deprecated [-Wdeprecated-declarations]
261 | gtk_action_group_add_actions (action_group, transfer_popup_menu_items, G_N_ELEMENTS (transfer_popup_menu_items), treeview);
| ^~~~~~~~~~~~~~~~~~~~~~~~~~~~
/usr/include/gtk-3.0/gtk/deprecated/gtkactiongroup.h:210:17: note: declared here
210 | void gtk_action_group_add_actions (GtkActionGroup *action_group,
| ^~~~~~~~~~~~~~~~~~~~~~~~~~~~
transfer_window.c:263:3: warning: 'gtk_ui_manager_new' is deprecated [-Wdeprecated-declarations]
263 | ui_manager = gtk_ui_manager_new ();
| ^~~~~~~~~~
In file included from /usr/include/gtk-3.0/gtk/gtk.h:284:
/usr/include/gtk-3.0/gtk/deprecated/gtkuimanager.h:130:16: note: declared here
130 | GtkUIManager *gtk_ui_manager_new (void);
| ^~~~~~~~~~~~~~~~~~
transfer_window.c:264:3: warning: 'gtk_ui_manager_insert_action_group' is deprecated [-Wdeprecated-declarations]
264 | gtk_ui_manager_insert_action_group (ui_manager, action_group, 0);
| ^~~~~~~~~~~~~~~~~~~~~~~~~~~~~~~~~~
/usr/include/gtk-3.0/gtk/deprecated/gtkuimanager.h:138:16: note: declared here
138 | void gtk_ui_manager_insert_action_group (GtkUIManager *manager,
| ^~~~~~~~~~~~~~~~~~~~~~~~~~~~~~~~~~
transfer_window.c:266:3: warning: 'gtk_ui_manager_add_ui_from_string' is deprecated [-Wdeprecated-declarations]
266 | gtk_ui_manager_add_ui_from_string (ui_manager, ui_transfer_popup_desc, -1, NULL);
| ^~~~~~~~~~~~~~~~~~~~~~~~~~~~~~~~~
/usr/include/gtk-3.0/gtk/deprecated/gtkuimanager.h:158:16: note: declared here
158 | guint gtk_ui_manager_add_ui_from_string (GtkUIManager *manager,
| ^~~~~~~~~~~~~~~~~~~~~~~~~~~~~~~~~
transfer_window.c:268:3: warning: 'gtk_ui_manager_get_widget' is deprecated [-Wdeprecated-declarations]
268 | popup = gtk_ui_manager_get_widget (ui_manager, "/TransferWindowPopupMenu");
| ^~~~~
/usr/include/gtk-3.0/gtk/deprecated/gtkuimanager.h:149:16: note: declared here
149 | GtkWidget *gtk_ui_manager_get_widget (GtkUIManager *manager,
| ^~~~~~~~~~~~~~~~~~~~~~~~~
transfer_window.c:272:3: warning: 'gtk_menu_popup' is deprecated: Use '(gtk_menu_popup_at_widget, gtk_menu_popup_at_pointer, gtk_menu_popup_at_rect)' instead [-Wdeprecated-declarations]
272 | gtk_menu_popup (GTK_MENU(popup), NULL, NULL, NULL, NULL,
| ^~~~~~~~~~~~~~
In file included from /usr/include/gtk-3.0/gtk/gtklabel.h:34,
from /usr/include/gtk-3.0/gtk/gtkaccellabel.h:35,
from /usr/include/gtk-3.0/gtk/gtk.h:33:
/usr/include/gtk-3.0/gtk/gtkmenu.h:138:12: note: declared here
138 | void gtk_menu_popup (GtkMenu *menu,
| ^~~~~~~~~~~~~~
transfer_window.c: In function 'create_transfer_window_tree_view':
transfer_window.c:444:15: warning: unused variable 'iter' [-Wunused-variable]
444 | GtkTreeIter iter;
| ^~~~
transfer_window.c: In function 'refresh_transfer_list_store':
transfer_window.c:581:7: warning: unused variable 'n' [-Wunused-variable]
581 | int n=0;
| ^
transfer_window.c:577:21: warning: unused variable 'actionIcon' [-Wunused-variable]
577 | GdkPixbuf *icon, *actionIcon;
| ^~~~~~~~~~
transfer_window.c: In function 'transfer_window_refresh':
transfer_window.c:682:25: warning: format '%lld' expects argument of type 'long long int', but argument 3 has type 'uint64_t' {aka 'long unsigned int'} [-Wformat=]
682 | sprintf (tmp_s, "%lld", pTi->size);
| ~~~^ ~~~~~~~~~
| | |
| | uint64_t {aka long unsigned int}
| long long int
| %ld
transfer_window.c:642:14: warning: variable 'sensitive' set but not used [-Wunused-but-set-variable]
642 | gboolean sensitive;
| ^~~~~~~~~
transfer_window.c: In function 'view_transfer_window':
transfer_window.c:740:7: error: implicit declaration of function 'msgbox_error' [-Wimplicit-function-declaration]
740 | msgbox_error ("Can't load user interface file:\n%s", error->message);
| ^~~~~~~~~~~~
In file included from /usr/include/gtk-3.0/gtk/gtkapplication.h:27,
from /usr/include/gtk-3.0/gtk/gtkwindow.h:33,
from /usr/include/gtk-3.0/gtk/gtkdialog.h:32,
from /usr/include/gtk-3.0/gtk/gtkaboutdialog.h:30,
from /usr/include/gtk-3.0/gtk/gtk.h:31:
/usr/include/gtk-3.0/gtk/gtkwidget.h:58:43: error: initialization of 'GtkWindow *' {aka 'struct _GtkWindow *'} from incompatible pointer type 'GtkWidget *' {aka 'struct _GtkWidget *'} [-Wincompatible-pointer-types]
58 | #define GTK_WIDGET(widget) (G_TYPE_CHECK_INSTANCE_CAST ((widget), GTK_TYPE_WIDGET, GtkWidget))
| ^
transfer_window.c:759:32: note: in expansion of macro 'GTK_WIDGET'
759 | GtkWindow *scrolled_window = GTK_WIDGET (gtk_builder_get_object (builder, "scrolled_window"));
| ^~~~~~~~~~
transfer_window.c:820:3: warning: 'gdk_screen_get_height' is deprecated [-Wdeprecated-declarations]
820 | gtk_widget_set_size_request (GTK_WIDGET (transferQueueWindow), gdk_screen_get_height (screen)/1.5, gdk_screen_get_height (screen)/1.8);
| ^~~~~~~~~~~~~~~~~~~~~~~~~~~
In file included from /usr/include/gtk-3.0/gdk/gdkapplaunchcontext.h:31,
from /usr/include/gtk-3.0/gdk/gdk.h:32,
from /usr/include/gtk-3.0/gtk/gtk.h:30:
/usr/include/gtk-3.0/gdk/gdkscreen.h:60:14: note: declared here
60 | gint gdk_screen_get_height (GdkScreen *screen);
| ^~~~~~~~~~~~~~~~~~~~~
transfer_window.c:820:3: warning: 'gdk_screen_get_height' is deprecated [-Wdeprecated-declarations]
820 | gtk_widget_set_size_request (GTK_WIDGET (transferQueueWindow), gdk_screen_get_height (screen)/1.5, gdk_screen_get_height (screen)/1.8);
| ^~~~~~~~~~~~~~~~~~~~~~~~~~~
/usr/include/gtk-3.0/gdk/gdkscreen.h:60:14: note: declared here
60 | gint gdk_screen_get_height (GdkScreen *screen);
| ^~~~~~~~~~~~~~~~~~~~~
transfer_window.c:837:27: warning: unused variable 'iter' [-Wunused-variable]
837 | GList *children, *iter;
| ^~~~
transfer_window.c:837:16: warning: unused variable 'children' [-Wunused-variable]
837 | GList *children, *iter;
| ^~~~~~~~
transfer_window.c:728:17: warning: unused variable 'tmp' [-Wunused-variable]
728 | char ui[256], tmp[512];
| ^~~
transfer_window.c:724:7: warning: unused variable 'i' [-Wunused-variable]
724 | int i;
| ^
make[2]: *** [Makefile:428: transfer_window.o] Error 1
make[2]: Leaving directory '/usr/src/RPM/BUILD/lterm-1.5.1/src'
make[2]: Entering directory '/usr/src/RPM/BUILD/lterm-1.5.1/src'
x86_64-alt-linux-gcc -DLOCALEDIR=\"/usr/share/locale\" -DIMGDIR=\"/usr/share/lterm/img\" -DPKGDATADIR=\"/usr/share/lterm/data\" -DHAVE_CONFIG_H -I. -pipe -frecord-gcc-switches -Wall -g -O2 -flto=auto -fcommon -pthread -I/usr/include/gtk-3.0 -I/usr/include/gio-unix-2.0 -I/usr/include/pango-1.0 -I/usr/include/harfbuzz -I/usr/include/pango-1.0 -I/usr/include/atk-1.0 -I/usr/include/cairo -I/usr/include/freetype2 -I/usr/include/harfbuzz -I/usr/include/gdk-pixbuf-2.0 -I/usr/include/libpng16 -I/usr/include/glib-2.0 -I/usr/lib64/glib-2.0/include -pthread -I/usr/include/vte-2.91 -I/usr/include/gtk-3.0 -I/usr/include/gio-unix-2.0 -I/usr/include/pango-1.0 -I/usr/include/harfbuzz -I/usr/include/pango-1.0 -I/usr/include/atk-1.0 -I/usr/include/cairo -I/usr/include/freetype2 -I/usr/include/harfbuzz -I/usr/include/gdk-pixbuf-2.0 -I/usr/include/libpng16 -I/usr/include/glib-2.0 -I/usr/lib64/glib-2.0/include -c -o utils.o utils.c
In file included from utils.c:43:
utils.h:47:1: error: parameter names (without types) in function declaration [-Wdeclaration-missing-parameter-type]
47 | char *readFile (filename);
| ^~~~
utils.c: In function 'seconds_to_hhmmdd':
utils.c:136:23: warning: format '%lld' expects argument of type 'long long int', but argument 3 has type 'uint64_t' {aka 'long unsigned int'} [-Wformat=]
136 | sprintf (buf, "%02lld:%02lld:%02lld", hour, min, sec);
| ~~~~~^ ~~~~
| | |
| long long int uint64_t {aka long unsigned int}
| %02ld
utils.c:136:30: warning: format '%lld' expects argument of type 'long long int', but argument 4 has type 'uint64_t' {aka 'long unsigned int'} [-Wformat=]
136 | sprintf (buf, "%02lld:%02lld:%02lld", hour, min, sec);
| ~~~~~^ ~~~
| | |
| long long int uint64_t {aka long unsigned int}
| %02ld
utils.c:136:37: warning: format '%lld' expects argument of type 'long long int', but argument 5 has type 'uint64_t' {aka 'long unsigned int'} [-Wformat=]
136 | sprintf (buf, "%02lld:%02lld:%02lld", hour, min, sec);
| ~~~~~^ ~~~
| | |
| long long int uint64_t {aka long unsigned int}
| %02ld
utils.c: In function 'permissions_octal_to_string':
utils.c:149:38: warning: suggest parentheses around '-' inside '<<' [-Wparentheses]
149 | triple[i] = (value & (0x01 << 8-i)) ? flags[i] : '-';
| ~^~
utils.c:144:10: warning: unused variable 'n' [-Wunused-variable]
144 | int i, n;
| ^
utils.c: In function 'lower':
utils.c:534:12: error: implicit declaration of function 'tolower' [-Wimplicit-function-declaration]
534 | s[i] = tolower (s[i]);
| ^~~~~~~
utils.c:44:1: note: include '' or provide a declaration of 'tolower'
43 | #include "utils.h"
+++ |+#include
44 |
utils.c: In function 'upper':
utils.c:545:12: error: implicit declaration of function 'toupper' [-Wimplicit-function-declaration]
545 | s[i] = toupper (s[i]);
| ^~~~~~~
utils.c:545:12: note: include '' or provide a declaration of 'toupper'
utils.c: In function 'get_desktop_environment':
utils.c:700:7: warning: suggest parentheses around assignment used as truth value [-Wparentheses]
700 | if (value = getenv ("DESKTOP_SESSION"))
| ^~~~~
utils.c:712:7: warning: suggest parentheses around assignment used as truth value [-Wparentheses]
712 | if (value = getenv ("GNOME_KEYRING_PID"))
| ^~~~~
utils.c: In function 'Encrypt':
utils.c:775:3: warning: 'DES_set_odd_parity' is deprecated: Since OpenSSL 3.0 [-Wdeprecated-declarations]
775 | DES_set_odd_parity (&Key2);
| ^~~~~~~~~~~~~~~~~~
In file included from utils.c:25:
/usr/include/openssl/des.h:176:28: note: declared here
176 | OSSL_DEPRECATEDIN_3_0 void DES_set_odd_parity(DES_cblock *key);
| ^~~~~~~~~~~~~~~~~~
utils.c:776:3: warning: 'DES_set_key_checked' is deprecated: Since OpenSSL 3.0 [-Wdeprecated-declarations]
776 | DES_set_key_checked (&Key2, &schedule);
| ^~~~~~~~~~~~~~~~~~~
/usr/include/openssl/des.h:190:5: note: declared here
190 | int DES_set_key_checked(const_DES_cblock *key, DES_key_schedule *schedule);
| ^~~~~~~~~~~~~~~~~~~
utils.c:779:3: warning: 'DES_cfb64_encrypt' is deprecated: Since OpenSSL 3.0 [-Wdeprecated-declarations]
779 | DES_cfb64_encrypt ((unsigned char *) Msg, (unsigned char *) Res, size, &schedule, &Key2, &n, DES_ENCRYPT);
| ^~~~~~~~~~~~~~~~~
/usr/include/openssl/des.h:197:6: note: declared here
197 | void DES_cfb64_encrypt(const unsigned char *in, unsigned char *out,
| ^~~~~~~~~~~~~~~~~
utils.c: In function 'Decrypt':
utils.c:797:3: warning: 'DES_set_odd_parity' is deprecated: Since OpenSSL 3.0 [-Wdeprecated-declarations]
797 | DES_set_odd_parity (&Key2);
| ^~~~~~~~~~~~~~~~~~
/usr/include/openssl/des.h:176:28: note: declared here
176 | OSSL_DEPRECATEDIN_3_0 void DES_set_odd_parity(DES_cblock *key);
| ^~~~~~~~~~~~~~~~~~
utils.c:798:3: warning: 'DES_set_key_checked' is deprecated: Since OpenSSL 3.0 [-Wdeprecated-declarations]
798 | DES_set_key_checked (&Key2, &schedule);
| ^~~~~~~~~~~~~~~~~~~
/usr/include/openssl/des.h:190:5: note: declared here
190 | int DES_set_key_checked(const_DES_cblock *key, DES_key_schedule *schedule);
| ^~~~~~~~~~~~~~~~~~~
utils.c:801:3: warning: 'DES_cfb64_encrypt' is deprecated: Since OpenSSL 3.0 [-Wdeprecated-declarations]
801 | DES_cfb64_encrypt (( unsigned char *) Msg, (unsigned char *) Res, size, &schedule, &Key2, &n, DES_DECRYPT);
| ^~~~~~~~~~~~~~~~~
/usr/include/openssl/des.h:197:6: note: declared here
197 | void DES_cfb64_encrypt(const unsigned char *in, unsigned char *out,
| ^~~~~~~~~~~~~~~~~
utils.c: In function 'des_encrypt_b64':
utils.c:815:9: warning: pointer targets in assignment from 'char *' to 'unsigned char *' differ in signedness [-Wpointer-sign]
815 | p_enc = Encrypt (KEY, clear_text, strlen (clear_text));
| ^
utils.c:817:15: warning: pointer targets in passing argument 1 of 'strlen' differ in signedness [-Wpointer-sign]
817 | if (strlen (p_enc) > strlen (clear_text))
| ^~~~~
| |
| unsigned char *
In file included from /usr/include/glib-2.0/glib/galloca.h:35,
from /usr/include/glib-2.0/glib.h:32,
from utils.c:23:
/usr/include/string.h:407:35: note: expected 'const char *' but argument is of type 'unsigned char *'
407 | extern size_t strlen (const char *__s)
| ~~~~~~~~~~~~^~~
utils.c:820:71: warning: pointer targets in passing argument 1 of 'strlen' differ in signedness [-Wpointer-sign]
820 | p_enc_b64 = g_base64_encode ((const unsigned char *) p_enc, strlen (p_enc));
| ^~~~~
| |
| unsigned char *
/usr/include/string.h:407:35: note: expected 'const char *' but argument is of type 'unsigned char *'
407 | extern size_t strlen (const char *__s)
| ~~~~~~~~~~~~^~~
utils.c: In function 'des_decrypt_b64':
utils.c:837:9: warning: pointer targets in assignment from 'guchar *' {aka 'unsigned char *'} to 'char *' differ in signedness [-Wpointer-sign]
837 | p_enc = g_base64_decode (ecrypted_text, &len);
| ^
utils.c: In function 'readFile':
utils.c:1008:1: error: type of 'filename' defaults to 'int' [-Wimplicit-int]
1008 | readFile (filename)
| ^~~~~~~~
utils.c:1012:21: error: passing argument 1 of 'fopen' makes pointer from integer without a cast [-Wint-conversion]
1012 | FILE * f = fopen (filename, "rb");
| ^~~~~~~~
| |
| int
In file included from utils.c:32:
/usr/include/stdio.h:263:44: note: expected 'const char * restrict' but argument is of type 'int'
263 | extern FILE *fopen (const char *__restrict __filename,
| ~~~~~~~~~~~~~~~~~~~~~~~^~~~~~~~~~
utils.c:1024:11: warning: ignoring return value of 'fread' declared with attribute 'warn_unused_result' [-Wunused-result]
1024 | fread (buffer, 1, length, f);
| ^~~~~~~~~~~~~~~~~~~~~~~~~~~~
make[2]: *** [Makefile:428: utils.o] Error 1
make[2]: Leaving directory '/usr/src/RPM/BUILD/lterm-1.5.1/src'
make[2]: Entering directory '/usr/src/RPM/BUILD/lterm-1.5.1/src'
x86_64-alt-linux-gcc -DLOCALEDIR=\"/usr/share/locale\" -DIMGDIR=\"/usr/share/lterm/img\" -DPKGDATADIR=\"/usr/share/lterm/data\" -DHAVE_CONFIG_H -I. -pipe -frecord-gcc-switches -Wall -g -O2 -flto=auto -fcommon -pthread -I/usr/include/gtk-3.0 -I/usr/include/gio-unix-2.0 -I/usr/include/pango-1.0 -I/usr/include/harfbuzz -I/usr/include/pango-1.0 -I/usr/include/atk-1.0 -I/usr/include/cairo -I/usr/include/freetype2 -I/usr/include/harfbuzz -I/usr/include/gdk-pixbuf-2.0 -I/usr/include/libpng16 -I/usr/include/glib-2.0 -I/usr/lib64/glib-2.0/include -pthread -I/usr/include/vte-2.91 -I/usr/include/gtk-3.0 -I/usr/include/gio-unix-2.0 -I/usr/include/pango-1.0 -I/usr/include/harfbuzz -I/usr/include/pango-1.0 -I/usr/include/atk-1.0 -I/usr/include/cairo -I/usr/include/freetype2 -I/usr/include/harfbuzz -I/usr/include/gdk-pixbuf-2.0 -I/usr/include/libpng16 -I/usr/include/glib-2.0 -I/usr/lib64/glib-2.0/include -c -o grouptree.o grouptree.c
grouptree.c: In function 'group_node_find':
grouptree.c:134:19: warning: suggest parentheses around assignment used as truth value [-Wparentheses]
134 | if (p_node = group_node_find (p_parent->child[i], name))
| ^~~~~~
grouptree.c: In function 'group_node_delete_child':
grouptree.c:187:13: error: implicit declaration of function 'cl_remove'; did you mean 'remove'? [-Wimplicit-function-declaration]
187 | cl_remove (&conn_list, p_node->name);
| ^~~~~~~~~
| remove
grouptree.c: In function 'group_node_find_by_path':
grouptree.c:232:3: error: implicit declaration of function 'list_get_nth' [-Wimplicit-function-declaration]
232 | list_get_nth (path, index, '/', nodename);
| ^~~~~~~~~~~~
grouptree.c:236:7: error: implicit declaration of function 'list_count' [-Wimplicit-function-declaration]
236 | if (list_count (path, '/') < index)
| ^~~~~~~~~~
grouptree.c:229:8: warning: unused variable 's_tmp' [-Wunused-variable]
229 | char s_tmp[64];
| ^~~~~
grouptree.c: In function 'group_node_find_by_numeric_path':
grouptree.c:262:8: warning: unused variable 's_tmp' [-Wunused-variable]
262 | char s_tmp[64];
| ^~~~~
grouptree.c: In function 'group_node_get_child_next':
grouptree.c:354:21: warning: unused variable 'p_child_next' [-Wunused-variable]
354 | struct GroupNode *p_child_next = NULL;
| ^~~~~~~~~~~~
make[2]: *** [Makefile:428: grouptree.o] Error 1
make[2]: Leaving directory '/usr/src/RPM/BUILD/lterm-1.5.1/src'
make[2]: Entering directory '/usr/src/RPM/BUILD/lterm-1.5.1/src'
x86_64-alt-linux-gcc -DLOCALEDIR=\"/usr/share/locale\" -DIMGDIR=\"/usr/share/lterm/img\" -DPKGDATADIR=\"/usr/share/lterm/data\" -DHAVE_CONFIG_H -I. -pipe -frecord-gcc-switches -Wall -g -O2 -flto=auto -fcommon -pthread -I/usr/include/gtk-3.0 -I/usr/include/gio-unix-2.0 -I/usr/include/pango-1.0 -I/usr/include/harfbuzz -I/usr/include/pango-1.0 -I/usr/include/atk-1.0 -I/usr/include/cairo -I/usr/include/freetype2 -I/usr/include/harfbuzz -I/usr/include/gdk-pixbuf-2.0 -I/usr/include/libpng16 -I/usr/include/glib-2.0 -I/usr/lib64/glib-2.0/include -pthread -I/usr/include/vte-2.91 -I/usr/include/gtk-3.0 -I/usr/include/gio-unix-2.0 -I/usr/include/pango-1.0 -I/usr/include/harfbuzz -I/usr/include/pango-1.0 -I/usr/include/atk-1.0 -I/usr/include/cairo -I/usr/include/freetype2 -I/usr/include/harfbuzz -I/usr/include/gdk-pixbuf-2.0 -I/usr/include/libpng16 -I/usr/include/glib-2.0 -I/usr/lib64/glib-2.0/include -c -o xml.o xml.c
xml.c: In function 'xml_parse':
xml.c:650:7: error: 'return' with no value, in function returning non-void [-Wreturn-mismatch]
650 | return;
| ^~~~~~
xml.c:639:1: note: declared here
639 | xml_parse (char *doc, XML *p_xml)
| ^~~~~~~~~
xml.c: In function 'xml_load':
xml.c:663:10: warning: unused variable 'rc' [-Wunused-variable]
663 | int i, rc = 0;
| ^~
xml.c:663:7: warning: unused variable 'i' [-Wunused-variable]
663 | int i, rc = 0;
| ^
make[2]: *** [Makefile:428: xml.o] Error 1
make[2]: Leaving directory '/usr/src/RPM/BUILD/lterm-1.5.1/src'
make[2]: Entering directory '/usr/src/RPM/BUILD/lterm-1.5.1/src'
x86_64-alt-linux-gcc -DLOCALEDIR=\"/usr/share/locale\" -DIMGDIR=\"/usr/share/lterm/img\" -DPKGDATADIR=\"/usr/share/lterm/data\" -DHAVE_CONFIG_H -I. -pipe -frecord-gcc-switches -Wall -g -O2 -flto=auto -fcommon -pthread -I/usr/include/gtk-3.0 -I/usr/include/gio-unix-2.0 -I/usr/include/pango-1.0 -I/usr/include/harfbuzz -I/usr/include/pango-1.0 -I/usr/include/atk-1.0 -I/usr/include/cairo -I/usr/include/freetype2 -I/usr/include/harfbuzz -I/usr/include/gdk-pixbuf-2.0 -I/usr/include/libpng16 -I/usr/include/glib-2.0 -I/usr/lib64/glib-2.0/include -pthread -I/usr/include/vte-2.91 -I/usr/include/gtk-3.0 -I/usr/include/gio-unix-2.0 -I/usr/include/pango-1.0 -I/usr/include/harfbuzz -I/usr/include/pango-1.0 -I/usr/include/atk-1.0 -I/usr/include/cairo -I/usr/include/freetype2 -I/usr/include/harfbuzz -I/usr/include/gdk-pixbuf-2.0 -I/usr/include/libpng16 -I/usr/include/glib-2.0 -I/usr/lib64/glib-2.0/include -c -o preferences.o preferences.c
preferences.c: In function 'profile_edit':
preferences.c:140:19: warning: 'GtkStock' is deprecated [-Wdeprecated-declarations]
140 | GTK_STOCK_CANCEL, GTK_RESPONSE_CANCEL,
| ^~~~~~~~~~~~~~~~
preferences.c:141:19: warning: 'GtkStock' is deprecated [-Wdeprecated-declarations]
141 | GTK_STOCK_OK, GTK_RESPONSE_OK,
| ^~~~~~~~~~~~
preferences.c:157:3: warning: 'gtk_font_button_set_font_name' is deprecated [-Wdeprecated-declarations]
157 | gtk_font_button_set_font_name (GTK_FONT_BUTTON (fontbutton_terminal), p_profile && p_profile->font[0] ? p_profile->font : "Monospace 9");
| ^~~~~~~~~~~~~~~~~~~~~~~~~~~~~
In file included from /usr/include/gtk-3.0/gtk/gtk.h:109,
from preferences.c:23:
/usr/include/gtk-3.0/gtk/gtkfontbutton.h:98:23: note: declared here
98 | gboolean gtk_font_button_set_font_name (GtkFontButton *font_button,
| ^~~~~~~~~~~~~~~~~~~~~~~~~~~~~
preferences.c:253:11: warning: 'gtk_font_button_get_font_name' is deprecated [-Wdeprecated-declarations]
253 | strcpy (new_profile.font, gtk_font_button_get_font_name (GTK_FONT_BUTTON(fontbutton_terminal)));
| ^~~~~~
/usr/include/gtk-3.0/gtk/gtkfontbutton.h:96:23: note: declared here
96 | const gchar * gtk_font_button_get_font_name (GtkFontButton *font_button);
| ^~~~~~~~~~~~~~~~~~~~~~~~~~~~~
preferences.c: In function 'profile_selected_cb':
preferences.c:352:3: error: implicit declaration of function 'apply_profile_terminal' [-Wimplicit-function-declaration]
352 | apply_profile_terminal (vte_profile, g_selected_profile);
| ^~~~~~~~~~~~~~~~~~~~~~
preferences.c:334:15: warning: unused variable 'iter' [-Wunused-variable]
334 | GtkTreeIter iter;
| ^~~~
preferences.c: In function 'show_preferences':
preferences.c:409:19: warning: 'GtkStock' is deprecated [-Wdeprecated-declarations]
409 | GTK_STOCK_CANCEL, GTK_RESPONSE_CANCEL,
| ^~~~~~~~~~~~~~~~
preferences.c:410:19: warning: 'GtkStock' is deprecated [-Wdeprecated-declarations]
410 | GTK_STOCK_OK, GTK_RESPONSE_OK,
| ^~~~~~~~~~~~
preferences.c:462:3: warning: 'gtk_font_button_set_font_name' is deprecated [-Wdeprecated-declarations]
462 | gtk_font_button_set_font_name (GTK_FONT_BUTTON (qlw_font_entry), prefs.font_quick_launch_window);
| ^~~~~~~~~~~~~~~~~~~~~~~~~~~~~
/usr/include/gtk-3.0/gtk/gtkfontbutton.h:98:23: note: declared here
98 | gboolean gtk_font_button_set_font_name (GtkFontButton *font_button,
| ^~~~~~~~~~~~~~~~~~~~~~~~~~~~~
preferences.c:610:7: warning: 'gtk_font_button_get_font_name' is deprecated [-Wdeprecated-declarations]
610 | strcpy (prefs.font_quick_launch_window, gtk_font_button_get_font_name (GTK_FONT_BUTTON (qlw_font_entry)));
| ^~~~~~
/usr/include/gtk-3.0/gtk/gtkfontbutton.h:96:23: note: declared here
96 | const gchar * gtk_font_button_get_font_name (GtkFontButton *font_button);
| ^~~~~~~~~~~~~~~~~~~~~~~~~~~~~
preferences.c:626:11: warning: suggest parentheses around assignment used as truth value [-Wparentheses]
626 | if (p_profile = profile_get_by_position (&g_profile_list,
| ^~~~~~~~~
preferences.c:472:15: warning: unused variable 'iter' [-Wunused-variable]
472 | GtkTreeIter iter;
| ^~~~
preferences.c:471:17: warning: unused variable 'tree_model' [-Wunused-variable]
471 | GtkTreeModel *tree_model;
| ^~~~~~~~~~
preferences.c:388:17: warning: unused variable 'tmp' [-Wunused-variable]
388 | char ui[256], tmp[512];
| ^~~
preferences.c:384:44: warning: unused variable 'bg_color_entry' [-Wunused-variable]
384 | GtkWidget *font_entry, *fg_color_entry, *bg_color_entry;
| ^~~~~~~~~~~~~~
preferences.c:384:27: warning: unused variable 'fg_color_entry' [-Wunused-variable]
384 | GtkWidget *font_entry, *fg_color_entry, *bg_color_entry;
| ^~~~~~~~~~~~~~
preferences.c:384:14: warning: unused variable 'font_entry' [-Wunused-variable]
384 | GtkWidget *font_entry, *fg_color_entry, *bg_color_entry;
| ^~~~~~~~~~
preferences.c:382:26: warning: unused variable 'button_cancel' [-Wunused-variable]
382 | GtkWidget *button_ok, *button_cancel;
| ^~~~~~~~~~~~~
preferences.c:382:14: warning: unused variable 'button_ok' [-Wunused-variable]
382 | GtkWidget *button_ok, *button_cancel;
| ^~~~~~~~~
make[2]: *** [Makefile:428: preferences.o] Error 1
make[2]: Leaving directory '/usr/src/RPM/BUILD/lterm-1.5.1/src'
make[2]: Entering directory '/usr/src/RPM/BUILD/lterm-1.5.1/src'
x86_64-alt-linux-gcc -DLOCALEDIR=\"/usr/share/locale\" -DIMGDIR=\"/usr/share/lterm/img\" -DPKGDATADIR=\"/usr/share/lterm/data\" -DHAVE_CONFIG_H -I. -pipe -frecord-gcc-switches -Wall -g -O2 -flto=auto -fcommon -pthread -I/usr/include/gtk-3.0 -I/usr/include/gio-unix-2.0 -I/usr/include/pango-1.0 -I/usr/include/harfbuzz -I/usr/include/pango-1.0 -I/usr/include/atk-1.0 -I/usr/include/cairo -I/usr/include/freetype2 -I/usr/include/harfbuzz -I/usr/include/gdk-pixbuf-2.0 -I/usr/include/libpng16 -I/usr/include/glib-2.0 -I/usr/lib64/glib-2.0/include -pthread -I/usr/include/vte-2.91 -I/usr/include/gtk-3.0 -I/usr/include/gio-unix-2.0 -I/usr/include/pango-1.0 -I/usr/include/harfbuzz -I/usr/include/pango-1.0 -I/usr/include/atk-1.0 -I/usr/include/cairo -I/usr/include/freetype2 -I/usr/include/harfbuzz -I/usr/include/gdk-pixbuf-2.0 -I/usr/include/libpng16 -I/usr/include/glib-2.0 -I/usr/lib64/glib-2.0/include -c -o main.o main.c
In file included from main.c:45:
utils.h:47:1: error: parameter names (without types) in function declaration [-Wdeclaration-missing-parameter-type]
47 | char *readFile (filename);
| ^~~~
main.c: In function 'log_write':
main.c:111:8: warning: unused variable 'log_file' [-Wunused-variable]
111 | char log_file[256];
| ^~~~~~~~
main.c: In function 'lterm_iteration':
main.c:208:10: error: implicit declaration of function 'ifr_get' [-Wimplicit-function-declaration]
208 | while (ifr_get (&ifr_function))
| ^~~~~~~
main.c:218:11: error: implicit declaration of function 'refresh_connection_tree_view' [-Wimplicit-function-declaration]
218 | refresh_connection_tree_view ((struct GtkTreeView *) ifr_function.user_data);
| ^~~~~~~~~~~~~~~~~~~~~~~~~~~~
main.c:226:11: error: implicit declaration of function 'connection_tab_close'; did you mean 'connection_tab_new'? [-Wimplicit-function-declaration]
226 | connection_tab_close ((SConnectionTab *) ifr_function.user_data);
| ^~~~~~~~~~~~~~~~~~~~
| connection_tab_new
main.c:199:25: warning: unused variable 'lterminal' [-Wunused-variable]
199 | struct ConnectionTab *lterminal;
| ^~~~~~~~~
main.c: In function 'main':
main.c:382:3: error: implicit declaration of function 'textdomain' [-Wimplicit-function-declaration]
382 | textdomain (PACKAGE);
| ^~~~~~~~~~
main.c:383:3: error: implicit declaration of function 'bindtextdomain' [-Wimplicit-function-declaration]
383 | bindtextdomain (PACKAGE, LOCALEDIR);
| ^~~~~~~~~~~~~~
main.c:510:3: error: implicit declaration of function 'pl_init'; did you mean 'cl_init'? [-Wimplicit-function-declaration]
510 | pl_init (&g_prot_list);
| ^~~~~~~
| cl_init
main.c:517:3: error: implicit declaration of function 'check_standard_protocols' [-Wimplicit-function-declaration]
517 | check_standard_protocols (&g_prot_list);
| ^~~~~~~~~~~~~~~~~~~~~~~~
main.c:539:3: error: implicit declaration of function 'XInitThreads' [-Wimplicit-function-declaration]
539 | XInitThreads ();
| ^~~~~~~~~~~~
main.c:542:13: warning: Deprecated pre-processor symbol
542 | if (!g_thread_supported())
| ^~~~~~~~~~~~~~~~
main.c:543:7: warning: 'g_thread_init' is deprecated [-Wdeprecated-declarations]
543 | g_thread_init(NULL);
| ^~~~~~~~~~~~~
In file included from /usr/include/glib-2.0/glib.h:115,
from /usr/include/gtk-3.0/gdk/gdkconfig.h:8,
from /usr/include/gtk-3.0/gdk/gdk.h:30,
from /usr/include/gtk-3.0/gtk/gtk.h:30,
from main.c:33:
/usr/include/glib-2.0/glib/deprecated/gthread.h:271:10: note: declared here
271 | void g_thread_init (gpointer vtable);
| ^~~~~~~~~~~~~
main.c:546:3: warning: 'gdk_threads_init' is deprecated [-Wdeprecated-declarations]
546 | gdk_threads_init();
| ^~~~~~~~~~~~~~~~
In file included from /usr/include/gtk-3.0/gdk/gdk.h:61:
/usr/include/gtk-3.0/gdk/gdkthreads.h:44:10: note: declared here
44 | void gdk_threads_init (void);
| ^~~~~~~~~~~~~~~~
main.c:551:3: error: implicit declaration of function 'start_gtk' [-Wimplicit-function-declaration]
551 | start_gtk (argc, argv);
| ^~~~~~~~~
main.c:554:3: warning: 'G_APPLICATION_FLAGS_NONE' is deprecated: Use 'G_APPLICATION_DEFAULT_FLAGS' instead [-Wdeprecated-declarations]
554 | application = g_application_new ("lterm.application", G_APPLICATION_FLAGS_NONE);
| ^~~~~~~~~~~
In file included from /usr/include/glib-2.0/gio/giotypes.h:30,
from /usr/include/glib-2.0/gio/gio.h:28,
from /usr/include/gtk-3.0/gdk/gdkapplaunchcontext.h:28,
from /usr/include/gtk-3.0/gdk/gdk.h:32:
/usr/include/glib-2.0/gio/gioenums.h:1545:3: note: declared here
1545 | G_APPLICATION_FLAGS_NONE GIO_DEPRECATED_ENUMERATOR_IN_2_74_FOR(G_APPLICATION_DEFAULT_FLAGS),
| ^~~~~~~~~~~~~~~~~~~~~~~~
main.c:558:3: error: implicit declaration of function 'ifr_init' [-Wimplicit-function-declaration]
558 | ifr_init ();
| ^~~~~~~~
main.c:586:7: error: implicit declaration of function 'list_count' [-Wimplicit-function-declaration]
586 | if (list_count (globals.start_connections, '#'))
| ^~~~~~~~~~
main.c:590:11: error: implicit declaration of function 'list_get_nth' [-Wimplicit-function-declaration]
590 | list_get_nth (globals.start_connections, i, '#', s_tmp);
| ^~~~~~~~~~~~
main.c:591:11: error: implicit declaration of function 'open_connection'; did you mean 'get_connection'? [-Wimplicit-function-declaration]
591 | open_connection (s_tmp);
| ^~~~~~~~~~~~~~~
| get_connection
main.c:597:9: error: implicit declaration of function 'load_session_file'; did you mean 'save_session_file'? [-Wimplicit-function-declaration]
597 | load_session_file (NULL);
| ^~~~~~~~~~~~~~~~~
| save_session_file
main.c:645:3: error: implicit declaration of function 'save_recent_connections'; did you mean 'add_recent_connection'? [-Wimplicit-function-declaration]
645 | save_recent_connections ();
| ^~~~~~~~~~~~~~~~~~~~~~~
| add_recent_connection
main.c:648:3: error: implicit declaration of function 'save_connections_to_file_xml'; did you mean 'save_connections_to_file'? [-Wimplicit-function-declaration]
648 | save_connections_to_file_xml (globals.connections_xml);
| ^~~~~~~~~~~~~~~~~~~~~~~~~~~~
| save_connections_to_file
main.c:654:3: error: implicit declaration of function 'pl_release'; did you mean 'cl_release'? [-Wimplicit-function-declaration]
654 | pl_release (&g_prot_list);
| ^~~~~~~~~~
| cl_release
main.c:343:7: warning: unused variable 'digit_optind' [-Wunused-variable]
343 | int digit_optind;
| ^~~~~~~~~~~~
main.c:342:7: warning: unused variable 'c' [-Wunused-variable]
342 | int c, n, rc;
| ^
main.c: In function 'save_settings':
main.c:795:7: warning: unused variable 'err' [-Wunused-variable]
795 | int err;
| ^~~
main.c: In function 'cmpver':
main.c:878:19: warning: unused variable 'cmp3' [-Wunused-variable]
878 | int cmp1, cmp2, cmp3;
| ^~~~
main.c:878:13: warning: unused variable 'cmp2' [-Wunused-variable]
878 | int cmp1, cmp2, cmp3;
| ^~~~
main.c:878:7: warning: unused variable 'cmp1' [-Wunused-variable]
878 | int cmp1, cmp2, cmp3;
| ^~~~
main.c: At top level:
main.c:154:13: warning: 'handle_signals' defined but not used [-Wunused-function]
154 | static void handle_signals (void)
| ^~~~~~~~~~~~~~
make[2]: *** [Makefile:428: main.o] Error 1
make[2]: Leaving directory '/usr/src/RPM/BUILD/lterm-1.5.1/src'
make[2]: Entering directory '/usr/src/RPM/BUILD/lterm-1.5.1/src'
x86_64-alt-linux-gcc -DLOCALEDIR=\"/usr/share/locale\" -DIMGDIR=\"/usr/share/lterm/img\" -DPKGDATADIR=\"/usr/share/lterm/data\" -DHAVE_CONFIG_H -I. -pipe -frecord-gcc-switches -Wall -g -O2 -flto=auto -fcommon -pthread -I/usr/include/gtk-3.0 -I/usr/include/gio-unix-2.0 -I/usr/include/pango-1.0 -I/usr/include/harfbuzz -I/usr/include/pango-1.0 -I/usr/include/atk-1.0 -I/usr/include/cairo -I/usr/include/freetype2 -I/usr/include/harfbuzz -I/usr/include/gdk-pixbuf-2.0 -I/usr/include/libpng16 -I/usr/include/glib-2.0 -I/usr/lib64/glib-2.0/include -pthread -I/usr/include/vte-2.91 -I/usr/include/gtk-3.0 -I/usr/include/gio-unix-2.0 -I/usr/include/pango-1.0 -I/usr/include/harfbuzz -I/usr/include/pango-1.0 -I/usr/include/atk-1.0 -I/usr/include/cairo -I/usr/include/freetype2 -I/usr/include/harfbuzz -I/usr/include/gdk-pixbuf-2.0 -I/usr/include/libpng16 -I/usr/include/glib-2.0 -I/usr/lib64/glib-2.0/include -c -o sftp-panel.o sftp-panel.c
In file included from sftp-panel.c:35:
utils.h:47:1: error: parameter names (without types) in function declaration [-Wdeclaration-missing-parameter-type]
47 | char *readFile (filename);
| ^~~~
sftp-panel.c: In function 'sftp_set_status':
sftp-panel.c:162:8: warning: unused variable 'text' [-Wunused-variable]
162 | char text[4096];
| ^~~~
sftp-panel.c: In function 'sftp_copy_file_upload':
sftp-panel.c:267:3: error: implicit declaration of function 'lockSSH' [-Wimplicit-function-declaration]
267 | lockSSH (__func__, TRUE);
| ^~~~~~~
sftp-panel.c: In function 'sftp_copy_file_download':
sftp-panel.c:345:25: warning: unused variable 'rc' [-Wunused-variable]
345 | int nbytes, nwritten, rc;
| ^~
sftp-panel.c: In function 'upload_directory':
sftp-panel.c:489:7: warning: suggest parentheses around assignment used as truth value [-Wparentheses]
489 | if (pc = (char *) strrchr (rootdir, '/'))
| ^~
sftp-panel.c: In function 'download_directory':
sftp-panel.c:586:7: warning: suggest parentheses around assignment used as truth value [-Wparentheses]
586 | if (pc = (char *) strrchr (rootdir, '/'))
| ^~
sftp-panel.c: In function 'sftp_panel_check_inotify':
sftp-panel.c:867:18: warning: unused variable 'timeout' [-Wunused-variable]
867 | struct timeval timeout;
| ^~~~~~~
sftp-panel.c:822:12: warning: unused variable 'isModified' [-Wunused-variable]
822 | gboolean isModified = FALSE;
| ^~~~~~~~~~
sftp-panel.c: In function 'sftp_panel_create_mirror_file':
sftp-panel.c:925:8: warning: unused variable 'mirrorFile' [-Wunused-variable]
925 | char mirrorFile[2048];
| ^~~~~~~~~~
sftp-panel.c:923:7: warning: variable 'result' set but not used [-Wunused-but-set-variable]
923 | int result;
| ^~~~~~
sftp-panel.c: In function 'sftp_panel_open':
sftp-panel.c:1067:12: warning: unused variable 'success' [-Wunused-variable]
1067 | gboolean success;
| ^~~~~~~
sftp-panel.c:1066:42: warning: unused variable 'command' [-Wunused-variable]
1066 | gchar *filename, *uri, filepath[2048], command[2048];
| ^~~~~~~
sftp-panel.c:1066:21: warning: unused variable 'uri' [-Wunused-variable]
1066 | gchar *filename, *uri, filepath[2048], command[2048];
| ^~~
sftp-panel.c:1065:8: warning: unused variable 'folder_name' [-Wunused-variable]
1065 | char folder_name[1024];
| ^~~~~~~~~~~
sftp-panel.c:1064:19: warning: unused variable 'i' [-Wunused-variable]
1064 | int create, rc, i;
| ^
sftp-panel.c:1064:15: warning: unused variable 'rc' [-Wunused-variable]
1064 | int create, rc, i;
| ^~
sftp-panel.c:1064:7: warning: unused variable 'create' [-Wunused-variable]
1064 | int create, rc, i;
| ^~~~~~
sftp-panel.c: In function 'sftp_panel_create_file':
sftp-panel.c:1159:15: warning: unused variable 'rc' [-Wunused-variable]
1159 | int create, rc = 0;
| ^~
sftp-panel.c: In function 'sftp_panel_rename':
sftp-panel.c:1218:11: warning: suggest parentheses around assignment used as truth value [-Wparentheses]
1218 | if (e = dl_search_by_name (&p_ssh_current->dirlist, filename))
| ^
sftp-panel.c:1202:8: warning: unused variable 'folder_name' [-Wunused-variable]
1202 | char folder_name[1024];
| ^~~~~~~~~~~
sftp-panel.c:1201:7: warning: unused variable 'create' [-Wunused-variable]
1201 | int create, rc;
| ^~~~~~
sftp-panel.c: In function 'sftp_panel_delete':
sftp-panel.c:1319:11: warning: suggest parentheses around assignment used as truth value [-Wparentheses]
1319 | if (e = dl_search_by_name (&p_ssh_current->dirlist, filename))
| ^
sftp-panel.c:1301:8: warning: unused variable 'folder_name' [-Wunused-variable]
1301 | char folder_name[1024];
| ^~~~~~~~~~~
sftp-panel.c:1300:7: warning: unused variable 'create' [-Wunused-variable]
1300 | int create, rc;
| ^~~~~~
sftp-panel.c: In function 'sftp_panel_change_time':
sftp-panel.c:1422:15: warning: pointer targets in passing argument 1 of 'localtime_r' differ in signedness [-Wpointer-sign]
1422 | localtime_r(&e->mtime, &dateTime);
| ^~~~~~~~~
| |
| long unsigned int *
In file included from /usr/include/glib-2.0/glib/gtypes.h:41,
from /usr/include/glib-2.0/glib/galloca.h:34,
from /usr/include/glib-2.0/glib.h:32,
from /usr/include/gtk-3.0/gdk/gdkconfig.h:8,
from /usr/include/gtk-3.0/gdk/gdk.h:30,
from /usr/include/gtk-3.0/gtk/gtk.h:30,
from sftp-panel.c:23:
/usr/include/time.h:160:57: note: expected 'const time_t * restrict' {aka 'const long int * restrict'} but argument is of type 'long unsigned int *'
160 | extern struct tm *localtime_r (const time_t *__restrict __timer,
| ~~~~~~~~~~~~~~~~~~~~~~~~~^~~~~~~
sftp-panel.c:1437:54: warning: pointer targets in passing argument 2 of 'gtk_calendar_get_date' differ in signedness [-Wpointer-sign]
1437 | gtk_calendar_get_date (GTK_CALENDAR(calendarDate), &year, &month, &day);
| ^~~~~
| |
| int *
In file included from /usr/include/gtk-3.0/gtk/gtk.h:55:
/usr/include/gtk-3.0/gtk/gtkcalendar.h:157:55: note: expected 'guint *' {aka 'unsigned int *'} but argument is of type 'int *'
157 | guint *year,
| ~~~~~~~~~~~~~^~~~
sftp-panel.c:1437:61: warning: pointer targets in passing argument 3 of 'gtk_calendar_get_date' differ in signedness [-Wpointer-sign]
1437 | gtk_calendar_get_date (GTK_CALENDAR(calendarDate), &year, &month, &day);
| ^~~~~~
| |
| int *
/usr/include/gtk-3.0/gtk/gtkcalendar.h:158:55: note: expected 'guint *' {aka 'unsigned int *'} but argument is of type 'int *'
158 | guint *month,
| ~~~~~~~~~~~~~^~~~~
sftp-panel.c:1437:69: warning: pointer targets in passing argument 4 of 'gtk_calendar_get_date' differ in signedness [-Wpointer-sign]
1437 | gtk_calendar_get_date (GTK_CALENDAR(calendarDate), &year, &month, &day);
| ^~~~
| |
| int *
/usr/include/gtk-3.0/gtk/gtkcalendar.h:159:55: note: expected 'guint *' {aka 'unsigned int *'} but argument is of type 'int *'
159 | guint *day);
| ~~~~~~~~~~~~~^~~
sftp-panel.c:1476:11: warning: suggest parentheses around assignment used as truth value [-Wparentheses]
1476 | if (e = dl_search_by_name (&p_ssh_current->dirlist, filename))
| ^
sftp-panel.c:1489:77: error: passing argument 3 of 'sftp_utimes' from incompatible pointer type [-Wincompatible-pointer-types]
1489 | rc = sftp_utimes (p_ssh_current->ssh_node->sftp, file_abs_path, &newFileTime);
| ^~~~~~~~~~~~
| |
| struct timeval (*)[2]
In file included from ssh.h:6,
from main.h:10,
from sftp-panel.c:33:
/usr/include/libssh/sftp.h:750:87: note: expected 'const struct timeval *' but argument is of type 'struct timeval (*)[2]'
750 | LIBSSH_API int sftp_utimes(sftp_session sftp, const char *file, const struct timeval *times);
| ~~~~~~~~~~~~~~~~~~~~~~^~~~~
sftp-panel.c:1430:1: warning: label 'run_dialog' defined but not used [-Wunused-label]
1430 | run_dialog:
| ^~~~~~~~~~
sftp-panel.c:1367:8: warning: unused variable 'folder_name' [-Wunused-variable]
1367 | char folder_name[1024];
| ^~~~~~~~~~~
sftp-panel.c:1365:23: warning: unused variable 'i' [-Wunused-variable]
1365 | int result, rc = 0, i;
| ^
sftp-panel.c: In function 'refresh_panel_history':
sftp-panel.c:1618:10: warning: unused variable 's' [-Wunused-variable]
1618 | gchar *s;
| ^
sftp-panel.c:1617:10: warning: unused variable 'n_items' [-Wunused-variable]
1617 | int i, n_items;
| ^~~~~~~
sftp-panel.c:1616:20: warning: unused variable 'b' [-Wunused-variable]
1616 | struct Bookmark *b;
| ^
sftp-panel.c: In function 'sftp_panel_change_directory':
sftp-panel.c:1716:7: warning: unused variable 'rc' [-Wunused-variable]
1716 | int rc;
| ^~
sftp-panel.c: In function 'row_activated_sftp_cb':
sftp-panel.c:1798:11: warning: suggest parentheses around assignment used as truth value [-Wparentheses]
1798 | if (e = dl_search_by_name (&p_ssh_current->dirlist, name))
| ^
sftp-panel.c:1786:7: warning: unused variable 'retcode' [-Wunused-variable]
1786 | int retcode;
| ^~~~~~~
sftp-panel.c:1785:12: warning: unused variable 'have_iter' [-Wunused-variable]
1785 | gboolean have_iter;
| ^~~~~~~~~
sftp-panel.c: In function 'sftp_go_up_cb':
sftp-panel.c:1833:7: warning: suggest parentheses around assignment used as truth value [-Wparentheses]
1833 | if (pc = (char *) strrchr (newpath, '/'))
| ^~
sftp-panel.c: In function 'follow_terminal_folder':
sftp-panel.c:1905:11: warning: suggest parentheses around assignment used as truth value [-Wparentheses]
1905 | if (path = get_remote_directory ())
| ^~~~
sftp-panel.c: In function 'sort_name_compare_func':
sftp-panel.c:2035:14: warning: unused variable 'size2' [-Wunused-variable]
2035 | int size1, size2;
| ^~~~~
sftp-panel.c:2035:7: warning: unused variable 'size1' [-Wunused-variable]
2035 | int size1, size2;
| ^~~~~
sftp-panel.c: In function 'sftp_cell_tooltip_cb':
sftp-panel.c:2120:11: warning: suggest parentheses around assignment used as truth value [-Wparentheses]
2120 | if (e = dl_search_by_name (&p_ssh_current->dirlist, name))
| ^
sftp-panel.c: In function 'sftp_popup_menu':
sftp-panel.c:2153:3: warning: 'gtk_action_group_new' is deprecated [-Wdeprecated-declarations]
2153 | action_group = gtk_action_group_new ("SFTPPopupActions");
| ^~~~~~~~~~~~
In file included from /usr/include/gtk-3.0/gtk/gtk.h:254:
/usr/include/gtk-3.0/gtk/deprecated/gtkactiongroup.h:175:17: note: declared here
175 | GtkActionGroup *gtk_action_group_new (const gchar *name);
| ^~~~~~~~~~~~~~~~~~~~
sftp-panel.c:2154:3: warning: 'gtk_action_group_add_actions' is deprecated [-Wdeprecated-declarations]
2154 | gtk_action_group_add_actions (action_group, sftp_popup_menu_items, G_N_ELEMENTS (sftp_popup_menu_items), treeview);
| ^~~~~~~~~~~~~~~~~~~~~~~~~~~~
/usr/include/gtk-3.0/gtk/deprecated/gtkactiongroup.h:210:17: note: declared here
210 | void gtk_action_group_add_actions (GtkActionGroup *action_group,
| ^~~~~~~~~~~~~~~~~~~~~~~~~~~~
sftp-panel.c:2156:3: warning: 'gtk_ui_manager_new' is deprecated [-Wdeprecated-declarations]
2156 | ui_manager = gtk_ui_manager_new ();
| ^~~~~~~~~~
In file included from /usr/include/gtk-3.0/gtk/gtk.h:284:
/usr/include/gtk-3.0/gtk/deprecated/gtkuimanager.h:130:16: note: declared here
130 | GtkUIManager *gtk_ui_manager_new (void);
| ^~~~~~~~~~~~~~~~~~
sftp-panel.c:2157:3: warning: 'gtk_ui_manager_insert_action_group' is deprecated [-Wdeprecated-declarations]
2157 | gtk_ui_manager_insert_action_group (ui_manager, action_group, 0);
| ^~~~~~~~~~~~~~~~~~~~~~~~~~~~~~~~~~
/usr/include/gtk-3.0/gtk/deprecated/gtkuimanager.h:138:16: note: declared here
138 | void gtk_ui_manager_insert_action_group (GtkUIManager *manager,
| ^~~~~~~~~~~~~~~~~~~~~~~~~~~~~~~~~~
sftp-panel.c:2158:3: warning: 'gtk_ui_manager_insert_action_group' is deprecated [-Wdeprecated-declarations]
2158 | gtk_ui_manager_insert_action_group (ui_manager, action_group_ssh_adds, 0);
| ^~~~~~~~~~~~~~~~~~~~~~~~~~~~~~~~~~
/usr/include/gtk-3.0/gtk/deprecated/gtkuimanager.h:138:16: note: declared here
138 | void gtk_ui_manager_insert_action_group (GtkUIManager *manager,
| ^~~~~~~~~~~~~~~~~~~~~~~~~~~~~~~~~~
sftp-panel.c:2160:3: warning: 'gtk_ui_manager_add_ui_from_string' is deprecated [-Wdeprecated-declarations]
2160 | gtk_ui_manager_add_ui_from_string (ui_manager, ui_sftp_popup_desc, -1, NULL);
| ^~~~~~~~~~~~~~~~~~~~~~~~~~~~~~~~~
/usr/include/gtk-3.0/gtk/deprecated/gtkuimanager.h:158:16: note: declared here
158 | guint gtk_ui_manager_add_ui_from_string (GtkUIManager *manager,
| ^~~~~~~~~~~~~~~~~~~~~~~~~~~~~~~~~
sftp-panel.c:2161:3: warning: 'gtk_ui_manager_add_ui_from_string' is deprecated [-Wdeprecated-declarations]
2161 | gtk_ui_manager_add_ui_from_string (ui_manager, ui_sftp_popup_desc_adds, -1, NULL);
| ^~~~~~~~~~~~~~~~~~~~~~~~~~~~~~~~~
/usr/include/gtk-3.0/gtk/deprecated/gtkuimanager.h:158:16: note: declared here
158 | guint gtk_ui_manager_add_ui_from_string (GtkUIManager *manager,
| ^~~~~~~~~~~~~~~~~~~~~~~~~~~~~~~~~
sftp-panel.c:2163:3: warning: 'gtk_ui_manager_get_widget' is deprecated [-Wdeprecated-declarations]
2163 | popup = gtk_ui_manager_get_widget (ui_manager, "/SFTPPopupMenu");
| ^~~~~
/usr/include/gtk-3.0/gtk/deprecated/gtkuimanager.h:149:16: note: declared here
149 | GtkWidget *gtk_ui_manager_get_widget (GtkUIManager *manager,
| ^~~~~~~~~~~~~~~~~~~~~~~~~
sftp-panel.c:2167:3: warning: 'gtk_menu_popup' is deprecated: Use '(gtk_menu_popup_at_widget, gtk_menu_popup_at_pointer, gtk_menu_popup_at_rect)' instead [-Wdeprecated-declarations]
2167 | gtk_menu_popup (GTK_MENU(popup), NULL, NULL, NULL, NULL,
| ^~~~~~~~~~~~~~
In file included from /usr/include/gtk-3.0/gtk/gtklabel.h:34,
from /usr/include/gtk-3.0/gtk/gtkaccellabel.h:35,
from /usr/include/gtk-3.0/gtk/gtk.h:33:
/usr/include/gtk-3.0/gtk/gtkmenu.h:138:12: note: declared here
138 | void gtk_menu_popup (GtkMenu *menu,
| ^~~~~~~~~~~~~~
sftp-panel.c: In function 'ssh_additionals_cb':
sftp-panel.c:2249:3: warning: 'gtk_action_get_name' is deprecated [-Wdeprecated-declarations]
2249 | gchar *name = (gchar *) gtk_action_get_name (GTK_ACTION (action));
| ^~~~~
In file included from /usr/include/gtk-3.0/gtk/deprecated/gtkactivatable.h:25,
from /usr/include/gtk-3.0/gtk/gtk.h:252:
/usr/include/gtk-3.0/gtk/deprecated/gtkaction.h:103:14: note: declared here
103 | const gchar* gtk_action_get_name (GtkAction *action);
| ^~~~~~~~~~~~~~~~~~~
sftp-panel.c: In function 'create_sftp_panel':
sftp-panel.c:2355:3: warning: 'gtk_image_new_from_stock' is deprecated: Use 'gtk_image_new_from_icon_name' instead [-Wdeprecated-declarations]
2355 | gtk_button_set_image (GTK_BUTTON(sftp_panel.button_home), gtk_image_new_from_stock (MY_STOCK_HOME, GTK_ICON_SIZE_BUTTON));
| ^~~~~~~~~~~~~~~~~~~~
In file included from /usr/include/gtk-3.0/gtk/gtkentry.h:42,
from /usr/include/gtk-3.0/gtk/gtktreeview.h:29,
from /usr/include/gtk-3.0/gtk/gtkcombobox.h:27,
from /usr/include/gtk-3.0/gtk/gtkappchooserbutton.h:29,
from /usr/include/gtk-3.0/gtk/gtk.h:42:
/usr/include/gtk-3.0/gtk/gtkimage.h:122:12: note: declared here
122 | GtkWidget* gtk_image_new_from_stock (const gchar *stock_id,
| ^~~~~~~~~~~~~~~~~~~~~~~~
sftp-panel.c:2359:3: warning: 'gtk_image_new_from_stock' is deprecated: Use 'gtk_image_new_from_icon_name' instead [-Wdeprecated-declarations]
2359 | gtk_button_set_image (GTK_BUTTON(sftp_panel.button_go_up), gtk_image_new_from_stock (MY_STOCK_FOLDER_UP, GTK_ICON_SIZE_BUTTON));
| ^~~~~~~~~~~~~~~~~~~~
/usr/include/gtk-3.0/gtk/gtkimage.h:122:12: note: declared here
122 | GtkWidget* gtk_image_new_from_stock (const gchar *stock_id,
| ^~~~~~~~~~~~~~~~~~~~~~~~
sftp-panel.c:2363:3: warning: 'gtk_image_new_from_stock' is deprecated: Use 'gtk_image_new_from_icon_name' instead [-Wdeprecated-declarations]
2363 | gtk_button_set_image (GTK_BUTTON(sftp_panel.button_file_new), gtk_image_new_from_stock (MY_STOCK_FILE_NEW, GTK_ICON_SIZE_BUTTON));
| ^~~~~~~~~~~~~~~~~~~~
/usr/include/gtk-3.0/gtk/gtkimage.h:122:12: note: declared here
122 | GtkWidget* gtk_image_new_from_stock (const gchar *stock_id,
| ^~~~~~~~~~~~~~~~~~~~~~~~
sftp-panel.c:2367:3: warning: 'gtk_image_new_from_stock' is deprecated: Use 'gtk_image_new_from_icon_name' instead [-Wdeprecated-declarations]
2367 | gtk_button_set_image (GTK_BUTTON(sftp_panel.button_folder_new), gtk_image_new_from_stock (MY_STOCK_FOLDER_NEW, GTK_ICON_SIZE_BUTTON));
| ^~~~~~~~~~~~~~~~~~~~
/usr/include/gtk-3.0/gtk/gtkimage.h:122:12: note: declared here
122 | GtkWidget* gtk_image_new_from_stock (const gchar *stock_id,
| ^~~~~~~~~~~~~~~~~~~~~~~~
sftp-panel.c:2371:3: warning: 'gtk_image_new_from_stock' is deprecated: Use 'gtk_image_new_from_icon_name' instead [-Wdeprecated-declarations]
2371 | gtk_button_set_image (GTK_BUTTON(sftp_panel.button_upload), gtk_image_new_from_stock (MY_STOCK_UPLOAD, GTK_ICON_SIZE_BUTTON));
| ^~~~~~~~~~~~~~~~~~~~
/usr/include/gtk-3.0/gtk/gtkimage.h:122:12: note: declared here
122 | GtkWidget* gtk_image_new_from_stock (const gchar *stock_id,
| ^~~~~~~~~~~~~~~~~~~~~~~~
sftp-panel.c:2375:3: warning: 'gtk_image_new_from_stock' is deprecated: Use 'gtk_image_new_from_icon_name' instead [-Wdeprecated-declarations]
2375 | gtk_button_set_image (GTK_BUTTON(sftp_panel.button_download), gtk_image_new_from_stock (MY_STOCK_DOWNLOAD, GTK_ICON_SIZE_BUTTON));
| ^~~~~~~~~~~~~~~~~~~~
/usr/include/gtk-3.0/gtk/gtkimage.h:122:12: note: declared here
122 | GtkWidget* gtk_image_new_from_stock (const gchar *stock_id,
| ^~~~~~~~~~~~~~~~~~~~~~~~
sftp-panel.c:2548:13: warning: 'gtk_action_group_new' is deprecated [-Wdeprecated-declarations]
2548 | action_group_ssh_adds = gtk_action_group_new ("SSHAdds");
| ^~~~~~~~~~~~~~~~~~~~~
/usr/include/gtk-3.0/gtk/deprecated/gtkactiongroup.h:175:17: note: declared here
175 | GtkActionGroup *gtk_action_group_new (const gchar *name);
| ^~~~~~~~~~~~~~~~~~~~
sftp-panel.c:2559:11: warning: 'gtk_action_new' is deprecated [-Wdeprecated-declarations]
2559 | action = gtk_action_new (action_name, SSHMenuItems[i].label, NULL, NULL);
| ^~~~~~
/usr/include/gtk-3.0/gtk/deprecated/gtkaction.h:98:14: note: declared here
98 | GtkAction *gtk_action_new (const gchar *name,
| ^~~~~~~~~~~~~~
sftp-panel.c:2561:11: warning: 'gtk_action_group_add_action' is deprecated [-Wdeprecated-declarations]
2561 | gtk_action_group_add_action (action_group_ssh_adds, action);
| ^~~~~~~~~~~~~~~~~~~~~~~~~~~
/usr/include/gtk-3.0/gtk/deprecated/gtkactiongroup.h:200:17: note: declared here
200 | void gtk_action_group_add_action (GtkActionGroup *action_group,
| ^~~~~~~~~~~~~~~~~~~~~~~~~~~
sftp-panel.c:2569:15: warning: 'gtk_action_new' is deprecated [-Wdeprecated-declarations]
2569 | action = gtk_action_new (SSHMenuItems[i].parent_menu, SSHMenuItems[i].parent_menu, NULL, NULL);
| ^~~~~~
/usr/include/gtk-3.0/gtk/deprecated/gtkaction.h:98:14: note: declared here
98 | GtkAction *gtk_action_new (const gchar *name,
| ^~~~~~~~~~~~~~
sftp-panel.c:2570:15: warning: 'gtk_action_group_add_action' is deprecated [-Wdeprecated-declarations]
2570 | gtk_action_group_add_action (action_group_ssh_adds, action);
| ^~~~~~~~~~~~~~~~~~~~~~~~~~~
/usr/include/gtk-3.0/gtk/deprecated/gtkactiongroup.h:200:17: note: declared here
200 | void gtk_action_group_add_action (GtkActionGroup *action_group,
| ^~~~~~~~~~~~~~~~~~~~~~~~~~~
sftp-panel.c:2505:17: warning: unused variable 'icon_theme' [-Wunused-variable]
2505 | GtkIconTheme *icon_theme;
| ^~~~~~~~~~
sftp-panel.c:2422:15: warning: unused variable 'iter' [-Wunused-variable]
2422 | GtkTreeIter iter;
| ^~~~
sftp-panel.c: In function 'load_additional_ssh_menu':
sftp-panel.c:2782:15: warning: unused variable 'i' [-Wunused-variable]
2782 | int action, i;
| ^
sftp-panel.c: In function 'load_types':
sftp-panel.c:2875:36: warning: unused variable 'pc' [-Wunused-variable]
2875 | char filename[256], tmp_s[128], *pc;
| ^~
sftp-panel.c:2875:23: warning: unused variable 'tmp_s' [-Wunused-variable]
2875 | char filename[256], tmp_s[128], *pc;
| ^~~~~
sftp-panel.c: In function 'show_output':
sftp-panel.c:2962:41: warning: 'GtkStock' is deprecated [-Wdeprecated-declarations]
2962 | GTK_STOCK_OK,
| ^~~~~~~~~~~~
sftp-panel.c:3005:3: warning: 'gdk_screen_get_width' is deprecated [-Wdeprecated-declarations]
3005 | gtk_widget_set_size_request (GTK_WIDGET (dialog), gdk_screen_get_width (screen)/2, gdk_screen_get_height (screen)/2);
| ^~~~~~~~~~~~~~~~~~~~~~~~~~~
In file included from /usr/include/gtk-3.0/gdk/gdkapplaunchcontext.h:31,
from /usr/include/gtk-3.0/gdk/gdk.h:32:
/usr/include/gtk-3.0/gdk/gdkscreen.h:58:14: note: declared here
58 | gint gdk_screen_get_width (GdkScreen *screen);
| ^~~~~~~~~~~~~~~~~~~~
sftp-panel.c:3005:3: warning: 'gdk_screen_get_height' is deprecated [-Wdeprecated-declarations]
3005 | gtk_widget_set_size_request (GTK_WIDGET (dialog), gdk_screen_get_width (screen)/2, gdk_screen_get_height (screen)/2);
| ^~~~~~~~~~~~~~~~~~~~~~~~~~~
/usr/include/gtk-3.0/gdk/gdkscreen.h:60:14: note: declared here
60 | gint gdk_screen_get_height (GdkScreen *screen);
| ^~~~~~~~~~~~~~~~~~~~~
sftp-panel.c:3007:7: warning: suggest parentheses around assignment used as truth value [-Wparentheses]
3007 | if (font_desc = pango_font_description_from_string (prefs.font_fixed))
| ^~~~~~~~~
sftp-panel.c:3009:7: warning: 'gtk_widget_modify_font' is deprecated: Use 'gtk_widget_override_font' instead [-Wdeprecated-declarations]
3009 | gtk_widget_modify_font (text_view, font_desc);
| ^~~~~~~~~~~~~~~~~~~~~~
In file included from /usr/include/gtk-3.0/gtk/gtk.h:277:
/usr/include/gtk-3.0/gtk/deprecated/gtkstyle.h:769:13: note: declared here
769 | void gtk_widget_modify_font (GtkWidget *widget,
| ^~~~~~~~~~~~~~~~~~~~~~
sftp-panel.c:3013:8: warning: unused variable 'result' [-Wunused-variable]
3013 | gint result = gtk_dialog_run (GTK_DIALOG (dialog));
| ^~~~~~
sftp-panel.c:3002:17: warning: unused variable 'w_height' [-Wunused-variable]
3002 | gint w_width, w_height;
| ^~~~~~~~
sftp-panel.c:3002:8: warning: unused variable 'w_width' [-Wunused-variable]
3002 | gint w_width, w_height;
| ^~~~~~~
sftp-panel.c: In function 'sftp_queue_count':
sftp-panel.c:3044:5: error: 'return' with no value, in function returning non-void [-Wreturn-mismatch]
3044 | return;
| ^~~~~~
sftp-panel.c:3032:1: note: declared here
3032 | sftp_queue_count (int *nUp, int *nDown)
| ^~~~~~~~~~~~~~~~
sftp-panel.c:3047:18: warning: passing argument 1 of 'lockSFTPQueue' discards 'const' qualifier from pointer target type [-Wdiscarded-qualifiers]
3047 | lockSFTPQueue (__func__, TRUE);
| ^~~~~~~~
In file included from sftp-panel.c:40:
async.h:9:27: note: expected 'char *' but argument is of type 'const char *'
9 | void lockSFTPQueue (char *caller, gboolean flagLock);
| ~~~~~~^~~~~~
sftp-panel.c:3066:18: warning: passing argument 1 of 'lockSFTPQueue' discards 'const' qualifier from pointer target type [-Wdiscarded-qualifiers]
3066 | lockSFTPQueue (__func__, FALSE);
| ^~~~~~~~
async.h:9:27: note: expected 'char *' but argument is of type 'const char *'
9 | void lockSFTPQueue (char *caller, gboolean flagLock);
| ~~~~~~^~~~~~
sftp-panel.c: In function 'sftp_queue_add':
sftp-panel.c:3125:22: warning: passing argument 1 of 'lockSFTPQueue' discards 'const' qualifier from pointer target type [-Wdiscarded-qualifiers]
3125 | lockSFTPQueue (__func__, TRUE);
| ^~~~~~~~
async.h:9:27: note: expected 'char *' but argument is of type 'const char *'
9 | void lockSFTPQueue (char *caller, gboolean flagLock);
| ~~~~~~^~~~~~
sftp-panel.c:3142:22: warning: passing argument 1 of 'lockSFTPQueue' discards 'const' qualifier from pointer target type [-Wdiscarded-qualifiers]
3142 | lockSFTPQueue (__func__, FALSE);
| ^~~~~~~~
async.h:9:27: note: expected 'char *' but argument is of type 'const char *'
9 | void lockSFTPQueue (char *caller, gboolean flagLock);
| ~~~~~~^~~~~~
sftp-panel.c:3153:50: error: passing argument 3 of 'pthread_create' from incompatible pointer type [-Wincompatible-pointer-types]
3153 | rc = pthread_create (&thread_transfer, NULL, async_sftp_transfer, (void *)sftp_panel.queue);
| ^~~~~~~~~~~~~~~~~~~
| |
| int (*)(void *)
In file included from /usr/include/glib-2.0/glib/deprecated/gthread.h:126,
from /usr/include/glib-2.0/glib.h:115:
/usr/include/pthread.h:204:36: note: expected 'void * (*)(void *)' but argument is of type 'int (*)(void *)'
204 | void *(*__start_routine) (void *),
| ~~~~~~~~^~~~~~~~~~~~~~~~~~~~~~~~~
sftp-panel.c:3085:15: warning: unused variable 'info' [-Wunused-variable]
3085 | struct stat info;
| ^~~~
sftp-panel.c:3084:27: warning: unused variable 'e' [-Wunused-variable]
3084 | struct Directory_Entry *e;
| ^
make[2]: *** [Makefile:428: sftp-panel.o] Error 1
make[2]: Leaving directory '/usr/src/RPM/BUILD/lterm-1.5.1/src'
make[2]: Entering directory '/usr/src/RPM/BUILD/lterm-1.5.1/src'
x86_64-alt-linux-gcc -DLOCALEDIR=\"/usr/share/locale\" -DIMGDIR=\"/usr/share/lterm/img\" -DPKGDATADIR=\"/usr/share/lterm/data\" -DHAVE_CONFIG_H -I. -pipe -frecord-gcc-switches -Wall -g -O2 -flto=auto -fcommon -pthread -I/usr/include/gtk-3.0 -I/usr/include/gio-unix-2.0 -I/usr/include/pango-1.0 -I/usr/include/harfbuzz -I/usr/include/pango-1.0 -I/usr/include/atk-1.0 -I/usr/include/cairo -I/usr/include/freetype2 -I/usr/include/harfbuzz -I/usr/include/gdk-pixbuf-2.0 -I/usr/include/libpng16 -I/usr/include/glib-2.0 -I/usr/lib64/glib-2.0/include -pthread -I/usr/include/vte-2.91 -I/usr/include/gtk-3.0 -I/usr/include/gio-unix-2.0 -I/usr/include/pango-1.0 -I/usr/include/harfbuzz -I/usr/include/pango-1.0 -I/usr/include/atk-1.0 -I/usr/include/cairo -I/usr/include/freetype2 -I/usr/include/harfbuzz -I/usr/include/gdk-pixbuf-2.0 -I/usr/include/libpng16 -I/usr/include/glib-2.0 -I/usr/lib64/glib-2.0/include -c -o async.o async.c
async.c: In function 'async_lterm_loop':
async.c:99:8: warning: unused variable 'i' [-Wunused-variable]
99 | gint i;
| ^
async.c: In function 'async_sftp_transfer':
async.c:163:20: warning: passing argument 1 of 'lockSFTPQueue' discards 'const' qualifier from pointer target type [-Wdiscarded-qualifiers]
163 | lockSFTPQueue (__func__, TRUE);
| ^~~~~~~~
async.c:64:22: note: expected 'char *' but argument is of type 'const char *'
64 | lockSFTPQueue (char *caller, gboolean flagLock)
| ~~~~~~^~~~~~
async.c:179:20: warning: passing argument 1 of 'lockSFTPQueue' discards 'const' qualifier from pointer target type [-Wdiscarded-qualifiers]
179 | lockSFTPQueue (__func__, FALSE);
| ^~~~~~~~
async.c:64:22: note: expected 'char *' but argument is of type 'const char *'
64 | lockSFTPQueue (char *caller, gboolean flagLock)
| ~~~~~~^~~~~~
async.c:153:8: warning: unused variable 'transferReport' [-Wunused-variable]
153 | char transferReport[256];
| ^~~~~~~~~~~~~~
async.c:141:12: warning: unused variable 'nDown' [-Wunused-variable]
141 | int nUp, nDown;
| ^~~~~
async.c:141:7: warning: unused variable 'nUp' [-Wunused-variable]
141 | int nUp, nDown;
| ^~~
async.c:140:10: warning: variable 'rc' set but not used [-Wunused-but-set-variable]
140 | int i, rc;
| ^~
make[2]: Leaving directory '/usr/src/RPM/BUILD/lterm-1.5.1/src'
make[2]: Entering directory '/usr/src/RPM/BUILD/lterm-1.5.1/src'
x86_64-alt-linux-gcc -DLOCALEDIR=\"/usr/share/locale\" -DIMGDIR=\"/usr/share/lterm/img\" -DPKGDATADIR=\"/usr/share/lterm/data\" -DHAVE_CONFIG_H -I. -pipe -frecord-gcc-switches -Wall -g -O2 -flto=auto -fcommon -pthread -I/usr/include/gtk-3.0 -I/usr/include/gio-unix-2.0 -I/usr/include/pango-1.0 -I/usr/include/harfbuzz -I/usr/include/pango-1.0 -I/usr/include/atk-1.0 -I/usr/include/cairo -I/usr/include/freetype2 -I/usr/include/harfbuzz -I/usr/include/gdk-pixbuf-2.0 -I/usr/include/libpng16 -I/usr/include/glib-2.0 -I/usr/lib64/glib-2.0/include -pthread -I/usr/include/vte-2.91 -I/usr/include/gtk-3.0 -I/usr/include/gio-unix-2.0 -I/usr/include/pango-1.0 -I/usr/include/harfbuzz -I/usr/include/pango-1.0 -I/usr/include/atk-1.0 -I/usr/include/cairo -I/usr/include/freetype2 -I/usr/include/harfbuzz -I/usr/include/gdk-pixbuf-2.0 -I/usr/include/libpng16 -I/usr/include/glib-2.0 -I/usr/lib64/glib-2.0/include -c -o connection.o connection.c
In file included from connection.c:38:
utils.h:47:1: error: parameter names (without types) in function declaration [-Wdeclaration-missing-parameter-type]
47 | char *readFile (filename);
| ^~~~
connection.c: In function 'detect_serverlist_file_version':
connection.c:130:8: warning: unused variable 'v2_s' [-Wunused-variable]
130 | char v2_s[] = ";mtsl-2";
| ^~~~
connection.c:127:8: warning: unused variable 'line' [-Wunused-variable]
127 | char line[1024];
| ^~~~
connection.c:126:9: warning: unused variable 'fp' [-Wunused-variable]
126 | FILE *fp;
| ^~
connection.c: In function 'save_connections_to_file_xml':
connection.c:569:7: warning: unused variable 'i' [-Wunused-variable]
569 | int i;
| ^
connection.c: In function 'save_connections_to_file_xml_from_glist':
connection.c:639:22: warning: unused variable 'c' [-Wunused-variable]
639 | struct Connection *c;
| ^
connection.c:637:7: warning: unused variable 'i' [-Wunused-variable]
637 | int i;
| ^
connection.c: In function 'read_connection_node':
connection.c:720:7: warning: suggest parentheses around assignment used as truth value [-Wparentheses]
720 | if (child = xml_node_get_child (node, "last_user"))
| ^~~~~
connection.c:723:7: warning: suggest parentheses around assignment used as truth value [-Wparentheses]
723 | if (child = xml_node_get_child (node, "user"))
| ^~~~~
connection.c:728:7: warning: suggest parentheses around assignment used as truth value [-Wparentheses]
728 | if (child = xml_node_get_child (node, "password"))
| ^~~~~
connection.c:747:7: warning: suggest parentheses around assignment used as truth value [-Wparentheses]
747 | if (child = xml_node_get_child (node, "directory"))
| ^~~~~
connection.c:750:7: warning: suggest parentheses around assignment used as truth value [-Wparentheses]
750 | if (child = xml_node_get_child (node, "note"))
| ^~~~~
connection.c:753:7: warning: suggest parentheses around assignment used as truth value [-Wparentheses]
753 | if (node_auth = xml_node_get_child (node, "authentication"))
| ^~~~~~~~~
connection.c:763:11: warning: suggest parentheses around assignment used as truth value [-Wparentheses]
763 | if (child = xml_node_get_child (node_auth, "mode"))
| ^~~~~
connection.c:770:11: warning: suggest parentheses around assignment used as truth value [-Wparentheses]
770 | if (child = xml_node_get_child (node_auth, "auth_user"))
| ^~~~~
connection.c:773:11: warning: suggest parentheses around assignment used as truth value [-Wparentheses]
773 | if (child = xml_node_get_child (node_auth, "auth_password"))
| ^~~~~
connection.c:789:11: warning: suggest parentheses around assignment used as truth value [-Wparentheses]
789 | if (child = xml_node_get_child (node_auth, "identityFile"))
| ^~~~~
connection.c:794:7: warning: suggest parentheses around assignment used as truth value [-Wparentheses]
794 | if (node_hist = xml_node_get_child (node, "history"))
| ^~~~~~~~~
connection.c:812:7: warning: suggest parentheses around assignment used as truth value [-Wparentheses]
812 | if (child = xml_node_get_child (node, "upload_dir"))
| ^~~~~
connection.c:815:7: warning: suggest parentheses around assignment used as truth value [-Wparentheses]
815 | if (child = xml_node_get_child (node, "download_dir"))
| ^~~~~
connection.c:819:7: warning: suggest parentheses around assignment used as truth value [-Wparentheses]
819 | if (child = xml_node_get_child (node, "x11Forwarding"))
| ^~~~~
connection.c:827:7: warning: suggest parentheses around assignment used as truth value [-Wparentheses]
827 | if (child = xml_node_get_child (node, "options"))
| ^~~~~
connection.c:699:20: warning: unused variable 'pc' [-Wunused-variable]
699 | char name[256], *pc;
| ^~
connection.c:699:8: warning: unused variable 'name' [-Wunused-variable]
699 | char name[256], *pc;
| ^~~~
connection.c: In function 'read_xml_connection_item':
connection.c:862:32: warning: unused variable 'node_hist' [-Wunused-variable]
862 | XMLNode *child, *node_auth, *node_hist;
| ^~~~~~~~~
connection.c:862:20: warning: unused variable 'node_auth' [-Wunused-variable]
862 | XMLNode *child, *node_auth, *node_hist;
| ^~~~~~~~~
connection.c:862:12: warning: unused variable 'child' [-Wunused-variable]
862 | XMLNode *child, *node_auth, *node_hist;
| ^~~~~
connection.c: In function 'get_xml_doc':
connection.c:915:20: warning: unused variable 'tmp_s' [-Wunused-variable]
915 | char line[2048], tmp_s[32];
| ^~~~~
connection.c: In function 'load_connections_from_file_xml':
connection.c:967:8: warning: unused variable 'line' [-Wunused-variable]
967 | char line[2048], tmp_s[32];
| ^~~~
connection.c:965:22: warning: unused variable 'p_conn' [-Wunused-variable]
965 | struct Connection *p_conn;
| ^~~~~~
connection.c: In function 'load_connections':
connection.c:1082:22: warning: unused variable 'p_conn' [-Wunused-variable]
1082 | struct Connection *p_conn;
| ^~~~~~
connection.c: In function 'count_current_connections':
connection.c:1121:11: error: implicit declaration of function 'cl_count' [-Wimplicit-function-declaration]
1121 | return (cl_count (&conn_list));
| ^~~~~~~~
connection.c: In function 'copy_button_clicked_cb':
connection.c:1250:11: error: implicit declaration of function 'get_selected_connection'; did you mean 'add_recent_connection'? [-Wimplicit-function-declaration]
1250 | found = get_selected_connection (select, &conn);
| ^~~~~~~~~~~~~~~~~~~~~~~
| add_recent_connection
connection.c: In function 'select_private_key_cb':
connection.c:1359:41: warning: 'GtkStock' is deprecated [-Wdeprecated-declarations]
1359 | GTK_STOCK_CANCEL, GTK_RESPONSE_CANCEL,
| ^~~~~~~~~~~~~~~~
connection.c:1360:41: warning: 'GtkStock' is deprecated [-Wdeprecated-declarations]
1360 | GTK_STOCK_OPEN, GTK_RESPONSE_ACCEPT,
| ^~~~~~~~~~~~~~
connection.c:1373:38: error: passing argument 1 of 'gtk_entry_set_text' from incompatible pointer type [-Wincompatible-pointer-types]
1373 | gtk_entry_set_text (authWidgets.entry_private_key, gtk_file_chooser_get_filename (GTK_FILE_CHOOSER(dialog)));
| ~~~~~~~~~~~^~~~~~~~~~~~~~~~~~
| |
| GtkWidget * {aka struct _GtkWidget *}
In file included from /usr/include/gtk-3.0/gtk/gtktreeview.h:29,
from /usr/include/gtk-3.0/gtk/gtkcombobox.h:27,
from /usr/include/gtk-3.0/gtk/gtkappchooserbutton.h:29,
from /usr/include/gtk-3.0/gtk/gtk.h:42,
from connection.c:23:
/usr/include/gtk-3.0/gtk/gtkentry.h:253:65: note: expected 'GtkEntry *' {aka 'struct _GtkEntry *'} but argument is of type 'GtkWidget *' {aka 'struct _GtkWidget *'}
253 | void gtk_entry_set_text (GtkEntry *entry,
| ~~~~~~~~~~~~~~~^~~~~
connection.c: In function 'clear_private_key_cb':
connection.c:1382:34: error: passing argument 1 of 'gtk_entry_set_text' from incompatible pointer type [-Wincompatible-pointer-types]
1382 | gtk_entry_set_text (authWidgets.entry_private_key, "");
| ~~~~~~~~~~~^~~~~~~~~~~~~~~~~~
| |
| GtkWidget * {aka struct _GtkWidget *}
/usr/include/gtk-3.0/gtk/gtkentry.h:253:65: note: expected 'GtkEntry *' {aka 'struct _GtkEntry *'} but argument is of type 'GtkWidget *' {aka 'struct _GtkWidget *'}
253 | void gtk_entry_set_text (GtkEntry *entry,
| ~~~~~~~~~~~~~~~^~~~~
connection.c: In function 'add_update_connection':
connection.c:1528:7: error: 'return' with no value, in function returning non-void [-Wreturn-mismatch]
1528 | return;
| ^~~~~~
connection.c:1485:1: note: declared here
1485 | add_update_connection (struct GroupNode *p_node, struct Connection *p_conn_model)
| ^~~~~~~~~~~~~~~~~~~~~
connection.c:1827:3: warning: 'GtkStock' is deprecated [-Wdeprecated-declarations]
1827 | cancel_button = gtk_dialog_add_button (GTK_DIALOG (dialog), GTK_STOCK_CANCEL, GTK_RESPONSE_CANCEL);
| ^~~~~~~~~~~~~
connection.c:1828:3: warning: 'GtkStock' is deprecated [-Wdeprecated-declarations]
1828 | ok_button = gtk_dialog_add_button (GTK_DIALOG (dialog), GTK_STOCK_OK, GTK_RESPONSE_OK);
| ^~~~~~~~~
connection.c:1856:13: error: implicit declaration of function 'connection_copy'; did you mean 'connection_init'? [-Wimplicit-function-declaration]
1856 | connection_copy (&conn_new, p_conn);
| ^~~~~~~~~~~~~~~
| connection_init
connection.c:1960:19: error: implicit declaration of function 'refresh_search_completion' [-Wimplicit-function-declaration]
1960 | refresh_search_completion ();
| ^~~~~~~~~~~~~~~~~~~~~~~~~
connection.c:1622:7: warning: unused variable 'sig_handler_prot' [-Wunused-variable]
1622 | int sig_handler_prot = g_signal_connect (G_OBJECT (GTK_COMBO_BOX (protocol_combo)), "changed", G_CALLBACK (change_protocol_cb), NULL);
| ^~~~~~~~~~~~~~~~
connection.c:1509:32: warning: variable 'p_conn_ctrl' set but not used [-Wunused-but-set-variable]
1509 | struct Connection conn_new, *p_conn_ctrl = NULL;
| ^~~~~~~~~~~
connection.c:1507:7: warning: unused variable 'len' [-Wunused-variable]
1507 | int len;
| ^~~
connection.c:1506:9: warning: unused variable 'p_enc_b64' [-Wunused-variable]
1506 | char *p_enc_b64;
| ^~~~~~~~~
connection.c:1505:9: warning: unused variable 'p_enc' [-Wunused-variable]
1505 | char *p_enc;
| ^~~~~
connection.c:1496:14: warning: unused variable 'table' [-Wunused-variable]
1496 | GtkWidget *table;
| ^~~~~
connection.c:1495:30: warning: variable 'ok_button' set but not used [-Wunused-but-set-variable]
1495 | GtkWidget *cancel_button, *ok_button;
| ^~~~~~~~~
connection.c:1495:14: warning: variable 'cancel_button' set but not used [-Wunused-but-set-variable]
1495 | GtkWidget *cancel_button, *ok_button;
| ^~~~~~~~~~~~~
connection.c:1493:19: warning: unused variable 'y_pad' [-Wunused-variable]
1493 | int x_pad = 10, y_pad = 5;
| ^~~~~
connection.c:1493:7: warning: unused variable 'x_pad' [-Wunused-variable]
1493 | int x_pad = 10, y_pad = 5;
| ^~~~~
connection.c:1491:9: warning: unused variable 'emu_tmp' [-Wunused-variable]
1491 | char *emu_tmp, connection_name[1024], s_tmp[1024];
| ^~~~~~~
connection.c:1490:19: warning: unused variable 'temp' [-Wunused-variable]
1490 | char title[64], temp[256];
| ^~~~
connection.c: In function 'add_update_folder':
connection.c:2035:3: warning: 'GtkStock' is deprecated [-Wdeprecated-declarations]
2035 | cancel_button = gtk_dialog_add_button (GTK_DIALOG (dialog), GTK_STOCK_CANCEL, GTK_RESPONSE_CANCEL);
| ^~~~~~~~~~~~~
connection.c:2036:3: warning: 'GtkStock' is deprecated [-Wdeprecated-declarations]
2036 | ok_button = gtk_dialog_add_button (GTK_DIALOG (dialog), GTK_STOCK_OK, GTK_RESPONSE_OK);
| ^~~~~~~~~
connection.c:1997:30: warning: variable 'ok_button' set but not used [-Wunused-but-set-variable]
1997 | GtkWidget *cancel_button, *ok_button;
| ^~~~~~~~~
connection.c:1997:14: warning: variable 'cancel_button' set but not used [-Wunused-but-set-variable]
1997 | GtkWidget *cancel_button, *ok_button;
| ^~~~~~~~~~~~~
connection.c:1995:10: warning: unused variable 'proceed' [-Wunused-variable]
1995 | int i, proceed, err_name_validation, result;
| ^~~~~~~
connection.c:1995:7: warning: unused variable 'i' [-Wunused-variable]
1995 | int i, proceed, err_name_validation, result;
| ^
connection.c:1993:19: warning: unused variable 'temp' [-Wunused-variable]
1993 | char title[64], temp[256];
| ^~~~
connection.c: In function 'rebuild_tree_store':
connection.c:2196:3: error: implicit declaration of function 'cl_check' [-Wimplicit-function-declaration]
2196 | cl_check (&conn_list);
| ^~~~~~~~
connection.c: In function 'cursor_changed_cb':
connection.c:2290:21: warning: unused variable 'selection' [-Wunused-variable]
2290 | GtkTreeSelection *selection;
| ^~~~~~~~~
connection.c: In function 'row_activated_quick_cb':
connection.c:2413:17: error: implicit declaration of function 'log_on' [-Wimplicit-function-declaration]
2413 | retcode = log_on (p_connection_tab);
| ^~~~~~
connection.c:2417:11: error: implicit declaration of function 'connection_tab_add'; did you mean 'connection_tab_new'? [-Wimplicit-function-declaration]
2417 | connection_tab_add (p_connection_tab);
| ^~~~~~~~~~~~~~~~~~
| connection_tab_new
connection.c:2389:10: warning: unused variable 'sel_name' [-Wunused-variable]
2389 | gchar *sel_name;
| ^~~~~~~~
connection.c:2388:8: warning: unused variable 'sel_port' [-Wunused-variable]
2388 | gint sel_port;
| ^~~~~~~~
connection.c:2387:20: warning: unused variable 'p_prot' [-Wunused-variable]
2387 | struct Protocol *p_prot;
| ^~~~~~
connection.c:2386:34: warning: unused variable 'conn1' [-Wunused-variable]
2386 | struct Connection *p_conn_new, conn1;
| ^~~~~
connection.c:2386:22: warning: unused variable 'p_conn_new' [-Wunused-variable]
2386 | struct Connection *p_conn_new, conn1;
| ^~~~~~~~~~
connection.c:2385:22: warning: unused variable 'p_conn_selected' [-Wunused-variable]
2385 | struct Connection *p_conn_selected, conn;
| ^~~~~~~~~~~~~~~
connection.c:2384:12: warning: unused variable 'have_iter' [-Wunused-variable]
2384 | gboolean have_iter;
| ^~~~~~~~~
connection.c:2383:15: warning: unused variable 'iter' [-Wunused-variable]
2383 | GtkTreeIter iter;
| ^~~~
connection.c: In function 'on_drag_data_inserted':
connection.c:2523:23: warning: unused variable 'tree_view' [-Wunused-variable]
2523 | struct GtkTreeView *tree_view = (struct GtkTreeView *) user_data;
| ^~~~~~~~~
connection.c: In function 'create_connections_tree_view':
connection.c:2671:10: warning: unused variable 'sel_name' [-Wunused-variable]
2671 | gchar *sel_name;
| ^~~~~~~~
connection.c:2670:8: warning: unused variable 'sel_port' [-Wunused-variable]
2670 | gint sel_port;
| ^~~~~~~~
connection.c:2669:20: warning: unused variable 'p_prot' [-Wunused-variable]
2669 | struct Protocol *p_prot;
| ^~~~~~
connection.c:2668:22: warning: unused variable 'p_conn_new' [-Wunused-variable]
2668 | struct Connection *p_conn_new;
| ^~~~~~~~~~
connection.c:2667:22: warning: unused variable 'p_conn_selected' [-Wunused-variable]
2667 | struct Connection *p_conn_selected;
| ^~~~~~~~~~~~~~~
connection.c:2665:7: warning: unused variable 'retcode' [-Wunused-variable]
2665 | int retcode = 0;
| ^~~~~~~
connection.c:2664:7: warning: unused variable 'port' [-Wunused-variable]
2664 | int port;
| ^~~~
connection.c:2663:43: warning: unused variable 'port_tmp' [-Wunused-variable]
2663 | char name[64], host[128], protocol[64], port_tmp[16];
| ^~~~~~~~
connection.c:2663:29: warning: unused variable 'protocol' [-Wunused-variable]
2663 | char name[64], host[128], protocol[64], port_tmp[16];
| ^~~~~~~~
connection.c:2663:18: warning: unused variable 'host' [-Wunused-variable]
2663 | char name[64], host[128], protocol[64], port_tmp[16];
| ^~~~
connection.c:2663:8: warning: unused variable 'name' [-Wunused-variable]
2663 | char name[64], host[128], protocol[64], port_tmp[16];
| ^~~~
connection.c:2662:20: warning: unused variable 's_path' [-Wunused-variable]
2662 | char line[1024], s_path[16];
| ^~~~~~
connection.c:2662:8: warning: unused variable 'line' [-Wunused-variable]
2662 | char line[1024], s_path[16];
| ^~~~
connection.c:2661:9: warning: unused variable 'fp' [-Wunused-variable]
2661 | FILE *fp;
| ^~
connection.c:2657:15: warning: unused variable 'iter' [-Wunused-variable]
2657 | GtkTreeIter iter;
| ^~~~
connection.c:2656:17: warning: unused variable 'tree_model' [-Wunused-variable]
2656 | GtkTreeModel *tree_model;
| ^~~~~~~~~~
connection.c: In function 'get_selected_connection':
connection.c:2776:12: warning: unused variable 'have_iter' [-Wunused-variable]
2776 | gboolean have_iter;
| ^~~~~~~~~
connection.c: In function 'edit_button_clicked_cb':
connection.c:2877:11: warning: suggest parentheses around assignment used as truth value [-Wparentheses]
2877 | if (p_node = add_update_connection (g_selected_node, NULL))
| ^~~~~~
connection.c:2882:11: warning: suggest parentheses around assignment used as truth value [-Wparentheses]
2882 | if (p_node = add_update_folder (g_selected_node))
| ^~~~~~
connection.c: In function 'delete_button_clicked_cb':
connection.c:2952:16: warning: unused variable 'path' [-Wunused-variable]
2952 | GtkTreePath *path;
| ^~~~
connection.c: In function 'ok_button_clicked_cb':
connection.c:3018:18: warning: unused variable 'buffer' [-Wunused-variable]
3018 | GtkTextBuffer *buffer = (GtkTextBuffer *) user_data;
| ^~~~~~
connection.c: In function 'choose_manage_connection':
connection.c:3151:3: warning: 'gtk_image_new_from_stock' is deprecated: Use 'gtk_image_new_from_icon_name' instead [-Wdeprecated-declarations]
3151 | gtk_button_set_image (GTK_BUTTON (new_connection_button), gtk_image_new_from_stock (MY_STOCK_PLUS, GTK_ICON_SIZE_LARGE_TOOLBAR));
| ^~~~~~~~~~~~~~~~~~~~
In file included from /usr/include/gtk-3.0/gtk/gtkentry.h:42:
/usr/include/gtk-3.0/gtk/gtkimage.h:122:12: note: declared here
122 | GtkWidget* gtk_image_new_from_stock (const gchar *stock_id,
| ^~~~~~~~~~~~~~~~~~~~~~~~
connection.c:3160:3: warning: 'gtk_image_new_from_stock' is deprecated: Use 'gtk_image_new_from_icon_name' instead [-Wdeprecated-declarations]
3160 | gtk_button_set_image (GTK_BUTTON (delete_button), gtk_image_new_from_stock (MY_STOCK_LESS, GTK_ICON_SIZE_LARGE_TOOLBAR));
| ^~~~~~~~~~~~~~~~~~~~
/usr/include/gtk-3.0/gtk/gtkimage.h:122:12: note: declared here
122 | GtkWidget* gtk_image_new_from_stock (const gchar *stock_id,
| ^~~~~~~~~~~~~~~~~~~~~~~~
connection.c:3169:3: warning: 'gtk_image_new_from_stock' is deprecated: Use 'gtk_image_new_from_icon_name' instead [-Wdeprecated-declarations]
3169 | gtk_button_set_image (GTK_BUTTON (edit_button), gtk_image_new_from_stock (MY_STOCK_PENCIL, GTK_ICON_SIZE_LARGE_TOOLBAR));
| ^~~~~~~~~~~~~~~~~~~~
/usr/include/gtk-3.0/gtk/gtkimage.h:122:12: note: declared here
122 | GtkWidget* gtk_image_new_from_stock (const gchar *stock_id,
| ^~~~~~~~~~~~~~~~~~~~~~~~
connection.c:3178:3: warning: 'gtk_image_new_from_stock' is deprecated: Use 'gtk_image_new_from_icon_name' instead [-Wdeprecated-declarations]
3178 | gtk_button_set_image (GTK_BUTTON (duplicate_connection_button), gtk_image_new_from_stock (MY_STOCK_COPY, GTK_ICON_SIZE_LARGE_TOOLBAR));
| ^~~~~~~~~~~~~~~~~~~~
/usr/include/gtk-3.0/gtk/gtkimage.h:122:12: note: declared here
122 | GtkWidget* gtk_image_new_from_stock (const gchar *stock_id,
| ^~~~~~~~~~~~~~~~~~~~~~~~
connection.c:3187:3: warning: 'gtk_image_new_from_stock' is deprecated: Use 'gtk_image_new_from_icon_name' instead [-Wdeprecated-declarations]
3187 | gtk_button_set_image (GTK_BUTTON (new_folder_button), gtk_image_new_from_stock (MY_STOCK_FOLDER, GTK_ICON_SIZE_LARGE_TOOLBAR));
| ^~~~~~~~~~~~~~~~~~~~
/usr/include/gtk-3.0/gtk/gtkimage.h:122:12: note: declared here
122 | GtkWidget* gtk_image_new_from_stock (const gchar *stock_id,
| ^~~~~~~~~~~~~~~~~~~~~~~~
connection.c:3247:3: warning: 'gtk_button_new_from_stock' is deprecated: Use 'gtk_button_new_with_label' instead [-Wdeprecated-declarations]
3247 | GtkWidget *cancel_button = gtk_button_new_from_stock (GTK_STOCK_CANCEL);
| ^~~~~~~~~
In file included from /usr/include/gtk-3.0/gtk/gtk.h:54:
/usr/include/gtk-3.0/gtk/gtkbutton.h:103:16: note: declared here
103 | GtkWidget* gtk_button_new_from_stock (const gchar *stock_id);
| ^~~~~~~~~~~~~~~~~~~~~~~~~
connection.c:3247:3: warning: 'GtkStock' is deprecated [-Wdeprecated-declarations]
3247 | GtkWidget *cancel_button = gtk_button_new_from_stock (GTK_STOCK_CANCEL);
| ^~~~~~~~~
connection.c:3252:3: warning: 'gtk_button_new_from_stock' is deprecated: Use 'gtk_button_new_with_label' instead [-Wdeprecated-declarations]
3252 | GtkWidget *ok_button = gtk_button_new_from_stock (GTK_STOCK_CONNECT);
| ^~~~~~~~~
/usr/include/gtk-3.0/gtk/gtkbutton.h:103:16: note: declared here
103 | GtkWidget* gtk_button_new_from_stock (const gchar *stock_id);
| ^~~~~~~~~~~~~~~~~~~~~~~~~
connection.c:3252:3: warning: 'GtkStock' is deprecated [-Wdeprecated-declarations]
3252 | GtkWidget *ok_button = gtk_button_new_from_stock (GTK_STOCK_CONNECT);
| ^~~~~~~~~
connection.c:3257:3: warning: 'gtk_alignment_new' is deprecated [-Wdeprecated-declarations]
3257 | GtkWidget *b_align = gtk_alignment_new (1, 0, 0, 0);
| ^~~~~~~~~
In file included from /usr/include/gtk-3.0/gtk/gtk.h:255:
/usr/include/gtk-3.0/gtk/deprecated/gtkalignment.h:79:12: note: declared here
79 | GtkWidget* gtk_alignment_new (gfloat xalign,
| ^~~~~~~~~~~~~~~~~
connection.c:3278:3: warning: 'gdk_screen_get_height' is deprecated [-Wdeprecated-declarations]
3278 | gtk_widget_set_size_request (GTK_WIDGET (dialog_window), w_width+100, gdk_screen_get_height (screen)/2);
| ^~~~~~~~~~~~~~~~~~~~~~~~~~~
In file included from /usr/include/gtk-3.0/gdk/gdkapplaunchcontext.h:31,
from /usr/include/gtk-3.0/gdk/gdk.h:32,
from /usr/include/gtk-3.0/gtk/gtk.h:30:
/usr/include/gtk-3.0/gdk/gdkscreen.h:60:14: note: declared here
60 | gint gdk_screen_get_height (GdkScreen *screen);
| ^~~~~~~~~~~~~~~~~~~~~
connection.c:3314:7: error: implicit declaration of function 'lterm_iteration'; did you mean 'gtk_main_iteration'? [-Wimplicit-function-declaration]
3314 | lterm_iteration ();
| ^~~~~~~~~~~~~~~
| gtk_main_iteration
connection.c:3064:10: warning: unused variable 'sel_name' [-Wunused-variable]
3064 | gchar *sel_name;
| ^~~~~~~~
connection.c:3063:8: warning: unused variable 'sel_port' [-Wunused-variable]
3063 | gint sel_port;
| ^~~~~~~~
connection.c:3062:21: warning: unused variable 'p_node' [-Wunused-variable]
3062 | struct GroupNode *p_node;
| ^~~~~~
connection.c:3061:20: warning: unused variable 'p_prot' [-Wunused-variable]
3061 | struct Protocol *p_prot;
| ^~~~~~
connection.c:3060:22: warning: unused variable 'p_conn_new' [-Wunused-variable]
3060 | struct Connection *p_conn_new;
| ^~~~~~~~~~
connection.c:3059:22: warning: unused variable 'p_conn_selected' [-Wunused-variable]
3059 | struct Connection *p_conn_selected;
| ^~~~~~~~~~~~~~~
connection.c:3055:7: warning: unused variable 'port' [-Wunused-variable]
3055 | int port;
| ^~~~
connection.c:3053:43: warning: unused variable 'port_tmp' [-Wunused-variable]
3053 | char name[64], host[128], protocol[64], port_tmp[16];
| ^~~~~~~~
connection.c:3053:29: warning: unused variable 'protocol' [-Wunused-variable]
3053 | char name[64], host[128], protocol[64], port_tmp[16];
| ^~~~~~~~
connection.c:3053:18: warning: unused variable 'host' [-Wunused-variable]
3053 | char name[64], host[128], protocol[64], port_tmp[16];
| ^~~~
connection.c:3053:8: warning: unused variable 'name' [-Wunused-variable]
3053 | char name[64], host[128], protocol[64], port_tmp[16];
| ^~~~
connection.c:3052:20: warning: unused variable 's_path' [-Wunused-variable]
3052 | char line[1024], s_path[16];
| ^~~~~~
connection.c:3052:8: warning: unused variable 'line' [-Wunused-variable]
3052 | char line[1024], s_path[16];
| ^~~~
connection.c:3051:9: warning: unused variable 'fp' [-Wunused-variable]
3051 | FILE *fp;
| ^~
connection.c:3049:12: warning: unused variable 'have_iter' [-Wunused-variable]
3049 | gboolean have_iter;
| ^~~~~~~~~
connection.c:3038:22: warning: unused variable 'column' [-Wunused-variable]
3038 | GtkTreeViewColumn *column;
| ^~~~~~
connection.c:3037:20: warning: unused variable 'cell' [-Wunused-variable]
3037 | GtkCellRenderer *cell;
| ^~~~
connection.c:3036:15: warning: unused variable 'iter' [-Wunused-variable]
3036 | GtkTreeIter iter;
| ^~~~
connection.c:3032:14: warning: unused variable 'vpaned' [-Wunused-variable]
3032 | GtkWidget *vpaned;
| ^~~~~~
connection.c: In function 'create_quick_launch_window':
connection.c:3389:3: warning: 'gtk_widget_modify_font' is deprecated: Use 'gtk_widget_override_font' instead [-Wdeprecated-declarations]
3389 | gtk_widget_modify_font (p_qlv->tree_view, font_desc);
| ^~~~~~~~~~~~~~~~~~~~~~
In file included from /usr/include/gtk-3.0/gtk/gtk.h:277:
/usr/include/gtk-3.0/gtk/deprecated/gtkstyle.h:769:13: note: declared here
769 | void gtk_widget_modify_font (GtkWidget *widget,
| ^~~~~~~~~~~~~~~~~~~~~~
connection.c: In function 'connection_import_file_chooser':
connection.c:3449:41: warning: 'GtkStock' is deprecated [-Wdeprecated-declarations]
3449 | GTK_STOCK_CANCEL, GTK_RESPONSE_CANCEL,
| ^~~~~~~~~~~~~~~~
connection.c:3450:41: warning: 'GtkStock' is deprecated [-Wdeprecated-declarations]
3450 | GTK_STOCK_OPEN, GTK_RESPONSE_ACCEPT,
| ^~~~~~~~~~~~~~
connection.c:3446:22: warning: unused variable 'p_conn' [-Wunused-variable]
3446 | struct Connection *p_conn;
| ^~~~~~
connection.c:3445:7: warning: unused variable 'err' [-Wunused-variable]
3445 | int err = 0;
| ^~~
connection.c: In function 'connection_import_MobaXterm':
connection.c:3586:9: error: implicit declaration of function 'list_get_nth' [-Wimplicit-function-declaration]
3586 | list_get_nth (line, 1, '=', conn.name);
| ^~~~~~~~~~~~
connection.c:3579:19: warning: unused variable 'sshId' [-Wunused-variable]
3579 | const int sshId = '0';
| ^~~~~
connection.c:3577:34: warning: variable 'pConn' set but not used [-Wunused-but-set-variable]
3577 | struct Connection conn, *pConn;
| ^~~~~
connection.c:3513:15: warning: unused variable 'err' [-Wunused-variable]
3513 | int result, err = 0;
| ^~~
connection.c: In function 'connection_import_Putty':
connection.c:3616:28: warning: unused variable 'pConn' [-Wunused-variable]
3616 | struct Connection conn, *pConn;
| ^~~~~
connection.c:3613:15: warning: unused variable 'err' [-Wunused-variable]
3613 | int result, err = 0, n = 0;
| ^~~
connection.c: In function 'connection_export_file_chooser':
connection.c:3705:41: warning: 'GtkStock' is deprecated [-Wdeprecated-declarations]
3705 | GTK_STOCK_CANCEL, GTK_RESPONSE_CANCEL,
| ^~~~~~~~~~~~~~~~
connection.c:3706:41: warning: 'GtkStock' is deprecated [-Wdeprecated-declarations]
3706 | GTK_STOCK_SAVE, GTK_RESPONSE_ACCEPT,
| ^~~~~~~~~~~~~~
connection.c: In function 'connection_export_CSV':
connection.c:3915:47: warning: unused variable 'template' [-Wunused-variable]
3915 | char filename[512], templateFilename[512], *template, *connectionEntry;
| ^~~~~~~~
connection.c:3915:23: warning: unused variable 'templateFilename' [-Wunused-variable]
3915 | char filename[512], templateFilename[512], *template, *connectionEntry;
| ^~~~~~~~~~~~~~~~
connection.c: At top level:
connection.c:2645:23: warning: 'row_targets' defined but not used [-Wunused-variable]
2645 | static GtkTargetEntry row_targets[] = {
| ^~~~~~~~~~~
make[2]: *** [Makefile:428: connection.o] Error 1
make[2]: Leaving directory '/usr/src/RPM/BUILD/lterm-1.5.1/src'
make[2]: Entering directory '/usr/src/RPM/BUILD/lterm-1.5.1/src'
x86_64-alt-linux-gcc -DLOCALEDIR=\"/usr/share/locale\" -DIMGDIR=\"/usr/share/lterm/img\" -DPKGDATADIR=\"/usr/share/lterm/data\" -DHAVE_CONFIG_H -I. -pipe -frecord-gcc-switches -Wall -g -O2 -flto=auto -fcommon -pthread -I/usr/include/gtk-3.0 -I/usr/include/gio-unix-2.0 -I/usr/include/pango-1.0 -I/usr/include/harfbuzz -I/usr/include/pango-1.0 -I/usr/include/atk-1.0 -I/usr/include/cairo -I/usr/include/freetype2 -I/usr/include/harfbuzz -I/usr/include/gdk-pixbuf-2.0 -I/usr/include/libpng16 -I/usr/include/glib-2.0 -I/usr/lib64/glib-2.0/include -pthread -I/usr/include/vte-2.91 -I/usr/include/gtk-3.0 -I/usr/include/gio-unix-2.0 -I/usr/include/pango-1.0 -I/usr/include/harfbuzz -I/usr/include/pango-1.0 -I/usr/include/atk-1.0 -I/usr/include/cairo -I/usr/include/freetype2 -I/usr/include/harfbuzz -I/usr/include/gdk-pixbuf-2.0 -I/usr/include/libpng16 -I/usr/include/glib-2.0 -I/usr/lib64/glib-2.0/include -c -o gui.o gui.c
In file included from gui.c:41:
utils.h:47:1: error: parameter names (without types) in function declaration [-Wdeclaration-missing-parameter-type]
47 | char *readFile (filename);
| ^~~~
gui.c: In function 'child_exit':
gui.c:540:9: error: implicit declaration of function 'wait' [-Wimplicit-function-declaration]
540 | pid = wait (&status);
| ^~~~
gui.c: In function 'tabResetFlag':
gui.c:606:16: warning: operation on 'pConn->flags' may be undefined [-Wsequence-point]
606 | pConn->flags = pConn->flags &= ~bitmask;
| ~~~~~~~~~~~~~^~~~~~~~~~~~~~~~~~~~~~~~~~
gui.c: In function 'query_value':
gui.c:666:3: warning: 'gtk_alignment_new' is deprecated [-Wdeprecated-declarations]
666 | l_align = gtk_alignment_new (0, 0, 0, 0);
| ^~~~~~~
In file included from /usr/include/gtk-3.0/gtk/gtk.h:255,
from gui.c:23:
/usr/include/gtk-3.0/gtk/deprecated/gtkalignment.h:79:12: note: declared here
79 | GtkWidget* gtk_alignment_new (gfloat xalign,
| ^~~~~~~~~~~~~~~~~
gui.c:703:7: warning: 'gdk_screen_get_width' is deprecated [-Wdeprecated-declarations]
703 | gtk_widget_set_size_request (GTK_WIDGET (dialog), gdk_screen_get_width (screen)/1.8, w_height);
| ^~~~~~~~~~~~~~~~~~~~~~~~~~~
In file included from /usr/include/gtk-3.0/gdk/gdkapplaunchcontext.h:31,
from /usr/include/gtk-3.0/gdk/gdk.h:32,
from /usr/include/gtk-3.0/gtk/gtk.h:30:
/usr/include/gtk-3.0/gdk/gdkscreen.h:58:14: note: declared here
58 | gint gdk_screen_get_width (GdkScreen *screen);
| ^~~~~~~~~~~~~~~~~~~~
gui.c: In function 'expand_args':
gui.c:819:23: error: implicit declaration of function 'conn_update_last_user' [-Wimplicit-function-declaration]
819 | if (conn_update_last_user (p_conn->name, p_conn->last_user))
| ^~~~~~~~~~~~~~~~~~~~~
gui.c: In function 'show_login_mask':
gui.c:946:1: warning: label 'run_dialog' defined but not used [-Wunused-label]
946 | run_dialog:
| ^~~~~~~~~~
gui.c:888:23: warning: unused variable 'i' [-Wunused-variable]
888 | int result, rc = 0, i;
| ^
gui.c: In function 'connection_tab_close':
gui.c:1049:14: warning: unused variable 'child' [-Wunused-variable]
1049 | GtkWidget *child;
| ^~~~~
gui.c: In function 'close_button_clicked_cb':
gui.c:1112:22: warning: unused variable 'can_close' [-Wunused-variable]
1112 | int page, retcode, can_close;
| ^~~~~~~~~
gui.c:1112:13: warning: unused variable 'retcode' [-Wunused-variable]
1112 | int page, retcode, can_close;
| ^~~~~~~
gui.c:1112:7: warning: unused variable 'page' [-Wunused-variable]
1112 | int page, retcode, can_close;
| ^~~~
gui.c: In function 'query_tooltip_cb':
gui.c:1148:5: warning: 'vte_terminal_match_check' is deprecated [-Wdeprecated-declarations]
1148 | g_match.matched_string = vte_terminal_match_check (VTE_TERMINAL (widget), col, row, &g_match.tag);
| ^~~~~~~
In file included from /usr/include/vte-2.91/vte/vte.h:38,
from gui.c:26:
/usr/include/vte-2.91/vte/vtedeprecated.h:62:7: note: declared here
62 | char *vte_terminal_match_check(VteTerminal *terminal,
| ^~~~~~~~~~~~~~~~~~~~~~~~
gui.c:1152:11: warning: suggest parentheses around assignment used as truth value [-Wparentheses]
1152 | if (p_conn = get_connection_by_host (g_match.matched_string))
| ^~~~~~
gui.c: In function 'connection_tab_new':
gui.c:1205:3: warning: 'vte_terminal_match_add_gregex' is deprecated [-Wdeprecated-declarations]
1205 | tag = vte_terminal_match_add_gregex (VTE_TERMINAL(connection_tab->vte), ip_regexpr, 0);
| ^~~
/usr/include/vte-2.91/vte/vtedeprecated.h:40:5: note: declared here
40 | int vte_terminal_match_add_gregex(VteTerminal *terminal,
| ^~~~~~~~~~~~~~~~~~~~~~~~~~~~~
gui.c:1206:3: warning: 'vte_terminal_match_set_cursor_type' is deprecated [-Wdeprecated-declarations]
1206 | vte_terminal_match_set_cursor_type (VTE_TERMINAL(connection_tab->vte), tag, GDK_HAND2);
| ^~~~~~~~~~~~~~~~~~~~~~~~~~~~~~~~~~
/usr/include/vte-2.91/vte/vtedeprecated.h:55:6: note: declared here
55 | void vte_terminal_match_set_cursor_type(VteTerminal *terminal,
| ^~~~~~~~~~~~~~~~~~~~~~~~~~~~~~~~~~
gui.c: In function 'connection_tab_add':
gui.c:1274:5: warning: 'gtk_image_new_from_stock' is deprecated: Use 'gtk_image_new_from_icon_name' instead [-Wdeprecated-declarations]
1274 | image_type = gtk_image_new_from_stock (MY_STOCK_TERMINAL, GTK_ICON_SIZE_MENU);
| ^~~~~~~~~~
In file included from /usr/include/gtk-3.0/gtk/gtkentry.h:42,
from /usr/include/gtk-3.0/gtk/gtktreeview.h:29,
from /usr/include/gtk-3.0/gtk/gtkcombobox.h:27,
from /usr/include/gtk-3.0/gtk/gtkappchooserbutton.h:29,
from /usr/include/gtk-3.0/gtk/gtk.h:42:
/usr/include/gtk-3.0/gtk/gtkimage.h:122:12: note: declared here
122 | GtkWidget* gtk_image_new_from_stock (const gchar *stock_id,
| ^~~~~~~~~~~~~~~~~~~~~~~~
gui.c:1232:7: warning: unused variable 'font_size' [-Wunused-variable]
1232 | int font_size;
| ^~~~~~~~~
gui.c:1230:11: warning: unused variable 'h' [-Wunused-variable]
1230 | gint w, h;
| ^
gui.c:1230:8: warning: unused variable 'w' [-Wunused-variable]
1230 | gint w, h;
| ^
gui.c: In function 'connection_tab_getcwd':
gui.c:1463:7: warning: 'vte_terminal_get_window_title' is deprecated [-Wdeprecated-declarations]
1463 | if (vte_terminal_get_window_title (VTE_TERMINAL(p_ct->vte)))
| ^~
/usr/include/vte-2.91/vte/vtedeprecated.h:217:13: note: declared here
217 | const char *vte_terminal_get_window_title(VteTerminal *terminal) _VTE_CXX_NOEXCEPT _VTE_GNUC_NONNULL(1);
| ^~~~~~~~~~~~~~~~~~~~~~~~~~~~~
gui.c:1464:9: warning: 'vte_terminal_get_window_title' is deprecated [-Wdeprecated-declarations]
1464 | strcpy (window_title, vte_terminal_get_window_title (VTE_TERMINAL(p_ct->vte)));
| ^~~~~~
/usr/include/vte-2.91/vte/vtedeprecated.h:217:13: note: declared here
217 | const char *vte_terminal_get_window_title(VteTerminal *terminal) _VTE_CXX_NOEXCEPT _VTE_GNUC_NONNULL(1);
| ^~~~~~~~~~~~~~~~~~~~~~~~~~~~~
gui.c:1473:11: warning: value computed is not used [-Wunused-value]
1473 | *pc ++;
| ^~~~~~
gui.c: In function 'connection_log_on_param':
gui.c:1500:7: error: implicit declaration of function 'connection_copy'; did you mean 'connection_init'? [-Wimplicit-function-declaration]
1500 | connection_copy (&p_connection_tab->connection, p_conn);
| ^~~~~~~~~~~~~~~
| connection_init
gui.c:1510:15: error: implicit declaration of function 'choose_manage_connection' [-Wimplicit-function-declaration]
1510 | retcode = choose_manage_connection (&p_connection_tab->connection);
| ^~~~~~~~~~~~~~~~~~~~~~~~
gui.c:1550:15: error: implicit declaration of function 'refresh_panel_history' [-Wimplicit-function-declaration]
1550 | refresh_panel_history ();
| ^~~~~~~~~~~~~~~~~~~~~
gui.c:1492:20: warning: unused variable 'p_prot' [-Wunused-variable]
1492 | struct Protocol *p_prot;
| ^~~~~~
gui.c: In function 'connection_duplicate':
gui.c:1613:8: warning: unused variable 'command' [-Wunused-variable]
1613 | char command[1024];
| ^~~~~~~
gui.c: In function 'connection_new_terminal_dir':
gui.c:1663:7: warning: unused variable 'rc' [-Wunused-variable]
1663 | int rc;
| ^~
gui.c:1659:20: warning: unused variable 'p_prot' [-Wunused-variable]
1659 | struct Protocol *p_prot;
| ^~~~~~
gui.c: In function 'application_quit':
gui.c:1727:10: warning: unused variable 'item' [-Wunused-variable]
1727 | GList *item;
| ^~~~
gui.c: In function 'open_recent_session_from_info':
gui.c:1798:8: warning: unused variable 's_tmp' [-Wunused-variable]
1798 | char s_tmp[256];
| ^~~~~
gui.c:1796:22: warning: unused variable 'p_conn' [-Wunused-variable]
1796 | struct Connection *p_conn;
| ^~~~~~
gui.c:1795:10: warning: unused variable 'item' [-Wunused-variable]
1795 | GList *item;
| ^~~~
gui.c: In function 'session_recent_cb':
gui.c:1815:22: warning: unused variable 'p_conn' [-Wunused-variable]
1815 | struct Connection *p_conn;
| ^~~~~~
gui.c:1814:10: warning: unused variable 'item' [-Wunused-variable]
1814 | GList *item;
| ^~~~
gui.c:1813:8: warning: unused variable 's_tmp' [-Wunused-variable]
1813 | char s_tmp[256];
| ^~~~~
gui.c:1812:7: warning: unused variable 'i' [-Wunused-variable]
1812 | int i;
| ^
gui.c: In function 'update_recent_sessions_menu':
gui.c:1914:5: warning: 'gtk_ui_manager_remove_ui' is deprecated [-Wdeprecated-declarations]
1914 | gtk_ui_manager_remove_ui (ui_manager, recents_menu_ui_id);
| ^~~~~~~~~~~~~~~~~~~~~~~~
In file included from /usr/include/gtk-3.0/gtk/gtk.h:284:
/usr/include/gtk-3.0/gtk/deprecated/gtkuimanager.h:179:16: note: declared here
179 | void gtk_ui_manager_remove_ui (GtkUIManager *manager,
| ^~~~~~~~~~~~~~~~~~~~~~~~
gui.c:1916:3: warning: 'gtk_action_group_list_actions' is deprecated [-Wdeprecated-declarations]
1916 | actions = gtk_action_group_list_actions (recents_action_group);
| ^~~~~~~
In file included from /usr/include/gtk-3.0/gtk/gtk.h:254:
/usr/include/gtk-3.0/gtk/deprecated/gtkactiongroup.h:198:17: note: declared here
198 | GList *gtk_action_group_list_actions (GtkActionGroup *action_group);
| ^~~~~~~~~~~~~~~~~~~~~~~~~~~~~
gui.c:1921:7: warning: 'gtk_action_group_remove_action' is deprecated [-Wdeprecated-declarations]
1921 | gtk_action_group_remove_action (recents_action_group, GTK_ACTION (l->data));
| ^~~~~~~~~~~~~~~~~~~~~~~~~~~~~~
/usr/include/gtk-3.0/gtk/deprecated/gtkactiongroup.h:207:17: note: declared here
207 | void gtk_action_group_remove_action (GtkActionGroup *action_group,
| ^~~~~~~~~~~~~~~~~~~~~~~~~~~~~~
gui.c:1928:3: warning: 'gtk_ui_manager_new_merge_id' is deprecated [-Wdeprecated-declarations]
1928 | recents_menu_ui_id = gtk_ui_manager_new_merge_id (ui_manager);
| ^~~~~~~~~~~~~~~~~~
/usr/include/gtk-3.0/gtk/deprecated/gtkuimanager.h:186:16: note: declared here
186 | guint gtk_ui_manager_new_merge_id (GtkUIManager *manager);
| ^~~~~~~~~~~~~~~~~~~~~~~~~~~
gui.c:1973:7: warning: 'gtk_action_new' is deprecated [-Wdeprecated-declarations]
1973 | action = gtk_action_new (action_name, label, NULL, NULL);
| ^~~~~~
In file included from /usr/include/gtk-3.0/gtk/deprecated/gtkactivatable.h:25,
from /usr/include/gtk-3.0/gtk/gtk.h:252:
/usr/include/gtk-3.0/gtk/deprecated/gtkaction.h:98:14: note: declared here
98 | GtkAction *gtk_action_new (const gchar *name,
| ^~~~~~~~~~~~~~
gui.c:1978:7: warning: 'gtk_action_group_add_action' is deprecated [-Wdeprecated-declarations]
1978 | gtk_action_group_add_action (recents_action_group, action);
| ^~~~~~~~~~~~~~~~~~~~~~~~~~~
/usr/include/gtk-3.0/gtk/deprecated/gtkactiongroup.h:200:17: note: declared here
200 | void gtk_action_group_add_action (GtkActionGroup *action_group,
| ^~~~~~~~~~~~~~~~~~~~~~~~~~~
gui.c:1981:7: warning: 'gtk_ui_manager_add_ui' is deprecated [-Wdeprecated-declarations]
1981 | gtk_ui_manager_add_ui (ui_manager,
| ^~~~~~~~~~~~~~~~~~~~~
/usr/include/gtk-3.0/gtk/deprecated/gtkuimanager.h:171:16: note: declared here
171 | void gtk_ui_manager_add_ui (GtkUIManager *manager,
| ^~~~~~~~~~~~~~~~~~~~~
gui.c:1961:12: warning: unused variable 's_tmp' [-Wunused-variable]
1961 | char s_tmp[256];
| ^~~~~
gui.c:1960:14: warning: unused variable 'location' [-Wunused-variable]
1960 | GFile *location;
| ^~~~~~~~
gui.c:1957:14: warning: unused variable 'tip' [-Wunused-variable]
1957 | gchar *tip;
| ^~~
gui.c:1956:14: warning: unused variable 'ruri' [-Wunused-variable]
1956 | gchar *ruri;
| ^~~~
gui.c:1955:14: warning: unused variable 'uri' [-Wunused-variable]
1955 | gchar *uri;
| ^~~
gui.c: In function 'add_recent_connection':
gui.c:2046:7: warning: unused variable 'found' [-Wunused-variable]
2046 | int found = 0;
| ^~~~~
gui.c:2042:22: warning: unused variable 'p_conn_recent' [-Wunused-variable]
2042 | struct Connection *p_conn_recent;
| ^~~~~~~~~~~~~
gui.c: In function 'recent_chooser_item_activated':
gui.c:2174:8: warning: unused variable 's_tmp' [-Wunused-variable]
2174 | char s_tmp[256];
| ^~~~~
gui.c:2173:8: warning: unused variable 'display_name' [-Wunused-variable]
2173 | char display_name[1024];
| ^~~~~~~~~~~~
gui.c:2172:22: warning: unused variable 'p_conn' [-Wunused-variable]
2172 | struct Connection *p_conn;
| ^~~~~~
gui.c:2170:10: warning: unused variable 'item' [-Wunused-variable]
2170 | GList *item;
| ^~~~
gui.c: In function 'setup_toolbar_connect_button':
gui.c:2230:3: warning: 'gtk_action_group_get_action' is deprecated [-Wdeprecated-declarations]
2230 | action = gtk_action_group_get_action (recents_action_group, "SessionRecent");
| ^~~~~~
/usr/include/gtk-3.0/gtk/deprecated/gtkactiongroup.h:195:17: note: declared here
195 | GtkAction *gtk_action_group_get_action (GtkActionGroup *action_group,
| ^~~~~~~~~~~~~~~~~~~~~~~~~~~
gui.c:2231:3: warning: 'gtk_activatable_set_related_action' is deprecated [-Wdeprecated-declarations]
2231 | gtk_activatable_set_related_action (GTK_ACTIVATABLE (connect_button), action);
| ^~~~~~~~~~~~~~~~~~~~~~~~~~~~~~~~~~
/usr/include/gtk-3.0/gtk/deprecated/gtkactivatable.h:80:12: note: declared here
80 | void gtk_activatable_set_related_action (GtkActivatable *activatable,
| ^~~~~~~~~~~~~~~~~~~~~~~~~~~~~~~~~~
gui.c: In function 'load_recent_connections':
gui.c:2244:22: warning: unused variable 'c' [-Wunused-variable]
2244 | struct Connection *c;
| ^
gui.c:2243:26: warning: unused variable 'cl' [-Wunused-variable]
2243 | struct Connection_List cl;
| ^~
gui.c:2242:10: warning: unused variable 'item' [-Wunused-variable]
2242 | GList *item;
| ^~~~
gui.c:2241:7: warning: unused variable 'rc' [-Wunused-variable]
2241 | int rc;
| ^~
gui.c: In function 'save_recent_connections':
gui.c:2302:10: warning: unused variable 'item' [-Wunused-variable]
2302 | GList *item;
| ^~~~
gui.c:2301:7: warning: unused variable 'i' [-Wunused-variable]
2301 | int i;
| ^
gui.c:2300:12: warning: variable 'rc' set but not used [-Wunused-but-set-variable]
2300 | int len, rc = 0;
| ^~
gui.c:2300:7: warning: unused variable 'len' [-Wunused-variable]
2300 | int len, rc = 0;
| ^~~
gui.c:2299:8: warning: unused variable 'name_tmp' [-Wunused-variable]
2299 | char name_tmp[256];
| ^~~~~~~~
gui.c:2298:9: warning: unused variable 'p_enc_b64' [-Wunused-variable]
2298 | char *p_enc_b64;
| ^~~~~~~~~
gui.c:2297:9: warning: unused variable 'p_enc' [-Wunused-variable]
2297 | char *p_enc;
| ^~~~~
gui.c:2296:26: warning: unused variable 'cl' [-Wunused-variable]
2296 | struct Connection_List cl;
| ^~
gui.c:2295:22: warning: unused variable 'p_conn' [-Wunused-variable]
2295 | struct Connection *p_conn;
| ^~~~~~
gui.c:2294:21: warning: unused variable 'conn' [-Wunused-variable]
2294 | struct Connection conn;
| ^~~~
gui.c: In function 'edit_copy':
gui.c:2389:13: warning: 'vte_terminal_copy_clipboard' is deprecated [-Wdeprecated-declarations]
2389 | vte_terminal_copy_clipboard (VTE_TERMINAL (p_current_connection_tab->vte));
| ^~~~~~~~~~~~~~~~~~~~~~~~~~~
/usr/include/vte-2.91/vte/vtedeprecated.h:109:6: note: declared here
109 | void vte_terminal_copy_clipboard(VteTerminal *terminal) _VTE_CXX_NOEXCEPT _VTE_GNUC_NONNULL(1);
| ^~~~~~~~~~~~~~~~~~~~~~~~~~~
gui.c: In function 'paste_host':
gui.c:2454:3: warning: 'gtk_action_get_name' is deprecated [-Wdeprecated-declarations]
2454 | gchar *name = (gchar *) gtk_action_get_name (GTK_ACTION (action));
| ^~~~~
/usr/include/gtk-3.0/gtk/deprecated/gtkaction.h:103:14: note: declared here
103 | const gchar* gtk_action_get_name (GtkAction *action);
| ^~~~~~~~~~~~~~~~~~~
gui.c: In function 'edit_find':
gui.c:2510:1: warning: label 'run_dialog' defined but not used [-Wunused-label]
2510 | run_dialog:
| ^~~~~~~~~~
gui.c:2468:23: warning: unused variable 'i' [-Wunused-variable]
2468 | int result, rc = 0, i;
| ^
gui.c: In function 'edit_current_profile':
gui.c:2549:7: warning: suggest parentheses around assignment used as truth value [-Wparentheses]
2549 | if (p_profile = profile_get_by_id (&g_profile_list, p_current_connection_tab->profile_id))
| ^~~~~~~~~
gui.c: At top level:
gui.c:2777:2: warning: "/*" within comment [-Wcomment]
2777 | \/*
gui.c: In function 'view_toolbar':
gui.c:2822:3: warning: 'gtk_ui_manager_get_widget' is deprecated [-Wdeprecated-declarations]
2822 | toggle = gtk_ui_manager_get_widget (ui_manager, N_("/MainMenu/ViewMenu/Toolbar"));
| ^~~~~~
/usr/include/gtk-3.0/gtk/deprecated/gtkuimanager.h:149:16: note: declared here
149 | GtkWidget *gtk_ui_manager_get_widget (GtkUIManager *manager,
| ^~~~~~~~~~~~~~~~~~~~~~~~~
gui.c: In function 'view_statusbar':
gui.c:2841:3: warning: 'gtk_ui_manager_get_widget' is deprecated [-Wdeprecated-declarations]
2841 | toggle = gtk_ui_manager_get_widget (ui_manager, N_("/MainMenu/ViewMenu/Statusbar"));
| ^~~~~~
/usr/include/gtk-3.0/gtk/deprecated/gtkuimanager.h:149:16: note: declared here
149 | GtkWidget *gtk_ui_manager_get_widget (GtkUIManager *manager,
| ^~~~~~~~~~~~~~~~~~~~~~~~~
gui.c: In function 'view_sidebar':
gui.c:2890:3: warning: 'gtk_ui_manager_get_widget' is deprecated [-Wdeprecated-declarations]
2890 | toggle = gtk_ui_manager_get_widget (ui_manager, N_("/MainMenu/ViewMenu/Sidebar"));
| ^~~~~~
/usr/include/gtk-3.0/gtk/deprecated/gtkuimanager.h:149:16: note: declared here
149 | GtkWidget *gtk_ui_manager_get_widget (GtkUIManager *manager,
| ^~~~~~~~~~~~~~~~~~~~~~~~~
gui.c: In function 'view_fullscreen':
gui.c:2900:3: warning: 'gtk_ui_manager_get_widget' is deprecated [-Wdeprecated-declarations]
2900 | toggle = gtk_ui_manager_get_widget (ui_manager, N_("/MainMenu/ViewMenu/Fullscreen"));
| ^~~~~~
/usr/include/gtk-3.0/gtk/deprecated/gtkuimanager.h:149:16: note: declared here
149 | GtkWidget *gtk_ui_manager_get_widget (GtkUIManager *manager,
| ^~~~~~~~~~~~~~~~~~~~~~~~~
gui.c:2898:14: warning: variable 'toggle' set but not used [-Wunused-but-set-variable]
2898 | GtkWidget *toggle;
| ^~~~~~
gui.c: In function 'terminal_detach':
gui.c:3018:3: error: implicit declaration of function 'lterm_iteration'; did you mean 'gtk_main_iteration'? [-Wimplicit-function-declaration]
3018 | lterm_iteration ();
| ^~~~~~~~~~~~~~~
| gtk_main_iteration
gui.c: In function 'terminal_attach_to_main':
gui.c:3058:3: warning: 'vte_terminal_get_window_title' is deprecated [-Wdeprecated-declarations]
3058 | log_write ("Attaching %s\n", vte_terminal_get_window_title (VTE_TERMINAL(connectionTab->vte)));
| ^~~~~~~~~
/usr/include/vte-2.91/vte/vtedeprecated.h:217:13: note: declared here
217 | const char *vte_terminal_get_window_title(VteTerminal *terminal) _VTE_CXX_NOEXCEPT _VTE_GNUC_NONNULL(1);
| ^~~~~~~~~~~~~~~~~~~~~~~~~~~~~
gui.c: In function 'terminal_toggled_cb':
gui.c:3178:16: warning: unused variable 'path' [-Wunused-variable]
3178 | GtkTreePath *path = gtk_tree_path_new_from_string (path_str);
| ^~~~
gui.c: In function 'terminal_cluster':
gui.c:3319:3: warning: 'gdk_screen_get_height' is deprecated [-Wdeprecated-declarations]
3319 | gtk_widget_set_size_request (GTK_WIDGET (dialog), w_width, gdk_screen_get_height (screen)/2);
| ^~~~~~~~~~~~~~~~~~~~~~~~~~~
/usr/include/gtk-3.0/gdk/gdkscreen.h:60:14: note: declared here
60 | gint gdk_screen_get_height (GdkScreen *screen);
| ^~~~~~~~~~~~~~~~~~~~~
gui.c:3231:17: warning: unused variable 'tree_model' [-Wunused-variable]
3231 | GtkTreeModel *tree_model;
| ^~~~~~~~~~
gui.c:3228:21: warning: unused variable 'select' [-Wunused-variable]
3228 | GtkTreeSelection *select;
| ^~~~~~
gui.c:3194:17: warning: unused variable 'tmp' [-Wunused-variable]
3194 | char ui[256], tmp[512];
| ^~~
gui.c:3192:26: warning: unused variable 'button_cancel' [-Wunused-variable]
3192 | GtkWidget *button_ok, *button_cancel;
| ^~~~~~~~~~~~~
gui.c:3192:14: warning: unused variable 'button_ok' [-Wunused-variable]
3192 | GtkWidget *button_ok, *button_cancel;
| ^~~~~~~~~
gui.c: In function 'sftp_upload_files':
gui.c:3420:11: warning: suggest parentheses around assignment used as truth value [-Wparentheses]
3420 | if (p_conn = cl_get_by_name (&conn_list, p_current_connection_tab->connection.name))
| ^~~~~~
gui.c:3403:1: warning: label 'l_upl_dialog' defined but not used [-Wunused-label]
3403 | l_upl_dialog:
| ^~~~~~~~~~~~
gui.c:3362:9: warning: unused variable 's_tmp' [-Wunused-variable]
3362 | char *s_tmp;
| ^~~~~
gui.c: In function 'sftp_download_files':
gui.c:3530:1: warning: label 'l_dwl_dialog' defined but not used [-Wunused-label]
3530 | l_dwl_dialog:
| ^~~~~~~~~~~~
gui.c:3487:23: warning: unused variable 'remote_directory' [-Wunused-variable]
3487 | char pattern[1024], remote_directory[1024] = "";
| ^~~~~~~~~~~~~~~~
gui.c:3487:8: warning: unused variable 'pattern' [-Wunused-variable]
3487 | char pattern[1024], remote_directory[1024] = "";
| ^~~~~~~
gui.c:3486:32: warning: unused variable 's_tmp' [-Wunused-variable]
3486 | char *local_directory=NULL, *s_tmp;
| ^~~~~
gui.c: In function 'go_to_url':
gui.c:3578:3: warning: 'gtk_show_uri' is deprecated: Use 'gtk_show_uri_on_window' instead [-Wdeprecated-declarations]
3578 | success = gtk_show_uri (NULL, url, GDK_CURRENT_TIME, &error);
| ^~~~~~~
In file included from /usr/include/gtk-3.0/gtk/gtk.h:200:
/usr/include/gtk-3.0/gtk/gtkshow.h:33:10: note: declared here
33 | gboolean gtk_show_uri (GdkScreen *screen,
| ^~~~~~~~~~~~
gui.c:3568:7: warning: variable 'exit_code' set but not used [-Wunused-but-set-variable]
3568 | int exit_code;
| ^~~~~~~~~
gui.c: In function 'Info':
gui.c:3665:3: error: implicit declaration of function 'get_system'; did you mean 'system'? [-Wimplicit-function-declaration]
3665 | get_system (sys);
| ^~~~~~~~~~
| system
gui.c:3628:9: warning: unused variable 'fp' [-Wunused-variable]
3628 | FILE *fp;
| ^~
gui.c:3627:27: warning: unused variable 'vbox_versions' [-Wunused-variable]
3627 | GtkWidget *hbox_title, *vbox_versions;
| ^~~~~~~~~~~~~
gui.c:3627:14: warning: unused variable 'hbox_title' [-Wunused-variable]
3627 | GtkWidget *hbox_title, *vbox_versions;
| ^~~~~~~~~~
gui.c:3625:18: warning: unused variable 'info' [-Wunused-variable]
3625 | struct utsname info;
| ^~~~
gui.c:3623:8: warning: unused variable 's' [-Wunused-variable]
3623 | char s[1024], text[1024];
| ^
gui.c: In function 'activate_radio_action':
gui.c:3819:3: warning: 'gtk_action_get_name' is deprecated [-Wdeprecated-declarations]
3819 | const gchar *name = gtk_action_get_name (GTK_ACTION (current));
| ^~~~~
/usr/include/gtk-3.0/gtk/deprecated/gtkaction.h:103:14: note: declared here
103 | const gchar* gtk_action_get_name (GtkAction *action);
| ^~~~~~~~~~~~~~~~~~~
gui.c:3821:3: warning: 'gtk_toggle_action_get_active' is deprecated [-Wdeprecated-declarations]
3821 | gboolean active = gtk_toggle_action_get_active (GTK_TOGGLE_ACTION (current));
| ^~~~~~~~
In file included from /usr/include/gtk-3.0/gtk/deprecated/gtkradioaction.h:36,
from /usr/include/gtk-3.0/gtk/gtk.h:272:
/usr/include/gtk-3.0/gtk/deprecated/gtktoggleaction.h:85:18: note: declared here
85 | gboolean gtk_toggle_action_get_active (GtkToggleAction *action);
| ^~~~~~~~~~~~~~~~~~~~~~~~~~~~
gui.c:3822:3: warning: 'gtk_radio_action_get_current_value' is deprecated [-Wdeprecated-declarations]
3822 | gint value = gtk_radio_action_get_current_value (GTK_RADIO_ACTION (current));
| ^~~~
/usr/include/gtk-3.0/gtk/deprecated/gtkradioaction.h:89:17: note: declared here
89 | gint gtk_radio_action_get_current_value (GtkRadioAction *action);
| ^~~~~~~~~~~~~~~~~~~~~~~~~~~~~~~~~~
gui.c:3821:12: warning: unused variable 'active' [-Wunused-variable]
3821 | gboolean active = gtk_toggle_action_get_active (GTK_TOGGLE_ACTION (current));
| ^~~~~~
gui.c:3820:16: warning: unused variable 'typename' [-Wunused-variable]
3820 | const gchar *typename = G_OBJECT_TYPE_NAME (GTK_ACTION (current));
| ^~~~~~~~
gui.c:3819:16: warning: unused variable 'name' [-Wunused-variable]
3819 | const gchar *name = gtk_action_get_name (GTK_ACTION (current));
| ^~~~
gui.c: In function 'profile_radio_action_cb':
gui.c:3837:3: warning: 'gtk_action_get_name' is deprecated [-Wdeprecated-declarations]
3837 | const gchar *name = gtk_action_get_name (GTK_ACTION (current));
| ^~~~~
/usr/include/gtk-3.0/gtk/deprecated/gtkaction.h:103:14: note: declared here
103 | const gchar* gtk_action_get_name (GtkAction *action);
| ^~~~~~~~~~~~~~~~~~~
gui.c:3838:3: warning: 'gtk_toggle_action_get_active' is deprecated [-Wdeprecated-declarations]
3838 | gboolean active = gtk_toggle_action_get_active (GTK_TOGGLE_ACTION (current));
| ^~~~~~~~
/usr/include/gtk-3.0/gtk/deprecated/gtktoggleaction.h:85:18: note: declared here
85 | gboolean gtk_toggle_action_get_active (GtkToggleAction *action);
| ^~~~~~~~~~~~~~~~~~~~~~~~~~~~
gui.c:3839:3: warning: 'gtk_radio_action_get_current_value' is deprecated [-Wdeprecated-declarations]
3839 | gint value = gtk_radio_action_get_current_value (GTK_RADIO_ACTION (current));
| ^~~~
/usr/include/gtk-3.0/gtk/deprecated/gtkradioaction.h:89:17: note: declared here
89 | gint gtk_radio_action_get_current_value (GtkRadioAction *action);
| ^~~~~~~~~~~~~~~~~~~~~~~~~~~~~~~~~~
gui.c:3839:8: warning: unused variable 'value' [-Wunused-variable]
3839 | gint value = gtk_radio_action_get_current_value (GTK_RADIO_ACTION (current));
| ^~~~~
gui.c:3838:12: warning: unused variable 'active' [-Wunused-variable]
3838 | gboolean active = gtk_toggle_action_get_active (GTK_TOGGLE_ACTION (current));
| ^~~~~~
gui.c: In function 'add_stock_icon':
gui.c:3850:3: warning: 'gtk_icon_source_new' is deprecated [-Wdeprecated-declarations]
3850 | GtkIconSource *source = gtk_icon_source_new ();
| ^~~~~~~~~~~~~
In file included from /usr/include/gtk-3.0/gtk/gtkstyleprovider.h:27,
from /usr/include/gtk-3.0/gtk/gtkstylecontext.h:27,
from /usr/include/gtk-3.0/gtk/gtkicontheme.h:27,
from /usr/include/gtk-3.0/gtk/gtk.h:127:
/usr/include/gtk-3.0/gtk/deprecated/gtkiconfactory.h:170:16: note: declared here
170 | GtkIconSource* gtk_icon_source_new (void);
| ^~~~~~~~~~~~~~~~~~~
gui.c:3851:3: warning: 'gtk_icon_set_new' is deprecated [-Wdeprecated-declarations]
3851 | GtkIconSet *set = gtk_icon_set_new ();
| ^~~~~~~~~~
/usr/include/gtk-3.0/gtk/deprecated/gtkiconfactory.h:138:13: note: declared here
138 | GtkIconSet* gtk_icon_set_new (void);
| ^~~~~~~~~~~~~~~~
gui.c:3853:3: warning: 'gtk_icon_source_set_filename' is deprecated [-Wdeprecated-declarations]
3853 | gtk_icon_source_set_filename (source, location);
| ^~~~~~~~~~~~~~~~~~~~~~~~~~~~
/usr/include/gtk-3.0/gtk/deprecated/gtkiconfactory.h:177:16: note: declared here
177 | void gtk_icon_source_set_filename (GtkIconSource *source,
| ^~~~~~~~~~~~~~~~~~~~~~~~~~~~
gui.c:3854:3: warning: 'gtk_icon_set_add_source' is deprecated [-Wdeprecated-declarations]
3854 | gtk_icon_set_add_source (set, source);
| ^~~~~~~~~~~~~~~~~~~~~~~
/usr/include/gtk-3.0/gtk/deprecated/gtkiconfactory.h:159:16: note: declared here
159 | void gtk_icon_set_add_source (GtkIconSet *icon_set,
| ^~~~~~~~~~~~~~~~~~~~~~~
gui.c:3855:3: warning: 'gtk_icon_factory_add' is deprecated [-Wdeprecated-declarations]
3855 | gtk_icon_factory_add (factory, stock_id, set);
| ^~~~~~~~~~~~~~~~~~~~
/usr/include/gtk-3.0/gtk/deprecated/gtkiconfactory.h:82:17: note: declared here
82 | void gtk_icon_factory_add (GtkIconFactory *factory,
| ^~~~~~~~~~~~~~~~~~~~
gui.c: In function 'create_stock_objects':
gui.c:3863:3: warning: 'gtk_icon_factory_new' is deprecated [-Wdeprecated-declarations]
3863 | factory = gtk_icon_factory_new ();
| ^~~~~~~
/usr/include/gtk-3.0/gtk/deprecated/gtkiconfactory.h:80:17: note: declared here
80 | GtkIconFactory* gtk_icon_factory_new (void);
| ^~~~~~~~~~~~~~~~~~~~
gui.c:3886:3: warning: 'gtk_icon_factory_add_default' is deprecated [-Wdeprecated-declarations]
3886 | gtk_icon_factory_add_default (factory);
| ^~~~~~~~~~~~~~~~~~~~~~~~~~~~
/usr/include/gtk-3.0/gtk/deprecated/gtkiconfactory.h:92:13: note: declared here
92 | void gtk_icon_factory_add_default (GtkIconFactory *factory);
| ^~~~~~~~~~~~~~~~~~~~~~~~~~~~
gui.c: In function 'refresh_profile_menu':
gui.c:3947:5: warning: 'gtk_ui_manager_remove_ui' is deprecated [-Wdeprecated-declarations]
3947 | gtk_ui_manager_remove_ui (ui_manager, profile_menu_ui_id);
| ^~~~~~~~~~~~~~~~~~~~~~~~
/usr/include/gtk-3.0/gtk/deprecated/gtkuimanager.h:179:16: note: declared here
179 | void gtk_ui_manager_remove_ui (GtkUIManager *manager,
| ^~~~~~~~~~~~~~~~~~~~~~~~
gui.c:3949:3: warning: 'gtk_action_group_list_actions' is deprecated [-Wdeprecated-declarations]
3949 | actions = gtk_action_group_list_actions (profile_action_group);
| ^~~~~~~
/usr/include/gtk-3.0/gtk/deprecated/gtkactiongroup.h:198:17: note: declared here
198 | GList *gtk_action_group_list_actions (GtkActionGroup *action_group);
| ^~~~~~~~~~~~~~~~~~~~~~~~~~~~~
gui.c:3954:7: warning: 'gtk_action_group_remove_action' is deprecated [-Wdeprecated-declarations]
3954 | gtk_action_group_remove_action (profile_action_group, GTK_ACTION (l->data));
| ^~~~~~~~~~~~~~~~~~~~~~~~~~~~~~
/usr/include/gtk-3.0/gtk/deprecated/gtkactiongroup.h:207:17: note: declared here
207 | void gtk_action_group_remove_action (GtkActionGroup *action_group,
| ^~~~~~~~~~~~~~~~~~~~~~~~~~~~~~
gui.c:3990:3: warning: 'gtk_action_group_add_radio_actions' is deprecated [-Wdeprecated-declarations]
3990 | gtk_action_group_add_radio_actions (profile_action_group, radio_enc_entries, G_N_ELEMENTS (radio_enc_entries), 1,
| ^~~~~~~~~~~~~~~~~~~~~~~~~~~~~~~~~~
/usr/include/gtk-3.0/gtk/deprecated/gtkactiongroup.h:220:17: note: declared here
220 | void gtk_action_group_add_radio_actions (GtkActionGroup *action_group,
| ^~~~~~~~~~~~~~~~~~~~~~~~~~~~~~~~~~
gui.c:3993:3: warning: 'gtk_ui_manager_add_ui_from_string' is deprecated [-Wdeprecated-declarations]
3993 | profile_menu_ui_id = gtk_ui_manager_add_ui_from_string (ui_manager, enc_desc, -1, NULL);
| ^~~~~~~~~~~~~~~~~~
/usr/include/gtk-3.0/gtk/deprecated/gtkuimanager.h:158:16: note: declared here
158 | guint gtk_ui_manager_add_ui_from_string (GtkUIManager *manager,
| ^~~~~~~~~~~~~~~~~~~~~~~~~~~~~~~~~
gui.c:3944:14: warning: unused variable 'action' [-Wunused-variable]
3944 | GtkAction *action;
| ^~~~~~
gui.c:3943:24: warning: unused variable 'items' [-Wunused-variable]
3943 | GList *actions, *l, *items;
| ^~~~~
gui.c: In function 'get_main_menu':
gui.c:4035:3: warning: 'gtk_action_group_new' is deprecated [-Wdeprecated-declarations]
4035 | action_group = gtk_action_group_new ("MenuActions");
| ^~~~~~~~~~~~
/usr/include/gtk-3.0/gtk/deprecated/gtkactiongroup.h:175:17: note: declared here
175 | GtkActionGroup *gtk_action_group_new (const gchar *name);
| ^~~~~~~~~~~~~~~~~~~~
gui.c:4036:3: warning: 'gtk_action_group_add_actions' is deprecated [-Wdeprecated-declarations]
4036 | gtk_action_group_add_actions (action_group, main_menu_items, G_N_ELEMENTS (main_menu_items), NULL);
| ^~~~~~~~~~~~~~~~~~~~~~~~~~~~
/usr/include/gtk-3.0/gtk/deprecated/gtkactiongroup.h:210:17: note: declared here
210 | void gtk_action_group_add_actions (GtkActionGroup *action_group,
| ^~~~~~~~~~~~~~~~~~~~~~~~~~~~
gui.c:4037:3: warning: 'gtk_action_group_add_toggle_actions' is deprecated [-Wdeprecated-declarations]
4037 | gtk_action_group_add_toggle_actions (action_group, toggle_entries, G_N_ELEMENTS (toggle_entries), NULL);
| ^~~~~~~~~~~~~~~~~~~~~~~~~~~~~~~~~~~
/usr/include/gtk-3.0/gtk/deprecated/gtkactiongroup.h:215:17: note: declared here
215 | void gtk_action_group_add_toggle_actions (GtkActionGroup *action_group,
| ^~~~~~~~~~~~~~~~~~~~~~~~~~~~~~~~~~~
gui.c:4038:3: warning: 'gtk_action_group_add_radio_actions' is deprecated [-Wdeprecated-declarations]
4038 | gtk_action_group_add_radio_actions (action_group, radio_enc_entries, G_N_ELEMENTS (radio_enc_entries), 1, G_CALLBACK (activate_radio_action), NULL);
| ^~~~~~~~~~~~~~~~~~~~~~~~~~~~~~~~~~
/usr/include/gtk-3.0/gtk/deprecated/gtkactiongroup.h:220:17: note: declared here
220 | void gtk_action_group_add_radio_actions (GtkActionGroup *action_group,
| ^~~~~~~~~~~~~~~~~~~~~~~~~~~~~~~~~~
gui.c:4040:3: warning: 'gtk_ui_manager_new' is deprecated [-Wdeprecated-declarations]
4040 | ui_manager = gtk_ui_manager_new ();
| ^~~~~~~~~~
/usr/include/gtk-3.0/gtk/deprecated/gtkuimanager.h:130:16: note: declared here
130 | GtkUIManager *gtk_ui_manager_new (void);
| ^~~~~~~~~~~~~~~~~~
gui.c:4041:3: warning: 'gtk_ui_manager_insert_action_group' is deprecated [-Wdeprecated-declarations]
4041 | gtk_ui_manager_insert_action_group (ui_manager, action_group, 0);
| ^~~~~~~~~~~~~~~~~~~~~~~~~~~~~~~~~~
/usr/include/gtk-3.0/gtk/deprecated/gtkuimanager.h:138:16: note: declared here
138 | void gtk_ui_manager_insert_action_group (GtkUIManager *manager,
| ^~~~~~~~~~~~~~~~~~~~~~~~~~~~~~~~~~
gui.c:4043:3: warning: 'gtk_ui_manager_get_accel_group' is deprecated [-Wdeprecated-declarations]
4043 | accel_group = gtk_ui_manager_get_accel_group (ui_manager);
| ^~~~~~~~~~~
/usr/include/gtk-3.0/gtk/deprecated/gtkuimanager.h:147:16: note: declared here
147 | GtkAccelGroup *gtk_ui_manager_get_accel_group (GtkUIManager *manager);
| ^~~~~~~~~~~~~~~~~~~~~~~~~~~~~~
gui.c:4046:3: warning: 'gtk_ui_manager_add_ui_from_string' is deprecated [-Wdeprecated-declarations]
4046 | gtk_ui_manager_add_ui_from_string (ui_manager, ui_main_desc, -1, NULL);
| ^~~~~~~~~~~~~~~~~~~~~~~~~~~~~~~~~
/usr/include/gtk-3.0/gtk/deprecated/gtkuimanager.h:158:16: note: declared here
158 | guint gtk_ui_manager_add_ui_from_string (GtkUIManager *manager,
| ^~~~~~~~~~~~~~~~~~~~~~~~~~~~~~~~~
gui.c:4047:3: warning: 'gtk_ui_manager_add_ui_from_string' is deprecated [-Wdeprecated-declarations]
4047 | gtk_ui_manager_add_ui_from_string (ui_manager, enc_desc, -1, NULL);
| ^~~~~~~~~~~~~~~~~~~~~~~~~~~~~~~~~
/usr/include/gtk-3.0/gtk/deprecated/gtkuimanager.h:158:16: note: declared here
158 | guint gtk_ui_manager_add_ui_from_string (GtkUIManager *manager,
| ^~~~~~~~~~~~~~~~~~~~~~~~~~~~~~~~~
gui.c:4050:3: warning: 'gtk_ui_manager_get_widget' is deprecated [-Wdeprecated-declarations]
4050 | menubar = gtk_ui_manager_get_widget (ui_manager, "/MainMenu");
| ^~~~~~~
/usr/include/gtk-3.0/gtk/deprecated/gtkuimanager.h:149:16: note: declared here
149 | GtkWidget *gtk_ui_manager_get_widget (GtkUIManager *manager,
| ^~~~~~~~~~~~~~~~~~~~~~~~~
gui.c:4068:3: warning: 'gtk_action_group_new' is deprecated [-Wdeprecated-declarations]
4068 | recents_action_group = gtk_action_group_new ("SessionRecent");
| ^~~~~~~~~~~~~~~~~~~~
/usr/include/gtk-3.0/gtk/deprecated/gtkactiongroup.h:175:17: note: declared here
175 | GtkActionGroup *gtk_action_group_new (const gchar *name);
| ^~~~~~~~~~~~~~~~~~~~
gui.c:4069:3: warning: 'gtk_action_group_set_translation_domain' is deprecated [-Wdeprecated-declarations]
4069 | gtk_action_group_set_translation_domain (recents_action_group, NULL);
| ^~~~~~~~~~~~~~~~~~~~~~~~~~~~~~~~~~~~~~~
/usr/include/gtk-3.0/gtk/deprecated/gtkactiongroup.h:252:17: note: declared here
252 | void gtk_action_group_set_translation_domain (GtkActionGroup *action_group,
| ^~~~~~~~~~~~~~~~~~~~~~~~~~~~~~~~~~~~~~~
gui.c:4070:3: warning: 'gtk_ui_manager_insert_action_group' is deprecated [-Wdeprecated-declarations]
4070 | gtk_ui_manager_insert_action_group (ui_manager, recents_action_group, 0);
| ^~~~~~~~~~~~~~~~~~~~~~~~~~~~~~~~~~
/usr/include/gtk-3.0/gtk/deprecated/gtkuimanager.h:138:16: note: declared here
138 | void gtk_ui_manager_insert_action_group (GtkUIManager *manager,
| ^~~~~~~~~~~~~~~~~~~~~~~~~~~~~~~~~~
gui.c:4074:3: warning: 'gtk_action_group_new' is deprecated [-Wdeprecated-declarations]
4074 | profile_action_group = gtk_action_group_new ("ProfileActions");
| ^~~~~~~~~~~~~~~~~~~~
/usr/include/gtk-3.0/gtk/deprecated/gtkactiongroup.h:175:17: note: declared here
175 | GtkActionGroup *gtk_action_group_new (const gchar *name);
| ^~~~~~~~~~~~~~~~~~~~
gui.c:4075:3: warning: 'gtk_action_group_set_translation_domain' is deprecated [-Wdeprecated-declarations]
4075 | gtk_action_group_set_translation_domain (profile_action_group, NULL);
| ^~~~~~~~~~~~~~~~~~~~~~~~~~~~~~~~~~~~~~~
/usr/include/gtk-3.0/gtk/deprecated/gtkactiongroup.h:252:17: note: declared here
252 | void gtk_action_group_set_translation_domain (GtkActionGroup *action_group,
| ^~~~~~~~~~~~~~~~~~~~~~~~~~~~~~~~~~~~~~~
gui.c:4076:3: warning: 'gtk_ui_manager_insert_action_group' is deprecated [-Wdeprecated-declarations]
4076 | gtk_ui_manager_insert_action_group (ui_manager, profile_action_group, 0);
| ^~~~~~~~~~~~~~~~~~~~~~~~~~~~~~~~~~
/usr/include/gtk-3.0/gtk/deprecated/gtkuimanager.h:138:16: note: declared here
138 | void gtk_ui_manager_insert_action_group (GtkUIManager *manager,
| ^~~~~~~~~~~~~~~~~~~~~~~~~~~~~~~~~~
gui.c:4003:8: warning: unused variable 'recent_connections_desc' [-Wunused-variable]
4003 | char recent_connections_desc[10000];
| ^~~~~~~~~~~~~~~~~~~~~~~
gui.c:4000:21: warning: unused variable 'recent_manager' [-Wunused-variable]
4000 | GtkRecentManager *recent_manager;
| ^~~~~~~~~~~~~~
gui.c: In function 'completion_match_selected_cb':
gui.c:4135:3: error: implicit declaration of function 'open_connection'; did you mean 'get_connection'? [-Wimplicit-function-declaration]
4135 | open_connection (connection_string);
| ^~~~~~~~~~~~~~~
| get_connection
gui.c:4137:3: error: implicit declaration of function 'search_entry_focus_out_event_cb' [-Wimplicit-function-declaration]
4137 | search_entry_focus_out_event_cb (search_entry, NULL, NULL);
| ^~~~~~~~~~~~~~~~~~~~~~~~~~~~~~~
gui.c: In function 'search_entry_focus_in_event_cb':
gui.c:4175:3: warning: 'gtk_widget_override_color' is deprecated [-Wdeprecated-declarations]
4175 | gtk_widget_override_color (search_entry, GTK_STATE_NORMAL, NULL);
| ^~~~~~~~~~~~~~~~~~~~~~~~~
In file included from /usr/include/gtk-3.0/gtk/gtkapplication.h:27,
from /usr/include/gtk-3.0/gtk/gtkwindow.h:33,
from /usr/include/gtk-3.0/gtk/gtkdialog.h:32,
from /usr/include/gtk-3.0/gtk/gtkaboutdialog.h:30,
from /usr/include/gtk-3.0/gtk/gtk.h:31:
/usr/include/gtk-3.0/gtk/gtkwidget.h:1144:14: note: declared here
1144 | void gtk_widget_override_color (GtkWidget *widget,
| ^~~~~~~~~~~~~~~~~~~~~~~~~
gui.c: In function 'search_entry_focus_out_event_cb':
gui.c:4195:3: warning: 'gtk_widget_override_color' is deprecated [-Wdeprecated-declarations]
4195 | gtk_widget_override_color (search_entry, GTK_STATE_NORMAL, &GRAY_COLOR);
| ^~~~~~~~~~~~~~~~~~~~~~~~~
/usr/include/gtk-3.0/gtk/gtkwidget.h:1144:14: note: declared here
1144 | void gtk_widget_override_color (GtkWidget *widget,
| ^~~~~~~~~~~~~~~~~~~~~~~~~
gui.c: In function 'refresh_search_completion':
gui.c:4245:10: warning: suggest parentheses around assignment used as truth value [-Wparentheses]
4245 | while (p_conn = cl_get_by_index (/*cl_get_current ()*/ &conn_list, i))
| ^~~~~~
gui.c: In function 'add_toolbar':
gui.c:4268:3: warning: 'gtk_ui_manager_get_widget' is deprecated [-Wdeprecated-declarations]
4268 | main_toolbar = gtk_ui_manager_get_widget (ui_manager, N_("/MainToolbar"));
| ^~~~~~~~~~~~
/usr/include/gtk-3.0/gtk/deprecated/gtkuimanager.h:149:16: note: declared here
149 | GtkWidget *gtk_ui_manager_get_widget (GtkUIManager *manager,
| ^~~~~~~~~~~~~~~~~~~~~~~~~
gui.c:4277:3: warning: 'gtk_entry_set_icon_from_stock' is deprecated: Use 'gtk_entry_set_icon_from_icon_name' instead [-Wdeprecated-declarations]
4277 | gtk_entry_set_icon_from_stock (GTK_ENTRY(search_entry), GTK_ENTRY_ICON_SECONDARY, "edit-find");
| ^~~~~~~~~~~~~~~~~~~~~~~~~~~~~
/usr/include/gtk-3.0/gtk/gtkentry.h:320:16: note: declared here
320 | void gtk_entry_set_icon_from_stock (GtkEntry *entry,
| ^~~~~~~~~~~~~~~~~~~~~~~~~~~~~
gui.c:4299:7: warning: 'gtk_ui_manager_get_widget' is deprecated [-Wdeprecated-declarations]
4299 | GtkWidget *toggle = gtk_ui_manager_get_widget (ui_manager, N_("/MainMenu/ViewMenu/Toolbar"));
| ^~~~~~~~~
/usr/include/gtk-3.0/gtk/deprecated/gtkuimanager.h:149:16: note: declared here
149 | GtkWidget *gtk_ui_manager_get_widget (GtkUIManager *manager,
| ^~~~~~~~~~~~~~~~~~~~~~~~~
gui.c: In function 'create_statusbar':
gui.c:4355:7: warning: 'gtk_ui_manager_get_widget' is deprecated [-Wdeprecated-declarations]
4355 | GtkWidget *toggle = gtk_ui_manager_get_widget (ui_manager, N_("/MainMenu/ViewMenu/Statusbar"));
| ^~~~~~~~~
/usr/include/gtk-3.0/gtk/deprecated/gtkuimanager.h:149:16: note: declared here
149 | GtkWidget *gtk_ui_manager_get_widget (GtkUIManager *manager,
| ^~~~~~~~~~~~~~~~~~~~~~~~~
gui.c: In function 'statusbar_push':
gui.c:4399:8: warning: unused variable 'result' [-Wunused-variable]
4399 | gint result;
| ^~~~~~
gui.c: In function 'statusbar_msg':
gui.c:4430:8: warning: unused variable 'result' [-Wunused-variable]
4430 | gint result;
| ^~~~~~
gui.c: In function 'update_statusbar':
gui.c:4476:11: warning: 'vte_terminal_get_encoding' is deprecated [-Wdeprecated-declarations]
4476 | strcpy (encoding, vte_terminal_get_encoding (VTE_TERMINAL (p_current_connection_tab->vte)));
| ^~~~~~
/usr/include/vte-2.91/vte/vtedeprecated.h:139:13: note: declared here
139 | const char *vte_terminal_get_encoding(VteTerminal *terminal) _VTE_CXX_NOEXCEPT _VTE_GNUC_NONNULL(1);
| ^~~~~~~~~~~~~~~~~~~~~~~~~
gui.c: In function 'hyperlink_add_host':
gui.c:4603:21: warning: variable 'p_node' set but not used [-Wunused-but-set-variable]
4603 | struct GroupNode *p_node;
| ^~~~~~
gui.c: In function 'terminal_popup_menu':
gui.c:4633:12: error: implicit declaration of function 'count_current_connections'; did you mean 'load_recent_connections'? [-Wimplicit-function-declaration]
4633 | n_conn = count_current_connections ();
| ^~~~~~~~~~~~~~~~~~~~~~~~~
| load_recent_connections
gui.c:4698:3: warning: 'gtk_action_group_new' is deprecated [-Wdeprecated-declarations]
4698 | action_group = gtk_action_group_new ("TermPopupActions");
| ^~~~~~~~~~~~
/usr/include/gtk-3.0/gtk/deprecated/gtkactiongroup.h:175:17: note: declared here
175 | GtkActionGroup *gtk_action_group_new (const gchar *name);
| ^~~~~~~~~~~~~~~~~~~~
gui.c:4699:3: warning: 'gtk_action_group_add_actions' is deprecated [-Wdeprecated-declarations]
4699 | gtk_action_group_add_actions (action_group, popup_menu_items, G_N_ELEMENTS (popup_menu_items), NULL);
| ^~~~~~~~~~~~~~~~~~~~~~~~~~~~
/usr/include/gtk-3.0/gtk/deprecated/gtkactiongroup.h:210:17: note: declared here
210 | void gtk_action_group_add_actions (GtkActionGroup *action_group,
| ^~~~~~~~~~~~~~~~~~~~~~~~~~~~
gui.c:4700:3: warning: 'gtk_action_group_add_actions' is deprecated [-Wdeprecated-declarations]
4700 | gtk_action_group_add_actions (action_group, conn_entries, G_N_ELEMENTS (conn_entries), NULL);
| ^~~~~~~~~~~~~~~~~~~~~~~~~~~~
/usr/include/gtk-3.0/gtk/deprecated/gtkactiongroup.h:210:17: note: declared here
210 | void gtk_action_group_add_actions (GtkActionGroup *action_group,
| ^~~~~~~~~~~~~~~~~~~~~~~~~~~~
gui.c:4702:3: warning: 'gtk_ui_manager_new' is deprecated [-Wdeprecated-declarations]
4702 | ui_manager = gtk_ui_manager_new ();
| ^~~~~~~~~~
/usr/include/gtk-3.0/gtk/deprecated/gtkuimanager.h:130:16: note: declared here
130 | GtkUIManager *gtk_ui_manager_new (void);
| ^~~~~~~~~~~~~~~~~~
gui.c:4703:3: warning: 'gtk_ui_manager_insert_action_group' is deprecated [-Wdeprecated-declarations]
4703 | gtk_ui_manager_insert_action_group (ui_manager, action_group, 0);
| ^~~~~~~~~~~~~~~~~~~~~~~~~~~~~~~~~~
/usr/include/gtk-3.0/gtk/deprecated/gtkuimanager.h:138:16: note: declared here
138 | void gtk_ui_manager_insert_action_group (GtkUIManager *manager,
| ^~~~~~~~~~~~~~~~~~~~~~~~~~~~~~~~~~
gui.c:4708:5: warning: 'gtk_ui_manager_add_ui_from_string' is deprecated [-Wdeprecated-declarations]
4708 | gtk_ui_manager_add_ui_from_string (ui_manager, ip_desc, -1, NULL);
| ^~~~~~~~~~~~~~~~~~~~~~~~~~~~~~~~~
/usr/include/gtk-3.0/gtk/deprecated/gtkuimanager.h:158:16: note: declared here
158 | guint gtk_ui_manager_add_ui_from_string (GtkUIManager *manager,
| ^~~~~~~~~~~~~~~~~~~~~~~~~~~~~~~~~
gui.c:4710:3: warning: 'gtk_ui_manager_add_ui_from_string' is deprecated [-Wdeprecated-declarations]
4710 | gtk_ui_manager_add_ui_from_string (ui_manager, ui_popup_desc, -1, NULL);
| ^~~~~~~~~~~~~~~~~~~~~~~~~~~~~~~~~
/usr/include/gtk-3.0/gtk/deprecated/gtkuimanager.h:158:16: note: declared here
158 | guint gtk_ui_manager_add_ui_from_string (GtkUIManager *manager,
| ^~~~~~~~~~~~~~~~~~~~~~~~~~~~~~~~~
gui.c:4711:3: warning: 'gtk_ui_manager_add_ui_from_string' is deprecated [-Wdeprecated-declarations]
4711 | gtk_ui_manager_add_ui_from_string (ui_manager, conn_desc, -1, NULL);
| ^~~~~~~~~~~~~~~~~~~~~~~~~~~~~~~~~
/usr/include/gtk-3.0/gtk/deprecated/gtkuimanager.h:158:16: note: declared here
158 | guint gtk_ui_manager_add_ui_from_string (GtkUIManager *manager,
| ^~~~~~~~~~~~~~~~~~~~~~~~~~~~~~~~~
gui.c:4714:3: warning: 'gtk_ui_manager_get_widget' is deprecated [-Wdeprecated-declarations]
4714 | popup = gtk_ui_manager_get_widget (ui_manager, "/TermPopupMenu");
| ^~~~~
/usr/include/gtk-3.0/gtk/deprecated/gtkuimanager.h:149:16: note: declared here
149 | GtkWidget *gtk_ui_manager_get_widget (GtkUIManager *manager,
| ^~~~~~~~~~~~~~~~~~~~~~~~~
gui.c:4729:3: warning: 'gtk_menu_popup' is deprecated: Use '(gtk_menu_popup_at_widget, gtk_menu_popup_at_pointer, gtk_menu_popup_at_rect)' instead [-Wdeprecated-declarations]
4729 | gtk_menu_popup (GTK_MENU (popup), NULL, NULL, NULL, NULL,
| ^~~~~~~~~~~~~~
In file included from /usr/include/gtk-3.0/gtk/gtklabel.h:34,
from /usr/include/gtk-3.0/gtk/gtkaccellabel.h:35,
from /usr/include/gtk-3.0/gtk/gtk.h:33:
/usr/include/gtk-3.0/gtk/gtkmenu.h:138:12: note: declared here
138 | void gtk_menu_popup (GtkMenu *menu,
| ^~~~~~~~~~~~~~
gui.c: In function 'child_exited_cb':
gui.c:4792:7: warning: unused variable 'code' [-Wunused-variable]
4792 | int code;
| ^~~~
gui.c: In function 'button_press_event_cb':
gui.c:4912:5: warning: 'vte_terminal_match_check' is deprecated [-Wdeprecated-declarations]
4912 | g_match.matched_string = vte_terminal_match_check (vte, col, row, &g_match.tag);
| ^~~~~~~
/usr/include/vte-2.91/vte/vtedeprecated.h:62:7: note: declared here
62 | char *vte_terminal_match_check(VteTerminal *terminal,
| ^~~~~~~~~~~~~~~~~~~~~~~~
gui.c:4938:19: warning: suggest parentheses around assignment used as truth value [-Wparentheses]
4938 | if (p_conn = get_connection_by_host (g_match.matched_string))
| ^~~~~~
gui.c:4897:17: warning: unused variable 'tag' [-Wunused-variable]
4897 | int row, col, tag;
| ^~~
gui.c: In function 'window_title_changed_cb':
gui.c:4963:7: warning: 'vte_terminal_get_window_title' is deprecated [-Wdeprecated-declarations]
4963 | strcpy (title, vte_terminal_get_window_title (vteterminal));
| ^~~~~~
/usr/include/vte-2.91/vte/vtedeprecated.h:217:13: note: declared here
217 | const char *vte_terminal_get_window_title(VteTerminal *terminal) _VTE_CXX_NOEXCEPT _VTE_GNUC_NONNULL(1);
| ^~~~~~~~~~~~~~~~~~~~~~~~~~~~~
gui.c: In function 'selection_changed_cb':
gui.c:5005:5: warning: 'vte_terminal_copy_clipboard' is deprecated [-Wdeprecated-declarations]
5005 | vte_terminal_copy_clipboard (vteterminal);
| ^~~~~~~~~~~~~~~~~~~~~~~~~~~
/usr/include/vte-2.91/vte/vtedeprecated.h:109:6: note: declared here
109 | void vte_terminal_copy_clipboard(VteTerminal *terminal) _VTE_CXX_NOEXCEPT _VTE_GNUC_NONNULL(1);
| ^~~~~~~~~~~~~~~~~~~~~~~~~~~
gui.c: In function 'contents_changed_cb':
gui.c:5027:3: warning: 'vte_terminal_get_text' is deprecated [-Wdeprecated-declarations]
5027 | p_ct->buffer = vte_terminal_get_text (vteterminal, NULL, NULL, NULL);
| ^~~~
/usr/include/vte-2.91/vte/vtedeprecated.h:149:7: note: declared here
149 | char *vte_terminal_get_text(VteTerminal *terminal,
| ^~~~~~~~~~~~~~~~~~~~~
gui.c:5042:3: warning: 'MD5_Init' is deprecated: Since OpenSSL 3.0 [-Wdeprecated-declarations]
5042 | MD5_Init (&mdContext);
| ^~~~~~~~
In file included from gui.c:28:
/usr/include/openssl/md5.h:49:27: note: declared here
49 | OSSL_DEPRECATEDIN_3_0 int MD5_Init(MD5_CTX *c);
| ^~~~~~~~
gui.c:5043:3: warning: 'MD5_Update' is deprecated: Since OpenSSL 3.0 [-Wdeprecated-declarations]
5043 | MD5_Update (&mdContext, bufferTmp, strlen(bufferTmp));
| ^~~~~~~~~~
/usr/include/openssl/md5.h:50:27: note: declared here
50 | OSSL_DEPRECATEDIN_3_0 int MD5_Update(MD5_CTX *c, const void *data, size_t len);
| ^~~~~~~~~~
gui.c:5044:3: warning: 'MD5_Final' is deprecated: Since OpenSSL 3.0 [-Wdeprecated-declarations]
5044 | MD5_Final (digest, &mdContext);
| ^~~~~~~~~
/usr/include/openssl/md5.h:51:27: note: declared here
51 | OSSL_DEPRECATEDIN_3_0 int MD5_Final(unsigned char *md, MD5_CTX *c);
| ^~~~~~~~~
gui.c:5107:5: error: implicit declaration of function 'lower' [-Wimplicit-function-declaration]
5107 | lower (line);
| ^~~~~
gui.c: In function 'char_size_changed_cb':
gui.c:5252:13: warning: unused variable 'ypad' [-Wunused-variable]
5252 | int xpad, ypad;
| ^~~~
gui.c:5252:7: warning: unused variable 'xpad' [-Wunused-variable]
5252 | int xpad, ypad;
| ^~~~
gui.c:5251:15: warning: unused variable 'geometry' [-Wunused-variable]
5251 | GdkGeometry geometry;
| ^~~~~~~~
gui.c:5250:14: warning: variable 'window' set but not used [-Wunused-but-set-variable]
5250 | GtkWindow *window;
| ^~~~~~
gui.c: In function 'select_current_profile_menu_item':
gui.c:5407:7: warning: 'gtk_ui_manager_get_action' is deprecated [-Wdeprecated-declarations]
5407 | GtkAction *toggleAction = gtk_ui_manager_get_action (ui_manager, tmp_s);
| ^~~~~~~~~
/usr/include/gtk-3.0/gtk/deprecated/gtkuimanager.h:155:16: note: declared here
155 | GtkAction *gtk_ui_manager_get_action (GtkUIManager *manager,
| ^~~~~~~~~~~~~~~~~~~~~~~~~
gui.c:5410:9: warning: 'gtk_radio_action_set_current_value' is deprecated [-Wdeprecated-declarations]
5410 | gtk_radio_action_set_current_value (GTK_RADIO_ACTION(toggleAction), p_ct->profile_id);
| ^~~~~~~~~~~~~~~~~~~~~~~~~~~~~~~~~~
/usr/include/gtk-3.0/gtk/deprecated/gtkradioaction.h:91:17: note: declared here
91 | void gtk_radio_action_set_current_value (GtkRadioAction *action,
| ^~~~~~~~~~~~~~~~~~~~~~~~~~~~~~~~~~
gui.c: In function 'apply_preferences':
gui.c:5530:9: warning: 'vte_terminal_get_encoding' is deprecated [-Wdeprecated-declarations]
5530 | strcpy (prefs.character_encoding, vte_terminal_get_encoding (VTE_TERMINAL (vte)));
| ^~~~~~
/usr/include/vte-2.91/vte/vtedeprecated.h:139:13: note: declared here
139 | const char *vte_terminal_get_encoding(VteTerminal *terminal) _VTE_CXX_NOEXCEPT _VTE_GNUC_NONNULL(1);
| ^~~~~~~~~~~~~~~~~~~~~~~~~
gui.c:5551:3: warning: 'gtk_widget_modify_font' is deprecated: Use 'gtk_widget_override_font' instead [-Wdeprecated-declarations]
5551 | gtk_widget_modify_font (g_quick_launch_window.tree_view, font_desc);
| ^~~~~~~~~~~~~~~~~~~~~~
In file included from /usr/include/gtk-3.0/gtk/gtk.h:277:
/usr/include/gtk-3.0/gtk/deprecated/gtkstyle.h:769:13: note: declared here
769 | void gtk_widget_modify_font (GtkWidget *widget,
| ^~~~~~~~~~~~~~~~~~~~~~
gui.c:5503:12: warning: unused variable 'terminal_back_color' [-Wunused-variable]
5503 | GdkColor terminal_back_color;
| ^~~~~~~~~~~~~~~~~~~
gui.c:5502:12: warning: unused variable 'terminal_fore_color' [-Wunused-variable]
5502 | GdkColor terminal_fore_color;
| ^~~~~~~~~~~~~~~~~~~
gui.c:5501:8: warning: unused variable 'word_chars' [-Wunused-variable]
5501 | char word_chars[1024];
| ^~~~~~~~~~
gui.c: In function 'apply_profile_terminal':
gui.c:5561:12: warning: unused variable 'object' [-Wunused-variable]
5561 | GObject *object;
| ^~~~~~
gui.c: In function 'start_gtk':
gui.c:5869:3: warning: 'gtk_ui_manager_get_widget' is deprecated [-Wdeprecated-declarations]
5869 | GtkWidget *toggle = gtk_ui_manager_get_widget (ui_manager, N_("/MainMenu/ViewMenu/Sidebar"));
| ^~~~~~~~~
/usr/include/gtk-3.0/gtk/deprecated/gtkuimanager.h:149:16: note: declared here
149 | GtkWidget *gtk_ui_manager_get_widget (GtkUIManager *manager,
| ^~~~~~~~~~~~~~~~~~~~~~~~~
gui.c:5736:37: warning: unused variable 'ifr_function' [-Wunused-variable]
5736 | struct Iteration_Function_Request ifr_function;
| ^~~~~~~~~~~~
gui.c:5735:7: warning: unused variable 'font_size' [-Wunused-variable]
5735 | int font_size;
| ^~~~~~~~~
gui.c:5734:25: warning: unused variable 'font_desc' [-Wunused-variable]
5734 | PangoFontDescription *font_desc;
| ^~~~~~~~~
gui.c:5733:14: warning: unused variable 'scrollbar' [-Wunused-variable]
5733 | GtkWidget *scrollbar;
| ^~~~~~~~~
gui.c:5732:14: warning: unused variable 'hbox_terminal' [-Wunused-variable]
5732 | GtkWidget *hbox_terminal; /* vte + scrollbar */
| ^~~~~~~~~~~~~
gui.c:5730:8: warning: unused variable 's_tmp' [-Wunused-variable]
5730 | char s_tmp[256];
| ^~~~~
gui.c:5729:7: warning: unused variable 'i' [-Wunused-variable]
5729 | int i;
| ^
gui.c: In function 'open_connection':
gui.c:5686:1: warning: control reaches end of non-void function [-Wreturn-type]
5686 | }
| ^
make[2]: *** [Makefile:428: gui.o] Error 1
make[2]: Leaving directory '/usr/src/RPM/BUILD/lterm-1.5.1/src'
make[1]: *** [Makefile:300: all] Error 2
make: *** [Makefile:355: all-recursive] Error 1
error: Bad exit status from /usr/src/tmp/rpm-tmp.4503 (%build)
RPM build errors:
Bad exit status from /usr/src/tmp/rpm-tmp.4503 (%build)
Command exited with non-zero status 1
10.99user 4.62system 0:10.80elapsed 144%CPU (0avgtext+0avgdata 80896maxresident)k
0inputs+0outputs (0major+658584minor)pagefaults 0swaps
hsh-rebuild: rebuild of `lterm-1.5.1-alt2.src.rpm' failed.
Command exited with non-zero status 1
6.71user 4.64system 0:49.32elapsed 23%CPU (0avgtext+0avgdata 136612maxresident)k
24568inputs+0outputs (0major+330656minor)pagefaults 0swaps