<86>Nov 20 01:54:08 userdel[2806159]: delete user 'rooter'
<86>Nov 20 01:54:08 userdel[2806159]: removed group 'rooter' owned by 'rooter'
<86>Nov 20 01:54:08 userdel[2806159]: removed shadow group 'rooter' owned by 'rooter'
<86>Nov 20 01:54:08 groupadd[2806206]: group added to /etc/group: name=rooter, GID=1814
<86>Nov 20 01:54:08 groupadd[2806206]: group added to /etc/gshadow: name=rooter
<86>Nov 20 01:54:08 groupadd[2806206]: new group: name=rooter, GID=1814
<86>Nov 20 01:54:08 useradd[2806235]: new user: name=rooter, UID=1814, GID=1814, home=/root, shell=/bin/bash, from=none
<86>Nov 20 01:54:08 userdel[2806264]: delete user 'builder'
<86>Nov 20 01:54:08 userdel[2806264]: removed group 'builder' owned by 'builder'
<86>Nov 20 01:54:08 userdel[2806264]: removed shadow group 'builder' owned by 'builder'
<86>Nov 20 01:54:08 groupadd[2806299]: group added to /etc/group: name=builder, GID=1815
<86>Nov 20 01:54:08 groupadd[2806299]: group added to /etc/gshadow: name=builder
<86>Nov 20 01:54:08 groupadd[2806299]: new group: name=builder, GID=1815
<86>Nov 20 01:54:08 useradd[2806317]: new user: name=builder, UID=1815, GID=1815, home=/usr/src, shell=/bin/bash, from=none
<13>Nov 20 01:54:12 rpmi: libidn2-2.3.7-alt1 sisyphus+339505.100.1.2 1706718968 installed
<13>Nov 20 01:54:12 rpmi: libcares-1.34.2-alt1 sisyphus+360677.100.1.1 1729855257 installed
<13>Nov 20 01:54:12 rpmi: gcc-c++-common-1.4.28-alt1 sisyphus+348678.100.1.1 1716396142 installed
<13>Nov 20 01:54:12 rpmi: libstdc++14-devel-14.2.1-alt1 sisyphus+360995.100.1.1 1730131018 installed
<13>Nov 20 01:54:13 rpmi: gcc14-c++-14.2.1-alt1 sisyphus+360995.100.1.1 1730131018 installed
<13>Nov 20 01:54:13 rpmi: libp11-kit-1:0.25.5-alt1 sisyphus+352553.100.1.1 1720622573 installed
<13>Nov 20 01:54:13 rpmi: libtasn1-4.19.0-alt3 sisyphus+327816.100.1.1 1692802615 installed
<13>Nov 20 01:54:13 rpmi: rpm-macros-alternatives-0.5.2-alt2 sisyphus+315270.200.2.1 1676457367 installed
<13>Nov 20 01:54:13 rpmi: alternatives-0.5.2-alt2 sisyphus+315270.200.2.1 1676457367 installed
<13>Nov 20 01:54:13 rpmi: ca-certificates-2024.07.01-alt1 sisyphus+351897.100.1.1 1719826350 installed
<13>Nov 20 01:54:13 rpmi: ca-trust-0.2.0-alt1 sisyphus+344843.100.1.1 1712743326 installed
<13>Nov 20 01:54:13 rpmi: p11-kit-trust-1:0.25.5-alt1 sisyphus+352553.100.1.1 1720622573 installed
<13>Nov 20 01:54:13 rpmi: libcrypto3-3.1.7-alt2 sisyphus+359910.100.1.1 1729080439 installed
<13>Nov 20 01:54:13 rpmi: libssl3-3.1.7-alt2 sisyphus+359910.100.1.1 1729080439 installed
<13>Nov 20 01:54:13 rpmi: wget-1.25.0-alt1 sisyphus+362379.100.1.1 1731425502 installed
<13>Nov 20 01:54:13 rpmi: gcc-c++-14-alt1 sisyphus+360995.300.1.1 1730139222 installed
<13>Nov 20 01:54:13 rpmi: flex-2.6.4.0.88.9801-alt2 sisyphus+346193.200.3.2 1716466857 installed
Building target platforms: x86_64
Building for target x86_64
Wrote: /usr/src/in/nosrpm/libsmi-0.5.0-alt2.nosrc.rpm (w1.gzdio)
Installing libsmi-0.5.0-alt2.src.rpm
Building target platforms: x86_64
Building for target x86_64
Executing(%prep): /bin/sh -e /usr/src/tmp/rpm-tmp.71360
+ umask 022
+ /bin/mkdir -p /usr/src/RPM/BUILD
+ cd /usr/src/RPM/BUILD
+ cd /usr/src/RPM/BUILD
+ rm -rf libsmi-0.5.0
+ echo 'Source #0 (libsmi-0.5.0.tar):'
Source #0 (libsmi-0.5.0.tar):
+ /bin/tar -xf /usr/src/RPM/SOURCES/libsmi-0.5.0.tar
+ cd libsmi-0.5.0
+ /bin/chmod -c -Rf u+rwX,go-w .
+ echo 'Patch #0 (libsmi-0.5.0-alt2.patch):'
Patch #0 (libsmi-0.5.0-alt2.patch):
+ /usr/bin/patch -p1
patching file lib/Makefile.am
patching file lib/parser-sming.y
patching file lib/scanner-smi.h
patching file lib/scanner-sming.h
patching file lib/scanner-yang.h
patching file tools/smicache.1.in
patching file tools/smistrip.in
+ exit 0
Executing(%build): /bin/sh -e /usr/src/tmp/rpm-tmp.71360
+ umask 022
+ /bin/mkdir -p /usr/src/RPM/BUILD
+ cd /usr/src/RPM/BUILD
+ cd libsmi-0.5.0
+ libtoolize --copy --force
libtoolize-default: putting auxiliary files in '.'.
libtoolize-default: copying file './ltmain.sh'
libtoolize-default: You should add the contents of the following files to 'aclocal.m4':
libtoolize-default:   '/usr/share/libtool-2.4/aclocal/libtool.m4'
libtoolize-default:   '/usr/share/libtool-2.4/aclocal/ltoptions.m4'
libtoolize-default:   '/usr/share/libtool-2.4/aclocal/ltsugar.m4'
libtoolize-default:   '/usr/share/libtool-2.4/aclocal/ltversion.m4'
libtoolize-default:   '/usr/share/libtool-2.4/aclocal/lt~obsolete.m4'
libtoolize-default: Consider adding 'AC_CONFIG_MACRO_DIRS([m4])' to configure.ac,
libtoolize-default: and rerunning libtoolize-default and aclocal.
libtoolize-default: Consider adding '-I m4' to ACLOCAL_AMFLAGS in Makefile.am.
+ autoreconf -fisv
autoreconf-default: export WARNINGS=
autoreconf-default: Entering directory '.'
autoreconf-default: configure.ac: not using Gettext
autoreconf-default: running: aclocal --force 
autoreconf-default: configure.ac: tracing
autoreconf-default: running: libtoolize --force --install
libtoolize-default: putting auxiliary files in '.'.
libtoolize-default: linking file './config.guess'
libtoolize-default: linking file './config.sub'
libtoolize-default: linking file './install-sh'
libtoolize-default: linking file './ltmain.sh'
libtoolize-default: Consider adding 'AC_CONFIG_MACRO_DIRS([m4])' to configure.ac,
libtoolize-default: and rerunning libtoolize-default and aclocal.
libtoolize-default: Consider adding '-I m4' to ACLOCAL_AMFLAGS in Makefile.am.
autoreconf-default: configure.ac: not using Intltool
autoreconf-default: configure.ac: not using Gtkdoc
autoreconf-default: running: aclocal --force 
autoreconf-default: running: /usr/bin/autoconf-2.71 --force
configure.ac:26: warning: AM_INIT_AUTOMAKE: two- and three-arguments forms are deprecated.
./lib/autoconf/general.m4:2434: AC_DIAGNOSE is expanded from...
aclocal.m4:9521: AM_INIT_AUTOMAKE is expanded from...
configure.ac:26: the top level
configure.ac:45: warning: The macro `AC_TRY_RUN' is obsolete.
configure.ac:45: You should run autoupdate.
./lib/autoconf/general.m4:2997: AC_TRY_RUN is expanded from...
configure.ac:45: the top level
configure.ac:107: warning: The macro `AC_TRY_RUN' is obsolete.
configure.ac:107: You should run autoupdate.
./lib/autoconf/general.m4:2997: AC_TRY_RUN is expanded from...
configure.ac:107: the top level
configure.ac:121: warning: The macro `AC_TRY_RUN' is obsolete.
configure.ac:121: You should run autoupdate.
./lib/autoconf/general.m4:2997: AC_TRY_RUN is expanded from...
configure.ac:121: the top level
configure.ac:147: warning: The macro `AC_TRY_RUN' is obsolete.
configure.ac:147: You should run autoupdate.
./lib/autoconf/general.m4:2997: AC_TRY_RUN is expanded from...
configure.ac:147: the top level
configure.ac:238: warning: The macro `AM_PROG_LIBTOOL' is obsolete.
configure.ac:238: You should run autoupdate.
aclocal.m4:123: AM_PROG_LIBTOOL is expanded from...
configure.ac:238: the top level
configure.ac:279: warning: AC_OUTPUT should be used without arguments.
configure.ac:279: You should run autoupdate.
autoreconf-default: running: /usr/bin/autoheader-2.71 --force
autoreconf-default: running: automake --add-missing --force-missing
configure.ac:26: warning: AM_INIT_AUTOMAKE: two- and three-arguments forms are deprecated.  For more info, see:
configure.ac:26: https://www.gnu.org/software/automake/manual/automake.html#Modernize-AM_005fINIT_005fAUTOMAKE-invocation
configure.ac:39: installing './compile'
configure.ac:26: installing './missing'
lib/Makefile.am: installing './depcomp'
mibs/iana/Makefile.am:15: warning: shell ls -1 $(srcdir: non-POSIX variable name
mibs/iana/Makefile.am:15: (probably a GNU make extension)
mibs/ietf/Makefile.am:15: warning: shell ls -1 $(srcdir: non-POSIX variable name
mibs/ietf/Makefile.am:15: (probably a GNU make extension)
mibs/irtf/Makefile.am:15: warning: shell ls -1 $(srcdir: non-POSIX variable name
mibs/irtf/Makefile.am:15: (probably a GNU make extension)
mibs/jacobs/Makefile.am:15: warning: shell ls -1 $(srcdir: non-POSIX variable name
mibs/jacobs/Makefile.am:15: (probably a GNU make extension)
mibs/site/Makefile.am:15: warning: shell ls -1 $(srcdir: non-POSIX variable name
mibs/site/Makefile.am:15: (probably a GNU make extension)
mibs/tubs/Makefile.am:15: warning: shell ls -1 $(srcdir: non-POSIX variable name
mibs/tubs/Makefile.am:15: (probably a GNU make extension)
pibs/Makefile.am:16: warning: shell ls -1d [a-z]*/* | egrep -v 'CVS|Makefile': non-POSIX variable name
pibs/Makefile.am:16: (probably a GNU make extension)
pibs/ietf/Makefile.am:14: warning: shell ls -1 | egrep -v 'CVS|Makefile': non-POSIX variable name
pibs/ietf/Makefile.am:14: (probably a GNU make extension)
pibs/site/Makefile.am:14: warning: shell ls -1 | egrep -v 'CVS|Makefile': non-POSIX variable name
pibs/site/Makefile.am:14: (probably a GNU make extension)
pibs/tubs/Makefile.am:14: warning: shell ls -1 | egrep -v 'CVS|Makefile': non-POSIX variable name
pibs/tubs/Makefile.am:14: (probably a GNU make extension)
test/Makefile.am:46: warning: shell ls -1d smidiff/* | egrep -v 'CVS|Makefile': non-POSIX variable name
test/Makefile.am:46: (probably a GNU make extension)
parallel-tests: installing './test-driver'
test/dumps/cm/Makefile.am:14: warning: shell ls -1 | egrep -v 'CVS|Makefile': non-POSIX variable name
test/dumps/cm/Makefile.am:14: (probably a GNU make extension)
test/dumps/corba/Makefile.am:14: warning: shell ls -1 | egrep -v 'CVS|Makefile': non-POSIX variable name
test/dumps/corba/Makefile.am:14: (probably a GNU make extension)
test/dumps/identifiers/Makefile.am:14: warning: shell ls -1 | egrep -v 'CVS|Makefile': non-POSIX variable name
test/dumps/identifiers/Makefile.am:14: (probably a GNU make extension)
test/dumps/imports/Makefile.am:14: warning: shell ls -1 | egrep -v 'CVS|Makefile': non-POSIX variable name
test/dumps/imports/Makefile.am:14: (probably a GNU make extension)
test/dumps/jax/Makefile.am:14: warning: shell ls -1 | egrep -v 'CVS|Makefile': non-POSIX variable name
test/dumps/jax/Makefile.am:14: (probably a GNU make extension)
test/dumps/metrics/Makefile.am:14: warning: shell ls -1 | egrep -v 'CVS|Makefile': non-POSIX variable name
test/dumps/metrics/Makefile.am:14: (probably a GNU make extension)
test/dumps/mosy/Makefile.am:14: warning: shell ls -1 | egrep -v 'CVS|Makefile': non-POSIX variable name
test/dumps/mosy/Makefile.am:14: (probably a GNU make extension)
test/dumps/netsnmp/Makefile.am:14: warning: shell ls -1 | egrep -v 'CVS|Makefile': non-POSIX variable name
test/dumps/netsnmp/Makefile.am:14: (probably a GNU make extension)
test/dumps/orig-smiv2/Makefile.am:14: warning: shell ls -1 | egrep -v 'CVS|Makefile': non-POSIX variable name
test/dumps/orig-smiv2/Makefile.am:14: (probably a GNU make extension)
test/dumps/python/Makefile.am:14: warning: shell ls -1 | egrep -v 'CVS|Makefile': non-POSIX variable name
test/dumps/python/Makefile.am:14: (probably a GNU make extension)
test/dumps/smilint-smiv2/Makefile.am:14: warning: shell ls -1 | egrep -v 'CVS|Makefile': non-POSIX variable name
test/dumps/smilint-smiv2/Makefile.am:14: (probably a GNU make extension)
test/dumps/sming/Makefile.am:14: warning: shell ls -1 | egrep -v 'CVS|Makefile': non-POSIX variable name
test/dumps/sming/Makefile.am:14: (probably a GNU make extension)
test/dumps/smiv1/Makefile.am:14: warning: shell ls -1 | egrep -v 'CVS|Makefile': non-POSIX variable name
test/dumps/smiv1/Makefile.am:14: (probably a GNU make extension)
test/dumps/smiv2-smiv2/Makefile.am:14: warning: shell ls -1 | egrep -v 'CVS|Makefile': non-POSIX variable name
test/dumps/smiv2-smiv2/Makefile.am:14: (probably a GNU make extension)
test/dumps/smiv2/Makefile.am:14: warning: shell ls -1 | egrep -v 'CVS|Makefile': non-POSIX variable name
test/dumps/smiv2/Makefile.am:14: (probably a GNU make extension)
test/dumps/tree/Makefile.am:14: warning: shell ls -1 | egrep -v 'CVS|Makefile': non-POSIX variable name
test/dumps/tree/Makefile.am:14: (probably a GNU make extension)
test/dumps/types/Makefile.am:14: warning: shell ls -1 | egrep -v 'CVS|Makefile': non-POSIX variable name
test/dumps/types/Makefile.am:14: (probably a GNU make extension)
test/dumps/xml/Makefile.am:14: warning: shell ls -1 | egrep -v 'CVS|Makefile': non-POSIX variable name
test/dumps/xml/Makefile.am:14: (probably a GNU make extension)
test/dumps/yang/Makefile.am:14: warning: shell ls -1 | egrep -v 'CVS|Makefile': non-POSIX variable name
test/dumps/yang/Makefile.am:14: (probably a GNU make extension)
test/smidiff/Makefile.am:14: warning: shell ls -1 | egrep -v 'CVS|Makefile': non-POSIX variable name
test/smidiff/Makefile.am:14: (probably a GNU make extension)
tools/Makefile.am:14: warning: 'INCLUDES' is the old name for 'AM_CPPFLAGS' (or '*_CPPFLAGS')
yang/Makefile.am:16: warning: shell ls -1d [a-z]*/* | egrep -v 'CVS|Makefile': non-POSIX variable name
yang/Makefile.am:16: (probably a GNU make extension)
yang/iana/Makefile.am:15: warning: shell ls -1 $(srcdir: non-POSIX variable name
yang/iana/Makefile.am:15: (probably a GNU make extension)
yang/ietf/Makefile.am:15: warning: shell ls -1 $(srcdir: non-POSIX variable name
yang/ietf/Makefile.am:15: (probably a GNU make extension)
yang/site/Makefile.am:14: warning: shell ls -1 | egrep -v 'CVS|Makefile': non-POSIX variable name
yang/site/Makefile.am:14: (probably a GNU make extension)
autoreconf-default: Leaving directory '.'
+ CFLAGS='-pipe -frecord-gcc-switches -Wall -g -O2 -flto=auto'
+ export CFLAGS
+ CXXFLAGS='-pipe -frecord-gcc-switches -Wall -g -O2 -flto=auto'
+ export CXXFLAGS
+ FFLAGS='-pipe -frecord-gcc-switches -Wall -g -O2 -flto=auto'
+ export FFLAGS
+ FCFLAGS='-pipe -frecord-gcc-switches -Wall -g -O2 -flto=auto'
+ export FCFLAGS
+ '[' -n '' ']'
++ printf %s '-pipe -frecord-gcc-switches -Wall -g -O2 -flto=auto'
++ sed -r 's/(^|[[:space:]]+)-[^m][^[:space:]]*//g'
+ ASFLAGS=
+ export ASFLAGS
+ export lt_cv_prog_cc_static_works=no
+ lt_cv_prog_cc_static_works=no
+ export lt_cv_deplibs_check_method=pass_all
+ lt_cv_deplibs_check_method=pass_all
+ readlink -e -- ./configure
+ xargs -ri dirname -- '{}'
+ xargs -ri find '{}' -type f '(' -name config.sub -or -name config.guess ')' -printf '%h/\n'
+ sort -u
+ xargs -rn1 install -pm755 -- /usr/share/gnu-config/config.sub /usr/share/gnu-config/config.guess
+ configure_runstatedir_flags=
+ grep -qF runstatedir=DIR ./configure
+ configure_runstatedir_flags=--runstatedir=/var/run
+ ./configure --build=x86_64-alt-linux --host=x86_64-alt-linux --prefix=/usr --exec-prefix=/usr --bindir=/usr/bin --sbindir=/usr/sbin --sysconfdir=/etc --datadir=/usr/share --includedir=/usr/include --libdir=/usr/lib64 --libexecdir=/usr/lib --localstatedir=/var/lib --sharedstatedir=/var/lib --mandir=/usr/share/man --infodir=/usr/share/info --disable-dependency-tracking --disable-silent-rules --runstatedir=/var/run --without-included-gettext --disable-static --enable-shared --sysconfdir=/etc --enable-smi --enable-sming
configure: WARNING: unrecognized options: --without-included-gettext
checking for a BSD-compatible install... /usr/bin/ginstall -c
checking whether build environment is sane... yes
checking for a race-free mkdir -p... /usr/bin/mkdir -p
checking for gawk... gawk
checking whether make sets $(MAKE)... yes
checking whether make supports nested variables... yes
checking for x86_64-alt-linux-gcc... x86_64-alt-linux-gcc
checking whether the C compiler works... yes
checking for C compiler default output file name... a.out
checking for suffix of executables... 
checking whether we are cross compiling... no
checking for suffix of object files... o
checking whether the compiler supports GNU C... yes
checking whether x86_64-alt-linux-gcc accepts -g... yes
checking for x86_64-alt-linux-gcc option to enable C11 features... none needed
checking whether x86_64-alt-linux-gcc understands -c and -o together... yes
checking whether make supports the include directive... yes (GNU style)
checking dependency style of x86_64-alt-linux-gcc... none
checking for additional required compiler flags... 
checking for strtoll... yes
checking for strtoull... yes
checking for strtoq... yes
checking for strtouq... yes
checking for timegm... yes
checking for vsnprintf... yes
checking for snprintf... yes
checking for asprintf... yes
checking for asnprintf... no
checking for vasprintf... yes
checking for vasnprintf... no
checking for stdio.h... yes
checking for stdlib.h... yes
checking for string.h... yes
checking for inttypes.h... yes
checking for stdint.h... yes
checking for strings.h... yes
checking for sys/stat.h... yes
checking for sys/types.h... yes
checking for unistd.h... yes
checking for pwd.h... yes
checking for unistd.h... (cached) yes
checking for regex.h... yes
checking for stdint.h... (cached) yes
checking for limits.h... yes
checking for regexec in -lc... yes
checking for path separator character... :
checking for dir separator character... /
checking for 64 bit types... long/%ld, etc.
checking for flex... /usr/bin/flex
checking for bison... /usr/bin/bison
checking for bash... /bin/sh
checking for sh... /usr/bin/sh
checking for awk... /usr/bin/awk
checking for wget... /usr/bin/wget
checking for gdiff... no
checking for diff... /usr/bin/diff
checking whether make sets $(MAKE)... (cached) yes
checking build system type... x86_64-alt-linux-gnu
checking host system type... x86_64-alt-linux-gnu
checking how to print strings... printf
checking for a sed that does not truncate output... /usr/bin/sed
checking for grep that handles long lines and -e... /usr/bin/grep
checking for egrep... /usr/bin/grep -E
checking for fgrep... /usr/bin/grep -F
checking for ld used by x86_64-alt-linux-gcc... /usr/bin/ld
checking if the linker (/usr/bin/ld) is GNU ld... yes
checking for BSD- or MS-compatible name lister (nm)... /usr/bin/nm -B
checking the name lister (/usr/bin/nm -B) interface... BSD nm
checking whether ln -s works... yes
checking the maximum length of command line arguments... 1572864
checking how to convert x86_64-alt-linux-gnu file names to x86_64-alt-linux-gnu format... func_convert_file_noop
checking how to convert x86_64-alt-linux-gnu file names to toolchain format... func_convert_file_noop
checking for /usr/bin/ld option to reload object files... -r
checking for x86_64-alt-linux-file... no
checking for file... file
checking for x86_64-alt-linux-objdump... no
checking for objdump... objdump
checking how to recognize dependent libraries... (cached) pass_all
checking for x86_64-alt-linux-dlltool... no
checking for dlltool... no
checking how to associate runtime and link libraries... printf %s\n
checking for x86_64-alt-linux-ar... no
checking for ar... ar
checking for archiver @FILE support... @
checking for x86_64-alt-linux-strip... no
checking for strip... strip
checking for x86_64-alt-linux-ranlib... no
checking for ranlib... ranlib
checking command to parse /usr/bin/nm -B output from x86_64-alt-linux-gcc object... ok
checking for sysroot... no
checking for a working dd... /usr/bin/dd
checking how to truncate binary pipes... /usr/bin/dd bs=4096 count=1
checking for x86_64-alt-linux-mt... no
checking for mt... no
checking if : is a manifest tool... no
checking for dlfcn.h... yes
checking for objdir... .libs
checking if x86_64-alt-linux-gcc supports -fno-rtti -fno-exceptions... no
checking for x86_64-alt-linux-gcc option to produce PIC... -fPIC -DPIC
checking if x86_64-alt-linux-gcc PIC flag -fPIC -DPIC works... yes
checking if x86_64-alt-linux-gcc static flag -static works... no
checking if x86_64-alt-linux-gcc supports -c -o file.o... yes
checking if x86_64-alt-linux-gcc supports -c -o file.o... (cached) yes
checking whether the x86_64-alt-linux-gcc linker (/usr/bin/ld -m elf_x86_64) supports shared libraries... yes
checking whether -lc should be explicitly linked in... no
checking dynamic linker characteristics... GNU/Linux ld.so
checking how to hardcode library paths into programs... immediate
checking whether stripping libraries is possible... yes
checking if libtool supports shared libraries... yes
checking whether to build shared libraries... yes
checking whether to build static libraries... no
./configure: line 13652: ./libtool: No such file or directory
checking that generated files are newer than configure... done
configure: creating ./config.status
config.status: creating Makefile
config.status: creating lib/Makefile
config.status: creating tools/Makefile
config.status: creating mibs/Makefile
config.status: creating mibs/iana/Makefile
config.status: creating mibs/ietf/Makefile
config.status: creating mibs/irtf/Makefile
config.status: creating mibs/jacobs/Makefile
config.status: creating mibs/tubs/Makefile
config.status: creating mibs/site/Makefile
config.status: creating pibs/Makefile
config.status: creating pibs/ietf/Makefile
config.status: creating pibs/tubs/Makefile
config.status: creating pibs/site/Makefile
config.status: creating yang/Makefile
config.status: creating yang/ietf/Makefile
config.status: creating yang/iana/Makefile
config.status: creating yang/site/Makefile
config.status: creating test/Makefile
config.status: creating test/mibs/Makefile
config.status: creating test/smidiff/Makefile
config.status: creating test/dumps/Makefile
config.status: creating test/dumps/corba/Makefile
config.status: creating test/dumps/imports/Makefile
config.status: creating test/dumps/jax/Makefile
config.status: creating test/dumps/netsnmp/Makefile
config.status: creating test/dumps/mosy/Makefile
config.status: creating test/dumps/orig-smiv2/Makefile
config.status: creating test/dumps/smilint-smiv2/Makefile
config.status: creating test/dumps/sming/Makefile
config.status: creating test/dumps/smiv1/Makefile
config.status: creating test/dumps/smiv2/Makefile
config.status: creating test/dumps/smiv2-smiv2/Makefile
config.status: creating test/dumps/tree/Makefile
config.status: creating test/dumps/types/Makefile
config.status: creating test/dumps/identifiers/Makefile
config.status: creating test/dumps/metrics/Makefile
config.status: creating test/dumps/xml/Makefile
config.status: creating test/dumps/cm/Makefile
config.status: creating test/dumps/python/Makefile
config.status: creating test/dumps/yang/Makefile
config.status: creating doc/Makefile
config.status: creating lib/smi.h
config.status: creating lib/libsmi.3
config.status: creating lib/smi_macro.3
config.status: creating lib/smi_module.3
config.status: creating lib/smi_node.3
config.status: creating lib/smi_type.3
config.status: creating lib/smi_config.3
config.status: creating lib/smi_render.3
config.status: creating lib/smi_util.3
config.status: creating lib/smi_class.3
config.status: creating lib/smi_attribute.3
config.status: creating lib/smi_event.3
config.status: creating lib/smi_identity.3
config.status: creating lib/yang_node.3
config.status: creating tools/smistrip
config.status: creating tools/smicache
config.status: creating tools/smiquery.1
config.status: creating tools/smilint.1
config.status: creating tools/smidump.1
config.status: creating tools/smidiff.1
config.status: creating tools/smistrip.1
config.status: creating tools/smicache.1
config.status: creating tools/smixlate.1
config.status: creating tools/mib2svg.cgi
config.status: creating test/parser.test
config.status: creating test/parser-yang.test
config.status: creating test/parser-yang-ct.test
config.status: creating test/smidump-corba.test
config.status: creating test/smidump-jax.test
config.status: creating test/smidump-netsnmp.test
config.status: creating test/smidump-imports.test
config.status: creating test/smidump-mosy.test
config.status: creating test/smidump-orig-smiv2.test
config.status: creating test/smidump-sming.test
config.status: creating test/smidump-yang.test
config.status: creating test/smidump-smiv1.test
config.status: creating test/smidump-smiv2-smiv2.test
config.status: creating test/smidump-smiv2.test
config.status: creating test/smidump-tree.test
config.status: creating test/smidump-types.test
config.status: creating test/smidump-identifiers.test
config.status: creating test/smidump-metrics.test
config.status: creating test/smidump-xml.test
config.status: creating test/smidump-cm.test
config.status: creating test/smidump-python.test
config.status: creating test/smilint-smiv2.test
config.status: creating test/smidiff.test
config.status: creating libsmi.pc
config.status: creating win/config.h
config.status: creating config.h
config.status: executing depfiles commands
config.status: executing libtool commands
config.status: executing default commands
configure: WARNING: unrecognized options: --without-included-gettext
+ LIBTOOL=/usr/bin/libtool
+ make -j16
make  all-recursive
Making all in lib
make[2]: Entering directory '/usr/src/RPM/BUILD/libsmi-0.5.0/lib'
cat error.c | grep ERR_ | \
sed -e 's/^.*\(ERR_[a-zA-Z0-9_]*\).*$/\1/' | \
awk '{printf "#define %-50s %d\n", $1, NR-1}' > errormacros.h
make[2]: Leaving directory '/usr/src/RPM/BUILD/libsmi-0.5.0/lib'
make[2]: Entering directory '/usr/src/RPM/BUILD/libsmi-0.5.0/lib'
/bin/sh ../libtool  --tag=CC   --mode=compile x86_64-alt-linux-gcc -DHAVE_CONFIG_H -I. -I..     -pipe -frecord-gcc-switches -Wall -g -O2 -flto=auto  -c -o yang-complex-types.lo yang-complex-types.c
libtool: compile:  x86_64-alt-linux-gcc -DHAVE_CONFIG_H -I. -I.. -pipe -frecord-gcc-switches -Wall -g -O2 -flto=auto -c yang-complex-types.c  -fPIC -DPIC -o .libs/yang-complex-types.o
yang-complex-types.c: In function 'addCTExtNode':
yang-complex-types.c:148:9: error: implicit declaration of function 'createIdentifierRef'; did you mean 'listIdentifierRef'? [-Wimplicit-function-declaration]
  148 |         createIdentifierRef(ret, prefix, identifier);
      |         ^~~~~~~~~~~~~~~~~~~
      |         listIdentifierRef
make[2]: *** [Makefile:572: yang-complex-types.lo] Error 1
make[2]: Leaving directory '/usr/src/RPM/BUILD/libsmi-0.5.0/lib'
make[2]: *** Waiting for unfinished jobs....
make[2]: Entering directory '/usr/src/RPM/BUILD/libsmi-0.5.0/lib'
/bin/sh ../libtool  --tag=CC   --mode=compile x86_64-alt-linux-gcc -DHAVE_CONFIG_H -I. -I..     -pipe -frecord-gcc-switches -Wall -g -O2 -flto=auto  -c -o util.lo util.c
libtool: compile:  x86_64-alt-linux-gcc -DHAVE_CONFIG_H -I. -I.. -pipe -frecord-gcc-switches -Wall -g -O2 -flto=auto -c util.c  -fPIC -DPIC -o .libs/util.o
make[2]: Leaving directory '/usr/src/RPM/BUILD/libsmi-0.5.0/lib'
make[2]: Entering directory '/usr/src/RPM/BUILD/libsmi-0.5.0/lib'
/bin/sh ../libtool  --tag=CC   --mode=compile x86_64-alt-linux-gcc -DHAVE_CONFIG_H -I. -I..     -pipe -frecord-gcc-switches -Wall -g -O2 -flto=auto  -c -o snprintf.lo snprintf.c
libtool: compile:  x86_64-alt-linux-gcc -DHAVE_CONFIG_H -I. -I.. -pipe -frecord-gcc-switches -Wall -g -O2 -flto=auto -c snprintf.c  -fPIC -DPIC -o .libs/snprintf.o
make[2]: Leaving directory '/usr/src/RPM/BUILD/libsmi-0.5.0/lib'
make[2]: Entering directory '/usr/src/RPM/BUILD/libsmi-0.5.0/lib'
/bin/sh ../libtool  --tag=CC   --mode=compile x86_64-alt-linux-gcc -DHAVE_CONFIG_H -I. -I..     -pipe -frecord-gcc-switches -Wall -g -O2 -flto=auto  -c -o yang.lo yang.c
libtool: compile:  x86_64-alt-linux-gcc -DHAVE_CONFIG_H -I. -I.. -pipe -frecord-gcc-switches -Wall -g -O2 -flto=auto -c yang.c  -fPIC -DPIC -o .libs/yang.o
yang.c: In function 'yangDeclAsString':
yang.c:51:5: warning: enumeration value 'YANG_DECL_LAST' not handled in switch [-Wswitch]
   51 |     switch (decl) {
      |     ^~~~~~
make[2]: Leaving directory '/usr/src/RPM/BUILD/libsmi-0.5.0/lib'
make[2]: Entering directory '/usr/src/RPM/BUILD/libsmi-0.5.0/lib'
/bin/sh ../libtool  --tag=CC   --mode=compile x86_64-alt-linux-gcc -DHAVE_CONFIG_H -I. -I..     -pipe -frecord-gcc-switches -Wall -g -O2 -flto=auto  -c -o error.lo error.c
libtool: compile:  x86_64-alt-linux-gcc -DHAVE_CONFIG_H -I. -I.. -pipe -frecord-gcc-switches -Wall -g -O2 -flto=auto -c error.c  -fPIC -DPIC -o .libs/error.o
make[2]: Leaving directory '/usr/src/RPM/BUILD/libsmi-0.5.0/lib'
make[2]: Entering directory '/usr/src/RPM/BUILD/libsmi-0.5.0/lib'
/bin/sh ../libtool  --tag=CC   --mode=compile x86_64-alt-linux-gcc -DHAVE_CONFIG_H -I. -I..     -pipe -frecord-gcc-switches -Wall -g -O2 -flto=auto  -c -o common.lo common.c
libtool: compile:  x86_64-alt-linux-gcc -DHAVE_CONFIG_H -I. -I.. -pipe -frecord-gcc-switches -Wall -g -O2 -flto=auto -c common.c  -fPIC -DPIC -o .libs/common.o
make[2]: Leaving directory '/usr/src/RPM/BUILD/libsmi-0.5.0/lib'
make[2]: Entering directory '/usr/src/RPM/BUILD/libsmi-0.5.0/lib'
/bin/sh ../libtool  --tag=CC   --mode=compile x86_64-alt-linux-gcc -DHAVE_CONFIG_H -I. -I..     -pipe -frecord-gcc-switches -Wall -g -O2 -flto=auto  -c -o smi2yang.lo smi2yang.c
libtool: compile:  x86_64-alt-linux-gcc -DHAVE_CONFIG_H -I. -I.. -pipe -frecord-gcc-switches -Wall -g -O2 -flto=auto -c smi2yang.c  -fPIC -DPIC -o .libs/smi2yang.o
smi2yang.c: In function 'smi2yangLeafPath':
smi2yang.c:442:28: warning: unused variable 'parentModule' [-Wunused-variable]
  442 |     SmiModule *smiModule, *parentModule = NULL;
      |                            ^~~~~~~~~~~~
make[2]: Leaving directory '/usr/src/RPM/BUILD/libsmi-0.5.0/lib'
make[2]: Entering directory '/usr/src/RPM/BUILD/libsmi-0.5.0/lib'
/bin/sh ../libtool  --tag=CC   --mode=compile x86_64-alt-linux-gcc -DHAVE_CONFIG_H -I. -I..     -pipe -frecord-gcc-switches -Wall -g -O2 -flto=auto  -c -o yang-check.lo yang-check.c
libtool: compile:  x86_64-alt-linux-gcc -DHAVE_CONFIG_H -I. -I.. -pipe -frecord-gcc-switches -Wall -g -O2 -flto=auto -c yang-check.c  -fPIC -DPIC -o .libs/yang-check.o
yang-check.c: In function 'findTargetNode':
yang-check.c:249:65: warning: suggest parentheses around '&&' within '||' [-Wparentheses]
  249 |                 || childPtr->export.nodeKind == YANG_DECL_INPUT && !strcmp("input", value)
      |                    ~~~~~~~~~~~~~~~~~~~~~~~~~~~~~~~~~~~~~~~~~~~~~^~~~~~~~~~~~~~~~~~~~~~~~~~
yang-check.c:250:66: warning: suggest parentheses around '&&' within '||' [-Wparentheses]
  250 |                 || childPtr->export.nodeKind == YANG_DECL_OUTPUT && !strcmp("output", value))
      |                    ~~~~~~~~~~~~~~~~~~~~~~~~~~~~~~~~~~~~~~~~~~~~~~^~~~~~~~~~~~~~~~~~~~~~~~~~~
yang-check.c: In function 'resolveXPath':
yang-check.c:328:43: warning: comparison between 'YangStatus' and 'enum _YangParsingState' [-Wenum-compare]
  328 |                 && tmpNode->export.status == YANG_PARSING_IN_PROGRESS) {
      |                                           ^~
yang-check.c: In function 'typeHandler':
yang-check.c:1075:9: warning: enumeration value 'YANG_TYPE_NONE' not handled in switch [-Wswitch]
 1075 |         switch (nodePtr->typeInfo->builtinType) {
      |         ^~~~~~
yang-check.c:1075:9: warning: enumeration value 'YANG_TYPE_BINARY' not handled in switch [-Wswitch]
yang-check.c:1075:9: warning: enumeration value 'YANG_TYPE_BOOLEAN' not handled in switch [-Wswitch]
yang-check.c:1075:9: warning: enumeration value 'YANG_TYPE_EMPTY' not handled in switch [-Wswitch]
yang-check.c:1075:9: warning: enumeration value 'YANG_TYPE_INSTANCE_IDENTIFIER' not handled in switch [-Wswitch]
yang-check.c:1075:9: warning: enumeration value 'YANG_TYPE_INT8' not handled in switch [-Wswitch]
yang-check.c:1075:9: warning: enumeration value 'YANG_TYPE_INT16' not handled in switch [-Wswitch]
yang-check.c:1075:9: warning: enumeration value 'YANG_TYPE_INT32' not handled in switch [-Wswitch]
yang-check.c:1075:9: warning: enumeration value 'YANG_TYPE_INT64' not handled in switch [-Wswitch]
yang-check.c:1075:9: warning: enumeration value 'YANG_TYPE_STRING' not handled in switch [-Wswitch]
yang-check.c:1075:9: warning: enumeration value 'YANG_TYPE_UINT8' not handled in switch [-Wswitch]
yang-check.c:1075:9: warning: enumeration value 'YANG_TYPE_UINT16' not handled in switch [-Wswitch]
yang-check.c:1075:9: warning: enumeration value 'YANG_TYPE_UINT32' not handled in switch [-Wswitch]
yang-check.c:1075:9: warning: enumeration value 'YANG_TYPE_UINT64' not handled in switch [-Wswitch]
make[2]: Leaving directory '/usr/src/RPM/BUILD/libsmi-0.5.0/lib'
make[2]: Entering directory '/usr/src/RPM/BUILD/libsmi-0.5.0/lib'
/bin/sh ../libtool  --tag=CC   --mode=compile x86_64-alt-linux-gcc -DHAVE_CONFIG_H -I. -I..     -pipe -frecord-gcc-switches -Wall -g -O2 -flto=auto  -c -o smi-check.lo smi-check.c
libtool: compile:  x86_64-alt-linux-gcc -DHAVE_CONFIG_H -I. -I.. -pipe -frecord-gcc-switches -Wall -g -O2 -flto=auto -c smi-check.c  -fPIC -DPIC -o .libs/smi-check.o
smi-check.c: In function 'smiCheckIndex':
smi-check.c:779:9: warning: enumeration value 'SMI_BASETYPE_POINTER' not handled in switch [-Wswitch]
  779 |         switch (typePtr->export.basetype) {
      |         ^~~~~~
smi-check.c: In function 'smiCheckNotificationMembers':
smi-check.c:2085:11: warning: variable 'node' set but not used [-Wunused-but-set-variable]
 2085 |     Node *node = NULL;
      |           ^~~~
make[2]: Leaving directory '/usr/src/RPM/BUILD/libsmi-0.5.0/lib'
make[2]: Entering directory '/usr/src/RPM/BUILD/libsmi-0.5.0/lib'
/bin/sh ../libtool  --tag=CC   --mode=compile x86_64-alt-linux-gcc -DHAVE_CONFIG_H -I. -I..     -pipe -frecord-gcc-switches -Wall -g -O2 -flto=auto  -c -o yang-data.lo yang-data.c
libtool: compile:  x86_64-alt-linux-gcc -DHAVE_CONFIG_H -I. -I.. -pipe -frecord-gcc-switches -Wall -g -O2 -flto=auto -c yang-data.c  -fPIC -DPIC -o .libs/yang-data.o
yang-data.c: In function 'getUniqueList':
yang-data.c:1173:28: warning: unused variable 'item' [-Wunused-variable]
 1173 |     YangList *ret = NULL, *item = NULL, *prev = NULL;
      |                            ^~~~
make[2]: Leaving directory '/usr/src/RPM/BUILD/libsmi-0.5.0/lib'
make[2]: Entering directory '/usr/src/RPM/BUILD/libsmi-0.5.0/lib'
/bin/sh ../libtool  --tag=CC   --mode=compile x86_64-alt-linux-gcc -DHAVE_CONFIG_H -I. -I..     -pipe -frecord-gcc-switches -Wall -g -O2 -flto=auto  -c -o smi-data.lo smi-data.c
libtool: compile:  x86_64-alt-linux-gcc -DHAVE_CONFIG_H -I. -I.. -pipe -frecord-gcc-switches -Wall -g -O2 -flto=auto -c smi-data.c  -fPIC -DPIC -o .libs/smi-data.o
make[2]: Leaving directory '/usr/src/RPM/BUILD/libsmi-0.5.0/lib'
make[2]: Entering directory '/usr/src/RPM/BUILD/libsmi-0.5.0/lib'
/bin/sh ../libtool  --tag=CC   --mode=compile x86_64-alt-linux-gcc -DHAVE_CONFIG_H -I. -I..     -pipe -frecord-gcc-switches -Wall -g -O2 -flto=auto  -c -o smi.lo smi.c
libtool: compile:  x86_64-alt-linux-gcc -DHAVE_CONFIG_H -I. -I.. -pipe -frecord-gcc-switches -Wall -g -O2 -flto=auto -c smi.c  -fPIC -DPIC -o .libs/smi.o
smi.c: In function 'smiValueAsString':
smi.c:522:9: warning: enumeration value 'SMI_LANGUAGE_UNKNOWN' not handled in switch [-Wswitch]
  522 |         switch (smiLanguage) {
      |         ^~~~~~
smi.c: In function 'smiUnpack':
smi.c:3000:15: warning: variable 'last' set but not used [-Wunused-but-set-variable]
 3000 |     int i, j, last = 0;
      |               ^~~~
make[2]: Leaving directory '/usr/src/RPM/BUILD/libsmi-0.5.0/lib'
make[2]: Entering directory '/usr/src/RPM/BUILD/libsmi-0.5.0/lib'
/usr/bin/bison --defines=parser-sming.tab.h -t -psming -o parser-sming.c parser-sming.y
parser-sming.y:352.1-12: warning: deprecated directive: '%pure_parser', use '%define api.pure' [-Wdeprecated]
  352 | %pure_parser
      | ^~~~~~~~~~~~
      | %define api.pure
parser-sming.y: warning: fix-its can be applied.  Rerun with option '--update'. [-Wother]
make[2]: Leaving directory '/usr/src/RPM/BUILD/libsmi-0.5.0/lib'
make[2]: Entering directory '/usr/src/RPM/BUILD/libsmi-0.5.0/lib'
/usr/bin/bison --defines=parser-sming.tab.h -t -psming -o parser-sming.c parser-sming.y
parser-sming.y:352.1-12: warning: deprecated directive: '%pure_parser', use '%define api.pure' [-Wdeprecated]
  352 | %pure_parser
      | ^~~~~~~~~~~~
      | %define api.pure
parser-sming.y: warning: fix-its can be applied.  Rerun with option '--update'. [-Wother]
make[2]: Leaving directory '/usr/src/RPM/BUILD/libsmi-0.5.0/lib'
make[2]: Entering directory '/usr/src/RPM/BUILD/libsmi-0.5.0/lib'
/usr/bin/bison --defines=parser-smi.tab.h -t -psmi -o parser-smi.c parser-smi.y
parser-smi.y:1290.1-12: warning: deprecated directive: '%pure_parser', use '%define api.pure' [-Wdeprecated]
 1290 | %pure_parser
      | ^~~~~~~~~~~~
      | %define api.pure
parser-smi.y: warning: 76 reduce/reduce conflicts [-Wconflicts-rr]
parser-smi.y: note: rerun with option '-Wcounterexamples' to generate conflict counterexamples
parser-smi.y: warning: fix-its can be applied.  Rerun with option '--update'. [-Wother]
make[2]: Leaving directory '/usr/src/RPM/BUILD/libsmi-0.5.0/lib'
make[2]: Entering directory '/usr/src/RPM/BUILD/libsmi-0.5.0/lib'
/usr/bin/bison --defines=parser-smi.tab.h -t -psmi -o parser-smi.c parser-smi.y
parser-smi.y:1290.1-12: warning: deprecated directive: '%pure_parser', use '%define api.pure' [-Wdeprecated]
 1290 | %pure_parser
      | ^~~~~~~~~~~~
      | %define api.pure
parser-smi.y: warning: 76 reduce/reduce conflicts [-Wconflicts-rr]
parser-smi.y: note: rerun with option '-Wcounterexamples' to generate conflict counterexamples
parser-smi.y: warning: fix-its can be applied.  Rerun with option '--update'. [-Wother]
make[2]: Leaving directory '/usr/src/RPM/BUILD/libsmi-0.5.0/lib'
make[1]: *** [Makefile:519: all-recursive] Error 1
make: *** [Makefile:405: all] Error 2
error: Bad exit status from /usr/src/tmp/rpm-tmp.71360 (%build)


RPM build errors:
    Bad exit status from /usr/src/tmp/rpm-tmp.71360 (%build)
Command exited with non-zero status 1
5.85user 5.15system 0:08.48elapsed 129%CPU (0avgtext+0avgdata 29696maxresident)k
0inputs+0outputs (0major+998484minor)pagefaults 0swaps
hsh-rebuild: rebuild of `libsmi-0.5.0-alt2.src.rpm' failed.
Command exited with non-zero status 1
3.48user 2.62system 0:18.73elapsed 32%CPU (0avgtext+0avgdata 135796maxresident)k
5128inputs+0outputs (0major+197019minor)pagefaults 0swaps