<86>Nov 14 04:29:35 userdel[746500]: delete user 'rooter'
<86>Nov 14 04:29:35 userdel[746500]: removed group 'rooter' owned by 'rooter'
<86>Nov 14 04:29:35 userdel[746500]: removed shadow group 'rooter' owned by 'rooter'
<86>Nov 14 04:29:35 groupadd[746530]: group added to /etc/group: name=rooter, GID=1862
<86>Nov 14 04:29:35 groupadd[746530]: group added to /etc/gshadow: name=rooter
<86>Nov 14 04:29:35 groupadd[746530]: new group: name=rooter, GID=1862
<86>Nov 14 04:29:35 useradd[746544]: new user: name=rooter, UID=1862, GID=1862, home=/root, shell=/bin/bash, from=none
<86>Nov 14 04:29:35 userdel[746563]: delete user 'builder'
<86>Nov 14 04:29:35 userdel[746563]: removed group 'builder' owned by 'builder'
<86>Nov 14 04:29:35 userdel[746563]: removed shadow group 'builder' owned by 'builder'
<86>Nov 14 04:29:35 groupadd[746582]: group added to /etc/group: name=builder, GID=1863
<86>Nov 14 04:29:35 groupadd[746582]: group added to /etc/gshadow: name=builder
<86>Nov 14 04:29:35 groupadd[746582]: new group: name=builder, GID=1863
<86>Nov 14 04:29:35 useradd[746597]: new user: name=builder, UID=1863, GID=1863, home=/usr/src, shell=/bin/bash, from=none
<13>Nov 14 04:29:39 rpmi: rpm-macros-cmake-3.29.1-alt1 sisyphus+344518.300.3.1 1712379787 installed
<13>Nov 14 04:29:40 rpmi: libglvnd-7:1.7.0-alt1 sisyphus+330949.100.1.1 1696424893 installed
<13>Nov 14 04:29:40 rpmi: libidn2-2.3.7-alt1 sisyphus+339505.100.1.2 1706718968 installed
<13>Nov 14 04:29:40 rpmi: libnettle8-3.9.1-alt1 sisyphus+322548.100.1.2 1686176879 installed
<13>Nov 14 04:29:40 rpmi: libogg-1.3.5-alt1 sisyphus+278100.3400.1.1 1626058929 installed
<13>Nov 14 04:29:40 rpmi: xorg-proto-devel-2024.1-alt1 sisyphus+343583.40.1.1 1711440649 installed
<13>Nov 14 04:29:40 rpmi: libwayland-server-1.23.1-alt1.1 sisyphus+356019.140.3.1 1724572111 installed
<13>Nov 14 04:29:40 rpmi: libuv-1.48.0-alt2 sisyphus+357579.100.1.1 1726426171 installed
<13>Nov 14 04:29:40 rpmi: libexpat-2.5.0-alt1 sisyphus+346180.200.2.1 1716349835 installed
<13>Nov 14 04:29:40 rpmi: libp11-kit-1:0.25.5-alt1 sisyphus+352553.100.1.1 1720622573 installed
<13>Nov 14 04:29:40 rpmi: libtasn1-4.19.0-alt3 sisyphus+327816.100.1.1 1692802615 installed
<13>Nov 14 04:29:40 rpmi: libvorbis-1.3.7-alt1 sisyphus+275738.100.1.1 1624751601 installed
<13>Nov 14 04:29:40 rpmi: libogg-devel-1.3.5-alt1 sisyphus+278100.3400.1.1 1626058929 installed
<13>Nov 14 04:29:40 rpmi: libhogweed6-3.9.1-alt1 sisyphus+322548.100.1.2 1686176879 installed
<13>Nov 14 04:29:40 rpmi: libgnutls30-3.8.4-alt1 sisyphus+343729.100.2.1 1711571288 installed
<13>Nov 14 04:29:41 rpmi: libngtcp2.16-1.7.0-alt1 sisyphus+356415.200.1.1 1725031912 installed
<13>Nov 14 04:29:41 rpmi: libngtcp2_crypto_gnutls8-1.7.0-alt1 sisyphus+356415.200.1.1 1725031912 installed
<13>Nov 14 04:29:41 rpmi: libGLES-7:1.7.0-alt1 sisyphus+330949.100.1.1 1696424893 installed
<13>Nov 14 04:29:41 rpmi: libOpenGL-7:1.7.0-alt1 sisyphus+330949.100.1.1 1696424893 installed
<13>Nov 14 04:29:41 rpmi: libpng16-1.6.42-alt2 sisyphus+339555.100.1.1 1706781682 installed
<13>Nov 14 04:29:41 rpmi: zlib-devel-1.3.1-alt1 sisyphus+342532.100.1.1 1710232285 installed
<13>Nov 14 04:29:41 rpmi: libjpeg-2:3.0.2-alt2.1 sisyphus+340135.100.1.1 1707449145 installed
<13>Nov 14 04:29:41 rpmi: libturbojpeg-2:3.0.2-alt2.1 sisyphus+340135.100.1.1 1707449145 installed
<13>Nov 14 04:29:41 rpmi: libSDL2-2.30.9-alt1 sisyphus+361541.100.1.1 1730534342 installed
<13>Nov 14 04:29:41 rpmi: libxshmfence-1.3.2-alt1 sisyphus+311428.400.1.1 1670577525 installed
<13>Nov 14 04:29:41 rpmi: libsensors3-3.6.0-alt3 sisyphus+308579.100.1.1 1666035267 installed
<13>Nov 14 04:29:41 rpmi: libX11-locales-3:1.8.10-alt1 sisyphus+353866.100.1.1 1722240771 installed
<13>Nov 14 04:29:41 rpmi: llvm18.1-filesystem-18.1.8-alt0.3 sisyphus+362390.100.1.1 1731449765 installed
<13>Nov 14 04:29:41 rpmi: llvm18.1-polly-18.1.8-alt0.3 sisyphus+362390.100.1.1 1731449765 installed
<13>Nov 14 04:29:41 rpmi: libedit3-3.1.20230828-alt1 sisyphus+330914.200.3.1 1696922743 installed
<13>Nov 14 04:29:41 rpmi: llvm18.1-gold-18.1.8-alt0.3 sisyphus+362390.100.1.1 1731449765 installed
<13>Nov 14 04:29:42 rpmi: llvm18.1-libs-18.1.8-alt0.3 sisyphus+362390.100.1.1 1731449765 installed
<13>Nov 14 04:29:42 rpmi: libXdmcp-1.1.5-alt1 sisyphus+343583.700.1.1 1711441061 installed
<13>Nov 14 04:29:42 rpmi: libXau-1.0.11-alt1 sisyphus+311428.100.1.1 1670577439 installed
<13>Nov 14 04:29:42 rpmi: libxcb-1.17.0-alt1 sisyphus+345308.200.1.1 1713342004 installed
<13>Nov 14 04:29:42 rpmi: libX11-3:1.8.10-alt1 sisyphus+353866.100.1.1 1722240771 installed
<13>Nov 14 04:29:42 rpmi: libXext-1.3.6-alt1 sisyphus+343583.1000.1.1 1711441101 installed
<13>Nov 14 04:29:42 rpmi: libXxf86vm-1.1.5-alt1 sisyphus+308663.1400.1.1 1666168523 installed
<13>Nov 14 04:29:42 rpmi: libXfixes-6.0.1-alt1 sisyphus+331490.300.1.1 1697023233 installed
<13>Nov 14 04:29:43 rpmi: libxcb-devel-1.17.0-alt1 sisyphus+345308.200.1.1 1713342004 installed
<13>Nov 14 04:29:43 rpmi: libX11-devel-3:1.8.10-alt1 sisyphus+353866.100.1.1 1722240771 installed
<13>Nov 14 04:29:43 rpmi: libwayland-client-1.23.1-alt1.1 sisyphus+356019.140.3.1 1724572111 installed
<13>Nov 14 04:29:43 rpmi: libpciaccess-1:0.18.1-alt1 sisyphus+343583.300.1.1 1711440789 installed
<13>Nov 14 04:29:43 rpmi: libdrm-1:2.4.123-alt1 sisyphus+357330.40.3.1 1726125397 installed
<13>Nov 14 04:29:44 rpmi: libGLX-mesa-4:24.2.6-alt1 sisyphus+361255.100.1.1 1730364463 installed
<13>Nov 14 04:29:44 rpmi: libgbm-4:24.2.6-alt1 sisyphus+361255.100.1.1 1730364463 installed
<13>Nov 14 04:29:44 rpmi: libEGL-mesa-4:24.2.6-alt1 sisyphus+361255.100.1.1 1730364463 installed
<13>Nov 14 04:29:44 rpmi: libEGL-7:1.7.0-alt1 sisyphus+330949.100.1.1 1696424893 installed
<13>Nov 14 04:29:44 rpmi: libGLX-7:1.7.0-alt1 sisyphus+330949.100.1.1 1696424893 installed
<13>Nov 14 04:29:44 rpmi: libGL-7:1.7.0-alt1 sisyphus+330949.100.1.1 1696424893 installed
<13>Nov 14 04:29:44 rpmi: libglvnd-devel-7:1.7.0-alt1 sisyphus+330949.100.1.1 1696424893 installed
<13>Nov 14 04:29:44 rpmi: libGLU-4:9.0.1-alt1 sisyphus+278350.100.1.2 1626174382 installed
<13>Nov 14 04:29:44 rpmi: cmake-modules-3.29.3-alt1 sisyphus+348648.100.2.1 1716590540 installed
<13>Nov 14 04:29:44 rpmi: librhash-1.3.5-alt3 sisyphus+286141.40.2.1 1632982456 installed
<13>Nov 14 04:29:44 rpmi: libjsoncpp24-1.9.4-alt2 sisyphus+346331.200.2.1 1716448551 installed
<13>Nov 14 04:29:44 rpmi: publicsuffix-list-dafsa-20240911-alt1 sisyphus+357399.100.1.1 1726160479 installed
<13>Nov 14 04:29:44 rpmi: libpsl-0.21.5-alt1 sisyphus+338474.100.1.1 1705684769 installed
<13>Nov 14 04:29:44 rpmi: libnghttp3.9-1.5.0-alt1 sisyphus+356415.100.1.1 1725031855 installed
<13>Nov 14 04:29:44 rpmi: libnghttp2-1.63.0-alt1 sisyphus+356414.100.1.1 1725031508 installed
<13>Nov 14 04:29:44 rpmi: openldap-common-2.6.8-alt1 sisyphus+351621.100.1.1 1719420449 installed
<13>Nov 14 04:29:44 rpmi: libntlm-1.5-alt1 sisyphus+278100.3300.1.1 1626058899 installed
<13>Nov 14 04:29:44 rpmi: libidn-1.37-alt2 sisyphus+300849.100.1.1 1653769687 installed
<13>Nov 14 04:29:44 rpmi: libverto-0.3.2-alt1_1 sisyphus+321176.2200.10.2 1684803947 installed
<13>Nov 14 04:29:44 rpmi: liblmdb-0.9.33-alt1 sisyphus+360625.100.1.1 1729819640 installed
<13>Nov 14 04:29:44 rpmi: libkeyutils-1.6.3-alt1 sisyphus+346336.200.2.2 1716472658 installed
<13>Nov 14 04:29:44 rpmi: libcom_err-1.46.4.0.5.4cda-alt1 sisyphus+283826.100.1.1 1629975345 installed
<13>Nov 14 04:29:44 rpmi: libbrotlicommon-1.1.0-alt1 sisyphus+328501.100.1.1 1693598419 installed
<13>Nov 14 04:29:44 rpmi: libbrotlidec-1.1.0-alt1 sisyphus+328501.100.1.1 1693598419 installed
<13>Nov 14 04:29:44 rpmi: rpm-macros-alternatives-0.5.2-alt2 sisyphus+315270.200.2.1 1676457367 installed
<13>Nov 14 04:29:44 rpmi: alternatives-0.5.2-alt2 sisyphus+315270.200.2.1 1676457367 installed
<13>Nov 14 04:29:44 rpmi: ca-certificates-2024.07.01-alt1 sisyphus+351897.100.1.1 1719826350 installed
<13>Nov 14 04:29:44 rpmi: ca-trust-0.2.0-alt1 sisyphus+344843.100.1.1 1712743326 installed
<13>Nov 14 04:29:44 rpmi: p11-kit-trust-1:0.25.5-alt1 sisyphus+352553.100.1.1 1720622573 installed
<13>Nov 14 04:29:44 rpmi: libcrypto3-3.1.7-alt2 sisyphus+359910.100.1.1 1729080439 installed
<13>Nov 14 04:29:44 rpmi: libssl3-3.1.7-alt2 sisyphus+359910.100.1.1 1729080439 installed
<86>Nov 14 04:29:44 groupadd[766305]: group added to /etc/group: name=_keytab, GID=999
<86>Nov 14 04:29:44 groupadd[766305]: group added to /etc/gshadow: name=_keytab
<86>Nov 14 04:29:44 groupadd[766305]: new group: name=_keytab, GID=999
<13>Nov 14 04:29:44 rpmi: libkrb5-1.21.3-alt2 sisyphus+351857.100.1.1 1719735141 installed
<13>Nov 14 04:29:44 rpmi: libgsasl18-2.2.1-alt2 sisyphus+359713.200.2.1 1728905430 installed
<86>Nov 14 04:29:44 groupadd[766457]: group added to /etc/group: name=sasl, GID=998
<86>Nov 14 04:29:44 groupadd[766457]: group added to /etc/gshadow: name=sasl
<86>Nov 14 04:29:44 groupadd[766457]: new group: name=sasl, GID=998
<13>Nov 14 04:29:44 rpmi: libsasl2-3-2.1.28-alt2 sisyphus+343335.100.1.1 1711112544 installed
<13>Nov 14 04:29:44 rpmi: libldap2-2.6.8-alt1 sisyphus+351621.100.1.1 1719420449 installed
<13>Nov 14 04:29:44 rpmi: libarchive13-3.7.5-alt2 sisyphus+358189.100.1.1 1727162763 installed
<13>Nov 14 04:29:44 rpmi: libssh2-1.11.0-alt2 sisyphus+339356.100.1.1 1706593137 installed
<13>Nov 14 04:29:44 rpmi: libcurl-8.11.0-alt1 sisyphus+361800.100.1.1 1730880969 installed
<13>Nov 14 04:29:45 rpmi: cmake-3.29.3-alt1 sisyphus+348648.100.2.1 1716590540 installed
<13>Nov 14 04:29:45 rpmi: libssl-devel-3.1.7-alt2 sisyphus+359910.100.1.1 1729080439 installed
<13>Nov 14 04:29:45 rpmi: libGLU-devel-4:9.0.1-alt1 sisyphus+278350.100.1.2 1626174382 installed
<13>Nov 14 04:29:45 rpmi: libSDL2-devel-2.30.9-alt1 sisyphus+361541.100.1.1 1730534342 installed
<13>Nov 14 04:29:45 rpmi: libjpeg-devel-2:3.0.2-alt2.1 sisyphus+340135.100.1.1 1707449145 installed
<13>Nov 14 04:29:45 rpmi: libpng-devel-1.6.42-alt2 sisyphus+339555.100.1.1 1706781682 installed
<13>Nov 14 04:29:45 rpmi: libvorbis-devel-1.3.7-alt1 sisyphus+275738.100.1.1 1624751601 installed
<13>Nov 14 04:29:45 rpmi: libuv-devel-1.48.0-alt2 sisyphus+357579.100.1.1 1726426171 installed
<13>Nov 14 04:29:45 rpmi: libdb4.7-devel-4.7.25-alt13 sisyphus+341099.200.4.1 1709732031 installed
Building target platforms: x86_64
Building for target x86_64
Wrote: /usr/src/in/nosrpm/hashlink-1.11-alt3.nosrc.rpm (w1.gzdio)
Installing hashlink-1.11-alt3.src.rpm
Building target platforms: x86_64
Building for target x86_64
Executing(%prep): /bin/sh -e /usr/src/tmp/rpm-tmp.61270
+ umask 022
+ /bin/mkdir -p /usr/src/RPM/BUILD
+ cd /usr/src/RPM/BUILD
+ cd /usr/src/RPM/BUILD
+ rm -rf hashlink-1.11
+ echo 'Source #0 (hashlink-1.11.tar):'
Source #0 (hashlink-1.11.tar):
+ /bin/tar -xf /usr/src/RPM/SOURCES/hashlink-1.11.tar
+ cd hashlink-1.11
+ /bin/chmod -c -Rf u+rwX,go-w .
+ exit 0
Executing(%build): /bin/sh -e /usr/src/tmp/rpm-tmp.61270
+ umask 022
+ /bin/mkdir -p /usr/src/RPM/BUILD
+ cd /usr/src/RPM/BUILD
+ cd hashlink-1.11
+ mkdir -p .
+ cmake -DCMAKE_SKIP_INSTALL_RPATH:BOOL=yes '-DCMAKE_C_FLAGS:STRING=-pipe -frecord-gcc-switches -Wall -g -O2 -flto=auto' '-DCMAKE_CXX_FLAGS:STRING=-pipe -frecord-gcc-switches -Wall -g -O2 -flto=auto' '-DCMAKE_Fortran_FLAGS:STRING=-pipe -frecord-gcc-switches -Wall -g -O2 -flto=auto' -DCMAKE_INSTALL_PREFIX=/usr -DINCLUDE_INSTALL_DIR:PATH=/usr/include -DLIB_INSTALL_DIR:PATH=/usr/lib64 -DSYSCONF_INSTALL_DIR:PATH=/etc -DSHARE_INSTALL_PREFIX:PATH=/usr/share -DLIB_DESTINATION=lib64 -DLIB_SUFFIX=64 -S . -B . -D BUILD_TESTING=OFF
CMake Deprecation Warning at CMakeLists.txt:1 (cmake_minimum_required):
  Compatibility with CMake < 3.5 will be removed from a future version of
  CMake.

  Update the VERSION argument <min> value or use a ...<max> suffix to tell
  CMake that the project does not need compatibility with older versions.


-- The C compiler identification is GNU 14.2.1
-- Detecting C compiler ABI info
-- Detecting C compiler ABI info - done
-- Check for working C compiler: /usr/bin/cc - skipped
-- Detecting C compile features
-- Detecting C compile features - done
-- Found PkgConfig: /usr/bin/pkg-config (found version "0.29.2")
-- Found ZLIB: /usr/lib64/libz.so (found version "1.3.1")
-- Found PNG: /usr/lib64/libpng.so (found version "1.6.42")
-- Performing Test TURBOJPEG_WORKS
-- Performing Test TURBOJPEG_WORKS - Success
-- Looking for vorbis_bitrate_addblock in vorbis
-- Looking for vorbis_bitrate_addblock in vorbis - found
-- Performing Test CMAKE_HAVE_LIBC_PTHREAD
-- Performing Test CMAKE_HAVE_LIBC_PTHREAD - Success
-- Found Threads: TRUE
-- Found SDL2: /usr/lib64/libSDL2.so
-- Found LibUV: /usr/lib64/libuv.so (found version "")
-- Configuring done (0.6s)
-- Generating done (0.0s)
CMake Warning:
  Manually-specified variables were not used by the project:

    CMAKE_CXX_FLAGS
    CMAKE_Fortran_FLAGS
    INCLUDE_INSTALL_DIR
    LIB_DESTINATION
    LIB_INSTALL_DIR
    LIB_SUFFIX
    SHARE_INSTALL_PREFIX
    SYSCONF_INSTALL_DIR


-- Build files have been written to: /usr/src/RPM/BUILD/hashlink-1.11
+ make -j16 MAKE=/usr/bin/make
make[2]: Entering directory '/usr/src/RPM/BUILD/hashlink-1.11'
[  1%] Building C object CMakeFiles/libhl.dir/include/pcre/pcre16_ord2utf16.c.o
make[2]: Leaving directory '/usr/src/RPM/BUILD/hashlink-1.11'
make[2]: Entering directory '/usr/src/RPM/BUILD/hashlink-1.11'
[  3%] Building C object CMakeFiles/libhl.dir/include/pcre/pcre_chartables.c.o
make[2]: Leaving directory '/usr/src/RPM/BUILD/hashlink-1.11'
make[2]: Entering directory '/usr/src/RPM/BUILD/hashlink-1.11'
[ 22%] Building C object CMakeFiles/libhl.dir/include/pcre/pcre_newline.c.o
make[2]: Leaving directory '/usr/src/RPM/BUILD/hashlink-1.11'
make[2]: Entering directory '/usr/src/RPM/BUILD/hashlink-1.11'
[ 10%] Building C object CMakeFiles/libhl.dir/include/pcre/pcre_globals.c.o
make[2]: Leaving directory '/usr/src/RPM/BUILD/hashlink-1.11'
make[2]: Entering directory '/usr/src/RPM/BUILD/hashlink-1.11'
[ 13%] Building C object CMakeFiles/libhl.dir/include/pcre/pcre_string_utils.c.o
make[2]: Leaving directory '/usr/src/RPM/BUILD/hashlink-1.11'
make[2]: Entering directory '/usr/src/RPM/BUILD/hashlink-1.11'
[ 18%] Building C object CMakeFiles/libhl.dir/include/pcre/pcre_fullinfo.c.o
make[2]: Leaving directory '/usr/src/RPM/BUILD/hashlink-1.11'
make[2]: Entering directory '/usr/src/RPM/BUILD/hashlink-1.11'
[ 11%] Building C object CMakeFiles/libhl.dir/include/pcre/pcre_tables.c.o
make[2]: Leaving directory '/usr/src/RPM/BUILD/hashlink-1.11'
make[2]: Entering directory '/usr/src/RPM/BUILD/hashlink-1.11'
[  8%] Building C object CMakeFiles/libhl.dir/include/pcre/pcre16_valid_utf16.c.o
make[2]: Leaving directory '/usr/src/RPM/BUILD/hashlink-1.11'
make[2]: Entering directory '/usr/src/RPM/BUILD/hashlink-1.11'
[ 15%] Building C object CMakeFiles/libhl.dir/include/pcre/pcre_xclass.c.o
make[2]: Leaving directory '/usr/src/RPM/BUILD/hashlink-1.11'
make[2]: Entering directory '/usr/src/RPM/BUILD/hashlink-1.11'
[ 25%] Building C object CMakeFiles/libhl.dir/src/std/array.c.o
make[2]: Leaving directory '/usr/src/RPM/BUILD/hashlink-1.11'
make[2]: Entering directory '/usr/src/RPM/BUILD/hashlink-1.11'
[ 27%] Building C object CMakeFiles/libhl.dir/src/std/buffer.c.o
make[2]: Leaving directory '/usr/src/RPM/BUILD/hashlink-1.11'
make[2]: Entering directory '/usr/src/RPM/BUILD/hashlink-1.11'
[ 35%] Building C object CMakeFiles/libhl.dir/src/std/error.c.o
make[2]: Leaving directory '/usr/src/RPM/BUILD/hashlink-1.11'
make[2]: Entering directory '/usr/src/RPM/BUILD/hashlink-1.11'
[ 33%] Building C object CMakeFiles/libhl.dir/src/std/date.c.o
make[2]: Leaving directory '/usr/src/RPM/BUILD/hashlink-1.11'
make[2]: Entering directory '/usr/src/RPM/BUILD/hashlink-1.11'
[ 33%] Building C object CMakeFiles/libhl.dir/src/std/file.c.o
make[2]: Leaving directory '/usr/src/RPM/BUILD/hashlink-1.11'
make[2]: Entering directory '/usr/src/RPM/BUILD/hashlink-1.11'
[ 28%] Building C object CMakeFiles/libhl.dir/src/std/bytes.c.o
/usr/src/RPM/BUILD/hashlink-1.11/src/std/bytes.c: In function 'hl_bytes_from_address':
/usr/src/RPM/BUILD/hashlink-1.11/src/std/bytes.c:244:17: warning: dereferencing type-punned pointer will break strict-aliasing rules [-Wstrict-aliasing]
  244 |         return *(vbyte**)&i64;
      |                 ^~~~~~~~~~~~~
/usr/src/RPM/BUILD/hashlink-1.11/src/std/bytes.c:244:16: warning: 'i64' is used uninitialized [-Wuninitialized]
  244 |         return *(vbyte**)&i64;
      |                ^~~~~~~~~~~~~~
/usr/src/RPM/BUILD/hashlink-1.11/src/std/bytes.c:241:39: note: 'i64' declared here
  241 |         struct { int low; int high; } i64;
      |                                       ^~~
make[2]: Leaving directory '/usr/src/RPM/BUILD/hashlink-1.11'
make[2]: Entering directory '/usr/src/RPM/BUILD/hashlink-1.11'
[ 16%] Building C object CMakeFiles/libhl.dir/include/pcre/pcre_ucd.c.o
make[2]: Leaving directory '/usr/src/RPM/BUILD/hashlink-1.11'
make[2]: Entering directory '/usr/src/RPM/BUILD/hashlink-1.11'
[ 37%] Building C object CMakeFiles/libhl.dir/src/std/fun.c.o
make[2]: Leaving directory '/usr/src/RPM/BUILD/hashlink-1.11'
make[2]: Entering directory '/usr/src/RPM/BUILD/hashlink-1.11'
[ 20%] Building C object CMakeFiles/libhl.dir/src/gc.c.o
/usr/src/RPM/BUILD/hashlink-1.11/src/gc.c: In function 'gc_mark':
/usr/src/RPM/BUILD/hashlink-1.11/src/gc.c:678:82: warning: expression does not compute the number of elements in this array; element type is 'struct __jmp_buf_tag', not 'void *' [-Wsizeof-array-div]
  678 |                 gc_mark_stack(&t->gc_regs,(void**)&t->gc_regs + (sizeof(jmp_buf) / sizeof(void*) - 1));
      |                                                                                  ^
/usr/src/RPM/BUILD/hashlink-1.11/src/gc.c:678:82: note: add parentheses around the second 'sizeof' to silence this warning
/usr/src/RPM/BUILD/hashlink-1.11/src/gc.c: In function 'gc_save_context':
/usr/src/RPM/BUILD/hashlink-1.11/src/gc.c:212:22: warning: storing the address of local variable 't' in 't.13_3->stack_cur' [-Wdangling-pointer=]
  212 |         t->stack_cur = &t;
      |         ~~~~~~~~~~~~~^~~~
/usr/src/RPM/BUILD/hashlink-1.11/src/gc.c:210:45: note: 't' declared here
  210 | static void gc_save_context(hl_thread_info *t ) {
      |                             ~~~~~~~~~~~~~~~~^
/usr/src/RPM/BUILD/hashlink-1.11/src/gc.c:210:45: note: 't' declared here
make[2]: Leaving directory '/usr/src/RPM/BUILD/hashlink-1.11'
make[2]: Entering directory '/usr/src/RPM/BUILD/hashlink-1.11'
[ 30%] Building C object CMakeFiles/libhl.dir/src/std/cast.c.o
make[2]: Leaving directory '/usr/src/RPM/BUILD/hashlink-1.11'
make[2]: Entering directory '/usr/src/RPM/BUILD/hashlink-1.11'
[ 45%] Building C object CMakeFiles/libhl.dir/src/std/random.c.o
make[2]: Leaving directory '/usr/src/RPM/BUILD/hashlink-1.11'
make[2]: Entering directory '/usr/src/RPM/BUILD/hashlink-1.11'
[ 44%] Building C object CMakeFiles/libhl.dir/src/std/process.c.o
make[2]: Leaving directory '/usr/src/RPM/BUILD/hashlink-1.11'
make[2]: Entering directory '/usr/src/RPM/BUILD/hashlink-1.11'
[ 38%] Building C object CMakeFiles/libhl.dir/src/std/math.c.o
make[2]: Leaving directory '/usr/src/RPM/BUILD/hashlink-1.11'
make[2]: Entering directory '/usr/src/RPM/BUILD/hashlink-1.11'
[ 47%] Building C object CMakeFiles/libhl.dir/src/std/regexp.c.o
make[2]: Leaving directory '/usr/src/RPM/BUILD/hashlink-1.11'
make[2]: Entering directory '/usr/src/RPM/BUILD/hashlink-1.11'
[ 42%] Building C object CMakeFiles/libhl.dir/src/std/maps.c.o
make[2]: Leaving directory '/usr/src/RPM/BUILD/hashlink-1.11'
make[2]: Entering directory '/usr/src/RPM/BUILD/hashlink-1.11'
[ 40%] Building C object CMakeFiles/libhl.dir/src/std/obj.c.o
make[2]: Leaving directory '/usr/src/RPM/BUILD/hashlink-1.11'
make[2]: Entering directory '/usr/src/RPM/BUILD/hashlink-1.11'
[ 55%] Building C object CMakeFiles/libhl.dir/src/std/track.c.o
make[2]: Leaving directory '/usr/src/RPM/BUILD/hashlink-1.11'
make[2]: Entering directory '/usr/src/RPM/BUILD/hashlink-1.11'
[ 59%] Building C object CMakeFiles/libhl.dir/src/std/ucs2.c.o
make[2]: Leaving directory '/usr/src/RPM/BUILD/hashlink-1.11'
make[2]: Entering directory '/usr/src/RPM/BUILD/hashlink-1.11'
[ 50%] Building C object CMakeFiles/libhl.dir/src/std/string.c.o
make[2]: Leaving directory '/usr/src/RPM/BUILD/hashlink-1.11'
make[2]: Entering directory '/usr/src/RPM/BUILD/hashlink-1.11'
[ 54%] Building C object CMakeFiles/libhl.dir/src/std/thread.c.o
make[2]: Leaving directory '/usr/src/RPM/BUILD/hashlink-1.11'
make[2]: Entering directory '/usr/src/RPM/BUILD/hashlink-1.11'
[ 52%] Building C object CMakeFiles/libhl.dir/src/std/sys.c.o
make[2]: Leaving directory '/usr/src/RPM/BUILD/hashlink-1.11'
make[2]: Entering directory '/usr/src/RPM/BUILD/hashlink-1.11'
[ 49%] Building C object CMakeFiles/libhl.dir/src/std/socket.c.o
make[2]: Leaving directory '/usr/src/RPM/BUILD/hashlink-1.11'
make[2]: Entering directory '/usr/src/RPM/BUILD/hashlink-1.11'
[ 57%] Building C object CMakeFiles/libhl.dir/src/std/types.c.o
make[2]: Leaving directory '/usr/src/RPM/BUILD/hashlink-1.11'
make[2]: Entering directory '/usr/src/RPM/BUILD/hashlink-1.11'
[  5%] Building C object CMakeFiles/libhl.dir/include/pcre/pcre_dfa_exec.c.o
make[2]: Leaving directory '/usr/src/RPM/BUILD/hashlink-1.11'
make[2]: Entering directory '/usr/src/RPM/BUILD/hashlink-1.11'
[  8%] Building C object CMakeFiles/libhl.dir/include/pcre/pcre_compile.c.o
make[2]: Leaving directory '/usr/src/RPM/BUILD/hashlink-1.11'
make[2]: Entering directory '/usr/src/RPM/BUILD/hashlink-1.11'
[ 23%] Building C object CMakeFiles/libhl.dir/include/pcre/pcre_exec.c.o
make[2]: Leaving directory '/usr/src/RPM/BUILD/hashlink-1.11'
make[2]: Entering directory '/usr/src/RPM/BUILD/hashlink-1.11'
[ 61%] Linking C shared library bin/libhl.so
make[2]: Leaving directory '/usr/src/RPM/BUILD/hashlink-1.11'
make[1]: Entering directory '/usr/src/RPM/BUILD/hashlink-1.11'
[ 61%] Built target libhl
make[1]: Leaving directory '/usr/src/RPM/BUILD/hashlink-1.11'
make[2]: Entering directory '/usr/src/RPM/BUILD/hashlink-1.11'
[ 77%] Building C object libs/sqlite/CMakeFiles/sqlite.hdll.dir/sqlite.c.o
/usr/src/RPM/BUILD/hashlink-1.11/libs/sqlite/sqlite.c: In function 'sqlite_request':
/usr/src/RPM/BUILD/hashlink-1.11/libs/sqlite/sqlite.c:120:58: error: passing argument 5 of 'sqlite3_prepare16_v2' from incompatible pointer type [-Wincompatible-pointer-types]
  120 |         if( sqlite3_prepare16_v2(db->db, sql, -1, &r->r, &tl) != SQLITE_OK ) {
      |                                                          ^~~
      |                                                          |
      |                                                          const char **
In file included from /usr/src/RPM/BUILD/hashlink-1.11/libs/sqlite/sqlite.c:5:
/usr/src/RPM/BUILD/hashlink-1.11/libs/../include/sqlite/src/sqlite3.h:3533:16: note: expected 'const void **' but argument is of type 'const char **'
 3533 |   const void **pzTail     /* OUT: Pointer to unused portion of zSql */
      |   ~~~~~~~~~~~~~^~~~~~
make[2]: *** [libs/sqlite/CMakeFiles/sqlite.hdll.dir/build.make:76: libs/sqlite/CMakeFiles/sqlite.hdll.dir/sqlite.c.o] Error 1
make[2]: Leaving directory '/usr/src/RPM/BUILD/hashlink-1.11'
make[2]: *** Waiting for unfinished jobs....
make[2]: Entering directory '/usr/src/RPM/BUILD/hashlink-1.11'
[ 76%] Building C object libs/ui/CMakeFiles/ui.hdll.dir/ui_stub.c.o
make[2]: Leaving directory '/usr/src/RPM/BUILD/hashlink-1.11'
make[2]: Entering directory '/usr/src/RPM/BUILD/hashlink-1.11'
[ 69%] Building C object CMakeFiles/hl.dir/src/debugger.c.o
make[2]: Leaving directory '/usr/src/RPM/BUILD/hashlink-1.11'
make[2]: Entering directory '/usr/src/RPM/BUILD/hashlink-1.11'
[ 88%] Building C object libs/fmt/CMakeFiles/fmt.hdll.dir/mikkt.c.o
make[2]: Leaving directory '/usr/src/RPM/BUILD/hashlink-1.11'
make[2]: Entering directory '/usr/src/RPM/BUILD/hashlink-1.11'
[ 67%] Building C object CMakeFiles/hl.dir/src/main.c.o
make[2]: Leaving directory '/usr/src/RPM/BUILD/hashlink-1.11'
make[2]: Entering directory '/usr/src/RPM/BUILD/hashlink-1.11'
[ 81%] Building C object libs/fmt/CMakeFiles/fmt.hdll.dir/sha1.c.o
make[2]: Leaving directory '/usr/src/RPM/BUILD/hashlink-1.11'
make[2]: Entering directory '/usr/src/RPM/BUILD/hashlink-1.11'
[ 71%] Building C object CMakeFiles/hl.dir/src/profile.c.o
/usr/src/RPM/BUILD/hashlink-1.11/src/profile.c:335:13: warning: 'profile_event' defined but not used [-Wunused-function]
  335 | static void profile_event( int code, vbyte *ptr, int dataLen ) {
      |             ^~~~~~~~~~~~~
/usr/src/RPM/BUILD/hashlink-1.11/src/profile.c:164:13: warning: 'hl_profile_loop' defined but not used [-Wunused-function]
  164 | static void hl_profile_loop( void *_ ) {
      |             ^~~~~~~~~~~~~~~
make[2]: Leaving directory '/usr/src/RPM/BUILD/hashlink-1.11'
make[2]: Entering directory '/usr/src/RPM/BUILD/hashlink-1.11'
[ 74%] Building C object libs/uv/CMakeFiles/uv.hdll.dir/uv.c.o
make[2]: Leaving directory '/usr/src/RPM/BUILD/hashlink-1.11'
make[2]: Entering directory '/usr/src/RPM/BUILD/hashlink-1.11'
[ 84%] Building C object libs/fmt/CMakeFiles/fmt.hdll.dir/dxt.c.o
make[2]: Leaving directory '/usr/src/RPM/BUILD/hashlink-1.11'
make[2]: Entering directory '/usr/src/RPM/BUILD/hashlink-1.11'
[ 67%] Building C object CMakeFiles/hl.dir/src/module.c.o
make[2]: Leaving directory '/usr/src/RPM/BUILD/hashlink-1.11'
make[2]: Entering directory '/usr/src/RPM/BUILD/hashlink-1.11'
[ 91%] Linking C shared library ../../bin/ui.hdll
make[2]: Leaving directory '/usr/src/RPM/BUILD/hashlink-1.11'
make[1]: Entering directory '/usr/src/RPM/BUILD/hashlink-1.11'
[ 93%] Built target ui.hdll
make[1]: Leaving directory '/usr/src/RPM/BUILD/hashlink-1.11'
make[2]: Entering directory '/usr/src/RPM/BUILD/hashlink-1.11'
[ 62%] Building C object CMakeFiles/hl.dir/src/code.c.o
make[2]: Leaving directory '/usr/src/RPM/BUILD/hashlink-1.11'
make[2]: Entering directory '/usr/src/RPM/BUILD/hashlink-1.11'
[ 89%] Building C object libs/fmt/CMakeFiles/fmt.hdll.dir/__/__/include/mikktspace/mikktspace.c.o
make[2]: Leaving directory '/usr/src/RPM/BUILD/hashlink-1.11'
make[2]: Entering directory '/usr/src/RPM/BUILD/hashlink-1.11'
[ 93%] Linking C shared library ../../bin/uv.hdll
make[2]: Leaving directory '/usr/src/RPM/BUILD/hashlink-1.11'
make[1]: Entering directory '/usr/src/RPM/BUILD/hashlink-1.11'
[ 93%] Built target uv.hdll
make[1]: Leaving directory '/usr/src/RPM/BUILD/hashlink-1.11'
make[2]: Entering directory '/usr/src/RPM/BUILD/hashlink-1.11'
[ 83%] Building C object CMakeFiles/hl.dir/src/jit.c.o
make[2]: Leaving directory '/usr/src/RPM/BUILD/hashlink-1.11'
make[2]: Entering directory '/usr/src/RPM/BUILD/hashlink-1.11'
[ 64%] Building C object libs/sdl/CMakeFiles/sdl.hdll.dir/sdl.c.o
make[2]: Leaving directory '/usr/src/RPM/BUILD/hashlink-1.11'
make[2]: Entering directory '/usr/src/RPM/BUILD/hashlink-1.11'
[ 79%] Building C object libs/sdl/CMakeFiles/sdl.hdll.dir/gl.c.o
make[2]: Leaving directory '/usr/src/RPM/BUILD/hashlink-1.11'
make[2]: Entering directory '/usr/src/RPM/BUILD/hashlink-1.11'
[ 72%] Building C object libs/fmt/CMakeFiles/fmt.hdll.dir/fmt.c.o
make[2]: Leaving directory '/usr/src/RPM/BUILD/hashlink-1.11'
make[2]: Entering directory '/usr/src/RPM/BUILD/hashlink-1.11'
[ 96%] Linking C shared library ../../bin/sdl.hdll
make[2]: Leaving directory '/usr/src/RPM/BUILD/hashlink-1.11'
make[1]: Entering directory '/usr/src/RPM/BUILD/hashlink-1.11'
[ 98%] Built target sdl.hdll
make[1]: Leaving directory '/usr/src/RPM/BUILD/hashlink-1.11'
make[2]: Entering directory '/usr/src/RPM/BUILD/hashlink-1.11'
[ 94%] Linking C executable bin/hl
make[2]: Leaving directory '/usr/src/RPM/BUILD/hashlink-1.11'
make[1]: Entering directory '/usr/src/RPM/BUILD/hashlink-1.11'
[ 98%] Built target hl
make[1]: Leaving directory '/usr/src/RPM/BUILD/hashlink-1.11'
make[2]: Entering directory '/usr/src/RPM/BUILD/hashlink-1.11'
[ 98%] Linking C shared library ../../bin/fmt.hdll
make[2]: Leaving directory '/usr/src/RPM/BUILD/hashlink-1.11'
make[1]: Entering directory '/usr/src/RPM/BUILD/hashlink-1.11'
[ 98%] Built target fmt.hdll
make[1]: Leaving directory '/usr/src/RPM/BUILD/hashlink-1.11'
make[2]: Entering directory '/usr/src/RPM/BUILD/hashlink-1.11'
[ 86%] Building C object libs/sqlite/CMakeFiles/sqlite.hdll.dir/__/__/include/sqlite/src/sqlite3.c.o
/usr/src/RPM/BUILD/hashlink-1.11/include/sqlite/src/sqlite3.c: In function 'sqlite3DefaultRowEst':
/usr/src/RPM/BUILD/hashlink-1.11/include/sqlite/src/sqlite3.c:101733:3: warning: this 'if' clause does not guard... [-Wmisleading-indentation]
101733 |   if( pIdx->pPartIdxWhere!=0 ) a[0] -= 10;  assert( 10==sqlite3LogEst(2) );
       |   ^~
In file included from /usr/src/RPM/BUILD/hashlink-1.11/include/sqlite/src/sqlite3.c:11468:
/usr/src/RPM/BUILD/hashlink-1.11/include/sqlite/src/sqlite3.c:101733:45: note: ...this statement, but the latter is misleadingly indented as if it were guarded by the 'if'
101733 |   if( pIdx->pPartIdxWhere!=0 ) a[0] -= 10;  assert( 10==sqlite3LogEst(2) );
       |                                             ^~~~~~
/usr/src/RPM/BUILD/hashlink-1.11/include/sqlite/src/sqlite3.c:101734:3: warning: this 'if' clause does not guard... [-Wmisleading-indentation]
101734 |   if( a[0]<33 ) a[0] = 33;                  assert( 33==sqlite3LogEst(10) );
       |   ^~
/usr/src/RPM/BUILD/hashlink-1.11/include/sqlite/src/sqlite3.c:101734:45: note: ...this statement, but the latter is misleadingly indented as if it were guarded by the 'if'
101734 |   if( a[0]<33 ) a[0] = 33;                  assert( 33==sqlite3LogEst(10) );
       |                                             ^~~~~~
make[2]: Leaving directory '/usr/src/RPM/BUILD/hashlink-1.11'
make[1]: *** [CMakeFiles/Makefile2:320: libs/sqlite/CMakeFiles/sqlite.hdll.dir/all] Error 2
make: *** [Makefile:156: all] Error 2
error: Bad exit status from /usr/src/tmp/rpm-tmp.61270 (%build)


RPM build errors:
    Bad exit status from /usr/src/tmp/rpm-tmp.61270 (%build)
Command exited with non-zero status 1
28.14user 3.42system 0:13.49elapsed 233%CPU (0avgtext+0avgdata 199012maxresident)k
0inputs+0outputs (0major+709661minor)pagefaults 0swaps
hsh-rebuild: rebuild of `hashlink-1.11-alt3.src.rpm' failed.
Command exited with non-zero status 1
4.56user 2.81system 0:28.19elapsed 26%CPU (0avgtext+0avgdata 138344maxresident)k
56inputs+0outputs (0major+284054minor)pagefaults 0swaps