<86>Nov  5 03:43:21 userdel[2128190]: delete user 'rooter'
<86>Nov  5 03:43:22 groupadd[2128387]: group added to /etc/group: name=rooter, GID=1265
<86>Nov  5 03:43:22 groupadd[2128387]: group added to /etc/gshadow: name=rooter
<86>Nov  5 03:43:22 groupadd[2128387]: new group: name=rooter, GID=1265
<86>Nov  5 03:43:22 useradd[2128757]: new user: name=rooter, UID=1265, GID=1265, home=/root, shell=/bin/bash, from=none
<86>Nov  5 03:43:22 userdel[2128781]: delete user 'builder'
<86>Nov  5 03:43:22 userdel[2128781]: removed group 'builder' owned by 'builder'
<86>Nov  5 03:43:22 userdel[2128781]: removed shadow group 'builder' owned by 'builder'
<86>Nov  5 03:43:22 groupadd[2128864]: group added to /etc/group: name=builder, GID=1266
<86>Nov  5 03:43:22 groupadd[2128864]: group added to /etc/gshadow: name=builder
<86>Nov  5 03:43:22 groupadd[2128864]: new group: name=builder, GID=1266
<86>Nov  5 03:43:22 useradd[2128892]: new user: name=builder, UID=1266, GID=1266, home=/usr/src, shell=/bin/bash, from=none
<13>Nov  5 03:43:33 rpmi: libpng16-1.6.42-alt2 sisyphus+339555.100.1.1 1706781682 installed
<13>Nov  5 03:43:33 rpmi: xorg-proto-devel-2024.1-alt1 sisyphus+343583.40.1.1 1711440649 installed
<13>Nov  5 03:43:33 rpmi: vapi-common-0.56.17-alt1 sisyphus+345617.100.1.1 1713782341 installed
<13>Nov  5 03:43:33 rpmi: libglvnd-7:1.7.0-alt1 sisyphus+330949.100.1.1 1696424893 installed
<13>Nov  5 03:43:33 rpmi: libwayland-client-1.23.1-alt1.1 sisyphus+356019.140.3.1 1724572111 installed
<13>Nov  5 03:43:33 rpmi: libsqlite3-3.46.0-alt1 sisyphus+352354.100.2.1 1721980422 installed
<13>Nov  5 03:43:33 rpmi: libexpat-2.5.0-alt1 sisyphus+346180.200.2.1 1716349835 installed
<13>Nov  5 03:43:33 rpmi: libogg-1.3.5-alt1 sisyphus+278100.3400.1.1 1626058929 installed
<13>Nov  5 03:43:33 rpmi: perl-HTTP-Date-6.06-alt1 sisyphus+324527.100.1.1 1688834564 installed
<13>Nov  5 03:43:33 rpmi: perl-XML-NamespaceSupport-1.12-alt1 1491296348 installed
<13>Nov  5 03:43:33 rpmi: libjpeg-2:3.0.2-alt2.1 sisyphus+340135.100.1.1 1707449145 installed
<13>Nov  5 03:43:33 rpmi: libidn2-2.3.7-alt1 sisyphus+339505.100.1.2 1706718968 installed
<13>Nov  5 03:43:33 rpmi: libnettle8-3.9.1-alt1 sisyphus+322548.100.1.2 1686176879 installed
<13>Nov  5 03:43:33 rpmi: libflac12-1.4.3-alt2 sisyphus+343354.100.1.1 1711118098 installed
<13>Nov  5 03:43:33 rpmi: libvorbis-1.3.7-alt1 sisyphus+275738.100.1.1 1624751601 installed
<13>Nov  5 03:43:33 rpmi: libxml2-devel-1:2.12.9-alt1 sisyphus+355784.100.1.1 1724333686 installed
<13>Nov  5 03:43:33 rpmi: libdav1d_7-1.4.3-alt1 sisyphus+351889.100.1.1 1719823612 installed
<13>Nov  5 03:43:33 rpmi: liblcms2-2.16-alt1 sisyphus+335676.100.1.1 1701682597 installed
<13>Nov  5 03:43:33 rpmi: libfribidi-1.0.16-alt1 sisyphus+358393.100.1.1 1727333692 installed
<13>Nov  5 03:43:33 rpmi: libmpg123-1:1.32.9-alt1 sisyphus+361601.100.1.1 1730561819 installed
<13>Nov  5 03:43:33 rpmi: libwayland-server-1.23.1-alt1.1 sisyphus+356019.140.3.1 1724572111 installed
<13>Nov  5 03:43:33 rpmi: perl-LWP-MediaTypes-6.04-alt1 sisyphus+225468.100.1.1 1553186684 installed
<13>Nov  5 03:43:33 rpmi: perl-Compress-Raw-Zlib-2.206-alt1 sisyphus+335067.600.1.1 1700901499 installed
<13>Nov  5 03:43:33 rpmi: perl-libnet-1:3.15-alt1 sisyphus+317310.100.1.1 1679580208 installed
<13>Nov  5 03:43:33 rpmi: perl-XML-SAX-Base-1.09-alt1 1494364363 installed
<13>Nov  5 03:43:33 rpmi: libnspr-1:4.35-alt1 sisyphus+308164.100.1.1 1665397040 installed
<13>Nov  5 03:43:33 rpmi: gobject-introspection-1.82.0-alt1 sisyphus+357735.200.3.1 1726641712 installed
<13>Nov  5 03:43:33 rpmi: libnghttp2-1.63.0-alt1 sisyphus+356414.100.1.1 1725031508 installed
<13>Nov  5 03:43:34 rpmi: libicu74-1:7.4.2-alt1 sisyphus+336372.200.1.1 1702423005 installed
<13>Nov  5 03:43:34 rpmi: libgraphite2-1.3.14-alt2.1 sisyphus+279571.100.1.2 1626605111 installed
<13>Nov  5 03:43:34 rpmi: zlib-devel-1.3.1-alt1 sisyphus+342532.100.1.1 1710232285 installed
<13>Nov  5 03:43:34 rpmi: xml-utils-1:2.12.9-alt1 sisyphus+355784.100.1.1 1724333686 installed
<13>Nov  5 03:43:34 rpmi: rpm-build-gir-0.7.3-alt3.1 sisyphus+319393.100.1.1 1682538783 installed
<13>Nov  5 03:43:34 rpmi: shared-mime-info-2.4-alt1 sisyphus+334259.100.1.1 1699787316 installed
<13>Nov  5 03:43:34 rpmi: libp11-kit-1:0.25.5-alt1 sisyphus+352553.100.1.1 1720622573 installed
<13>Nov  5 03:43:34 rpmi: libtasn1-4.19.0-alt3 sisyphus+327816.100.1.1 1692802615 installed
<13>Nov  5 03:43:34 rpmi: libatk-2.54.0-alt1 sisyphus+357735.600.3.1 1726642126 installed
<13>Nov  5 03:43:34 rpmi: libXau-1.0.11-alt1 sisyphus+311428.100.1.1 1670577439 installed
<13>Nov  5 03:43:34 rpmi: libXau-devel-1.0.11-alt1 sisyphus+311428.100.1.1 1670577439 installed
<13>Nov  5 03:43:35 rpmi: libpng-devel-1.6.42-alt2 sisyphus+339555.100.1.1 1706781682 installed
<13>Nov  5 03:43:35 rpmi: libgraphite2-devel-1.3.14-alt2.1 sisyphus+279571.100.1.2 1626605111 installed
<13>Nov  5 03:43:35 rpmi: icu-utils-1:7.4.2-alt1 sisyphus+336372.200.1.1 1702423005 installed
<13>Nov  5 03:43:35 rpmi: libicu-devel-1:7.4.2-alt1 sisyphus+336372.200.1.1 1702423005 installed
<13>Nov  5 03:43:35 rpmi: gobject-introspection-x11-1.82.0-alt1 sisyphus+357735.200.3.1 1726641712 installed
<13>Nov  5 03:43:35 rpmi: libdav1d-devel-1.4.3-alt1 sisyphus+351889.100.1.1 1719823612 installed
<13>Nov  5 03:43:35 rpmi: libhogweed6-3.9.1-alt1 sisyphus+322548.100.1.2 1686176879 installed
<13>Nov  5 03:43:35 rpmi: libgnutls30-3.8.4-alt1 sisyphus+343729.100.2.1 1711571288 installed
<13>Nov  5 03:43:35 rpmi: libngtcp2.16-1.7.0-alt1 sisyphus+356415.200.1.1 1725031912 installed
<13>Nov  5 03:43:35 rpmi: libngtcp2_crypto_gnutls8-1.7.0-alt1 sisyphus+356415.200.1.1 1725031912 installed
<13>Nov  5 03:43:35 rpmi: perl-File-Listing-6.16-alt1 sisyphus+325783.100.1.1 1690559356 installed
<13>Nov  5 03:43:35 rpmi: libwayland-cursor-1.23.1-alt1.1 sisyphus+356019.140.3.1 1724572111 installed
<13>Nov  5 03:43:35 rpmi: libwayland-egl-4:18.1.0-alt1.1 sisyphus+356019.140.3.1 1724572111 installed
<13>Nov  5 03:43:35 rpmi: libGLES-7:1.7.0-alt1 sisyphus+330949.100.1.1 1696424893 installed
<13>Nov  5 03:43:35 rpmi: libOpenGL-7:1.7.0-alt1 sisyphus+330949.100.1.1 1696424893 installed
<13>Nov  5 03:43:35 rpmi: rpm-build-vala-0.3-alt1 sisyphus+277005.100.1.2 1625345329 installed
<13>Nov  5 03:43:35 rpmi: libyaml2-0.2.5-alt1 sisyphus+278391.100.1.1 1626094928 installed
<13>Nov  5 03:43:35 rpmi: libstemmer-2.0.0-alt1 sisyphus+278406.100.1.1 1626096572 installed
<13>Nov  5 03:43:35 rpmi: libxkbcommon-1.7.0-alt1.1 sisyphus+343672.100.1.1 1711490810 installed
<13>Nov  5 03:43:35 rpmi: libepoxy-1.5.10-alt1 sisyphus+296853.200.2.1 1647631866 installed
<13>Nov  5 03:43:35 rpmi: libusb-1.0.27-alt1 sisyphus+347412.100.1.1 1714739651 installed
<13>Nov  5 03:43:35 rpmi: libgudev-1:238-alt1 sisyphus+324364.100.1.1 1688646144 installed
<13>Nov  5 03:43:35 rpmi: libdatrie-0.2.13-alt1_7 sisyphus+328221.100.1.1 1693336966 installed
<13>Nov  5 03:43:35 rpmi: libthai-0.1.29-alt1_6 sisyphus+328230.100.1.2 1693348044 installed
<13>Nov  5 03:43:35 rpmi: libmad-0.15.1b-alt9 sisyphus+278239.100.1.1 1626080123 installed
<13>Nov  5 03:43:35 rpmi: timidity-instruments-1:1.0-alt1 sisyphus+276870.100.1.1 1625246545 installed
<13>Nov  5 03:43:36 rpmi: libopus-1.5.2-alt1 sisyphus+347834.100.1.1 1715455356 installed
<13>Nov  5 03:43:36 rpmi: liblame-3.100-alt1 sisyphus+346342.200.2.2 1716474674 installed
<13>Nov  5 03:43:36 rpmi: libgsm-1.0.17-alt1 sisyphus+275359.100.2.1 1624907612 installed
<13>Nov  5 03:43:36 rpmi: libsndfile-1.1.0-alt1 sisyphus+339776.7300.6.2 1707350065 installed
<13>Nov  5 03:43:36 rpmi: libasyncns-0.8-alt2.qa1 sisyphus+275091.100.1.1 1624402241 installed
<13>Nov  5 03:43:36 rpmi: libxshmfence-1.3.2-alt1 sisyphus+311428.400.1.1 1670577525 installed
<13>Nov  5 03:43:36 rpmi: libsensors3-3.6.0-alt3 sisyphus+308579.100.1.1 1666035267 installed
<13>Nov  5 03:43:36 rpmi: llvm18.1-filesystem-18.1.8-alt0.2 sisyphus+357910.700.19.1 1728048814 installed
<13>Nov  5 03:43:36 rpmi: llvm18.1-polly-18.1.8-alt0.2 sisyphus+357910.700.19.1 1728048814 installed
<13>Nov  5 03:43:36 rpmi: libedit3-3.1.20230828-alt1 sisyphus+330914.200.3.1 1696922743 installed
<13>Nov  5 03:43:36 rpmi: llvm18.1-gold-18.1.8-alt0.2 sisyphus+357910.700.19.1 1728048814 installed
<13>Nov  5 03:43:38 rpmi: llvm18.1-libs-18.1.8-alt0.2 sisyphus+357910.700.19.1 1728048814 installed
<13>Nov  5 03:43:38 rpmi: libpciaccess-1:0.18.1-alt1 sisyphus+343583.300.1.1 1711440789 installed
<13>Nov  5 03:43:38 rpmi: libdrm-1:2.4.123-alt1 sisyphus+357330.40.3.1 1726125397 installed
<13>Nov  5 03:43:38 rpmi: perl-Try-Tiny-0.31-alt1 sisyphus+290597.100.1.1 1637915507 installed
<13>Nov  5 03:43:38 rpmi: perl-IO-Socket-IP-0.42-alt1 sisyphus+325815.100.1.2 1690571193 installed
<13>Nov  5 03:43:38 rpmi: perl-Module-Load-0.36-alt1 sisyphus+258992.100.1.1 1601543407 installed
<13>Nov  5 03:43:38 rpmi: perl-Compress-Raw-Bzip2-2.210-alt1 sisyphus+343108.100.1.3 1710881036 installed
<13>Nov  5 03:43:38 rpmi: perl-IO-Compress-Brotli-2:0.004001-alt3 sisyphus+335067.1200.1.1 1700901589 installed
<13>Nov  5 03:43:38 rpmi: perl-Clone-0.46-alt1 sisyphus+335067.1100.1.1 1700901562 installed
<13>Nov  5 03:43:38 rpmi: perl-HTML-Tagset-3.24-alt1 sisyphus+343117.100.1.3 1710883587 installed
<13>Nov  5 03:43:38 rpmi: perl-Term-ANSIColor-5.01-alt1 sisyphus+244783.100.1.2 1579747505 installed
<13>Nov  5 03:43:38 rpmi: perl-Data-Dump-1.25-alt1 sisyphus+276551.100.1.1 1625126880 installed
<13>Nov  5 03:43:38 rpmi: perl-Filter-1.64-alt1 sisyphus+335067.400.1.1 1700901412 installed
<13>Nov  5 03:43:38 rpmi: perl-Encode-3.21-alt1 sisyphus+343095.100.1.1 1710875477 installed
<13>Nov  5 03:43:38 rpmi: perl-URI-5.27-alt1 sisyphus+340901.100.1.1 1708180683 installed
<13>Nov  5 03:43:38 rpmi: perl-IO-Compress-2.206-alt1 sisyphus+325819.100.1.1 1690563199 installed
<13>Nov  5 03:43:38 rpmi: perl-Net-HTTP-6.23-alt1 sisyphus+323470.100.1.1 1687422469 installed
<13>Nov  5 03:43:38 rpmi: perl-HTML-Parser-3.82-alt1 sisyphus+343116.100.1.3 1710883258 installed
<13>Nov  5 03:43:38 rpmi: perl-WWW-RobotRules-6.02-alt1 1329756211 installed
<13>Nov  5 03:43:38 rpmi: perl-Encode-Locale-1.05-alt1 1444608613 installed
<13>Nov  5 03:43:38 rpmi: perl-IO-HTML-1.004-alt1 sisyphus+258983.100.1.1 1601542619 installed
<13>Nov  5 03:43:38 rpmi: perl-HTTP-Message-6.45-alt1 sisyphus+330728.100.1.1 1696162276 installed
<13>Nov  5 03:43:38 rpmi: perl-HTTP-Negotiate-6.01-alt1 1329760563 installed
<13>Nov  5 03:43:38 rpmi: perl-libwww-6.77-alt1 sisyphus+343120.100.1.2 1710884405 installed
<13>Nov  5 03:43:38 rpmi: perl-XML-LibXML-2.0210-alt8 sisyphus+355798.100.1.1 1724340088 installed
<13>Nov  5 03:43:38 rpmi: perl-XML-SAX-1.02-alt1 sisyphus+232322.100.1.1 1560758406 installed
<13>Nov  5 03:43:38 rpmi: perl-XML-Simple-2.25-alt2 sisyphus+257498.100.1.1 1599324034 installed
<13>Nov  5 03:43:38 rpmi: icon-naming-utils-0.8.90-alt1 sisyphus+276851.100.1.1 1625243947 installed
<13>Nov  5 03:43:38 rpmi: icon-theme-adwaita-47.0-alt1 sisyphus+357735.1000.3.1 1726642413 installed
<13>Nov  5 03:43:38 rpmi: usbids-20240206-alt1 sisyphus+339943.100.1.1 1707270512 installed
<13>Nov  5 03:43:39 rpmi: pciids-20241031-alt1 sisyphus+361327.100.1.1 1730460822 installed
<13>Nov  5 03:43:39 rpmi: hwdata-0.384-alt1 sisyphus+354460.100.1.1 1722898493 installed
<13>Nov  5 03:43:39 rpmi: libwebp7-1.4.0-alt1 sisyphus+345159.200.1.1 1713168663 installed
<13>Nov  5 03:43:39 rpmi: libdeflate-1.22-alt1 sisyphus+359192.100.1.1 1728330316 installed
<13>Nov  5 03:43:39 rpmi: libtiff5-4.4.0-alt4 sisyphus+322581.100.1.2 1686180089 installed
<13>Nov  5 03:43:39 rpmi: libgdk-pixbuf-locales-2.42.12-alt1 sisyphus+348142.100.1.1 1715791856 installed
<13>Nov  5 03:43:39 rpmi: gtk+3-themes-incompatible-3.20-alt3 1461944560 installed
<13>Nov  5 03:43:39 rpmi: libgirepository1.0-1.82.0-alt1 sisyphus+357735.200.3.1 1726641712 installed
<13>Nov  5 03:43:39 rpmi: libffi-devel-1:3.4.6-alt1 sisyphus+341904.100.1.1 1709474358 installed
<13>Nov  5 03:43:39 rpmi: libncurses6-6.3.20220618-alt4 sisyphus+327286.4600.14.1 1711486705 installed
<13>Nov  5 03:43:39 rpmi: libtinfo-devel-6.3.20220618-alt4 sisyphus+327286.4600.14.1 1711486705 installed
<13>Nov  5 03:43:39 rpmi: libncurses-devel-6.3.20220618-alt4 sisyphus+327286.4600.14.1 1711486705 installed
<13>Nov  5 03:43:39 rpmi: libduktape207-2.7.0-alt3 sisyphus+352341.100.1.1 1720324462 installed
<13>Nov  5 03:43:39 rpmi: publicsuffix-list-dafsa-20240911-alt1 sisyphus+357399.100.1.1 1726160479 installed
<13>Nov  5 03:43:39 rpmi: libpsl-0.21.5-alt1 sisyphus+338474.100.1.1 1705684769 installed
<13>Nov  5 03:43:39 rpmi: libnghttp3.9-1.5.0-alt1 sisyphus+356415.100.1.1 1725031855 installed
<13>Nov  5 03:43:39 rpmi: openldap-common-2.6.8-alt1 sisyphus+351621.100.1.1 1719420449 installed
<13>Nov  5 03:43:39 rpmi: libntlm-1.5-alt1 sisyphus+278100.3300.1.1 1626058899 installed
<13>Nov  5 03:43:39 rpmi: libidn-1.37-alt2 sisyphus+300849.100.1.1 1653769687 installed
<13>Nov  5 03:43:39 rpmi: libverto-0.3.2-alt1_1 sisyphus+321176.2200.10.2 1684803947 installed
<13>Nov  5 03:43:39 rpmi: liblmdb-0.9.33-alt1 sisyphus+360625.100.1.1 1729819640 installed
<13>Nov  5 03:43:39 rpmi: libkeyutils-1.6.3-alt1 sisyphus+346336.200.2.2 1716472658 installed
<13>Nov  5 03:43:39 rpmi: libcom_err-1.46.4.0.5.4cda-alt1 sisyphus+283826.100.1.1 1629975345 installed
<13>Nov  5 03:43:39 rpmi: gcc-c++-common-1.4.28-alt1 sisyphus+348678.100.1.1 1716396142 installed
<13>Nov  5 03:43:39 rpmi: libstdc++14-devel-14.2.1-alt1 sisyphus+360995.100.1.1 1730131018 installed
<13>Nov  5 03:43:41 rpmi: gcc14-c++-14.2.1-alt1 sisyphus+360995.100.1.1 1730131018 installed
<13>Nov  5 03:43:41 rpmi: libpixman-3:0.43.4-alt2 sisyphus+344164.100.1.1 1711987977 installed
<13>Nov  5 03:43:41 rpmi: libbrotlicommon-1.1.0-alt1 sisyphus+328501.100.1.1 1693598419 installed
<13>Nov  5 03:43:41 rpmi: libbrotlidec-1.1.0-alt1 sisyphus+328501.100.1.1 1693598419 installed
<13>Nov  5 03:43:41 rpmi: libharfbuzz-10.0.1-alt1 sisyphus+358317.100.1.1 1727257731 installed
<13>Nov  5 03:43:41 rpmi: libfreetype-2.13.3-alt1 sisyphus+355656.100.1.1 1724221064 installed
<13>Nov  5 03:43:41 rpmi: libfontconfig1-2.15.0-alt1 sisyphus+355771.100.2.3 1724337298 installed
<13>Nov  5 03:43:41 rpmi: fontconfig-2.15.0-alt1 sisyphus+355771.100.2.3 1724337298 installed
Updating fonts cache: <29>Nov  5 03:43:42 fontconfig: Updating fonts cache: succeeded
[ DONE ]
<13>Nov  5 03:43:42 rpmi: libharfbuzz-icu-10.0.1-alt1 sisyphus+358317.100.1.1 1727257731 installed
<13>Nov  5 03:43:42 rpmi: libharfbuzz-gobject-10.0.1-alt1 sisyphus+358317.100.1.1 1727257731 installed
<13>Nov  5 03:43:42 rpmi: libmpdec3-2.5.1-alt3 sisyphus+314490.500.5.1 1675432004 installed
<13>Nov  5 03:43:42 rpmi: libgdbm-1.8.3-alt10 sisyphus+346222.200.3.2 1716468404 installed
<13>Nov  5 03:43:42 rpmi: libb2-0.98.1-alt1_1 sisyphus+291614.100.1.1 1638962877 installed
<13>Nov  5 03:43:42 rpmi: libdevmapper-1.02.200-alt1 sisyphus+355869.100.1.1 1724444357 installed
<13>Nov  5 03:43:42 rpmi: mount-2.39.2-alt1 sisyphus+327286.4500.14.1 1711486324 installed
<13>Nov  5 03:43:42 rpmi: losetup-2.39.2-alt1 sisyphus+327286.4500.14.1 1711486324 installed
<13>Nov  5 03:43:42 rpmi: lsblk-2.39.2-alt1 sisyphus+327286.4500.14.1 1711486324 installed
<13>Nov  5 03:43:42 rpmi: dconf-profile-0.1-alt1 sisyphus+325633.340.3.1 1690415358 installed
<13>Nov  5 03:43:42 rpmi: desktop-file-utils-0.26-alt6 sisyphus+331944.100.1.3 1697550026 installed
<13>Nov  5 03:43:42 rpmi: gsettings-desktop-schemas-data-47.1-alt1 sisyphus+357735.300.3.1 1726641752 installed
<13>Nov  5 03:43:42 rpmi: libgio-2.82.2-alt1 sisyphus+360023.100.1.1 1729169691 installed
<13>Nov  5 03:43:42 rpmi: gsettings-desktop-schemas-47.1-alt1 sisyphus+357735.300.3.1 1726641752 installed
<13>Nov  5 03:43:42 rpmi: libgdk-pixbuf-2.42.12-alt1 sisyphus+348142.100.1.1 1715791856 installed
<13>Nov  5 03:43:42 rpmi: libgdk-pixbuf-gir-2.42.12-alt1 sisyphus+348142.100.1.1 1715791856 installed
<13>Nov  5 03:43:42 rpmi: libjson-glib-1.10.0-alt1 sisyphus+357735.1200.3.1 1726642581 installed
<13>Nov  5 03:43:42 rpmi: libgusb-0.4.9-alt1 sisyphus+345693.100.1.1 1713857461 installed
<13>Nov  5 03:43:42 rpmi: libcolord-1.4.7-alt1.1 sisyphus+338793.100.1.1 1706039016 installed
<13>Nov  5 03:43:42 rpmi: gtk4-update-icon-cache-4.16.5-alt1 sisyphus+361649.100.1.1 1730624826 installed
<13>Nov  5 03:43:42 rpmi: libdconf-0.40.0-alt3 sisyphus+325650.100.1.1 1690417205 installed
<13>Nov  5 03:43:42 rpmi: systemd-modules-common-1:255.13-alt1 sisyphus+359453.100.2.1 1728651180 installed
<13>Nov  5 03:43:42 rpmi: systemd-sysctl-common-1:255.13-alt1 sisyphus+359453.100.2.1 1728651180 installed
<13>Nov  5 03:43:42 rpmi: systemd-tmpfiles-common-1:255.13-alt1 sisyphus+359453.100.2.1 1728651180 installed
<13>Nov  5 03:43:42 rpmi: systemd-utils-filetriggers-1:255.13-alt1 sisyphus+359453.100.2.1 1728651180 installed
<13>Nov  5 03:43:42 rpmi: libfdisk-2.39.2-alt1 sisyphus+327286.4500.14.1 1711486324 installed
<13>Nov  5 03:43:43 rpmi: libX11-locales-3:1.8.10-alt1 sisyphus+353866.100.1.1 1722240771 installed
<13>Nov  5 03:43:43 rpmi: libXdmcp-1.1.5-alt1 sisyphus+343583.700.1.1 1711441061 installed
<13>Nov  5 03:43:43 rpmi: libxcb-1.17.0-alt1 sisyphus+345308.200.1.1 1713342004 installed
<13>Nov  5 03:43:43 rpmi: libX11-3:1.8.10-alt1 sisyphus+353866.100.1.1 1722240771 installed
<13>Nov  5 03:43:43 rpmi: libXext-1.3.6-alt1 sisyphus+343583.1000.1.1 1711441101 installed
<13>Nov  5 03:43:43 rpmi: libXrender-0.9.11-alt1 sisyphus+308841.100.1.1 1666436130 installed
<13>Nov  5 03:43:43 rpmi: libcairo-1:1.18.2-alt1 sisyphus+357195.100.1.1 1725948391 installed
<13>Nov  5 03:43:43 rpmi: libcairo-gobject-1:1.18.2-alt1 sisyphus+357195.100.1.1 1725948391 installed
<13>Nov  5 03:43:43 rpmi: libXfixes-6.0.1-alt1 sisyphus+331490.300.1.1 1697023233 installed
<13>Nov  5 03:43:43 rpmi: libXrandr-1.5.4-alt1 sisyphus+330992.100.1.1 1696485400 installed
<13>Nov  5 03:43:43 rpmi: libXft-2.3.8-alt1 sisyphus+331490.400.1.1 1697023269 installed
<13>Nov  5 03:43:43 rpmi: libpango-1.54.0-alt1 sisyphus+350796.200.1.1 1718041393 installed
<13>Nov  5 03:43:43 rpmi: librsvg-1:2.59.2-alt1 sisyphus+361144.100.1.1 1730276750 installed
<13>Nov  5 03:43:43 rpmi: libXi-1.8-alt1 sisyphus+285490.200.1.1 1632124174 installed
<13>Nov  5 03:43:45 rpmi: libxcb-devel-1.17.0-alt1 sisyphus+345308.200.1.1 1713342004 installed
<13>Nov  5 03:43:46 rpmi: libX11-devel-3:1.8.10-alt1 sisyphus+353866.100.1.1 1722240771 installed
<13>Nov  5 03:43:46 rpmi: libXrender-devel-0.9.11-alt1 sisyphus+308841.100.1.1 1666436130 installed
<13>Nov  5 03:43:46 rpmi: libXext-devel-1.3.6-alt1 sisyphus+343583.1000.1.1 1711441101 installed
<13>Nov  5 03:43:46 rpmi: librsvg-gir-1:2.59.2-alt1 sisyphus+361144.100.1.1 1730276750 installed
<13>Nov  5 03:43:46 rpmi: libXcursor-1.2.2-alt1 sisyphus+343583.600.1.1 1711441025 installed
<13>Nov  5 03:43:46 rpmi: libharfbuzz-cairo-10.0.1-alt1 sisyphus+358317.100.1.1 1727257731 installed
<13>Nov  5 03:43:46 rpmi: libXtst-1.2.4-alt1 sisyphus+308663.1300.1.1 1666168495 installed
<13>Nov  5 03:43:46 rpmi: libXxf86vm-1.1.5-alt1 sisyphus+308663.1400.1.1 1666168523 installed
<13>Nov  5 03:43:47 rpmi: libGLX-mesa-4:24.2.6-alt1 sisyphus+361255.100.1.1 1730364463 installed
<13>Nov  5 03:43:47 rpmi: libgbm-4:24.2.6-alt1 sisyphus+361255.100.1.1 1730364463 installed
<13>Nov  5 03:43:47 rpmi: libEGL-mesa-4:24.2.6-alt1 sisyphus+361255.100.1.1 1730364463 installed
<13>Nov  5 03:43:47 rpmi: libEGL-7:1.7.0-alt1 sisyphus+330949.100.1.1 1696424893 installed
<13>Nov  5 03:43:47 rpmi: libGLX-7:1.7.0-alt1 sisyphus+330949.100.1.1 1696424893 installed
<13>Nov  5 03:43:47 rpmi: libGL-7:1.7.0-alt1 sisyphus+330949.100.1.1 1696424893 installed
<13>Nov  5 03:43:47 rpmi: libglvnd-devel-7:1.7.0-alt1 sisyphus+330949.100.1.1 1696424893 installed
<13>Nov  5 03:43:47 rpmi: libGLU-4:9.0.1-alt1 sisyphus+278350.100.1.2 1626174382 installed
<13>Nov  5 03:43:47 rpmi: libGLU-devel-4:9.0.1-alt1 sisyphus+278350.100.1.2 1626174382 installed
<13>Nov  5 03:43:47 rpmi: libXinerama-1.1.5-alt1 sisyphus+309287.100.1.1 1667213208 installed
<13>Nov  5 03:43:47 rpmi: xprop-1.2.5-alt1 sisyphus+279025.100.1.1 1626354198 installed
<13>Nov  5 03:43:47 rpmi: libXcomposite-0.4.6-alt1 sisyphus+311188.200.1.1 1670233682 installed
<13>Nov  5 03:43:47 rpmi: libXdamage-1.1.6-alt1 sisyphus+311188.300.1.1 1670233711 installed
<13>Nov  5 03:43:47 rpmi: liblz4-1:1.9.4-alt1 sisyphus+309416.100.1.1 1667412981 installed
<13>Nov  5 03:43:47 rpmi: libsystemd-1:255.13-alt1 sisyphus+359453.100.2.1 1728651180 installed
<13>Nov  5 03:43:47 rpmi: libdbus-1.14.10-alt1 sisyphus+327286.5700.14.1 1711487401 installed
<13>Nov  5 03:43:47 rpmi: libpulseaudio-17.0-alt2 sisyphus+339257.100.1.1 1706519226 installed
<13>Nov  5 03:43:47 rpmi: libat-spi2-core-2.54.0-alt1 sisyphus+357735.600.3.1 1726642126 installed
<13>Nov  5 03:43:47 rpmi: at-spi2-atk-2.54.0-alt1 sisyphus+357735.600.3.1 1726642126 installed
<13>Nov  5 03:43:47 rpmi: libmikmod-3.3.11.1-alt2 sisyphus+278211.100.1.1 1626077581 installed
<13>Nov  5 03:43:47 rpmi: dbus-tools-1.14.10-alt1 sisyphus+327286.5700.14.1 1711487401 installed
<86>Nov  5 03:43:47 groupadd[2174185]: group added to /etc/group: name=messagebus, GID=999
<86>Nov  5 03:43:47 groupadd[2174185]: group added to /etc/gshadow: name=messagebus
<86>Nov  5 03:43:47 groupadd[2174185]: new group: name=messagebus, GID=999
<86>Nov  5 03:43:47 useradd[2174191]: new user: name=messagebus, UID=999, GID=999, home=/run/dbus, shell=/dev/null, from=none
<13>Nov  5 03:43:47 rpmi: dbus-1.14.10-alt1 sisyphus+327286.5700.14.1 1711487401 installed
<13>Nov  5 03:43:47 rpmi: dbus-tools-gui-1.14.10-alt1 sisyphus+327286.5700.14.1 1711487401 installed
<13>Nov  5 03:43:47 rpmi: dconf-0.40.0-alt3 sisyphus+325650.100.1.1 1690417205 installed
<13>Nov  5 03:43:47 rpmi: libgtk+3-schemas-3.24.43-alt1 sisyphus+352627.100.1.1 1720700731 installed
<13>Nov  5 03:43:47 rpmi: libavahi-0.8-alt4 sisyphus+344258.100.1.1 1712133856 installed
<13>Nov  5 03:43:47 rpmi: libpolkit-124-alt3 sisyphus+351454.100.1.1 1719236630 installed
<13>Nov  5 03:43:47 rpmi: rpm-macros-alternatives-0.5.2-alt2 sisyphus+315270.200.2.1 1676457367 installed
<13>Nov  5 03:43:47 rpmi: alternatives-0.5.2-alt2 sisyphus+315270.200.2.1 1676457367 installed
<13>Nov  5 03:43:47 rpmi: ca-certificates-2024.07.01-alt1 sisyphus+351897.100.1.1 1719826350 installed
<13>Nov  5 03:43:47 rpmi: ca-trust-0.2.0-alt1 sisyphus+344843.100.1.1 1712743326 installed
<13>Nov  5 03:43:47 rpmi: p11-kit-trust-1:0.25.5-alt1 sisyphus+352553.100.1.1 1720622573 installed
<13>Nov  5 03:43:48 rpmi: libcrypto3-3.1.7-alt2 sisyphus+359910.100.1.1 1729080439 installed
<13>Nov  5 03:43:48 rpmi: libssl3-3.1.7-alt2 sisyphus+359910.100.1.1 1729080439 installed
<13>Nov  5 03:43:48 rpmi: python3-3.12.7-alt1 sisyphus+358796.100.1.1 1727844808 installed
<13>Nov  5 03:43:49 rpmi: python3-base-3.12.7-alt1 sisyphus+358796.100.1.1 1727844808 installed
<13>Nov  5 03:43:49 rpmi: glib2-devel-2.82.2-alt1 sisyphus+360023.100.1.1 1729169691 installed
<86>Nov  5 03:43:49 groupadd[2175701]: group added to /etc/group: name=_keytab, GID=998
<86>Nov  5 03:43:49 groupadd[2175701]: group added to /etc/gshadow: name=_keytab
<86>Nov  5 03:43:49 groupadd[2175701]: new group: name=_keytab, GID=998
<13>Nov  5 03:43:49 rpmi: libkrb5-1.21.3-alt2 sisyphus+351857.100.1.1 1719735141 installed
<13>Nov  5 03:43:49 rpmi: libgio-devel-2.82.2-alt1 sisyphus+360023.100.1.1 1729169691 installed
<13>Nov  5 03:43:49 rpmi: libcairo-devel-1:1.18.2-alt1 sisyphus+357195.100.1.1 1725948391 installed
<13>Nov  5 03:43:49 rpmi: fontconfig-devel-2.15.0-alt1 sisyphus+355771.100.2.3 1724337298 installed
<13>Nov  5 03:43:49 rpmi: libfreetype-devel-2.13.3-alt1 sisyphus+355656.100.1.1 1724221064 installed
<13>Nov  5 03:43:49 rpmi: libharfbuzz-devel-10.0.1-alt1 sisyphus+358317.100.1.1 1727257731 installed
<13>Nov  5 03:43:49 rpmi: python3-module-more-itertools-10.5.0-alt1 sisyphus+357221.100.1.1 1725964420 installed
<13>Nov  5 03:43:49 rpmi: libkmod-32-alt1 sisyphus+357452.100.2.1 1727718007 installed
<13>Nov  5 03:43:49 rpmi: python3-module-jaraco.functools-4.1.0-alt1 sisyphus+358564.100.1.1 1727528718 installed
<13>Nov  5 03:43:49 rpmi: libgdk-pixbuf-devel-2.42.12-alt1 sisyphus+348142.100.1.1 1715791856 installed
<13>Nov  5 03:43:49 rpmi: python3-module-Pygments-2.18.0-alt1 sisyphus+347552.100.1.1 1714992955 installed
<13>Nov  5 03:43:49 rpmi: libgdk-pixbuf-gir-devel-2.42.12-alt1 sisyphus+348142.100.1.1 1715791856 installed
<13>Nov  5 03:43:49 rpmi: systemd-utils-standalone-1:255.13-alt1 sisyphus+359453.100.2.1 1728651180 installed
<13>Nov  5 03:43:50 rpmi: at-spi2-core-2.54.0-alt1 sisyphus+357735.600.3.1 1726642126 installed
<13>Nov  5 03:43:50 rpmi: kmod-32-alt1 sisyphus+357452.100.2.1 1727718007 installed
<13>Nov  5 03:43:50 rpmi: dmsetup-1.02.200-alt1 sisyphus+355869.100.1.1 1724444357 installed
<86>Nov  5 03:43:50 groupadd[2176712]: group added to /etc/group: name=tape, GID=997
<86>Nov  5 03:43:50 groupadd[2176712]: group added to /etc/gshadow: name=tape
<86>Nov  5 03:43:50 groupadd[2176712]: new group: name=tape, GID=997
<86>Nov  5 03:43:50 groupadd[2176853]: group added to /etc/group: name=dialout, GID=996
<86>Nov  5 03:43:50 groupadd[2176853]: group added to /etc/gshadow: name=dialout
<86>Nov  5 03:43:50 groupadd[2176853]: new group: name=dialout, GID=996
<86>Nov  5 03:43:50 groupadd[2177020]: group added to /etc/group: name=input, GID=995
<86>Nov  5 03:43:50 groupadd[2177020]: group added to /etc/gshadow: name=input
<86>Nov  5 03:43:50 groupadd[2177020]: new group: name=input, GID=995
<86>Nov  5 03:43:50 groupadd[2177128]: group added to /etc/group: name=video, GID=994
<86>Nov  5 03:43:50 groupadd[2177128]: group added to /etc/gshadow: name=video
<86>Nov  5 03:43:50 groupadd[2177128]: new group: name=video, GID=994
<86>Nov  5 03:43:50 groupadd[2177179]: group added to /etc/group: name=render, GID=993
<86>Nov  5 03:43:50 groupadd[2177179]: group added to /etc/gshadow: name=render
<86>Nov  5 03:43:50 groupadd[2177179]: new group: name=render, GID=993
<86>Nov  5 03:43:50 groupadd[2177296]: group added to /etc/group: name=sgx, GID=992
<86>Nov  5 03:43:50 groupadd[2177296]: group added to /etc/gshadow: name=sgx
<86>Nov  5 03:43:50 groupadd[2177296]: new group: name=sgx, GID=992
<13>Nov  5 03:43:50 rpmi: udev-1:255.13-alt1 sisyphus+359453.100.2.1 1728651180 installed
<86>Nov  5 03:43:50 groupadd[2178214]: group added to /etc/group: name=colord, GID=991
<86>Nov  5 03:43:50 groupadd[2178214]: group added to /etc/gshadow: name=colord
<86>Nov  5 03:43:50 groupadd[2178214]: new group: name=colord, GID=991
<86>Nov  5 03:43:50 useradd[2178226]: new user: name=colord, UID=998, GID=991, home=/var/colord, shell=/dev/null, from=none
<13>Nov  5 03:43:51 rpmi: colord-1.4.7-alt1.1 sisyphus+338793.100.1.1 1706039016 installed
<13>Nov  5 03:43:51 rpmi: libXft-devel-2.3.8-alt1 sisyphus+331490.400.1.1 1697023269 installed
<13>Nov  5 03:43:51 rpmi: libpango-devel-1.54.0-alt1 sisyphus+350796.200.1.1 1718041393 installed
<13>Nov  5 03:43:51 rpmi: libcairo-gobject-devel-1:1.18.2-alt1 sisyphus+357195.100.1.1 1725948391 installed
<13>Nov  5 03:43:51 rpmi: libgsasl18-2.2.1-alt2 sisyphus+359713.200.2.1 1728905430 installed
<86>Nov  5 03:43:51 groupadd[2178325]: group added to /etc/group: name=sasl, GID=990
<86>Nov  5 03:43:51 groupadd[2178325]: group added to /etc/gshadow: name=sasl
<86>Nov  5 03:43:51 groupadd[2178325]: new group: name=sasl, GID=990
<13>Nov  5 03:43:51 rpmi: libsasl2-3-2.1.28-alt2 sisyphus+343335.100.1.1 1711112544 installed
<13>Nov  5 03:43:51 rpmi: libldap2-2.6.8-alt1 sisyphus+351621.100.1.1 1719420449 installed
<13>Nov  5 03:43:51 rpmi: libcups-2.4.11-alt1 sisyphus+359120.200.2.1 1728202635 installed
<13>Nov  5 03:43:51 rpmi: libgtk+3-3.24.43-alt1 sisyphus+352627.100.1.1 1720700731 installed
<13>Nov  5 03:43:51 rpmi: libgirepository1.0-devel-1.82.0-alt1 sisyphus+357735.200.3.1 1726641712 installed
<13>Nov  5 03:43:51 rpmi: python3-module-py3dephell-0.1.0-alt2 sisyphus+328191.600.5.1 1693609196 installed
<13>Nov  5 03:43:52 rpmi: libpython3-3.12.7-alt1 sisyphus+358796.100.1.1 1727844808 installed
<13>Nov  5 03:43:52 rpmi: python3-module-autocommand-2.2.2-alt1.1 sisyphus+339714.100.1.1 1706968174 installed
<13>Nov  5 03:43:52 rpmi: python3-module-jaraco.context-6.0.1-alt1 sisyphus+357809.300.1.1 1726769204 installed
<13>Nov  5 03:43:52 rpmi: python3-module-jaraco.text-4.0.0-alt1 sisyphus+353877.400.2.1 1722250727 installed
<13>Nov  5 03:43:52 rpmi: python3-module-jaraco.collections-5.1.0-alt1 sisyphus+357809.200.1.1 1726769173 installed
<13>Nov  5 03:43:52 rpmi: python3-module-packaging-24.1-alt1 sisyphus+350717.100.2.1 1718268656 installed
<13>Nov  5 03:43:52 rpmi: python3-module-platformdirs-4.3.6-alt1 sisyphus+357787.200.1.1 1726664692 installed
<13>Nov  5 03:43:52 rpmi: python3-module-wheel-0.44.0-alt1 sisyphus+355530.100.1.1 1724069901 installed
<13>Nov  5 03:43:52 rpmi: python3-module-pkg_resources-1:75.1.0-alt1 sisyphus+358755.300.4.1 1729870276 installed
<13>Nov  5 03:43:52 rpmi: python3-module-pycparser-2.21-alt1.1 sisyphus+309935.7300.4.1 1668527005 installed
<13>Nov  5 03:43:52 rpmi: python3-module-cffi-1.17.1-alt1 sisyphus+357396.100.1.1 1726156476 installed
<13>Nov  5 03:43:52 rpmi: python3-module-cryptography-43.0.0-alt1 sisyphus+353417.100.1.1 1721731007 installed
<13>Nov  5 03:43:52 rpmi: python3-module-markupsafe-1:3.0.2-alt1 sisyphus+360209.100.1.1 1729323052 installed
<13>Nov  5 03:43:52 rpmi: python3-module-babel-1:2.15.0-alt1 sisyphus+353791.100.1.1 1722073848 installed
<13>Nov  5 03:43:52 rpmi: python3-module-chameleon.core-4.5.4-alt1 sisyphus+348413.100.1.1 1716027273 installed
<13>Nov  5 03:43:52 rpmi: python3-module-click-8.1.7-alt1 sisyphus+327424.100.2.1 1695395098 installed
<13>Nov  5 03:43:52 rpmi: python3-module-polib-1.1.1-alt1 sisyphus+282657.100.1.1 1628954165 installed
<13>Nov  5 03:43:52 rpmi: python3-module-lingua-4.15.0-alt3 sisyphus+339340.100.1.1 1706573397 installed
<13>Nov  5 03:43:52 rpmi: python3-module-zipp-3.20.2-alt1 sisyphus+357620.100.2.1 1726639447 installed
<13>Nov  5 03:43:52 rpmi: python3-module-importlib-metadata-8.5.0-alt1 sisyphus+357362.100.1.1 1726136861 installed
<13>Nov  5 03:43:52 rpmi: python3-module-markdown-3.7-alt1 sisyphus+356078.100.1.1 1724670316 installed
<13>Nov  5 03:43:52 rpmi: tests-for-installed-python3-pkgs-0.1.25-alt1 sisyphus+344685.100.1.1 1712595070 installed
<13>Nov  5 03:43:52 rpmi: rpm-build-python3-0.1.25-alt1 sisyphus+344685.100.1.1 1712595070 installed
<13>Nov  5 03:43:54 rpmi: python3-dev-3.12.7-alt1 sisyphus+358796.100.1.1 1727844808 installed
<13>Nov  5 03:43:54 rpmi: python3-module-setuptools-1:75.1.0-alt1 sisyphus+358755.300.4.1 1729870276 installed
<13>Nov  5 03:43:54 rpmi: libssh2-1.11.0-alt2 sisyphus+339356.100.1.1 1706593137 installed
<13>Nov  5 03:43:54 rpmi: libcurl-8.10.0-alt1 sisyphus+357271.100.1.1 1726044759 installed
<13>Nov  5 03:43:54 rpmi: libproxy-0.5.9-alt1 sisyphus+360721.100.1.1 1729865346 installed
<13>Nov  5 03:43:54 rpmi: glib-networking-2.80.0-alt1 sisyphus+342825.100.1.1 1710537082 installed
<13>Nov  5 03:43:54 rpmi: libsoup-2.74.3-alt1.1 sisyphus+318260.100.1.1 1680994685 installed
<13>Nov  5 03:43:54 rpmi: libsoup3.0-3.6.0-alt1 sisyphus+357735.1300.3.1 1726642639 installed
<13>Nov  5 03:43:54 rpmi: libsoup-devel-2.74.3-alt1.1 sisyphus+318260.100.1.1 1680994685 installed
<13>Nov  5 03:43:54 rpmi: vala-0.56.17-alt1 sisyphus+345617.100.1.1 1713782341 installed
<13>Nov  5 03:43:54 rpmi: libsoup3.0-devel-3.6.0-alt1 sisyphus+357735.1300.3.1 1726642639 installed
<13>Nov  5 03:43:54 rpmi: librsvg-devel-1:2.59.2-alt1 sisyphus+361144.100.1.1 1730276750 installed
<13>Nov  5 03:43:54 rpmi: libarchive13-3.7.5-alt2 sisyphus+358189.100.1.1 1727162763 installed
<13>Nov  5 03:43:54 rpmi: libnss-3.105-alt1 sisyphus+358568.40.2.1 1727535126 installed
<13>Nov  5 03:43:54 rpmi: python3-module-nss-1.0.1-alt7 sisyphus+333513.61400.73.1 1704656705 installed
<13>Nov  5 03:43:54 rpmi: python3-module-beaker-1.12.1-alt1 sisyphus+319143.100.1.1 1682256768 installed
<13>Nov  5 03:43:54 rpmi: python3-module-mako-1.3.6-alt1 sisyphus+360386.100.1.1 1729584866 installed
<13>Nov  5 03:43:54 rpmi: gobject-introspection-devel-1.82.0-alt1 sisyphus+357735.200.3.1 1726641712 installed
<13>Nov  5 03:43:54 rpmi: alsa-ucm-conf-1.2.12-alt1 sisyphus+352670.100.1.1 1720712327 installed
<13>Nov  5 03:43:54 rpmi: alsa-topology-conf-1.2.5.1-alt1 sisyphus+274777.100.1.1 1624089141 installed
<13>Nov  5 03:43:54 rpmi: libalsa-1:1.2.12-alt1 sisyphus+352670.200.1.1 1720712401 installed
<13>Nov  5 03:43:54 rpmi: libSDL-1.2.14-alt10 sisyphus+346015.200.2.1 1716212609 installed
<13>Nov  5 03:43:54 rpmi: libSDL-devel-1.2.14-alt10 sisyphus+346015.200.2.1 1716212609 installed
<13>Nov  5 03:43:54 rpmi: libSDL_image-1.2.12-alt3.gitd0ea78d sisyphus+346018.200.2.1 1716213795 installed
<13>Nov  5 03:43:54 rpmi: libSDL_mixer-1.2.12-alt2.git40a7e1a sisyphus+339776.1500.6.2 1707344473 installed
<13>Nov  5 03:43:54 rpmi: libSDL_net-1.2.8-alt3.git9a629d6 sisyphus+346019.200.2.1 1716214192 installed
<13>Nov  5 03:43:54 rpmi: libSDL_pango1-0.1.2-alt6 sisyphus+331519.100.1.1 1697031333 installed
<13>Nov  5 03:43:54 rpmi: libSDL_pango-devel-0.1.2-alt6 sisyphus+331519.100.1.1 1697031333 installed
<13>Nov  5 03:43:54 rpmi: libSDL_net-devel-1.2.8-alt3.git9a629d6 sisyphus+346019.200.2.1 1716214192 installed
<13>Nov  5 03:43:54 rpmi: libSDL_mixer-devel-1.2.12-alt2.git40a7e1a sisyphus+339776.1500.6.2 1707344473 installed
<13>Nov  5 03:43:54 rpmi: libSDL_image-devel-1.2.12-alt3.gitd0ea78d sisyphus+346018.200.2.1 1716213795 installed
<13>Nov  5 03:43:54 rpmi: libpcaudio0-1.2-alt1_1 sisyphus+343841.100.1.1 1711633263 installed
<13>Nov  5 03:43:54 rpmi: libespeak-ng1-1.51.1-alt4 sisyphus+350707.700.7.1 1719391776 installed
<13>Nov  5 03:43:54 rpmi: t4k_common-0.1.1-alt5.gita6c6b15.1 sisyphus+350707.1300.7.1 1719391931 installed
<13>Nov  5 03:43:54 rpmi: t4k_common-devel-0.1.1-alt5.gita6c6b15.1 sisyphus+350707.1300.7.1 1719391931 installed
<13>Nov  5 03:43:54 rpmi: librsvg-gir-devel-1:2.59.2-alt1 sisyphus+361144.100.1.1 1730276750 installed
<13>Nov  5 03:43:54 rpmi: libappstream-glib-0.8.2-alt1.1 sisyphus+333037.40.2.1 1698571890 installed
<13>Nov  5 03:43:54 rpmi: gcc-c++-14-alt1 sisyphus+360995.300.1.1 1730139222 installed
Building target platforms: x86_64
Building for target x86_64
Wrote: /usr/src/in/nosrpm/tuxmath-2.0.3-alt6.nosrc.rpm (w1.gzdio)
Installing tuxmath-2.0.3-alt6.src.rpm
Building target platforms: x86_64
Building for target x86_64
Executing(%prep): /bin/sh -e /usr/src/tmp/rpm-tmp.27418
+ umask 022
+ /bin/mkdir -p /usr/src/RPM/BUILD
+ cd /usr/src/RPM/BUILD
+ cd /usr/src/RPM/BUILD
+ rm -rf tuxmath-2.0.3
+ echo 'Source #0 (tuxmath-2.0.3.tar):'
Source #0 (tuxmath-2.0.3.tar):
+ /bin/tar -xf /usr/src/RPM/SOURCES/tuxmath-2.0.3.tar
+ cd tuxmath-2.0.3
+ /bin/chmod -c -Rf u+rwX,go-w .
+ echo 'Patch #0 (tuxmath-update-russian-po.patch):'
Patch #0 (tuxmath-update-russian-po.patch):
+ /usr/bin/patch -p1
patching file po/ru.po
+ exit 0
Executing(%build): /bin/sh -e /usr/src/tmp/rpm-tmp.27418
+ umask 022
+ /bin/mkdir -p /usr/src/RPM/BUILD
+ cd /usr/src/RPM/BUILD
+ cd tuxmath-2.0.3
+ autoreconf -fisv
autoreconf-default: export WARNINGS=
autoreconf-default: Entering directory '.'
autoreconf-default: running: autopoint --force
Copying file m4/fcntl-o.m4
Copying file m4/threadlib.m4
autoreconf-default: running: aclocal --force -I m4
autoreconf-default: configure.ac: tracing
autoreconf-default: configure.ac: not using Libtool
autoreconf-default: configure.ac: not using Intltool
autoreconf-default: configure.ac: not using Gtkdoc
autoreconf-default: running: /usr/bin/autoconf-2.71 --force
configure.ac:21: warning: The macro `AC_GNU_SOURCE' is obsolete.
configure.ac:21: You should run autoupdate.
./lib/autoconf/specific.m4:298: AC_GNU_SOURCE is expanded from...
configure.ac:21: the top level
configure.ac:50: warning: AM_PROG_MKDIR_P: this macro is deprecated, and will soon be removed.
configure.ac:50: You should use the Autoconf-provided 'AC_PROG_MKDIR_P' macro instead,
configure.ac:50: and use '$(MKDIR_P)' instead of '$(mkdir_p)'in your Makefile.am files.
./lib/autoconf/general.m4:2434: AC_DIAGNOSE is expanded from...
aclocal.m4:1020: AM_PROG_MKDIR_P is expanded from...
m4/po.m4:23: AM_PO_SUBDIRS is expanded from...
m4/gettext.m4:57: AM_GNU_GETTEXT is expanded from...
configure.ac:50: the top level
configure.ac:50: warning: The macro `AC_TRY_LINK' is obsolete.
configure.ac:50: You should run autoupdate.
./lib/autoconf/general.m4:2920: AC_TRY_LINK is expanded from...
lib/m4sugar/m4sh.m4:692: _AS_IF_ELSE is expanded from...
lib/m4sugar/m4sh.m4:699: AS_IF is expanded from...
./lib/autoconf/general.m4:2249: AC_CACHE_VAL is expanded from...
./lib/autoconf/general.m4:2270: AC_CACHE_CHECK is expanded from...
m4/intlmacosx.m4:18: gt_INTL_MACOSX is expanded from...
m4/gettext.m4:57: AM_GNU_GETTEXT is expanded from...
configure.ac:50: the top level
configure.ac:50: warning: The macro `AC_TRY_LINK' is obsolete.
configure.ac:50: You should run autoupdate.
./lib/autoconf/general.m4:2920: AC_TRY_LINK is expanded from...
lib/m4sugar/m4sh.m4:692: _AS_IF_ELSE is expanded from...
lib/m4sugar/m4sh.m4:699: AS_IF is expanded from...
./lib/autoconf/general.m4:2249: AC_CACHE_VAL is expanded from...
./lib/autoconf/general.m4:2270: AC_CACHE_CHECK is expanded from...
m4/gettext.m4:57: AM_GNU_GETTEXT is expanded from...
configure.ac:50: the top level
configure.ac:50: warning: The macro `AC_TRY_LINK' is obsolete.
configure.ac:50: You should run autoupdate.
./lib/autoconf/general.m4:2920: AC_TRY_LINK is expanded from...
lib/m4sugar/m4sh.m4:692: _AS_IF_ELSE is expanded from...
lib/m4sugar/m4sh.m4:699: AS_IF is expanded from...
./lib/autoconf/general.m4:2249: AC_CACHE_VAL is expanded from...
./lib/autoconf/general.m4:2270: AC_CACHE_CHECK is expanded from...
m4/iconv.m4:20: AM_ICONV_LINK is expanded from...
m4/gettext.m4:57: AM_GNU_GETTEXT is expanded from...
configure.ac:50: the top level
configure.ac:50: warning: The macro `AC_TRY_RUN' is obsolete.
configure.ac:50: You should run autoupdate.
./lib/autoconf/general.m4:2997: AC_TRY_RUN is expanded from...
lib/m4sugar/m4sh.m4:692: _AS_IF_ELSE is expanded from...
lib/m4sugar/m4sh.m4:699: AS_IF is expanded from...
./lib/autoconf/general.m4:2249: AC_CACHE_VAL is expanded from...
./lib/autoconf/general.m4:2270: AC_CACHE_CHECK is expanded from...
m4/iconv.m4:20: AM_ICONV_LINK is expanded from...
m4/gettext.m4:57: AM_GNU_GETTEXT is expanded from...
configure.ac:50: the top level
configure.ac:69: warning: The macro `AC_TRY_RUN' is obsolete.
configure.ac:69: You should run autoupdate.
./lib/autoconf/general.m4:2997: AC_TRY_RUN is expanded from...
acinclude.m4:11: AM_PATH_SDL is expanded from...
aclocal.m4:161: PKG_CHECK_MODULES is expanded from...
configure.ac:69: the top level
configure.ac:69: warning: The macro `AC_TRY_LINK' is obsolete.
configure.ac:69: You should run autoupdate.
./lib/autoconf/general.m4:2920: AC_TRY_LINK is expanded from...
acinclude.m4:11: AM_PATH_SDL is expanded from...
aclocal.m4:161: PKG_CHECK_MODULES is expanded from...
configure.ac:69: the top level
configure.ac:228: warning: The macro `AC_HEADER_STDC' is obsolete.
configure.ac:228: You should run autoupdate.
./lib/autoconf/headers.m4:704: AC_HEADER_STDC is expanded from...
configure.ac:228: the top level
autoreconf-default: running: /usr/bin/autoheader-2.71 --force
autoreconf-default: running: automake --add-missing --force-missing
configure.ac:50: warning: The 'AM_PROG_MKDIR_P' macro is deprecated, and its use is discouraged.
configure.ac:50: You should use the Autoconf-provided 'AC_PROG_MKDIR_P' macro instead,
configure.ac:50: and use '$(MKDIR_P)' instead of '$(mkdir_p)'in your Makefile.am files.
configure.ac:21: installing './compile'
configure.ac:6: installing './config.guess'
configure.ac:6: installing './config.sub'
configure.ac:10: installing './install-sh'
configure.ac:10: installing './missing'
src/Makefile.am: installing './depcomp'
autoreconf-default: Leaving directory '.'
+ CFLAGS='-pipe -frecord-gcc-switches -Wall -g -O2 -flto=auto -fcommon'
+ export CFLAGS
+ CXXFLAGS='-pipe -frecord-gcc-switches -Wall -g -O2 -flto=auto -fcommon'
+ export CXXFLAGS
+ FFLAGS='-pipe -frecord-gcc-switches -Wall -g -O2 -flto=auto -fcommon'
+ export FFLAGS
+ FCFLAGS='-pipe -frecord-gcc-switches -Wall -g -O2 -flto=auto -fcommon'
+ export FCFLAGS
+ '[' -n '' ']'
++ sed -r 's/(^|[[:space:]]+)-[^m][^[:space:]]*//g'
++ printf %s '-pipe -frecord-gcc-switches -Wall -g -O2 -flto=auto -fcommon'
+ ASFLAGS=
+ export ASFLAGS
+ export lt_cv_deplibs_check_method=pass_all
+ lt_cv_deplibs_check_method=pass_all
+ readlink -e -- ./configure
+ xargs -ri dirname -- '{}'
+ xargs -ri find '{}' -type f '(' -name config.sub -or -name config.guess ')' -printf '%h/\n'
+ sort -u
+ xargs -rn1 install -pm755 -- /usr/share/gnu-config/config.sub /usr/share/gnu-config/config.guess
+ configure_runstatedir_flags=
+ grep -qF runstatedir=DIR ./configure
+ configure_runstatedir_flags=--runstatedir=/var/run
+ ./configure --build=x86_64-alt-linux --host=x86_64-alt-linux --prefix=/usr --exec-prefix=/usr --bindir=/usr/bin --sbindir=/usr/sbin --sysconfdir=/etc --datadir=/usr/share --includedir=/usr/include --libdir=/usr/lib64 --libexecdir=/usr/lib --localstatedir=/var/lib --sharedstatedir=/var/lib --mandir=/usr/share/man --infodir=/usr/share/info --disable-dependency-tracking --disable-silent-rules --runstatedir=/var/run --without-included-gettext
configure: WARNING: unrecognized options: --without-included-gettext
checking build system type... x86_64-alt-linux-gnu
checking host system type... x86_64-alt-linux-gnu
checking target system type... x86_64-alt-linux-gnu
checking for a BSD-compatible install... /usr/bin/ginstall -c
checking whether build environment is sane... yes
checking for a race-free mkdir -p... /usr/bin/mkdir -p
checking for gawk... gawk
checking whether make sets $(MAKE)... yes
checking whether make supports nested variables... yes
checking whether make supports the include directive... yes (GNU style)
checking for x86_64-alt-linux-gcc... x86_64-alt-linux-gcc
checking whether the C compiler works... yes
checking for C compiler default output file name... a.out
checking for suffix of executables... 
checking whether we are cross compiling... no
checking for suffix of object files... o
checking whether the compiler supports GNU C... yes
checking whether x86_64-alt-linux-gcc accepts -g... yes
checking for x86_64-alt-linux-gcc option to enable C11 features... none needed
checking whether x86_64-alt-linux-gcc understands -c and -o together... yes
checking dependency style of x86_64-alt-linux-gcc... none
checking for stdio.h... yes
checking for stdlib.h... yes
checking for string.h... yes
checking for inttypes.h... yes
checking for stdint.h... yes
checking for strings.h... yes
checking for sys/stat.h... yes
checking for sys/types.h... yes
checking for unistd.h... yes
checking for wchar.h... yes
checking for minix/config.h... no
checking for sys/param.h... yes
checking whether it is safe to define __EXTENSIONS__... yes
checking whether _XOPEN_SOURCE should be defined... no
checking for x86_64-alt-linux-ranlib... no
checking for ranlib... ranlib
checking for x86_64-alt-linux-g++... x86_64-alt-linux-g++
checking whether the compiler supports GNU C++... yes
checking whether x86_64-alt-linux-g++ accepts -g... yes
checking for x86_64-alt-linux-g++ option to enable C++11 features... none needed
checking dependency style of x86_64-alt-linux-g++... none
checking for x86_64-alt-linux-gcc... (cached) x86_64-alt-linux-gcc
checking whether the compiler supports GNU C... (cached) yes
checking whether x86_64-alt-linux-gcc accepts -g... (cached) yes
checking for x86_64-alt-linux-gcc option to enable C11 features... (cached) none needed
checking whether x86_64-alt-linux-gcc understands -c and -o together... (cached) yes
checking dependency style of x86_64-alt-linux-gcc... (cached) none
checking whether make sets $(MAKE)... (cached) yes
checking for gawk... (cached) gawk
checking how to run the C preprocessor... x86_64-alt-linux-gcc -E
checking for bison... bison -y
checking whether NLS is requested... yes
checking for msgfmt... /usr/bin/msgfmt
checking for gmsgfmt... /usr/bin/msgfmt
checking for xgettext... /usr/bin/xgettext
checking for msgmerge... /usr/bin/msgmerge
checking for ld used by GCC... /usr/bin/ld
checking if the linker (/usr/bin/ld) is GNU ld... yes
checking for shared library run path origin... done
checking for grep that handles long lines and -e... /usr/bin/grep
checking for egrep... /usr/bin/grep -E
checking for CFPreferencesCopyAppValue... no
checking for CFLocaleCopyCurrent... no
checking for GNU gettext in libc... yes
checking whether to use NLS... yes
checking where the gettext function comes from... libc
checking for x86_64-alt-linux-pkg-config... no
checking for pkg-config... /usr/bin/pkg-config
checking pkg-config is at least version 0.9.0... yes
checking for sdl >= 1.2.0... yes
checking for SDL_image... yes
checking for SDL_mixer... yes
checking for librsvg-2.0 >= 2.18... yes
checking for cairo >= 1.4.10... yes
checking for csin in -lm... yes
checking for WSAStartup in -lws2_32... no
configure: Windows socket library ws2_32 not found - (only needed on win32)
checking for SDL_net... yes
checking for libxml-2.0... yes
checking for t4k_common... yes
checking for size_t... yes
checking for working alloca.h... yes
checking for alloca... yes
checking for dirent.h that defines DIR... yes
checking for library containing opendir... none required
checking for egrep... (cached) /usr/bin/grep -E
checking for argz.h... yes
checking for error.h... yes
checking for errno.h... yes
checking for fcntl.h... yes
checking for float.h... yes
checking for iconv.h... yes
checking for inttypes.h... (cached) yes
checking for langinfo.h... yes
checking for libgen.h... yes
checking for libintl.h... yes
checking for limits.h... yes
checking for locale.h... yes
checking for malloc.h... yes
checking for math.h... yes
checking for pthread.h... yes
checking for stddef.h... yes
checking for stdint.h... (cached) yes
checking for stdio_ext.h... yes
checking for stdlib.h... (cached) yes
checking for string.h... (cached) yes
checking for strings.h... (cached) yes
checking for sys/param.h... (cached) yes
checking for unistd.h... (cached) yes
checking for wchar.h... (cached) yes
checking for _Bool... yes
checking for stdbool.h that conforms to C99... yes
checking for an ANSI C-conforming const... yes
checking for inline... inline
checking for C/C++ restrict keyword... __restrict__
checking for mode_t... yes
checking for size_t... (cached) yes
checking for uint16_t... yes
checking for uint32_t... yes
checking for uint8_t... yes
checking for working volatile... yes
checking for ptrdiff_t... yes
checking whether closedir returns void... no
checking for error_at_line... yes
checking for getpagesize... yes
checking for vprintf... yes
checking for working mmap... yes
checking whether lstat correctly handles trailing slash... yes
checking whether stat accepts an empty string... no
checking for working strcoll... yes
checking for working strtod... yes
checking for __argz_count... yes
checking for __argz_next... yes
checking for __argz_stringify... yes
checking for alphasort... yes
checking for atexit... yes
checking for basename... yes
checking for bcopy... yes
checking for fcntl... yes
checking for floor... yes
checking for fsync... yes
checking for getcwd... yes
checking for localeconv... yes
checking for localtime_r... yes
checking for memmove... yes
checking for mempcpy... yes
checking for memset... yes
checking for Mix_Init... yes
checking for mkdir... yes
checking for munmap... yes
checking for nl_langinfo... yes
checking for scandir... yes
checking for setlocale... yes
checking for sqrt... yes
checking for stpcpy... yes
checking for strcasecmp... yes
checking for strchr... yes
checking for strcspn... yes
checking for strdup... yes
checking for strncasecmp... yes
checking for strndup... yes
checking for strrchr... yes
checking for strstr... yes
checking for strtoul... yes
checking for native Win32... no
checking for makensis... no
checking for todos... no
checking for unix2dos... no
checking that generated files are newer than configure... done
configure: creating ./config.status
config.status: creating Makefile
config.status: creating tuxmath.spec
config.status: creating tuxmath_preview.spec
config.status: creating data/Makefile
config.status: creating data/fonts/Makefile
config.status: creating data/images/Makefile
config.status: creating data/images/backgrounds/Makefile
config.status: creating data/images/cities/Makefile
config.status: creating data/images/comets/Makefile
config.status: creating data/images/icons/Makefile
config.status: creating data/images/igloos/Makefile
config.status: creating data/images/penguins/Makefile
config.status: creating data/images/sprites/Makefile
config.status: creating data/images/status/Makefile
config.status: creating data/images/title/Makefile
config.status: creating data/images/tux/Makefile
config.status: creating data/images/factoroids/Makefile
config.status: creating data/menus/Makefile
config.status: creating data/missions/Makefile
config.status: creating data/missions/arcade/Makefile
config.status: creating data/missions/campaign/Makefile
config.status: creating data/missions/campaign/ace/Makefile
config.status: creating data/missions/campaign/cadet/Makefile
config.status: creating data/missions/campaign/commando/Makefile
config.status: creating data/missions/campaign/ranger/Makefile
config.status: creating data/missions/campaign/scout/Makefile
config.status: creating data/missions/lessons/Makefile
config.status: creating data/missions/multiplay/Makefile
config.status: creating data/sounds/Makefile
config.status: creating doc/Makefile
config.status: creating nsis/tuxmath.nsi
config.status: creating src/Makefile
config.status: creating po/Makefile.in
config.status: creating config.h
config.status: executing depfiles commands
config.status: executing po-directories commands
config.status: creating po/POTFILES
config.status: creating po/Makefile
configure: WARNING: unrecognized options: --without-included-gettext
+ make -j8
make  all-recursive
Making all in data
Making all in fonts
make[3]: Nothing to be done for 'all'.
Making all in images
Making all in backgrounds
make[4]: Nothing to be done for 'all'.
Making all in cities
make[4]: Nothing to be done for 'all'.
Making all in comets
make[4]: Nothing to be done for 'all'.
Making all in factoroids
make[4]: Nothing to be done for 'all'.
Making all in icons
make[4]: Nothing to be done for 'all'.
Making all in igloos
make[4]: Nothing to be done for 'all'.
Making all in penguins
make[4]: Nothing to be done for 'all'.
Making all in sprites
make[4]: Nothing to be done for 'all'.
Making all in status
make[4]: Nothing to be done for 'all'.
Making all in title
make[4]: Nothing to be done for 'all'.
Making all in tux
make[4]: Nothing to be done for 'all'.
make[4]: Nothing to be done for 'all-am'.
Making all in menus
make[3]: Entering directory '/usr/src/RPM/BUILD/tuxmath-2.0.3/data/menus'
cd .; ./update-po.sh
make[3]: Leaving directory '/usr/src/RPM/BUILD/tuxmath-2.0.3/data/menus'
Making all in missions
Making all in arcade
make[4]: Nothing to be done for 'all'.
Making all in campaign
Making all in ace
make[5]: Nothing to be done for 'all'.
Making all in cadet
make[5]: Nothing to be done for 'all'.
Making all in commando
make[5]: Nothing to be done for 'all'.
Making all in ranger
make[5]: Nothing to be done for 'all'.
Making all in scout
make[5]: Nothing to be done for 'all'.
make[5]: Nothing to be done for 'all-am'.
Making all in lessons
make[4]: Nothing to be done for 'all'.
Making all in multiplay
make[4]: Nothing to be done for 'all'.
make[4]: Nothing to be done for 'all-am'.
Making all in sounds
make[3]: Nothing to be done for 'all'.
make[3]: Nothing to be done for 'all-am'.
Making all in doc
make[2]: Nothing to be done for 'all'.
Making all in po
test ! -f ./tuxmath.pot || \
  test -z "ar.gmo ast.gmo bg.gmo ca.gmo cs.gmo da.gmo de.gmo el.gmo en@quot.gmo en@boldquot.gmo en_GB.gmo en_US@piglatin.gmo es.gmo fi.gmo fr.gmo ga.gmo gd.gmo he.gmo hi.gmo hr.gmo hu.gmo it.gmo ja.gmo ku.gmo mn.gmo nb.gmo nl.gmo nn.gmo oc.gmo pl.gmo pt.gmo pt_BR.gmo ro.gmo ru.gmo sk.gmo sl.gmo sv.gmo tl.gmo tr.gmo uk.gmo vi.gmo zam.gmo zh_CN.gmo zh_TW.gmo" || make ar.gmo ast.gmo bg.gmo ca.gmo cs.gmo da.gmo de.gmo el.gmo en@quot.gmo en@boldquot.gmo en_GB.gmo en_US@piglatin.gmo es.gmo fi.gmo fr.gmo ga.gmo gd.gmo he.gmo hi.gmo hr.gmo hu.gmo it.gmo ja.gmo ku.gmo mn.gmo nb.gmo nl.gmo nn.gmo oc.gmo pl.gmo pt.gmo pt_BR.gmo ro.gmo ru.gmo sk.gmo sl.gmo sv.gmo tl.gmo tr.gmo uk.gmo vi.gmo zam.gmo zh_CN.gmo zh_TW.gmo
make[3]: Entering directory '/usr/src/RPM/BUILD/tuxmath-2.0.3/po'
rm -f ar.gmo && /usr/bin/msgfmt -c --statistics --verbose -o ar.gmo ar.po
ar.po: 71 translated messages, 6 fuzzy translations, 123 untranslated messages.
make[3]: Leaving directory '/usr/src/RPM/BUILD/tuxmath-2.0.3/po'
make[3]: Entering directory '/usr/src/RPM/BUILD/tuxmath-2.0.3/po'
rm -f ast.gmo && /usr/bin/msgfmt -c --statistics --verbose -o ast.gmo ast.po
ast.po: 199 translated messages, 1 fuzzy translation.
make[3]: Leaving directory '/usr/src/RPM/BUILD/tuxmath-2.0.3/po'
make[3]: Entering directory '/usr/src/RPM/BUILD/tuxmath-2.0.3/po'
rm -f bg.gmo && /usr/bin/msgfmt -c --statistics --verbose -o bg.gmo bg.po
bg.po: 140 translated messages, 18 fuzzy translations, 42 untranslated messages.
make[3]: Leaving directory '/usr/src/RPM/BUILD/tuxmath-2.0.3/po'
make[3]: Entering directory '/usr/src/RPM/BUILD/tuxmath-2.0.3/po'
rm -f ca.gmo && /usr/bin/msgfmt -c --statistics --verbose -o ca.gmo ca.po
ca.po:6: warning: header field 'Language-Team' still has the initial default value
ca.po: 198 translated messages, 1 fuzzy translation, 1 untranslated message.
make[3]: Leaving directory '/usr/src/RPM/BUILD/tuxmath-2.0.3/po'
make[3]: Entering directory '/usr/src/RPM/BUILD/tuxmath-2.0.3/po'
rm -f da.gmo && /usr/bin/msgfmt -c --statistics --verbose -o da.gmo da.po
da.po: 128 translated messages, 11 fuzzy translations, 61 untranslated messages.
make[3]: Leaving directory '/usr/src/RPM/BUILD/tuxmath-2.0.3/po'
make[3]: Entering directory '/usr/src/RPM/BUILD/tuxmath-2.0.3/po'
rm -f cs.gmo && /usr/bin/msgfmt -c --statistics --verbose -o cs.gmo cs.po
cs.po: 71 translated messages, 6 fuzzy translations, 123 untranslated messages.
make[3]: Leaving directory '/usr/src/RPM/BUILD/tuxmath-2.0.3/po'
make[3]: Entering directory '/usr/src/RPM/BUILD/tuxmath-2.0.3/po'
rm -f de.gmo && /usr/bin/msgfmt -c --statistics --verbose -o de.gmo de.po
de.po: 141 translated messages, 17 fuzzy translations, 42 untranslated messages.
make[3]: Leaving directory '/usr/src/RPM/BUILD/tuxmath-2.0.3/po'
make[3]: Entering directory '/usr/src/RPM/BUILD/tuxmath-2.0.3/po'
rm -f en@quot.gmo && /usr/bin/msgfmt -c --statistics --verbose -o en@quot.gmo en@quot.po
en@quot.po: 200 translated messages.
make[3]: Leaving directory '/usr/src/RPM/BUILD/tuxmath-2.0.3/po'
make[3]: Entering directory '/usr/src/RPM/BUILD/tuxmath-2.0.3/po'
rm -f en@boldquot.gmo && /usr/bin/msgfmt -c --statistics --verbose -o en@boldquot.gmo en@boldquot.po
en@boldquot.po: 200 translated messages.
make[3]: Leaving directory '/usr/src/RPM/BUILD/tuxmath-2.0.3/po'
make[3]: Entering directory '/usr/src/RPM/BUILD/tuxmath-2.0.3/po'
rm -f el.gmo && /usr/bin/msgfmt -c --statistics --verbose -o el.gmo el.po
el.po: 141 translated messages, 17 fuzzy translations, 42 untranslated messages.
make[3]: Leaving directory '/usr/src/RPM/BUILD/tuxmath-2.0.3/po'
make[3]: Entering directory '/usr/src/RPM/BUILD/tuxmath-2.0.3/po'
rm -f es.gmo && /usr/bin/msgfmt -c --statistics --verbose -o es.gmo es.po
es.po: 138 translated messages, 20 fuzzy translations, 42 untranslated messages.
make[3]: Leaving directory '/usr/src/RPM/BUILD/tuxmath-2.0.3/po'
make[3]: Entering directory '/usr/src/RPM/BUILD/tuxmath-2.0.3/po'
rm -f fi.gmo && /usr/bin/msgfmt -c --statistics --verbose -o fi.gmo fi.po
fi.po: 44 translated messages, 6 fuzzy translations, 150 untranslated messages.
make[3]: Leaving directory '/usr/src/RPM/BUILD/tuxmath-2.0.3/po'
make[3]: Entering directory '/usr/src/RPM/BUILD/tuxmath-2.0.3/po'
rm -f fr.gmo && /usr/bin/msgfmt -c --statistics --verbose -o fr.gmo fr.po
fr.po: 199 translated messages, 1 fuzzy translation.
make[3]: Leaving directory '/usr/src/RPM/BUILD/tuxmath-2.0.3/po'
make[3]: Entering directory '/usr/src/RPM/BUILD/tuxmath-2.0.3/po'
rm -f en_US@piglatin.gmo && /usr/bin/msgfmt -c --statistics --verbose -o en_US@piglatin.gmo en_US@piglatin.po
en_US@piglatin.po: 199 translated messages, 1 fuzzy translation.
make[3]: Leaving directory '/usr/src/RPM/BUILD/tuxmath-2.0.3/po'
make[3]: Entering directory '/usr/src/RPM/BUILD/tuxmath-2.0.3/po'
rm -f en_GB.gmo && /usr/bin/msgfmt -c --statistics --verbose -o en_GB.gmo en_GB.po
en_GB.po: 128 translated messages, 11 fuzzy translations, 61 untranslated messages.
make[3]: Leaving directory '/usr/src/RPM/BUILD/tuxmath-2.0.3/po'
make[3]: Entering directory '/usr/src/RPM/BUILD/tuxmath-2.0.3/po'
rm -f ga.gmo && /usr/bin/msgfmt -c --statistics --verbose -o ga.gmo ga.po
ga.po:6: warning: header field 'Project-Id-Version' still has the initial default value
ga.po:6: warning: header field 'Language-Team' still has the initial default value
ga.po: 71 translated messages, 6 fuzzy translations, 123 untranslated messages.
make[3]: Leaving directory '/usr/src/RPM/BUILD/tuxmath-2.0.3/po'
make[3]: Entering directory '/usr/src/RPM/BUILD/tuxmath-2.0.3/po'
rm -f he.gmo && /usr/bin/msgfmt -c --statistics --verbose -o he.gmo he.po
he.po: 140 translated messages, 15 fuzzy translations, 45 untranslated messages.
make[3]: Leaving directory '/usr/src/RPM/BUILD/tuxmath-2.0.3/po'
make[3]: Entering directory '/usr/src/RPM/BUILD/tuxmath-2.0.3/po'
rm -f hr.gmo && /usr/bin/msgfmt -c --statistics --verbose -o hr.gmo hr.po
hr.po:7: warning: header field 'PO-Revision-Date' still has the initial default value
hr.po: 196 translated messages, 4 fuzzy translations.
make[3]: Leaving directory '/usr/src/RPM/BUILD/tuxmath-2.0.3/po'
make[3]: Entering directory '/usr/src/RPM/BUILD/tuxmath-2.0.3/po'
rm -f gd.gmo && /usr/bin/msgfmt -c --statistics --verbose -o gd.gmo gd.po
gd.po: 200 translated messages.
make[3]: Leaving directory '/usr/src/RPM/BUILD/tuxmath-2.0.3/po'
make[3]: Entering directory '/usr/src/RPM/BUILD/tuxmath-2.0.3/po'
rm -f hu.gmo && /usr/bin/msgfmt -c --statistics --verbose -o hu.gmo hu.po
hu.po:6: warning: header field 'Project-Id-Version' still has the initial default value
hu.po: 71 translated messages, 6 fuzzy translations, 123 untranslated messages.
make[3]: Leaving directory '/usr/src/RPM/BUILD/tuxmath-2.0.3/po'
make[3]: Entering directory '/usr/src/RPM/BUILD/tuxmath-2.0.3/po'
rm -f ku.gmo && /usr/bin/msgfmt -c --statistics --verbose -o ku.gmo ku.po
ku.po: 70 translated messages, 6 fuzzy translations, 124 untranslated messages.
make[3]: Leaving directory '/usr/src/RPM/BUILD/tuxmath-2.0.3/po'
make[3]: Entering directory '/usr/src/RPM/BUILD/tuxmath-2.0.3/po'
rm -f hi.gmo && /usr/bin/msgfmt -c --statistics --verbose -o hi.gmo hi.po
hi.po: 141 translated messages, 17 fuzzy translations, 42 untranslated messages.
make[3]: Leaving directory '/usr/src/RPM/BUILD/tuxmath-2.0.3/po'
make[3]: Entering directory '/usr/src/RPM/BUILD/tuxmath-2.0.3/po'
rm -f it.gmo && /usr/bin/msgfmt -c --statistics --verbose -o it.gmo it.po
it.po: 140 translated messages, 17 fuzzy translations, 43 untranslated messages.
make[3]: Leaving directory '/usr/src/RPM/BUILD/tuxmath-2.0.3/po'
make[3]: Entering directory '/usr/src/RPM/BUILD/tuxmath-2.0.3/po'
rm -f ja.gmo && /usr/bin/msgfmt -c --statistics --verbose -o ja.gmo ja.po
ja.po: 71 translated messages, 6 fuzzy translations, 123 untranslated messages.
make[3]: Leaving directory '/usr/src/RPM/BUILD/tuxmath-2.0.3/po'
make[3]: Entering directory '/usr/src/RPM/BUILD/tuxmath-2.0.3/po'
rm -f mn.gmo && /usr/bin/msgfmt -c --statistics --verbose -o mn.gmo mn.po
mn.po: 128 translated messages, 11 fuzzy translations, 61 untranslated messages.
make[3]: Leaving directory '/usr/src/RPM/BUILD/tuxmath-2.0.3/po'
make[3]: Entering directory '/usr/src/RPM/BUILD/tuxmath-2.0.3/po'
rm -f oc.gmo && /usr/bin/msgfmt -c --statistics --verbose -o oc.gmo oc.po
oc.po: 45 translated messages, 2 fuzzy translations, 153 untranslated messages.
make[3]: Leaving directory '/usr/src/RPM/BUILD/tuxmath-2.0.3/po'
make[3]: Entering directory '/usr/src/RPM/BUILD/tuxmath-2.0.3/po'
rm -f nb.gmo && /usr/bin/msgfmt -c --statistics --verbose -o nb.gmo nb.po
nb.po: 77 translated messages, 7 fuzzy translations, 116 untranslated messages.
make[3]: Leaving directory '/usr/src/RPM/BUILD/tuxmath-2.0.3/po'
make[3]: Entering directory '/usr/src/RPM/BUILD/tuxmath-2.0.3/po'
rm -f pl.gmo && /usr/bin/msgfmt -c --statistics --verbose -o pl.gmo pl.po
pl.po: 126 translated messages, 29 fuzzy translations, 45 untranslated messages.
make[3]: Leaving directory '/usr/src/RPM/BUILD/tuxmath-2.0.3/po'
make[3]: Entering directory '/usr/src/RPM/BUILD/tuxmath-2.0.3/po'
rm -f pt.gmo && /usr/bin/msgfmt -c --statistics --verbose -o pt.gmo pt.po
pt.po: 128 translated messages, 11 fuzzy translations, 61 untranslated messages.
make[3]: Leaving directory '/usr/src/RPM/BUILD/tuxmath-2.0.3/po'
make[3]: Entering directory '/usr/src/RPM/BUILD/tuxmath-2.0.3/po'
rm -f nn.gmo && /usr/bin/msgfmt -c --statistics --verbose -o nn.gmo nn.po
nn.po: 128 translated messages, 11 fuzzy translations, 61 untranslated messages.
make[3]: Leaving directory '/usr/src/RPM/BUILD/tuxmath-2.0.3/po'
make[3]: Entering directory '/usr/src/RPM/BUILD/tuxmath-2.0.3/po'
rm -f nl.gmo && /usr/bin/msgfmt -c --statistics --verbose -o nl.gmo nl.po
nl.po: 249 translated messages.
make[3]: Leaving directory '/usr/src/RPM/BUILD/tuxmath-2.0.3/po'
make[3]: Entering directory '/usr/src/RPM/BUILD/tuxmath-2.0.3/po'
rm -f ro.gmo && /usr/bin/msgfmt -c --statistics --verbose -o ro.gmo ro.po
ro.po:5: warning: header field 'Language-Team' still has the initial default value
ro.po: 141 translated messages, 17 fuzzy translations, 42 untranslated messages.
make[3]: Leaving directory '/usr/src/RPM/BUILD/tuxmath-2.0.3/po'
make[3]: Entering directory '/usr/src/RPM/BUILD/tuxmath-2.0.3/po'
rm -f pt_BR.gmo && /usr/bin/msgfmt -c --statistics --verbose -o pt_BR.gmo pt_BR.po
pt_BR.po: 71 translated messages, 6 fuzzy translations, 123 untranslated messages.
make[3]: Leaving directory '/usr/src/RPM/BUILD/tuxmath-2.0.3/po'
make[3]: Entering directory '/usr/src/RPM/BUILD/tuxmath-2.0.3/po'
rm -f sk.gmo && /usr/bin/msgfmt -c --statistics --verbose -o sk.gmo sk.po
sk.po: 144 translated messages, 15 fuzzy translations, 41 untranslated messages.
make[3]: Leaving directory '/usr/src/RPM/BUILD/tuxmath-2.0.3/po'
make[3]: Entering directory '/usr/src/RPM/BUILD/tuxmath-2.0.3/po'
rm -f sl.gmo && /usr/bin/msgfmt -c --statistics --verbose -o sl.gmo sl.po
sl.po: 67 translated messages, 6 fuzzy translations, 127 untranslated messages.
make[3]: Leaving directory '/usr/src/RPM/BUILD/tuxmath-2.0.3/po'
make[3]: Entering directory '/usr/src/RPM/BUILD/tuxmath-2.0.3/po'
rm -f ru.gmo && /usr/bin/msgfmt -c --statistics --verbose -o ru.gmo ru.po
ru.po: 274 translated messages.
make[3]: Leaving directory '/usr/src/RPM/BUILD/tuxmath-2.0.3/po'
make[3]: Entering directory '/usr/src/RPM/BUILD/tuxmath-2.0.3/po'
rm -f tl.gmo && /usr/bin/msgfmt -c --statistics --verbose -o tl.gmo tl.po
tl.po:7: warning: header field 'PO-Revision-Date' still has the initial default value
tl.po:7: warning: header field 'Last-Translator' still has the initial default value
tl.po:7: warning: header field 'Language-Team' still has the initial default value
tl.po: 141 translated messages, 16 fuzzy translations, 43 untranslated messages.
make[3]: Leaving directory '/usr/src/RPM/BUILD/tuxmath-2.0.3/po'
make[3]: Entering directory '/usr/src/RPM/BUILD/tuxmath-2.0.3/po'
rm -f sv.gmo && /usr/bin/msgfmt -c --statistics --verbose -o sv.gmo sv.po
sv.po: 93 translated messages, 14 fuzzy translations, 93 untranslated messages.
make[3]: Leaving directory '/usr/src/RPM/BUILD/tuxmath-2.0.3/po'
make[3]: Entering directory '/usr/src/RPM/BUILD/tuxmath-2.0.3/po'
rm -f tr.gmo && /usr/bin/msgfmt -c --statistics --verbose -o tr.gmo tr.po
tr.po: 91 translated messages, 11 fuzzy translations, 98 untranslated messages.
make[3]: Leaving directory '/usr/src/RPM/BUILD/tuxmath-2.0.3/po'
make[3]: Entering directory '/usr/src/RPM/BUILD/tuxmath-2.0.3/po'
rm -f vi.gmo && /usr/bin/msgfmt -c --statistics --verbose -o vi.gmo vi.po
vi.po: 13 translated messages, 2 fuzzy translations, 185 untranslated messages.
make[3]: Leaving directory '/usr/src/RPM/BUILD/tuxmath-2.0.3/po'
make[3]: Entering directory '/usr/src/RPM/BUILD/tuxmath-2.0.3/po'
rm -f uk.gmo && /usr/bin/msgfmt -c --statistics --verbose -o uk.gmo uk.po
uk.po: 142 translated messages, 15 fuzzy translations, 43 untranslated messages.
make[3]: Leaving directory '/usr/src/RPM/BUILD/tuxmath-2.0.3/po'
make[3]: Entering directory '/usr/src/RPM/BUILD/tuxmath-2.0.3/po'
rm -f zam.gmo && /usr/bin/msgfmt -c --statistics --verbose -o zam.gmo zam.po
zam.po: 90 translated messages, 8 fuzzy translations, 102 untranslated messages.
make[3]: Leaving directory '/usr/src/RPM/BUILD/tuxmath-2.0.3/po'
make[3]: Entering directory '/usr/src/RPM/BUILD/tuxmath-2.0.3/po'
rm -f zh_TW.gmo && /usr/bin/msgfmt -c --statistics --verbose -o zh_TW.gmo zh_TW.po
zh_TW.po: 140 translated messages, 15 fuzzy translations, 45 untranslated messages.
make[3]: Leaving directory '/usr/src/RPM/BUILD/tuxmath-2.0.3/po'
make[3]: Entering directory '/usr/src/RPM/BUILD/tuxmath-2.0.3/po'
rm -f zh_CN.gmo && /usr/bin/msgfmt -c --statistics --verbose -o zh_CN.gmo zh_CN.po
zh_CN.po: 105 translated messages, 9 fuzzy translations, 86 untranslated messages.
make[3]: Leaving directory '/usr/src/RPM/BUILD/tuxmath-2.0.3/po'
make[2]: Entering directory '/usr/src/RPM/BUILD/tuxmath-2.0.3/po'
touch stamp-po
make[2]: Leaving directory '/usr/src/RPM/BUILD/tuxmath-2.0.3/po'
Making all in src
make[2]: Entering directory '/usr/src/RPM/BUILD/tuxmath-2.0.3/src'
x86_64-alt-linux-gcc -DLOCALEDIR=\"/usr/share/locale\" -DHAVE_CONFIG_H -I. -I..  -DLOCALEDIR=\"/usr/share/locale\"  -Wall -g -DDATA_PREFIX=\"/usr/share/tuxmath\" -DDEBUG -DSOUND -pipe -frecord-gcc-switches -Wall -g -O2 -flto=auto -fcommon -D_GNU_SOURCE=1 -D_REENTRANT -I/usr/include/SDL  -D_GNU_SOURCE=1 -D_REENTRANT -I/usr/include/SDL -pthread -I/usr/lib64/pkgconfig/../../include/librsvg-2.0 -I/usr/include/cairo -I/usr/include/gdk-pixbuf-2.0 -I/usr/include/libxml2 -I/usr/include/pango-1.0 -I/usr/include/harfbuzz -I/usr/include/pango-1.0 -I/usr/include/cairo -I/usr/include/freetype2 -I/usr/include/libpng16 -I/usr/include/harfbuzz -I/usr/include/glib-2.0 -I/usr/lib64/glib-2.0/include -I/usr/include/cairo -I/usr/include/freetype2 -I/usr/include/libpng16 -I/usr/include/harfbuzz -I/usr/include/glib-2.0 -I/usr/lib64/glib-2.0/include -D_GNU_SOURCE=1 -D_REENTRANT -I/usr/include/SDL -I/usr/include/libxml2 -D_GNU_SOURCE=1 -D_REENTRANT -pthread -I/usr/include/SDL -I/usr/lib64/pkgconfig/../../include/librsvg-2.0 -I/usr/include/cairo -I/usr/include/gdk-pixbuf-2.0 -I/usr/include/pango-1.0 -I/usr/include/harfbuzz -I/usr/include/pango-1.0 -I/usr/include/cairo -I/usr/include/freetype2 -I/usr/include/libpng16 -I/usr/include/harfbuzz -I/usr/include/glib-2.0 -I/usr/lib64/glib-2.0/include -I/usr/include/libxml2 -c -o tuxmath.o tuxmath.c
make[2]: Leaving directory '/usr/src/RPM/BUILD/tuxmath-2.0.3/src'
make[2]: Entering directory '/usr/src/RPM/BUILD/tuxmath-2.0.3/src'
x86_64-alt-linux-gcc -DLOCALEDIR=\"/usr/share/locale\" -DHAVE_CONFIG_H -I. -I..  -DLOCALEDIR=\"/usr/share/locale\"  -Wall -g -DDATA_PREFIX=\"/usr/share/tuxmath\" -DDEBUG -DSOUND -pipe -frecord-gcc-switches -Wall -g -O2 -flto=auto -fcommon -D_GNU_SOURCE=1 -D_REENTRANT -I/usr/include/SDL  -D_GNU_SOURCE=1 -D_REENTRANT -I/usr/include/SDL -pthread -I/usr/lib64/pkgconfig/../../include/librsvg-2.0 -I/usr/include/cairo -I/usr/include/gdk-pixbuf-2.0 -I/usr/include/libxml2 -I/usr/include/pango-1.0 -I/usr/include/harfbuzz -I/usr/include/pango-1.0 -I/usr/include/cairo -I/usr/include/freetype2 -I/usr/include/libpng16 -I/usr/include/harfbuzz -I/usr/include/glib-2.0 -I/usr/lib64/glib-2.0/include -I/usr/include/cairo -I/usr/include/freetype2 -I/usr/include/libpng16 -I/usr/include/harfbuzz -I/usr/include/glib-2.0 -I/usr/lib64/glib-2.0/include -D_GNU_SOURCE=1 -D_REENTRANT -I/usr/include/SDL -I/usr/include/libxml2 -D_GNU_SOURCE=1 -D_REENTRANT -pthread -I/usr/include/SDL -I/usr/lib64/pkgconfig/../../include/librsvg-2.0 -I/usr/include/cairo -I/usr/include/gdk-pixbuf-2.0 -I/usr/include/pango-1.0 -I/usr/include/harfbuzz -I/usr/include/pango-1.0 -I/usr/include/cairo -I/usr/include/freetype2 -I/usr/include/libpng16 -I/usr/include/harfbuzz -I/usr/include/glib-2.0 -I/usr/lib64/glib-2.0/include -I/usr/include/libxml2 -c -o comets_graphics.o comets_graphics.c
comets_graphics.c: In function 'comets_draw_comets':
comets_graphics.c:99:62: warning: passing argument 3 of 'comets_draw_comet_nums' discards 'const' qualifier from pointer target type [-Wdiscarded-qualifiers]
   99 |                 comets_draw_comet_nums(&comets[i], answered, &white);
      |                                                              ^~~~~~
In file included from comets_graphics.c:1:
comets_graphics.h:15:80: note: expected 'SDL_Color *' but argument is of type 'const SDL_Color *'
   15 | void comets_draw_comet_nums(const comet_type *comet, bool answered, SDL_Color *col);
      |                                                                     ~~~~~~~~~~~^~~
comets_graphics.c:135:62: warning: passing argument 3 of 'comets_draw_comet_nums' discards 'const' qualifier from pointer target type [-Wdiscarded-qualifiers]
  135 |                 comets_draw_comet_nums(&comets[i], answered, &white);
      |                                                              ^~~~~~
comets_graphics.h:15:80: note: expected 'SDL_Color *' but argument is of type 'const SDL_Color *'
   15 | void comets_draw_comet_nums(const comet_type *comet, bool answered, SDL_Color *col);
      |                                                                     ~~~~~~~~~~~^~~
comets_graphics.c: In function 'comets_draw_misc':
comets_graphics.c:336:5: error: implicit declaration of function 'draw_numbers' [-Wimplicit-function-declaration]
  336 |     draw_numbers(screen, str, offset+images[IMG_WAVE]->w + (images[IMG_NUMBERS]->w / 10), 0);
      |     ^~~~~~~~~~~~
comets_graphics.c:352:34: error: implicit declaration of function 'LAN_PlayerScore' [-Wimplicit-function-declaration]
  352 |             sprintf(str, "%.6d", LAN_PlayerScore(LAN_MyIndex()));
      |                                  ^~~~~~~~~~~~~~~
comets_graphics.c:352:50: error: implicit declaration of function 'LAN_MyIndex' [-Wimplicit-function-declaration]
  352 |             sprintf(str, "%.6d", LAN_PlayerScore(LAN_MyIndex()));
      |                                                  ^~~~~~~~~~~
comets_graphics.c:369:55: error: implicit declaration of function 'get_scale'; did you mean 'setlocale'? [-Wimplicit-function-declaration]
  369 |         int fontsize = (int)(DEFAULT_MENU_FONT_SIZE * get_scale());
      |                                                       ^~~~~~~~~
      |                                                       setlocale
comets_graphics.c:401:16: error: implicit declaration of function 'LAN_PlayerConnected' [-Wimplicit-function-declaration]
  401 |             if(LAN_PlayerConnected(i))
      |                ^~~~~~~~~~~~~~~~~~~
comets_graphics.c:403:46: error: implicit declaration of function 'LAN_PlayerName' [-Wimplicit-function-declaration]
  403 |                 snprintf(str, 64, "%s: %d",  LAN_PlayerName(i),  LAN_PlayerScore(i));
      |                                              ^~~~~~~~~~~~~~
comets_graphics.c:403:37: warning: format '%s' expects argument of type 'char *', but argument 4 has type 'int' [-Wformat=]
  403 |                 snprintf(str, 64, "%s: %d",  LAN_PlayerName(i),  LAN_PlayerScore(i));
      |                                    ~^        ~~~~~~~~~~~~~~~~~
      |                                     |        |
      |                                     char *   int
      |                                    %d
comets_graphics.c:404:20: error: implicit declaration of function 'LAN_PlayerMine' [-Wimplicit-function-declaration]
  404 |                 if(LAN_PlayerMine(i))
      |                    ^~~~~~~~~~~~~~
comets_graphics.c: In function 'comets_draw_led_console':
comets_graphics.c:511:5: error: implicit declaration of function 'draw_console_image' [-Wimplicit-function-declaration]
  511 |     draw_console_image(IMG_CONSOLE_LED);
      |     ^~~~~~~~~~~~~~~~~~
comets_graphics.c: In function 'comets_draw_powerup':
comets_graphics.c:620:67: warning: passing argument 3 of 'comets_draw_comet_nums' discards 'const' qualifier from pointer target type [-Wdiscarded-qualifiers]
  620 |         comets_draw_comet_nums(&(powerup_comet->comet), answered, &white);
      |                                                                   ^~~~~~
comets_graphics.c:437:80: note: expected 'SDL_Color *' but argument is of type 'const SDL_Color *'
  437 | void comets_draw_comet_nums(const comet_type *comet, bool answered, SDL_Color *col)
      |                                                                     ~~~~~~~~~~~^~~
make[2]: *** [Makefile:623: comets_graphics.o] Error 1
make[2]: Leaving directory '/usr/src/RPM/BUILD/tuxmath-2.0.3/src'
make[2]: *** Waiting for unfinished jobs....
make[2]: Entering directory '/usr/src/RPM/BUILD/tuxmath-2.0.3/src'
x86_64-alt-linux-gcc -DLOCALEDIR=\"/usr/share/locale\" -DHAVE_CONFIG_H -I. -I..  -DLOCALEDIR=\"/usr/share/locale\"  -Wall -g -DDATA_PREFIX=\"/usr/share/tuxmath\" -DDEBUG -DSOUND -pipe -frecord-gcc-switches -Wall -g -O2 -flto=auto -fcommon -D_GNU_SOURCE=1 -D_REENTRANT -I/usr/include/SDL  -D_GNU_SOURCE=1 -D_REENTRANT -I/usr/include/SDL -pthread -I/usr/lib64/pkgconfig/../../include/librsvg-2.0 -I/usr/include/cairo -I/usr/include/gdk-pixbuf-2.0 -I/usr/include/libxml2 -I/usr/include/pango-1.0 -I/usr/include/harfbuzz -I/usr/include/pango-1.0 -I/usr/include/cairo -I/usr/include/freetype2 -I/usr/include/libpng16 -I/usr/include/harfbuzz -I/usr/include/glib-2.0 -I/usr/lib64/glib-2.0/include -I/usr/include/cairo -I/usr/include/freetype2 -I/usr/include/libpng16 -I/usr/include/harfbuzz -I/usr/include/glib-2.0 -I/usr/lib64/glib-2.0/include -D_GNU_SOURCE=1 -D_REENTRANT -I/usr/include/SDL -I/usr/include/libxml2 -D_GNU_SOURCE=1 -D_REENTRANT -pthread -I/usr/include/SDL -I/usr/lib64/pkgconfig/../../include/librsvg-2.0 -I/usr/include/cairo -I/usr/include/gdk-pixbuf-2.0 -I/usr/include/pango-1.0 -I/usr/include/harfbuzz -I/usr/include/pango-1.0 -I/usr/include/cairo -I/usr/include/freetype2 -I/usr/include/libpng16 -I/usr/include/harfbuzz -I/usr/include/glib-2.0 -I/usr/lib64/glib-2.0/include -I/usr/include/libxml2 -c -o titlescreen.o titlescreen.c
titlescreen.c: In function 'TitleScreen':
titlescreen.c:189:28: error: passing argument 1 of 'T4K_OnResolutionSwitch' from incompatible pointer type [-Wincompatible-pointer-types]
  189 |     T4K_OnResolutionSwitch(&HandleTitleScreenResSwitch);
      |                            ^~~~~~~~~~~~~~~~~~~~~~~~~~~
      |                            |
      |                            int (*)(int,  int)
In file included from globals.h:50,
                 from tuxmath.h:36,
                 from titlescreen.h:57,
                 from titlescreen.c:30:
/usr/include/t4k_common.h:938:48: note: expected 'ResSwitchCallback' {aka 'void (*)(int,  int)'} but argument is of type 'int (*)(int,  int)'
  938 | void T4K_OnResolutionSwitch( ResSwitchCallback callback );
      |                              ~~~~~~~~~~~~~~~~~~^~~~~~~~
titlescreen.c: In function 'ShowMessageWrap':
titlescreen.c:545:5: warning: this 'else' clause does not guard... [-Wmisleading-indentation]
  545 |     else
      |     ^~~~
titlescreen.c:549:9: note: ...this statement, but the latter is misleadingly indented as if it were guarded by the 'else'
  549 |         T4K_Tts_say(DEFAULT_VALUE,DEFAULT_VALUE,INTERRUPT,"%s",str);
      |         ^~~~~~~~~~~
make[2]: *** [Makefile:623: titlescreen.o] Error 1
make[2]: Leaving directory '/usr/src/RPM/BUILD/tuxmath-2.0.3/src'
make[2]: Entering directory '/usr/src/RPM/BUILD/tuxmath-2.0.3/src'
x86_64-alt-linux-gcc -DLOCALEDIR=\"/usr/share/locale\" -DHAVE_CONFIG_H -I. -I..  -DLOCALEDIR=\"/usr/share/locale\"  -Wall -g -DDATA_PREFIX=\"/usr/share/tuxmath\" -DDEBUG -DSOUND -pipe -frecord-gcc-switches -Wall -g -O2 -flto=auto -fcommon -D_GNU_SOURCE=1 -D_REENTRANT -I/usr/include/SDL  -D_GNU_SOURCE=1 -D_REENTRANT -I/usr/include/SDL -pthread -I/usr/lib64/pkgconfig/../../include/librsvg-2.0 -I/usr/include/cairo -I/usr/include/gdk-pixbuf-2.0 -I/usr/include/libxml2 -I/usr/include/pango-1.0 -I/usr/include/harfbuzz -I/usr/include/pango-1.0 -I/usr/include/cairo -I/usr/include/freetype2 -I/usr/include/libpng16 -I/usr/include/harfbuzz -I/usr/include/glib-2.0 -I/usr/lib64/glib-2.0/include -I/usr/include/cairo -I/usr/include/freetype2 -I/usr/include/libpng16 -I/usr/include/harfbuzz -I/usr/include/glib-2.0 -I/usr/lib64/glib-2.0/include -D_GNU_SOURCE=1 -D_REENTRANT -I/usr/include/SDL -I/usr/include/libxml2 -D_GNU_SOURCE=1 -D_REENTRANT -pthread -I/usr/include/SDL -I/usr/lib64/pkgconfig/../../include/librsvg-2.0 -I/usr/include/cairo -I/usr/include/gdk-pixbuf-2.0 -I/usr/include/pango-1.0 -I/usr/include/harfbuzz -I/usr/include/pango-1.0 -I/usr/include/cairo -I/usr/include/freetype2 -I/usr/include/libpng16 -I/usr/include/harfbuzz -I/usr/include/glib-2.0 -I/usr/lib64/glib-2.0/include -I/usr/include/libxml2 -c -o game.o game.c
make[2]: Leaving directory '/usr/src/RPM/BUILD/tuxmath-2.0.3/src'
make[2]: Entering directory '/usr/src/RPM/BUILD/tuxmath-2.0.3/src'
x86_64-alt-linux-gcc -DLOCALEDIR=\"/usr/share/locale\" -DHAVE_CONFIG_H -I. -I..  -DLOCALEDIR=\"/usr/share/locale\"  -Wall -g -DDATA_PREFIX=\"/usr/share/tuxmath\" -DDEBUG -DSOUND -pipe -frecord-gcc-switches -Wall -g -O2 -flto=auto -fcommon -D_GNU_SOURCE=1 -D_REENTRANT -I/usr/include/SDL  -D_GNU_SOURCE=1 -D_REENTRANT -I/usr/include/SDL -pthread -I/usr/lib64/pkgconfig/../../include/librsvg-2.0 -I/usr/include/cairo -I/usr/include/gdk-pixbuf-2.0 -I/usr/include/libxml2 -I/usr/include/pango-1.0 -I/usr/include/harfbuzz -I/usr/include/pango-1.0 -I/usr/include/cairo -I/usr/include/freetype2 -I/usr/include/libpng16 -I/usr/include/harfbuzz -I/usr/include/glib-2.0 -I/usr/lib64/glib-2.0/include -I/usr/include/cairo -I/usr/include/freetype2 -I/usr/include/libpng16 -I/usr/include/harfbuzz -I/usr/include/glib-2.0 -I/usr/lib64/glib-2.0/include -D_GNU_SOURCE=1 -D_REENTRANT -I/usr/include/SDL -I/usr/include/libxml2 -D_GNU_SOURCE=1 -D_REENTRANT -pthread -I/usr/include/SDL -I/usr/lib64/pkgconfig/../../include/librsvg-2.0 -I/usr/include/cairo -I/usr/include/gdk-pixbuf-2.0 -I/usr/include/pango-1.0 -I/usr/include/harfbuzz -I/usr/include/pango-1.0 -I/usr/include/cairo -I/usr/include/freetype2 -I/usr/include/libpng16 -I/usr/include/harfbuzz -I/usr/include/glib-2.0 -I/usr/lib64/glib-2.0/include -I/usr/include/libxml2 -c -o menu_lan.o menu_lan.c
menu_lan.c: In function 'ConnectToServer':
menu_lan.c:150:21: error: passing argument 4 of 'T4K_RunMenu' from incompatible pointer type [-Wincompatible-pointer-types]
  150 |                     &HandleTitleScreenEvents, &HandleTitleScreenAnimations, NULL);
      |                     ^~~~~~~~~~~~~~~~~~~~~~~~
      |                     |
      |                     int (*)(const SDL_Event *)
In file included from globals.h:50,
                 from tuxmath.h:36,
                 from menu_lan.c:29:
/usr/include/t4k_common.h:477:27: note: expected 'int (*)(SDL_Event *)' but argument is of type 'int (*)(const SDL_Event *)'
  477 |                  int    (*handle_event)(SDL_Event*),
      |                  ~~~~~~~~~^~~~~~~~~~~~~~~~~~~~~~~~~
menu_lan.c: In function 'draw_player_table':
menu_lan.c:488:17: warning: assignment discards 'const' qualifier from pointer target type [-Wdiscarded-qualifiers]
  488 |             col = &yellow;
      |                 ^
menu_lan.c:490:17: warning: assignment discards 'const' qualifier from pointer target type [-Wdiscarded-qualifiers]
  490 |             col = &white;
      |                 ^
menu_lan.c:507:21: warning: assignment discards 'const' qualifier from pointer target type [-Wdiscarded-qualifiers]
  507 |                 col = &bright_green;
      |                     ^
menu_lan.c:512:21: warning: assignment discards 'const' qualifier from pointer target type [-Wdiscarded-qualifiers]
  512 |                 col = &red;
      |                     ^
make[2]: *** [Makefile:623: menu_lan.o] Error 1
make[2]: Leaving directory '/usr/src/RPM/BUILD/tuxmath-2.0.3/src'
make[2]: Entering directory '/usr/src/RPM/BUILD/tuxmath-2.0.3/src'
x86_64-alt-linux-gcc -DLOCALEDIR=\"/usr/share/locale\" -DHAVE_CONFIG_H -I. -I..  -DLOCALEDIR=\"/usr/share/locale\"  -Wall -g -DDATA_PREFIX=\"/usr/share/tuxmath\" -DDEBUG -DSOUND -pipe -frecord-gcc-switches -Wall -g -O2 -flto=auto -fcommon -D_GNU_SOURCE=1 -D_REENTRANT -I/usr/include/SDL  -D_GNU_SOURCE=1 -D_REENTRANT -I/usr/include/SDL -pthread -I/usr/lib64/pkgconfig/../../include/librsvg-2.0 -I/usr/include/cairo -I/usr/include/gdk-pixbuf-2.0 -I/usr/include/libxml2 -I/usr/include/pango-1.0 -I/usr/include/harfbuzz -I/usr/include/pango-1.0 -I/usr/include/cairo -I/usr/include/freetype2 -I/usr/include/libpng16 -I/usr/include/harfbuzz -I/usr/include/glib-2.0 -I/usr/lib64/glib-2.0/include -I/usr/include/cairo -I/usr/include/freetype2 -I/usr/include/libpng16 -I/usr/include/harfbuzz -I/usr/include/glib-2.0 -I/usr/lib64/glib-2.0/include -D_GNU_SOURCE=1 -D_REENTRANT -I/usr/include/SDL -I/usr/include/libxml2 -D_GNU_SOURCE=1 -D_REENTRANT -pthread -I/usr/include/SDL -I/usr/lib64/pkgconfig/../../include/librsvg-2.0 -I/usr/include/cairo -I/usr/include/gdk-pixbuf-2.0 -I/usr/include/pango-1.0 -I/usr/include/harfbuzz -I/usr/include/pango-1.0 -I/usr/include/cairo -I/usr/include/freetype2 -I/usr/include/libpng16 -I/usr/include/harfbuzz -I/usr/include/glib-2.0 -I/usr/lib64/glib-2.0/include -I/usr/include/libxml2 -c -o menu.o menu.c
menu.c: In function 'run_menu':
menu.c:115:13: error: passing argument 4 of 'T4K_RunMenu' from incompatible pointer type [-Wincompatible-pointer-types]
  115 |             &HandleTitleScreenEvents,
      |             ^~~~~~~~~~~~~~~~~~~~~~~~
      |             |
      |             int (*)(const SDL_Event *)
In file included from globals.h:50,
                 from menu.c:28:
/usr/include/t4k_common.h:477:27: note: expected 'int (*)(SDL_Event *)' but argument is of type 'int (*)(const SDL_Event *)'
  477 |                  int    (*handle_event)(SDL_Event*),
      |                  ~~~~~~~~~^~~~~~~~~~~~~~~~~~~~~~~~~
menu.c: In function 'handle_activity':
menu.c:188:13: error: implicit declaration of function 'comets_game' [-Wimplicit-function-declaration]
  188 |             comets_game(local_game);
      |             ^~~~~~~~~~~
menu.c:231:28: error: passing argument 1 of 'T4K_OnResolutionSwitch' from incompatible pointer type [-Wincompatible-pointer-types]
  231 |     T4K_OnResolutionSwitch(&HandleTitleScreenResSwitch);
      |                            ^~~~~~~~~~~~~~~~~~~~~~~~~~~
      |                            |
      |                            int (*)(int,  int)
/usr/include/t4k_common.h:938:48: note: expected 'ResSwitchCallback' {aka 'void (*)(int,  int)'} but argument is of type 'int (*)(int,  int)'
  938 | void T4K_OnResolutionSwitch( ResSwitchCallback callback );
      |                              ~~~~~~~~~~~~~~~~~~^~~~~~~~
menu.c: In function 'run_academy':
menu.c:246:28: error: passing argument 1 of 'T4K_OnResolutionSwitch' from incompatible pointer type [-Wincompatible-pointer-types]
  246 |     T4K_OnResolutionSwitch(&HandleTitleScreenResSwitch);
      |                            ^~~~~~~~~~~~~~~~~~~~~~~~~~~
      |                            |
      |                            int (*)(int,  int)
/usr/include/t4k_common.h:938:48: note: expected 'ResSwitchCallback' {aka 'void (*)(int,  int)'} but argument is of type 'int (*)(int,  int)'
  938 | void T4K_OnResolutionSwitch( ResSwitchCallback callback );
      |                              ~~~~~~~~~~~~~~~~~~^~~~~~~~
menu.c:266:36: error: passing argument 1 of 'T4K_OnResolutionSwitch' from incompatible pointer type [-Wincompatible-pointer-types]
  266 |             T4K_OnResolutionSwitch(&HandleTitleScreenResSwitch);
      |                                    ^~~~~~~~~~~~~~~~~~~~~~~~~~~
      |                                    |
      |                                    int (*)(int,  int)
/usr/include/t4k_common.h:938:48: note: expected 'ResSwitchCallback' {aka 'void (*)(int,  int)'} but argument is of type 'int (*)(int,  int)'
  938 | void T4K_OnResolutionSwitch( ResSwitchCallback callback );
      |                              ~~~~~~~~~~~~~~~~~~^~~~~~~~
menu.c: In function 'RunLoginMenu':
menu.c:666:74: warning: passing argument 6 of 'T4K_CreateOneLevelMenu' discards 'const' qualifier from pointer target type [-Wdiscarded-qualifiers]
  666 |     T4K_CreateOneLevelMenu(MENU_LOGIN, n_users, user_names, NULL, title, trailer_quit);
      |                                                                          ^~~~~~~~~~~~
/usr/include/t4k_common.h:444:38: note: expected 'char *' but argument is of type 'const char *'
  444 |                              char*   trailer
      |                              ~~~~~~~~^~~~~~~
menu.c:717:21: warning: assignment discards 'const' qualifier from pointer target type [-Wdiscarded-qualifiers]
  717 |             trailer = trailer_quit;
      |                     ^
menu.c:719:21: warning: assignment discards 'const' qualifier from pointer target type [-Wdiscarded-qualifiers]
  719 |             trailer = trailer_back;
      |                     ^
make[2]: *** [Makefile:623: menu.o] Error 1
make[2]: Leaving directory '/usr/src/RPM/BUILD/tuxmath-2.0.3/src'
make[2]: Entering directory '/usr/src/RPM/BUILD/tuxmath-2.0.3/src'
x86_64-alt-linux-gcc -DLOCALEDIR=\"/usr/share/locale\" -DHAVE_CONFIG_H -I. -I..  -DLOCALEDIR=\"/usr/share/locale\"  -Wall -g -DDATA_PREFIX=\"/usr/share/tuxmath\" -DDEBUG -DSOUND -pipe -frecord-gcc-switches -Wall -g -O2 -flto=auto -fcommon -D_GNU_SOURCE=1 -D_REENTRANT -I/usr/include/SDL  -D_GNU_SOURCE=1 -D_REENTRANT -I/usr/include/SDL -pthread -I/usr/lib64/pkgconfig/../../include/librsvg-2.0 -I/usr/include/cairo -I/usr/include/gdk-pixbuf-2.0 -I/usr/include/libxml2 -I/usr/include/pango-1.0 -I/usr/include/harfbuzz -I/usr/include/pango-1.0 -I/usr/include/cairo -I/usr/include/freetype2 -I/usr/include/libpng16 -I/usr/include/harfbuzz -I/usr/include/glib-2.0 -I/usr/lib64/glib-2.0/include -I/usr/include/cairo -I/usr/include/freetype2 -I/usr/include/libpng16 -I/usr/include/harfbuzz -I/usr/include/glib-2.0 -I/usr/lib64/glib-2.0/include -D_GNU_SOURCE=1 -D_REENTRANT -I/usr/include/SDL -I/usr/include/libxml2 -D_GNU_SOURCE=1 -D_REENTRANT -pthread -I/usr/include/SDL -I/usr/lib64/pkgconfig/../../include/librsvg-2.0 -I/usr/include/cairo -I/usr/include/gdk-pixbuf-2.0 -I/usr/include/pango-1.0 -I/usr/include/harfbuzz -I/usr/include/pango-1.0 -I/usr/include/cairo -I/usr/include/freetype2 -I/usr/include/libpng16 -I/usr/include/harfbuzz -I/usr/include/glib-2.0 -I/usr/lib64/glib-2.0/include -I/usr/include/libxml2 -c -o setup.o setup.c
make[2]: Leaving directory '/usr/src/RPM/BUILD/tuxmath-2.0.3/src'
make[2]: Entering directory '/usr/src/RPM/BUILD/tuxmath-2.0.3/src'
x86_64-alt-linux-gcc -DLOCALEDIR=\"/usr/share/locale\" -DHAVE_CONFIG_H -I. -I..  -DLOCALEDIR=\"/usr/share/locale\"  -Wall -g -DDATA_PREFIX=\"/usr/share/tuxmath\" -DDEBUG -DSOUND -pipe -frecord-gcc-switches -Wall -g -O2 -flto=auto -fcommon -D_GNU_SOURCE=1 -D_REENTRANT -I/usr/include/SDL  -D_GNU_SOURCE=1 -D_REENTRANT -I/usr/include/SDL -pthread -I/usr/lib64/pkgconfig/../../include/librsvg-2.0 -I/usr/include/cairo -I/usr/include/gdk-pixbuf-2.0 -I/usr/include/libxml2 -I/usr/include/pango-1.0 -I/usr/include/harfbuzz -I/usr/include/pango-1.0 -I/usr/include/cairo -I/usr/include/freetype2 -I/usr/include/libpng16 -I/usr/include/harfbuzz -I/usr/include/glib-2.0 -I/usr/lib64/glib-2.0/include -I/usr/include/cairo -I/usr/include/freetype2 -I/usr/include/libpng16 -I/usr/include/harfbuzz -I/usr/include/glib-2.0 -I/usr/lib64/glib-2.0/include -D_GNU_SOURCE=1 -D_REENTRANT -I/usr/include/SDL -I/usr/include/libxml2 -D_GNU_SOURCE=1 -D_REENTRANT -pthread -I/usr/include/SDL -I/usr/lib64/pkgconfig/../../include/librsvg-2.0 -I/usr/include/cairo -I/usr/include/gdk-pixbuf-2.0 -I/usr/include/pango-1.0 -I/usr/include/harfbuzz -I/usr/include/pango-1.0 -I/usr/include/cairo -I/usr/include/freetype2 -I/usr/include/libpng16 -I/usr/include/harfbuzz -I/usr/include/glib-2.0 -I/usr/lib64/glib-2.0/include -I/usr/include/libxml2 -c -o comets.o comets.c
comets.c: In function 'comets_handle_help':
comets.c:759:5: warning: this 'while' clause does not guard... [-Wmisleading-indentation]
  759 |     while (comets[0].alive && (timer+=FC_time_elapsed) < 7 && !(quit_help = help_renderframe_exit())); // advance comet
      |     ^~~~~
comets.c:760:5: note: ...this statement, but the latter is misleadingly indented as if it were guarded by the 'while'
  760 |     {
      |     ^
comets.c:920:5: warning: this 'while' clause does not guard... [-Wmisleading-indentation]
  920 |     while (powerup_comet->comet.alive && ((timer+=FC_time_elapsed) < 1) && !(quit_help = help_renderframe_exit()));
      |     ^~~~~
comets.c:921:5: note: ...this statement, but the latter is misleadingly indented as if it were guarded by the 'while'
  921 |     {
      |     ^
In file included from gettext.h:25,
                 from globals.h:36,
                 from tuxmath.h:36,
                 from comets.c:30:
comets.c: In function 'convert_formula_to_sentence':
comets.c:4011:43: error: passing argument 2 of 'dcgettext' from incompatible pointer type [-Wincompatible-pointer-types]
 4011 |                         wcscat(sentence,_(L"plus "));
      |                                           ^~~~~~~~
      |                                           |
      |                                           int *
comets.c:4011:41: note: in expansion of macro '_'
 4011 |                         wcscat(sentence,_(L"plus "));
      |                                         ^
/usr/include/libintl.h:52:37: note: expected 'const char *' but argument is of type 'int *'
   52 |                         const char *__msgid, int __category)
      |                         ~~~~~~~~~~~~^~~~~~~
comets.c:4011:41: error: passing argument 2 of 'wcscat' from incompatible pointer type [-Wincompatible-pointer-types]
 4011 |                         wcscat(sentence,_(L"plus "));
      |                                         ^
      |                                         |
      |                                         char *
In file included from /usr/include/features.h:503,
                 from /usr/include/libintl.h:23:
/usr/include/bits/wchar2.h:96:1: note: expected 'const wchar_t *' {aka 'const int *'} but argument is of type 'char *'
   96 | __NTH (wcscat (wchar_t *__restrict __dest, const wchar_t *__restrict __src))
      | ^~~~~
comets.c:4013:43: error: passing argument 2 of 'dcgettext' from incompatible pointer type [-Wincompatible-pointer-types]
 4013 |                         wcscat(sentence,_(L"minus "));
      |                                           ^~~~~~~~~
      |                                           |
      |                                           int *
comets.c:4013:41: note: in expansion of macro '_'
 4013 |                         wcscat(sentence,_(L"minus "));
      |                                         ^
/usr/include/libintl.h:52:37: note: expected 'const char *' but argument is of type 'int *'
   52 |                         const char *__msgid, int __category)
      |                         ~~~~~~~~~~~~^~~~~~~
comets.c:4013:41: error: passing argument 2 of 'wcscat' from incompatible pointer type [-Wincompatible-pointer-types]
 4013 |                         wcscat(sentence,_(L"minus "));
      |                                         ^
      |                                         |
      |                                         char *
/usr/include/bits/wchar2.h:96:1: note: expected 'const wchar_t *' {aka 'const int *'} but argument is of type 'char *'
   96 | __NTH (wcscat (wchar_t *__restrict __dest, const wchar_t *__restrict __src))
      | ^~~~~
comets.c:4015:43: error: passing argument 2 of 'dcgettext' from incompatible pointer type [-Wincompatible-pointer-types]
 4015 |                         wcscat(sentence,_(L"divided by "));
      |                                           ^~~~~~~~~~~~~~
      |                                           |
      |                                           int *
comets.c:4015:41: note: in expansion of macro '_'
 4015 |                         wcscat(sentence,_(L"divided by "));
      |                                         ^
/usr/include/libintl.h:52:37: note: expected 'const char *' but argument is of type 'int *'
   52 |                         const char *__msgid, int __category)
      |                         ~~~~~~~~~~~~^~~~~~~
comets.c:4015:41: error: passing argument 2 of 'wcscat' from incompatible pointer type [-Wincompatible-pointer-types]
 4015 |                         wcscat(sentence,_(L"divided by "));
      |                                         ^
      |                                         |
      |                                         char *
/usr/include/bits/wchar2.h:96:1: note: expected 'const wchar_t *' {aka 'const int *'} but argument is of type 'char *'
   96 | __NTH (wcscat (wchar_t *__restrict __dest, const wchar_t *__restrict __src))
      | ^~~~~
comets.c:4017:43: error: passing argument 2 of 'dcgettext' from incompatible pointer type [-Wincompatible-pointer-types]
 4017 |                         wcscat(sentence,_(L"Times "));
      |                                           ^~~~~~~~~
      |                                           |
      |                                           int *
comets.c:4017:41: note: in expansion of macro '_'
 4017 |                         wcscat(sentence,_(L"Times "));
      |                                         ^
/usr/include/libintl.h:52:37: note: expected 'const char *' but argument is of type 'int *'
   52 |                         const char *__msgid, int __category)
      |                         ~~~~~~~~~~~~^~~~~~~
comets.c:4017:41: error: passing argument 2 of 'wcscat' from incompatible pointer type [-Wincompatible-pointer-types]
 4017 |                         wcscat(sentence,_(L"Times "));
      |                                         ^
      |                                         |
      |                                         char *
/usr/include/bits/wchar2.h:96:1: note: expected 'const wchar_t *' {aka 'const int *'} but argument is of type 'char *'
   96 | __NTH (wcscat (wchar_t *__restrict __dest, const wchar_t *__restrict __src))
      | ^~~~~
comets.c: In function 'tts_announcer':
comets.c:4041:9: error: implicit declaration of function 'T4K_Tts_wait'; did you mean 'T4K_Tts_init'? [-Wimplicit-function-declaration]
 4041 |         T4K_Tts_wait();
      |         ^~~~~~~~~~~~
      |         T4K_Tts_init
comets.c:4036:13: warning: unused variable 'pitch' [-Wunused-variable]
 4036 |         int pitch;
      |             ^~~~~
comets.c: In function 'stop_tts_announcer_thread':
comets.c:4161:9: error: implicit declaration of function 'T4K_Tts_stop'; did you mean 'T4K_Tts_say'? [-Wimplicit-function-declaration]
 4161 |         T4K_Tts_stop();
      |         ^~~~~~~~~~~~
      |         T4K_Tts_say
make[2]: *** [Makefile:623: comets.o] Error 1
make[2]: Leaving directory '/usr/src/RPM/BUILD/tuxmath-2.0.3/src'
make[2]: Entering directory '/usr/src/RPM/BUILD/tuxmath-2.0.3/src'
x86_64-alt-linux-gcc -DLOCALEDIR=\"/usr/share/locale\" -DHAVE_CONFIG_H -I. -I..  -DLOCALEDIR=\"/usr/share/locale\"  -Wall -g -DDATA_PREFIX=\"/usr/share/tuxmath\" -DDEBUG -DSOUND -pipe -frecord-gcc-switches -Wall -g -O2 -flto=auto -fcommon -D_GNU_SOURCE=1 -D_REENTRANT -I/usr/include/SDL  -D_GNU_SOURCE=1 -D_REENTRANT -I/usr/include/SDL -pthread -I/usr/lib64/pkgconfig/../../include/librsvg-2.0 -I/usr/include/cairo -I/usr/include/gdk-pixbuf-2.0 -I/usr/include/libxml2 -I/usr/include/pango-1.0 -I/usr/include/harfbuzz -I/usr/include/pango-1.0 -I/usr/include/cairo -I/usr/include/freetype2 -I/usr/include/libpng16 -I/usr/include/harfbuzz -I/usr/include/glib-2.0 -I/usr/lib64/glib-2.0/include -I/usr/include/cairo -I/usr/include/freetype2 -I/usr/include/libpng16 -I/usr/include/harfbuzz -I/usr/include/glib-2.0 -I/usr/lib64/glib-2.0/include -D_GNU_SOURCE=1 -D_REENTRANT -I/usr/include/SDL -I/usr/include/libxml2 -D_GNU_SOURCE=1 -D_REENTRANT -pthread -I/usr/include/SDL -I/usr/lib64/pkgconfig/../../include/librsvg-2.0 -I/usr/include/cairo -I/usr/include/gdk-pixbuf-2.0 -I/usr/include/pango-1.0 -I/usr/include/harfbuzz -I/usr/include/pango-1.0 -I/usr/include/cairo -I/usr/include/freetype2 -I/usr/include/libpng16 -I/usr/include/harfbuzz -I/usr/include/glib-2.0 -I/usr/lib64/glib-2.0/include -I/usr/include/libxml2 -c -o factoroids.o factoroids.c
factoroids.c: In function 'FF_over':
factoroids.c:865:21: warning: unused variable 'looping' [-Wunused-variable]
  865 |                 int looping = 1;
      |                     ^~~~~~~
factoroids.c:846:15: warning: unused variable 'event' [-Wunused-variable]
  846 |     SDL_Event event;
      |               ^~~~~
make[2]: Leaving directory '/usr/src/RPM/BUILD/tuxmath-2.0.3/src'
make[1]: *** [Makefile:466: all-recursive] Error 1
make: *** [Makefile:401: all] Error 2
error: Bad exit status from /usr/src/tmp/rpm-tmp.27418 (%build)


RPM build errors:
    Bad exit status from /usr/src/tmp/rpm-tmp.27418 (%build)
Command exited with non-zero status 1
14.16user 4.47system 0:25.04elapsed 74%CPU (0avgtext+0avgdata 38144maxresident)k
0inputs+0outputs (0major+1252609minor)pagefaults 0swaps
hsh-rebuild: rebuild of `tuxmath-2.0.3-alt6.src.rpm' failed.
Command exited with non-zero status 1
7.40user 3.28system 1:08.72elapsed 15%CPU (0avgtext+0avgdata 139160maxresident)k
1240inputs+0outputs (0major+299018minor)pagefaults 0swaps