<86>Nov  2 02:23:52 userdel[1362778]: delete user 'rooter'
<86>Nov  2 02:23:52 userdel[1362778]: removed group 'rooter' owned by 'rooter'
<86>Nov  2 02:23:52 userdel[1362778]: removed shadow group 'rooter' owned by 'rooter'
<86>Nov  2 02:23:52 groupadd[1363390]: group added to /etc/group: name=rooter, GID=1814
<86>Nov  2 02:23:52 groupadd[1363390]: group added to /etc/gshadow: name=rooter
<86>Nov  2 02:23:52 groupadd[1363390]: new group: name=rooter, GID=1814
<86>Nov  2 02:23:52 useradd[1364059]: new user: name=rooter, UID=1814, GID=1814, home=/root, shell=/bin/bash, from=none
<86>Nov  2 02:23:53 userdel[1364568]: delete user 'builder'
<86>Nov  2 02:23:53 userdel[1364568]: removed group 'builder' owned by 'builder'
<86>Nov  2 02:23:53 userdel[1364568]: removed shadow group 'builder' owned by 'builder'
<86>Nov  2 02:23:53 groupadd[1364817]: group added to /etc/group: name=builder, GID=1815
<86>Nov  2 02:23:53 groupadd[1364817]: group added to /etc/gshadow: name=builder
<86>Nov  2 02:23:53 groupadd[1364817]: new group: name=builder, GID=1815
<86>Nov  2 02:23:53 useradd[1365154]: new user: name=builder, UID=1815, GID=1815, home=/usr/src, shell=/bin/bash, from=none
<13>Nov  2 02:24:03 rpmi: libatk-2.54.0-alt1 sisyphus+357735.600.3.1 1726642126 installed
<13>Nov  2 02:24:03 rpmi: xorg-proto-devel-2024.1-alt1 sisyphus+343583.40.1.1 1711440649 installed
<13>Nov  2 02:24:03 rpmi: libart_lgpl-2.3.21-alt3 sisyphus+276909.100.1.1 1625271431 installed
<13>Nov  2 02:24:03 rpmi: libpng16-1.6.42-alt2 sisyphus+339555.100.1.1 1706781682 installed
<13>Nov  2 02:24:03 rpmi: libexpat-2.5.0-alt1 sisyphus+346180.200.2.1 1716349835 installed
<13>Nov  2 02:24:03 rpmi: libogg-1.3.5-alt1 sisyphus+278100.3400.1.1 1626058929 installed
<13>Nov  2 02:24:03 rpmi: libICE-1.1.1-alt1 sisyphus+311428.500.1.1 1670577555 installed
<13>Nov  2 02:24:03 rpmi: libIDL-0.8.14-alt4 sisyphus+277957.100.1.1 1625926356 installed
<13>Nov  2 02:24:03 rpmi: libORBit2-2.14.20-alt0.3 sisyphus+278855.100.1.1 1626224376 installed
<13>Nov  2 02:24:03 rpmi: xml-utils-1:2.12.9-alt1 sisyphus+355784.100.1.1 1724333686 installed
<13>Nov  2 02:24:03 rpmi: libICE-devel-1.1.1-alt1 sisyphus+311428.500.1.1 1670577555 installed
<13>Nov  2 02:24:03 rpmi: libSM-1.2.4-alt1 sisyphus+312057.200.1.1 1671526916 installed
<13>Nov  2 02:24:03 rpmi: libvorbis-1.3.7-alt1 sisyphus+275738.100.1.1 1624751601 installed
<13>Nov  2 02:24:03 rpmi: libpopt-devel-1:1.18-alt1 sisyphus+283609.300.5.1 1630003299 installed
<13>Nov  2 02:24:03 rpmi: libjpeg-2:3.0.2-alt2.1 sisyphus+340135.100.1.1 1707449145 installed
<13>Nov  2 02:24:04 rpmi: libicu74-1:7.4.2-alt1 sisyphus+336372.200.1.1 1702423005 installed
<13>Nov  2 02:24:04 rpmi: libgraphite2-1.3.14-alt2.1 sisyphus+279571.100.1.2 1626605111 installed
<13>Nov  2 02:24:04 rpmi: zlib-devel-1.3.1-alt1 sisyphus+342532.100.1.1 1710232285 installed
<13>Nov  2 02:24:04 rpmi: shared-mime-info-2.4-alt1 sisyphus+334259.100.1.1 1699787316 installed
<13>Nov  2 02:24:04 rpmi: libXau-1.0.11-alt1 sisyphus+311428.100.1.1 1670577439 installed
<13>Nov  2 02:24:04 rpmi: libXau-devel-1.0.11-alt1 sisyphus+311428.100.1.1 1670577439 installed
<13>Nov  2 02:24:04 rpmi: libpng-devel-1.6.42-alt2 sisyphus+339555.100.1.1 1706781682 installed
<13>Nov  2 02:24:04 rpmi: libgraphite2-devel-1.3.14-alt2.1 sisyphus+279571.100.1.2 1626605111 installed
<13>Nov  2 02:24:04 rpmi: icu-utils-1:7.4.2-alt1 sisyphus+336372.200.1.1 1702423005 installed
<13>Nov  2 02:24:04 rpmi: libicu-devel-1:7.4.2-alt1 sisyphus+336372.200.1.1 1702423005 installed
<13>Nov  2 02:24:04 rpmi: libSM-devel-1.2.4-alt1 sisyphus+312057.200.1.1 1671526916 installed
<13>Nov  2 02:24:04 rpmi: rpm-build-gir-0.7.3-alt3.1 sisyphus+319393.100.1.1 1682538783 installed
<13>Nov  2 02:24:04 rpmi: libflac12-1.4.3-alt2 sisyphus+343354.100.1.1 1711118098 installed
<13>Nov  2 02:24:04 rpmi: libart_lgpl-devel-2.3.21-alt3 sisyphus+276909.100.1.1 1625271431 installed
<13>Nov  2 02:24:04 rpmi: libtdb-1.4.10-alt1 sisyphus+342425.100.8.1 1714748986 installed
<13>Nov  2 02:24:04 rpmi: libltdl7-2.4.7-alt5 sisyphus+341963.200.3.1 1711659208 installed
<13>Nov  2 02:24:04 rpmi: libopus-1.5.2-alt1 sisyphus+347834.100.1.1 1715455356 installed
<13>Nov  2 02:24:04 rpmi: libmpg123-1:1.32.8-alt1 sisyphus+360917.100.1.1 1729965192 installed
<13>Nov  2 02:24:04 rpmi: liblame-3.100-alt1 sisyphus+346342.200.2.2 1716474674 installed
<13>Nov  2 02:24:04 rpmi: libgsm-1.0.17-alt1 sisyphus+275359.100.2.1 1624907612 installed
<13>Nov  2 02:24:04 rpmi: libsndfile-1.1.0-alt1 sisyphus+339776.7300.6.2 1707350065 installed
<13>Nov  2 02:24:04 rpmi: sound-theme-freedesktop-0.8-alt1 sisyphus+277010.100.1.2 1625346634 installed
<13>Nov  2 02:24:04 rpmi: libdatrie-0.2.13-alt1_7 sisyphus+328221.100.1.1 1693336966 installed
<13>Nov  2 02:24:04 rpmi: libthai-0.1.29-alt1_6 sisyphus+328230.100.1.2 1693348044 installed
<13>Nov  2 02:24:04 rpmi: libfribidi-1.0.16-alt1 sisyphus+358393.100.1.1 1727333692 installed
<13>Nov  2 02:24:04 rpmi: libgtk+2-locales-2.24.33-alt2 sisyphus+361465.100.1.1 1730475121 installed
<13>Nov  2 02:24:05 rpmi: libasyncns-0.8-alt2.qa1 sisyphus+275091.100.1.1 1624402241 installed
<13>Nov  2 02:24:05 rpmi: icon-theme-hicolor-0.18-alt1 sisyphus+349610.100.1.1 1716831669 installed
<13>Nov  2 02:24:05 rpmi: libwebp7-1.4.0-alt1 sisyphus+345159.200.1.1 1713168663 installed
<13>Nov  2 02:24:05 rpmi: libdeflate-1.22-alt1 sisyphus+359192.100.1.1 1728330316 installed
<13>Nov  2 02:24:05 rpmi: libtiff5-4.4.0-alt4 sisyphus+322581.100.1.2 1686180089 installed
<13>Nov  2 02:24:05 rpmi: libgdk-pixbuf-locales-2.42.12-alt1 sisyphus+348142.100.1.1 1715791856 installed
<13>Nov  2 02:24:05 rpmi: libgamin-fam-0.1.10-alt7 sisyphus+346213.200.2.1 1716364233 installed
<13>Nov  2 02:24:05 rpmi: gnome-audio-2.22.2-alt1 sisyphus+276847.100.1.1 1625243226 installed
<13>Nov  2 02:24:05 rpmi: libgamin-0.1.10-alt7 sisyphus+346213.200.2.1 1716364233 installed
<13>Nov  2 02:24:05 rpmi: gamin-0.1.10-alt7 sisyphus+346213.200.2.1 1716364233 installed
<13>Nov  2 02:24:05 rpmi: libpixman-3:0.43.4-alt2 sisyphus+344164.100.1.1 1711987977 installed
<13>Nov  2 02:24:05 rpmi: libbrotlicommon-1.1.0-alt1 sisyphus+328501.100.1.1 1693598419 installed
<13>Nov  2 02:24:05 rpmi: libbrotlidec-1.1.0-alt1 sisyphus+328501.100.1.1 1693598419 installed
<13>Nov  2 02:24:05 rpmi: libharfbuzz-10.0.1-alt1 sisyphus+358317.100.1.1 1727257731 installed
<13>Nov  2 02:24:05 rpmi: libfreetype-2.13.3-alt1 sisyphus+355656.100.1.1 1724221064 installed
<13>Nov  2 02:24:05 rpmi: libfontconfig1-2.15.0-alt1 sisyphus+355771.100.2.3 1724337298 installed
<13>Nov  2 02:24:05 rpmi: fontconfig-2.15.0-alt1 sisyphus+355771.100.2.3 1724337298 installed
Updating fonts cache: <29>Nov  2 02:24:06 fontconfig: Updating fonts cache: succeeded
[ DONE ]
<13>Nov  2 02:24:06 rpmi: libharfbuzz-icu-10.0.1-alt1 sisyphus+358317.100.1.1 1727257731 installed
<13>Nov  2 02:24:06 rpmi: libharfbuzz-gobject-10.0.1-alt1 sisyphus+358317.100.1.1 1727257731 installed
<13>Nov  2 02:24:06 rpmi: alsa-ucm-conf-1.2.12-alt1 sisyphus+352670.100.1.1 1720712327 installed
<13>Nov  2 02:24:06 rpmi: alsa-topology-conf-1.2.5.1-alt1 sisyphus+274777.100.1.1 1624089141 installed
<13>Nov  2 02:24:06 rpmi: libalsa-1:1.2.12-alt1 sisyphus+352670.200.1.1 1720712401 installed
<13>Nov  2 02:24:06 rpmi: openldap-common-2.6.8-alt1 sisyphus+351621.100.1.1 1719420449 installed
<13>Nov  2 02:24:06 rpmi: libverto-0.3.2-alt1_1 sisyphus+321176.2200.10.2 1684803947 installed
<13>Nov  2 02:24:06 rpmi: liblmdb-0.9.33-alt1 sisyphus+360625.100.1.1 1729819640 installed
<13>Nov  2 02:24:06 rpmi: libkeyutils-1.6.3-alt1 sisyphus+346336.200.2.2 1716472658 installed
<13>Nov  2 02:24:06 rpmi: libcom_err-1.46.4.0.5.4cda-alt1 sisyphus+283826.100.1.1 1629975345 installed
<13>Nov  2 02:24:06 rpmi: libxslt-1.1.39-alt1 sisyphus+349406.100.1.1 1716751806 installed
<13>Nov  2 02:24:06 rpmi: xsltproc-1.1.39-alt1 sisyphus+349406.100.1.1 1716751806 installed
<13>Nov  2 02:24:06 rpmi: desktop-file-utils-0.26-alt6 sisyphus+331944.100.1.3 1697550026 installed
<13>Nov  2 02:24:06 rpmi: gsettings-desktop-schemas-data-47.1-alt1 sisyphus+357735.300.3.1 1726641752 installed
<13>Nov  2 02:24:06 rpmi: libgio-2.82.2-alt1 sisyphus+360023.100.1.1 1729169691 installed
<13>Nov  2 02:24:06 rpmi: gsettings-desktop-schemas-47.1-alt1 sisyphus+357735.300.3.1 1726641752 installed
<13>Nov  2 02:24:06 rpmi: libgdk-pixbuf-2.42.12-alt1 sisyphus+348142.100.1.1 1715791856 installed
<13>Nov  2 02:24:06 rpmi: libbonobo-2.32.1-alt5 sisyphus+277998.100.1.3 1625971644 installed
<13>Nov  2 02:24:06 rpmi: gtk4-update-icon-cache-4.16.4-alt1 sisyphus+361465.200.1.1 1730475354 installed
<13>Nov  2 02:24:06 rpmi: libgstreamer1.0-1.24.9-alt1 sisyphus+361260.100.1.1 1730379899 installed
<13>Nov  2 02:24:06 rpmi: libmpdec3-2.5.1-alt3 sisyphus+314490.500.5.1 1675432004 installed
<13>Nov  2 02:24:06 rpmi: libgdbm-1.8.3-alt10 sisyphus+346222.200.3.2 1716468404 installed
<13>Nov  2 02:24:06 rpmi: libp11-kit-1:0.25.5-alt1 sisyphus+352553.100.1.1 1720622573 installed
<13>Nov  2 02:24:06 rpmi: libtasn1-4.19.0-alt3 sisyphus+327816.100.1.1 1692802615 installed
<13>Nov  2 02:24:06 rpmi: rpm-macros-alternatives-0.5.2-alt2 sisyphus+315270.200.2.1 1676457367 installed
<13>Nov  2 02:24:06 rpmi: alternatives-0.5.2-alt2 sisyphus+315270.200.2.1 1676457367 installed
<13>Nov  2 02:24:06 rpmi: ca-certificates-2024.07.01-alt1 sisyphus+351897.100.1.1 1719826350 installed
<13>Nov  2 02:24:06 rpmi: ca-trust-0.2.0-alt1 sisyphus+344843.100.1.1 1712743326 installed
<13>Nov  2 02:24:06 rpmi: p11-kit-trust-1:0.25.5-alt1 sisyphus+352553.100.1.1 1720622573 installed
<13>Nov  2 02:24:07 rpmi: libcrypto3-3.1.7-alt2 sisyphus+359910.100.1.1 1729080439 installed
<13>Nov  2 02:24:07 rpmi: libssl3-3.1.7-alt2 sisyphus+359910.100.1.1 1729080439 installed
<86>Nov  2 02:24:07 groupadd[1443242]: group added to /etc/group: name=_keytab, GID=999
<86>Nov  2 02:24:07 groupadd[1443242]: group added to /etc/gshadow: name=_keytab
<86>Nov  2 02:24:07 groupadd[1443242]: new group: name=_keytab, GID=999
<13>Nov  2 02:24:07 rpmi: libkrb5-1.21.3-alt2 sisyphus+351857.100.1.1 1719735141 installed
<86>Nov  2 02:24:07 groupadd[1444427]: group added to /etc/group: name=sasl, GID=998
<86>Nov  2 02:24:07 groupadd[1444427]: group added to /etc/gshadow: name=sasl
<86>Nov  2 02:24:07 groupadd[1444427]: new group: name=sasl, GID=998
<13>Nov  2 02:24:07 rpmi: libsasl2-3-2.1.28-alt2 sisyphus+343335.100.1.1 1711112544 installed
<13>Nov  2 02:24:07 rpmi: libldap2-2.6.8-alt1 sisyphus+351621.100.1.1 1719420449 installed
<13>Nov  2 02:24:07 rpmi: libb2-0.98.1-alt1_1 sisyphus+291614.100.1.1 1638962877 installed
<13>Nov  2 02:24:07 rpmi: python3-3.12.7-alt1 sisyphus+358796.100.1.1 1727844808 installed
<13>Nov  2 02:24:08 rpmi: python3-base-3.12.7-alt1 sisyphus+358796.100.1.1 1727844808 installed
<13>Nov  2 02:24:08 rpmi: glib2-devel-2.82.2-alt1 sisyphus+360023.100.1.1 1729169691 installed
<13>Nov  2 02:24:08 rpmi: libgio-devel-2.82.2-alt1 sisyphus+360023.100.1.1 1729169691 installed
<13>Nov  2 02:24:08 rpmi: libgdk-pixbuf-devel-2.42.12-alt1 sisyphus+348142.100.1.1 1715791856 installed
<13>Nov  2 02:24:08 rpmi: libIDL-devel-0.8.14-alt4 sisyphus+277957.100.1.1 1625926356 installed
<13>Nov  2 02:24:08 rpmi: ORBit2-devel-2.14.20-alt0.3 sisyphus+278855.100.1.1 1626224376 installed
<13>Nov  2 02:24:08 rpmi: libbonobo-devel-2.32.1-alt5 sisyphus+277998.100.1.3 1625971644 installed
<13>Nov  2 02:24:08 rpmi: libatk-devel-2.54.0-alt1 sisyphus+357735.600.3.1 1726642126 installed
<13>Nov  2 02:24:08 rpmi: gtk-builder-convert-2.24.33-alt2 sisyphus+361465.100.1.1 1730475121 installed
<13>Nov  2 02:24:08 rpmi: liblz4-1:1.9.4-alt1 sisyphus+309416.100.1.1 1667412981 installed
<13>Nov  2 02:24:08 rpmi: libsystemd-1:255.13-alt1 sisyphus+359453.100.2.1 1728651180 installed
<13>Nov  2 02:24:08 rpmi: libdbus-1.14.10-alt1 sisyphus+327286.5700.14.1 1711487401 installed
<13>Nov  2 02:24:08 rpmi: libdbus-glib-1:0.110-alt1 sisyphus+278470.100.1.2 1626224690 installed
<13>Nov  2 02:24:08 rpmi: libGConf-3.2.6-alt4 sisyphus+346002.100.2.1 1716202565 installed
<13>Nov  2 02:24:08 rpmi: libavahi-0.8-alt4 sisyphus+344258.100.1.1 1712133856 installed
<13>Nov  2 02:24:08 rpmi: libavahi-glib-0.8-alt4 sisyphus+344258.100.1.1 1712133856 installed
<13>Nov  2 02:24:08 rpmi: libcups-2.4.11-alt1 sisyphus+359120.200.2.1 1728202635 installed
<13>Nov  2 02:24:08 rpmi: libGConf-devel-3.2.6-alt4 sisyphus+346002.100.2.1 1716202565 installed
<13>Nov  2 02:24:08 rpmi: dbus-tools-1.14.10-alt1 sisyphus+327286.5700.14.1 1711487401 installed
<86>Nov  2 02:24:08 groupadd[1452456]: group added to /etc/group: name=messagebus, GID=997
<86>Nov  2 02:24:08 groupadd[1452456]: group added to /etc/gshadow: name=messagebus
<86>Nov  2 02:24:08 groupadd[1452456]: new group: name=messagebus, GID=997
<86>Nov  2 02:24:08 useradd[1452977]: new user: name=messagebus, UID=999, GID=997, home=/run/dbus, shell=/dev/null, from=none
<13>Nov  2 02:24:08 rpmi: dbus-1.14.10-alt1 sisyphus+327286.5700.14.1 1711487401 installed
<13>Nov  2 02:24:08 rpmi: libgnome-keyring-3.12.0-alt3 sisyphus+275102.100.2.1 1624561375 installed
<13>Nov  2 02:24:08 rpmi: libpolkit-124-alt3 sisyphus+351454.100.1.1 1719236630 installed
<13>Nov  2 02:24:08 rpmi: libX11-locales-3:1.8.10-alt1 sisyphus+353866.100.1.1 1722240771 installed
<13>Nov  2 02:24:08 rpmi: libXdmcp-1.1.5-alt1 sisyphus+343583.700.1.1 1711441061 installed
<13>Nov  2 02:24:08 rpmi: libxcb-1.17.0-alt1 sisyphus+345308.200.1.1 1713342004 installed
<13>Nov  2 02:24:08 rpmi: libX11-3:1.8.10-alt1 sisyphus+353866.100.1.1 1722240771 installed
<13>Nov  2 02:24:08 rpmi: libXrender-0.9.11-alt1 sisyphus+308841.100.1.1 1666436130 installed
<13>Nov  2 02:24:08 rpmi: libXext-1.3.6-alt1 sisyphus+343583.1000.1.1 1711441101 installed
<13>Nov  2 02:24:08 rpmi: libcairo-1:1.18.2-alt1 sisyphus+357195.100.1.1 1725948391 installed
<13>Nov  2 02:24:08 rpmi: libXft-2.3.8-alt1 sisyphus+331490.400.1.1 1697023269 installed
<13>Nov  2 02:24:08 rpmi: libpango-1.54.0-alt1 sisyphus+350796.200.1.1 1718041393 installed
<13>Nov  2 02:24:08 rpmi: libXfixes-6.0.1-alt1 sisyphus+331490.300.1.1 1697023233 installed
<13>Nov  2 02:24:10 rpmi: libxcb-devel-1.17.0-alt1 sisyphus+345308.200.1.1 1713342004 installed
<13>Nov  2 02:24:10 rpmi: libX11-devel-3:1.8.10-alt1 sisyphus+353866.100.1.1 1722240771 installed
<13>Nov  2 02:24:10 rpmi: libXrender-devel-0.9.11-alt1 sisyphus+308841.100.1.1 1666436130 installed
<13>Nov  2 02:24:10 rpmi: libXext-devel-1.3.6-alt1 sisyphus+343583.1000.1.1 1711441101 installed
<13>Nov  2 02:24:10 rpmi: libXcursor-1.2.2-alt1 sisyphus+343583.600.1.1 1711441025 installed
<13>Nov  2 02:24:10 rpmi: libharfbuzz-cairo-10.0.1-alt1 sisyphus+358317.100.1.1 1727257731 installed
<13>Nov  2 02:24:10 rpmi: fontconfig-devel-2.15.0-alt1 sisyphus+355771.100.2.3 1724337298 installed
<13>Nov  2 02:24:10 rpmi: libfreetype-devel-2.13.3-alt1 sisyphus+355656.100.1.1 1724221064 installed
<13>Nov  2 02:24:10 rpmi: libcairo-devel-1:1.18.2-alt1 sisyphus+357195.100.1.1 1725948391 installed
<13>Nov  2 02:24:11 rpmi: libharfbuzz-devel-10.0.1-alt1 sisyphus+358317.100.1.1 1727257731 installed
<13>Nov  2 02:24:11 rpmi: libXft-devel-2.3.8-alt1 sisyphus+331490.400.1.1 1697023269 installed
<13>Nov  2 02:24:11 rpmi: libpango-devel-1.54.0-alt1 sisyphus+350796.200.1.1 1718041393 installed
<13>Nov  2 02:24:11 rpmi: libXi-1.8-alt1 sisyphus+285490.200.1.1 1632124174 installed
<13>Nov  2 02:24:11 rpmi: libXinerama-1.1.5-alt1 sisyphus+309287.100.1.1 1667213208 installed
<13>Nov  2 02:24:11 rpmi: libXrandr-1.5.4-alt1 sisyphus+330992.100.1.1 1696485400 installed
<13>Nov  2 02:24:11 rpmi: dbus-tools-gui-1.14.10-alt1 sisyphus+327286.5700.14.1 1711487401 installed
<13>Nov  2 02:24:11 rpmi: GConf-3.2.6-alt4 sisyphus+346002.100.2.1 1716202565 installed
<13>Nov  2 02:24:11 rpmi: gnome-vfs-1:2.24.4-alt12 sisyphus+346252.200.2.1 1716416519 installed
killall: /proc lacks process entries (not mounted ?)
killall: /proc lacks process entries (not mounted ?)
killall: /proc lacks process entries (not mounted ?)
killall: /proc lacks process entries (not mounted ?)
<13>Nov  2 02:24:11 rpmi: gnome-vfs-devel-1:2.24.4-alt12 sisyphus+346252.200.2.1 1716416519 installed
<13>Nov  2 02:24:11 rpmi: libXcomposite-0.4.6-alt1 sisyphus+311188.200.1.1 1670233682 installed
<13>Nov  2 02:24:11 rpmi: libXdamage-1.1.6-alt1 sisyphus+311188.300.1.1 1670233711 installed
<13>Nov  2 02:24:11 rpmi: libgtk+2-2.24.33-alt2 sisyphus+361465.100.1.1 1730475121 installed
<13>Nov  2 02:24:11 rpmi: libglade-2.6.4-alt6 sisyphus+286822.100.2.1 1633968398 installed
<13>Nov  2 02:24:11 rpmi: libgtk+2-devel-2.24.33-alt2 sisyphus+361465.100.1.1 1730475121 installed
<13>Nov  2 02:24:11 rpmi: libgail-2.24.33-alt2 sisyphus+361465.100.1.1 1730475121 installed
<13>Nov  2 02:24:11 rpmi: libgnomecanvas-2.30.3-alt2 sisyphus+278556.100.1.3 1626253822 installed
<13>Nov  2 02:24:11 rpmi: libgnomecanvas-devel-2.30.3-alt2 sisyphus+278556.100.1.3 1626253822 installed
<13>Nov  2 02:24:11 rpmi: libpulseaudio-17.0-alt2 sisyphus+339257.100.1.1 1706519226 installed
<13>Nov  2 02:24:11 rpmi: libcanberra-0.30-alt3 sisyphus+275093.100.2.3 1624562350 installed
<13>Nov  2 02:24:11 rpmi: libgnome-2.32.1-alt4 sisyphus+275101.100.2.2 1624564313 installed
killall: /proc lacks process entries (not mounted ?)
killall: /proc lacks process entries (not mounted ?)
killall: /proc lacks process entries (not mounted ?)
killall: /proc lacks process entries (not mounted ?)
killall: /proc lacks process entries (not mounted ?)
killall: /proc lacks process entries (not mounted ?)
killall: /proc lacks process entries (not mounted ?)
killall: /proc lacks process entries (not mounted ?)
killall: /proc lacks process entries (not mounted ?)
killall: /proc lacks process entries (not mounted ?)
killall: /proc lacks process entries (not mounted ?)
killall: /proc lacks process entries (not mounted ?)
killall: /proc lacks process entries (not mounted ?)
killall: /proc lacks process entries (not mounted ?)
killall: /proc lacks process entries (not mounted ?)
killall: /proc lacks process entries (not mounted ?)
killall: /proc lacks process entries (not mounted ?)
killall: /proc lacks process entries (not mounted ?)
killall: /proc lacks process entries (not mounted ?)
<13>Nov  2 02:24:12 rpmi: libbonoboui-2.24.5-alt1 sisyphus+278557.100.1.2 1626254327 installed
<13>Nov  2 02:24:12 rpmi: libgnome-devel-2.32.1-alt4 sisyphus+275101.100.2.2 1624564313 installed
<13>Nov  2 02:24:12 rpmi: libbonoboui-devel-2.24.5-alt1 sisyphus+278557.100.1.2 1626254327 installed
<13>Nov  2 02:24:12 rpmi: libgnomeui-2.24.5-alt3 sisyphus+278852.100.1.2 1626301958 installed
<13>Nov  2 02:24:12 rpmi: libgnomeui-devel-2.24.5-alt3 sisyphus+278852.100.1.2 1626301958 installed
Building target platforms: x86_64
Building for target x86_64
Wrote: /usr/src/in/nosrpm/gdado-2.2-alt6.nosrc.rpm (w1.gzdio)
Installing gdado-2.2-alt6.src.rpm
Building target platforms: x86_64
Building for target x86_64
Executing(%prep): /bin/sh -e /usr/src/tmp/rpm-tmp.21285
+ umask 022
+ /bin/mkdir -p /usr/src/RPM/BUILD
+ cd /usr/src/RPM/BUILD
+ cd /usr/src/RPM/BUILD
+ rm -rf gdado-2.2
+ echo 'Source #0 (gdado-2.2.tar.gz):'
Source #0 (gdado-2.2.tar.gz):
+ /bin/tar -xf -
+ /usr/bin/gzip -dc /usr/src/RPM/SOURCES/gdado-2.2.tar.gz
+ cd gdado-2.2
+ /bin/chmod -c -Rf u+rwX,go-w .
+ echo 'Patch #0 (gdado-2.2-alt-desktop-file.patch):'
Patch #0 (gdado-2.2-alt-desktop-file.patch):
+ /usr/bin/patch -p1
patching file gdado.desktop
+ echo 'Patch #1 (gdado-2.2-alt-gcc10.patch):'
Patch #1 (gdado-2.2-alt-gcc10.patch):
+ /usr/bin/patch -p2
patching file src/main.c
+ exit 0
Executing(%build): /bin/sh -e /usr/src/tmp/rpm-tmp.21285
+ umask 022
+ /bin/mkdir -p /usr/src/RPM/BUILD
+ cd /usr/src/RPM/BUILD
+ cd gdado-2.2
+ CFLAGS='-pipe -frecord-gcc-switches -Wall -g -O2 -flto=auto'
+ export CFLAGS
+ CXXFLAGS='-pipe -frecord-gcc-switches -Wall -g -O2 -flto=auto'
+ export CXXFLAGS
+ FFLAGS='-pipe -frecord-gcc-switches -Wall -g -O2 -flto=auto'
+ export FFLAGS
+ FCFLAGS='-pipe -frecord-gcc-switches -Wall -g -O2 -flto=auto'
+ export FCFLAGS
+ '[' -n '' ']'
++ sed -r 's/(^|[[:space:]]+)-[^m][^[:space:]]*//g'
++ printf %s '-pipe -frecord-gcc-switches -Wall -g -O2 -flto=auto'
+ ASFLAGS=
+ export ASFLAGS
+ export lt_cv_deplibs_check_method=pass_all
+ lt_cv_deplibs_check_method=pass_all
+ readlink -e -- ./configure
+ xargs -ri find '{}' -type f '(' -name config.sub -or -name config.guess ')' -printf '%h/\n'
+ xargs -ri dirname -- '{}'
+ sort -u
+ xargs -rn1 install -pm755 -- /usr/share/gnu-config/config.sub /usr/share/gnu-config/config.guess
+ configure_runstatedir_flags=
+ grep -qF runstatedir=DIR ./configure
+ echo 'rpm-build: warning: ./configure script does not support --runstatedir'
rpm-build: warning: ./configure script does not support --runstatedir
+ ./configure --build=x86_64-alt-linux --host=x86_64-alt-linux --prefix=/usr --exec-prefix=/usr --bindir=/usr/bin --sbindir=/usr/sbin --sysconfdir=/etc --datadir=/usr/share --includedir=/usr/include --libdir=/usr/lib64 --libexecdir=/usr/lib --localstatedir=/var/lib --sharedstatedir=/var/lib --mandir=/usr/share/man --infodir=/usr/share/info --disable-dependency-tracking --disable-silent-rules --without-included-gettext
checking for a BSD-compatible install... /usr/bin/ginstall -c
checking whether build environment is sane... yes
checking whether make sets $(MAKE)... yes
checking for working aclocal-1.4... missing
checking for working autoconf... found
checking for working automake-1.4... missing
checking for working autoheader... found
checking for working makeinfo... missing
checking whether to enable maintainer-specific portions of Makefiles... no
checking for x86_64-alt-linux-gcc... x86_64-alt-linux-gcc
checking for C compiler default output file name... a.out
checking whether the C compiler works... yes
checking whether we are cross compiling... no
checking for suffix of executables... 
checking for suffix of object files... o
checking whether we are using the GNU C compiler... yes
checking whether x86_64-alt-linux-gcc accepts -g... yes
checking for x86_64-alt-linux-gcc option to accept ISO C89... none needed
checking for library containing strerror... none required
checking for x86_64-alt-linux-gcc... (cached) x86_64-alt-linux-gcc
checking whether we are using the GNU C compiler... (cached) yes
checking whether x86_64-alt-linux-gcc accepts -g... (cached) yes
checking for x86_64-alt-linux-gcc option to accept ISO C89... (cached) none needed
checking for x86_64-alt-linux-gcc option to accept ANSI C... none needed
checking how to run the C preprocessor... x86_64-alt-linux-gcc -E
checking for grep that handles long lines and -e... /usr/bin/grep
checking for egrep... /usr/bin/grep -E
checking for ANSI C header files... yes
checking for x86_64-alt-linux-pkg-config... no
checking for pkg-config... /usr/bin/pkg-config
checking pkg-config is at least version 0.9.0... yes
checking for PACKAGE... yes
checking for sys/types.h... yes
checking for sys/stat.h... yes
checking for stdlib.h... yes
checking for string.h... yes
checking for memory.h... yes
checking for strings.h... yes
checking for inttypes.h... yes
checking for stdint.h... yes
checking for unistd.h... yes
checking build system type... x86_64-alt-linux-gnu
checking host system type... x86_64-alt-linux-gnu
checking locale.h usability... yes
checking locale.h presence... yes
checking for locale.h... yes
checking for LC_MESSAGES... yes
checking libintl.h usability... yes
checking libintl.h presence... yes
checking for libintl.h... yes
checking for ngettext in libc... yes
checking for dgettext in libc... yes
checking for bind_textdomain_codeset... yes
checking for msgfmt... /usr/bin/msgfmt
checking for dcgettext... yes
checking if msgfmt accepts -c... yes
checking for gmsgfmt... /usr/bin/msgfmt
checking for xgettext... /usr/bin/xgettext
checking for catalogs to be installed...  es
configure: creating ./config.status
config.status: creating Makefile
config.status: WARNING:  Makefile.in seems to ignore the --datarootdir setting
config.status: creating src/Makefile
config.status: WARNING:  src/Makefile.in seems to ignore the --datarootdir setting
config.status: creating po/Makefile.in
config.status: creating config.h
config.status: executing default-1 commands
config.status: executing default-2 commands
+ make -j16
make  all-recursive
Making all in src
make[2]: Entering directory '/usr/src/RPM/BUILD/gdado-2.2/src'
x86_64-alt-linux-gcc -DHAVE_CONFIG_H -I. -I. -I.. -DPACKAGE_DATA_DIR=\""/usr/share"\" 	-DPACKAGE_LOCALE_DIR=\""/usr/share/locale"\" 	-DORBIT2=1 -pthread -I/usr/include/libgnomeui-2.0 -I/usr/include/libbonoboui-2.0 -I/usr/include/libgnome-2.0 -I/usr/include/libbonobo-2.0 -I/usr/include/bonobo-activation-2.0 -I/usr/include/orbit-2.0 -I/usr/include/libgnomecanvas-2.0 -I/usr/include/libart-2.0 -I/usr/include/gtk-2.0 -I/usr/lib64/gtk-2.0/include -I/usr/include/pango-1.0 -I/usr/include/atk-1.0 -I/usr/include/pango-1.0 -I/usr/include/harfbuzz -I/usr/include/pango-1.0 -I/usr/include/cairo -I/usr/include/freetype2 -I/usr/include/harfbuzz -I/usr/include/gdk-pixbuf-2.0 -I/usr/include/libpng16 -I/usr/include/gnome-vfs-2.0 -I/usr/lib64/gnome-vfs-2.0/include -I/usr/include/gconf/2 -I/usr/include/glib-2.0 -I/usr/lib64/glib-2.0/include    -pipe -frecord-gcc-switches -Wall -g -O2 -flto=auto -c utils.c
In file included from /usr/include/gtk-2.0/gtk/gtkobject.h:37,
                 from /usr/include/gtk-2.0/gtk/gtkwidget.h:36,
                 from /usr/include/gtk-2.0/gtk/gtkcontainer.h:35,
                 from /usr/include/gtk-2.0/gtk/gtkbin.h:35,
                 from /usr/include/gtk-2.0/gtk/gtkwindow.h:36,
                 from /usr/include/gtk-2.0/gtk/gtkdialog.h:35,
                 from /usr/include/gtk-2.0/gtk/gtkaboutdialog.h:32,
                 from /usr/include/gtk-2.0/gtk/gtk.h:33,
                 from /usr/include/libgnomeui-2.0/gnome.h:4,
                 from utils.c:28:
/usr/include/gtk-2.0/gtk/gtktypeutils.h:236:1: warning: 'GTypeDebugFlags' is deprecated [-Wdeprecated-declarations]
  236 | void            gtk_type_init   (GTypeDebugFlags    debug_flags);
      | ^~~~
In file included from /usr/include/glib-2.0/gobject/gobject.h:26,
                 from /usr/include/glib-2.0/gobject/gbinding.h:31,
                 from /usr/include/glib-2.0/glib-object.h:24,
                 from /usr/include/glib-2.0/gio/gioenums.h:30,
                 from /usr/include/glib-2.0/gio/giotypes.h:30,
                 from /usr/include/glib-2.0/gio/gio.h:28,
                 from /usr/include/gtk-2.0/gdk/gdkapplaunchcontext.h:30,
                 from /usr/include/gtk-2.0/gdk/gdk.h:32,
                 from /usr/include/gtk-2.0/gtk/gtk.h:32:
/usr/include/glib-2.0/gobject/gtype.h:725:1: note: declared here
  725 | {
      | ^
In file included from /usr/include/gtk-2.0/gtk/gtktoolitem.h:31,
                 from /usr/include/gtk-2.0/gtk/gtktoolbutton.h:30,
                 from /usr/include/gtk-2.0/gtk/gtkmenutoolbutton.h:30,
                 from /usr/include/gtk-2.0/gtk/gtk.h:126:
/usr/include/gtk-2.0/gtk/gtktooltips.h:73:3: warning: 'GTimeVal' is deprecated: Use 'GDateTime' instead [-Wdeprecated-declarations]
   73 |   GTimeVal last_popdown;
      |   ^~~~~~~~
In file included from /usr/include/glib-2.0/glib/galloca.h:34,
                 from /usr/include/glib-2.0/glib.h:32,
                 from /usr/include/glib-2.0/gobject/gbinding.h:30:
/usr/include/glib-2.0/glib/gtypes.h:580:8: note: declared here
  580 | struct _GTimeVal
      |        ^~~~~~~~~
In file included from /usr/include/libgnome-2.0/libgnome/libgnome.h:29,
                 from /usr/include/libgnomeui-2.0/gnome.h:5:
/usr/include/libgnome-2.0/libgnome/gnome-program.h:246:28: warning: 'GParameter' is deprecated [-Wdeprecated-declarations]
  246 |                            guint nparams, GParameter *params);
      |                            ^~~~~
In file included from /usr/include/glib-2.0/gobject/gobject.h:28:
/usr/include/glib-2.0/gobject/gparam.h:278:8: note: declared here
  278 | struct _GParameter /* auxiliary structure for _setv() variants */
      |        ^~~~~~~~~~~
make[2]: Leaving directory '/usr/src/RPM/BUILD/gdado-2.2/src'
make[2]: Entering directory '/usr/src/RPM/BUILD/gdado-2.2/src'
x86_64-alt-linux-gcc -DHAVE_CONFIG_H -I. -I. -I.. -DPACKAGE_DATA_DIR=\""/usr/share"\" 	-DPACKAGE_LOCALE_DIR=\""/usr/share/locale"\" 	-DORBIT2=1 -pthread -I/usr/include/libgnomeui-2.0 -I/usr/include/libbonoboui-2.0 -I/usr/include/libgnome-2.0 -I/usr/include/libbonobo-2.0 -I/usr/include/bonobo-activation-2.0 -I/usr/include/orbit-2.0 -I/usr/include/libgnomecanvas-2.0 -I/usr/include/libart-2.0 -I/usr/include/gtk-2.0 -I/usr/lib64/gtk-2.0/include -I/usr/include/pango-1.0 -I/usr/include/atk-1.0 -I/usr/include/pango-1.0 -I/usr/include/harfbuzz -I/usr/include/pango-1.0 -I/usr/include/cairo -I/usr/include/freetype2 -I/usr/include/harfbuzz -I/usr/include/gdk-pixbuf-2.0 -I/usr/include/libpng16 -I/usr/include/gnome-vfs-2.0 -I/usr/lib64/gnome-vfs-2.0/include -I/usr/include/gconf/2 -I/usr/include/glib-2.0 -I/usr/lib64/glib-2.0/include    -pipe -frecord-gcc-switches -Wall -g -O2 -flto=auto -c callbacks.c
In file included from /usr/include/gtk-2.0/gtk/gtkobject.h:37,
                 from /usr/include/gtk-2.0/gtk/gtkwidget.h:36,
                 from /usr/include/gtk-2.0/gtk/gtkcontainer.h:35,
                 from /usr/include/gtk-2.0/gtk/gtkbin.h:35,
                 from /usr/include/gtk-2.0/gtk/gtkwindow.h:36,
                 from /usr/include/gtk-2.0/gtk/gtkdialog.h:35,
                 from /usr/include/gtk-2.0/gtk/gtkaboutdialog.h:32,
                 from /usr/include/gtk-2.0/gtk/gtk.h:33,
                 from /usr/include/libgnomeui-2.0/gnome.h:4,
                 from callbacks.c:27:
/usr/include/gtk-2.0/gtk/gtktypeutils.h:236:1: warning: 'GTypeDebugFlags' is deprecated [-Wdeprecated-declarations]
  236 | void            gtk_type_init   (GTypeDebugFlags    debug_flags);
      | ^~~~
In file included from /usr/include/glib-2.0/gobject/gobject.h:26,
                 from /usr/include/glib-2.0/gobject/gbinding.h:31,
                 from /usr/include/glib-2.0/glib-object.h:24,
                 from /usr/include/glib-2.0/gio/gioenums.h:30,
                 from /usr/include/glib-2.0/gio/giotypes.h:30,
                 from /usr/include/glib-2.0/gio/gio.h:28,
                 from /usr/include/gtk-2.0/gdk/gdkapplaunchcontext.h:30,
                 from /usr/include/gtk-2.0/gdk/gdk.h:32,
                 from /usr/include/gtk-2.0/gtk/gtk.h:32:
/usr/include/glib-2.0/gobject/gtype.h:725:1: note: declared here
  725 | {
      | ^
In file included from /usr/include/gtk-2.0/gtk/gtktoolitem.h:31,
                 from /usr/include/gtk-2.0/gtk/gtktoolbutton.h:30,
                 from /usr/include/gtk-2.0/gtk/gtkmenutoolbutton.h:30,
                 from /usr/include/gtk-2.0/gtk/gtk.h:126:
/usr/include/gtk-2.0/gtk/gtktooltips.h:73:3: warning: 'GTimeVal' is deprecated: Use 'GDateTime' instead [-Wdeprecated-declarations]
   73 |   GTimeVal last_popdown;
      |   ^~~~~~~~
In file included from /usr/include/glib-2.0/glib/galloca.h:34,
                 from /usr/include/glib-2.0/glib.h:32,
                 from /usr/include/glib-2.0/gobject/gbinding.h:30:
/usr/include/glib-2.0/glib/gtypes.h:580:8: note: declared here
  580 | struct _GTimeVal
      |        ^~~~~~~~~
In file included from /usr/include/libgnome-2.0/libgnome/libgnome.h:29,
                 from /usr/include/libgnomeui-2.0/gnome.h:5:
/usr/include/libgnome-2.0/libgnome/gnome-program.h:246:28: warning: 'GParameter' is deprecated [-Wdeprecated-declarations]
  246 |                            guint nparams, GParameter *params);
      |                            ^~~~~
In file included from /usr/include/glib-2.0/gobject/gobject.h:28:
/usr/include/glib-2.0/gobject/gparam.h:278:8: note: declared here
  278 | struct _GParameter /* auxiliary structure for _setv() variants */
      |        ^~~~~~~~~~~
callbacks.c: In function 'on_menu_separatedlines1_activate':
callbacks.c:79:58: error: passing argument 1 of 'gtk_check_menu_item_get_active' from incompatible pointer type [-Wincompatible-pointer-types]
   79 |   opt_separatedlines = gtk_check_menu_item_get_active  ( menuitem );
      |                                                          ^~~~~~~~
      |                                                          |
      |                                                          GtkMenuItem * {aka struct _GtkMenuItem *}
In file included from /usr/include/gtk-2.0/gtk/gtk.h:67:
/usr/include/gtk-2.0/gtk/gtkcheckmenuitem.h:84:69: note: expected 'GtkCheckMenuItem *' {aka 'struct _GtkCheckMenuItem *'} but argument is of type 'GtkMenuItem *' {aka 'struct _GtkMenuItem *'}
   84 | gboolean   gtk_check_menu_item_get_active        (GtkCheckMenuItem *check_menu_item);
      |                                                   ~~~~~~~~~~~~~~~~~~^~~~~~~~~~~~~~~
callbacks.c: In function 'on_menu_sumresults1_activate':
callbacks.c:87:53: error: passing argument 1 of 'gtk_check_menu_item_get_active' from incompatible pointer type [-Wincompatible-pointer-types]
   87 |   opt_sumresults = gtk_check_menu_item_get_active  (menuitem );
      |                                                     ^~~~~~~~
      |                                                     |
      |                                                     GtkMenuItem * {aka struct _GtkMenuItem *}
/usr/include/gtk-2.0/gtk/gtkcheckmenuitem.h:84:69: note: expected 'GtkCheckMenuItem *' {aka 'struct _GtkCheckMenuItem *'} but argument is of type 'GtkMenuItem *' {aka 'struct _GtkMenuItem *'}
   84 | gboolean   gtk_check_menu_item_get_active        (GtkCheckMenuItem *check_menu_item);
      |                                                   ~~~~~~~~~~~~~~~~~~^~~~~~~~~~~~~~~
callbacks.c:91:37: error: passing argument 1 of 'gtk_check_menu_item_set_active' from incompatible pointer type [-Wincompatible-pointer-types]
   91 |     gtk_check_menu_item_set_active (lookup_widget(GTK_WIDGET (wg), "menu_onlyfinalresult"), FALSE);
      |                                     ^~~~~~~~~~~~~~~~~~~~~~~~~~~~~~~~~~~~~~~~~~~~~~~~~~~~~~
      |                                     |
      |                                     GtkWidget * {aka struct _GtkWidget *}
/usr/include/gtk-2.0/gtk/gtkcheckmenuitem.h:82:69: note: expected 'GtkCheckMenuItem *' {aka 'struct _GtkCheckMenuItem *'} but argument is of type 'GtkWidget *' {aka 'struct _GtkWidget *'}
   82 | void       gtk_check_menu_item_set_active        (GtkCheckMenuItem *check_menu_item,
      |                                                   ~~~~~~~~~~~~~~~~~~^~~~~~~~~~~~~~~
callbacks.c: In function 'on_menu_onlyfinalresult_activate':
callbacks.c:103:58: error: passing argument 1 of 'gtk_check_menu_item_get_active' from incompatible pointer type [-Wincompatible-pointer-types]
  103 |   opt_onlyfinalresult = gtk_check_menu_item_get_active  (menuitem);
      |                                                          ^~~~~~~~
      |                                                          |
      |                                                          GtkMenuItem * {aka struct _GtkMenuItem *}
/usr/include/gtk-2.0/gtk/gtkcheckmenuitem.h:84:69: note: expected 'GtkCheckMenuItem *' {aka 'struct _GtkCheckMenuItem *'} but argument is of type 'GtkMenuItem *' {aka 'struct _GtkMenuItem *'}
   84 | gboolean   gtk_check_menu_item_get_active        (GtkCheckMenuItem *check_menu_item);
      |                                                   ~~~~~~~~~~~~~~~~~~^~~~~~~~~~~~~~~
callbacks.c:109:37: error: passing argument 1 of 'gtk_check_menu_item_set_active' from incompatible pointer type [-Wincompatible-pointer-types]
  109 |     gtk_check_menu_item_set_active (lookup_widget(GTK_WIDGET (wg), "menu_sumresults1"), TRUE);
      |                                     ^~~~~~~~~~~~~~~~~~~~~~~~~~~~~~~~~~~~~~~~~~~~~~~~~~
      |                                     |
      |                                     GtkWidget * {aka struct _GtkWidget *}
/usr/include/gtk-2.0/gtk/gtkcheckmenuitem.h:82:69: note: expected 'GtkCheckMenuItem *' {aka 'struct _GtkCheckMenuItem *'} but argument is of type 'GtkWidget *' {aka 'struct _GtkWidget *'}
   82 | void       gtk_check_menu_item_set_active        (GtkCheckMenuItem *check_menu_item,
      |                                                   ~~~~~~~~~~~~~~~~~~^~~~~~~~~~~~~~~
callbacks.c: In function 'on_button_roll_clicked':
callbacks.c:234:46: error: passing argument 1 of 'gtk_spin_button_get_value_as_int' from incompatible pointer type [-Wincompatible-pointer-types]
  234 |   ndices = gtk_spin_button_get_value_as_int( lookup_widget(GTK_WIDGET (wg), "spinbutton_ndices") );
      |                                              ^~~~~~~~~~~~~~~~~~~~~~~~~~~~~~~~~~~~~~~~~~~~~~~~~~~
      |                                              |
      |                                              GtkWidget * {aka struct _GtkWidget *}
In file included from /usr/include/gtk-2.0/gtk/gtk.h:170:
/usr/include/gtk-2.0/gtk/gtkspinbutton.h:163:69: note: expected 'GtkSpinButton *' {aka 'struct _GtkSpinButton *'} but argument is of type 'GtkWidget *' {aka 'struct _GtkWidget *'}
  163 | gint            gtk_spin_button_get_value_as_int   (GtkSpinButton  *spin_button);
      |                                                     ~~~~~~~~~~~~~~~~^~~~~~~~~~~
callbacks.c:236:46: error: passing argument 1 of 'gtk_spin_button_get_value_as_int' from incompatible pointer type [-Wincompatible-pointer-types]
  236 |   nsides = gtk_spin_button_get_value_as_int( lookup_widget(GTK_WIDGET (wg), "spinbutton_nsides") );
      |                                              ^~~~~~~~~~~~~~~~~~~~~~~~~~~~~~~~~~~~~~~~~~~~~~~~~~~
      |                                              |
      |                                              GtkWidget * {aka struct _GtkWidget *}
/usr/include/gtk-2.0/gtk/gtkspinbutton.h:163:69: note: expected 'GtkSpinButton *' {aka 'struct _GtkSpinButton *'} but argument is of type 'GtkWidget *' {aka 'struct _GtkWidget *'}
  163 | gint            gtk_spin_button_get_value_as_int   (GtkSpinButton  *spin_button);
      |                                                     ~~~~~~~~~~~~~~~~^~~~~~~~~~~
callbacks.c:242:9: error: implicit declaration of function 'giveResult' [-Wimplicit-function-declaration]
  242 |   aux = giveResult(results, ndices, opt_separatedlines, opt_sumresults, opt_onlyfinalresult);
      |         ^~~~~~~~~~
callbacks.c:242:7: error: assignment to 'char *' from 'int' makes pointer from integer without a cast [-Wint-conversion]
  242 |   aux = giveResult(results, ndices, opt_separatedlines, opt_sumresults, opt_onlyfinalresult);
      |       ^
make[2]: *** [Makefile:247: callbacks.o] Error 1
make[2]: Leaving directory '/usr/src/RPM/BUILD/gdado-2.2/src'
make[2]: *** Waiting for unfinished jobs....
make[2]: Entering directory '/usr/src/RPM/BUILD/gdado-2.2/src'
x86_64-alt-linux-gcc -DHAVE_CONFIG_H -I. -I. -I.. -DPACKAGE_DATA_DIR=\""/usr/share"\" 	-DPACKAGE_LOCALE_DIR=\""/usr/share/locale"\" 	-DORBIT2=1 -pthread -I/usr/include/libgnomeui-2.0 -I/usr/include/libbonoboui-2.0 -I/usr/include/libgnome-2.0 -I/usr/include/libbonobo-2.0 -I/usr/include/bonobo-activation-2.0 -I/usr/include/orbit-2.0 -I/usr/include/libgnomecanvas-2.0 -I/usr/include/libart-2.0 -I/usr/include/gtk-2.0 -I/usr/lib64/gtk-2.0/include -I/usr/include/pango-1.0 -I/usr/include/atk-1.0 -I/usr/include/pango-1.0 -I/usr/include/harfbuzz -I/usr/include/pango-1.0 -I/usr/include/cairo -I/usr/include/freetype2 -I/usr/include/harfbuzz -I/usr/include/gdk-pixbuf-2.0 -I/usr/include/libpng16 -I/usr/include/gnome-vfs-2.0 -I/usr/lib64/gnome-vfs-2.0/include -I/usr/include/gconf/2 -I/usr/include/glib-2.0 -I/usr/lib64/glib-2.0/include    -pipe -frecord-gcc-switches -Wall -g -O2 -flto=auto -c main.c
In file included from /usr/include/gtk-2.0/gtk/gtkobject.h:37,
                 from /usr/include/gtk-2.0/gtk/gtkwidget.h:36,
                 from /usr/include/gtk-2.0/gtk/gtkcontainer.h:35,
                 from /usr/include/gtk-2.0/gtk/gtkbin.h:35,
                 from /usr/include/gtk-2.0/gtk/gtkwindow.h:36,
                 from /usr/include/gtk-2.0/gtk/gtkdialog.h:35,
                 from /usr/include/gtk-2.0/gtk/gtkaboutdialog.h:32,
                 from /usr/include/gtk-2.0/gtk/gtk.h:33,
                 from /usr/include/libgnomeui-2.0/gnome.h:4,
                 from main.c:37:
/usr/include/gtk-2.0/gtk/gtktypeutils.h:236:1: warning: 'GTypeDebugFlags' is deprecated [-Wdeprecated-declarations]
  236 | void            gtk_type_init   (GTypeDebugFlags    debug_flags);
      | ^~~~
In file included from /usr/include/glib-2.0/gobject/gobject.h:26,
                 from /usr/include/glib-2.0/gobject/gbinding.h:31,
                 from /usr/include/glib-2.0/glib-object.h:24,
                 from /usr/include/glib-2.0/gio/gioenums.h:30,
                 from /usr/include/glib-2.0/gio/giotypes.h:30,
                 from /usr/include/glib-2.0/gio/gio.h:28,
                 from /usr/include/gtk-2.0/gdk/gdkapplaunchcontext.h:30,
                 from /usr/include/gtk-2.0/gdk/gdk.h:32,
                 from /usr/include/gtk-2.0/gtk/gtk.h:32:
/usr/include/glib-2.0/gobject/gtype.h:725:1: note: declared here
  725 | {
      | ^
In file included from /usr/include/gtk-2.0/gtk/gtktoolitem.h:31,
                 from /usr/include/gtk-2.0/gtk/gtktoolbutton.h:30,
                 from /usr/include/gtk-2.0/gtk/gtkmenutoolbutton.h:30,
                 from /usr/include/gtk-2.0/gtk/gtk.h:126:
/usr/include/gtk-2.0/gtk/gtktooltips.h:73:3: warning: 'GTimeVal' is deprecated: Use 'GDateTime' instead [-Wdeprecated-declarations]
   73 |   GTimeVal last_popdown;
      |   ^~~~~~~~
In file included from /usr/include/glib-2.0/glib/galloca.h:34,
                 from /usr/include/glib-2.0/glib.h:32,
                 from /usr/include/glib-2.0/gobject/gbinding.h:30:
/usr/include/glib-2.0/glib/gtypes.h:580:8: note: declared here
  580 | struct _GTimeVal
      |        ^~~~~~~~~
In file included from /usr/include/libgnome-2.0/libgnome/libgnome.h:29,
                 from /usr/include/libgnomeui-2.0/gnome.h:5:
/usr/include/libgnome-2.0/libgnome/gnome-program.h:246:28: warning: 'GParameter' is deprecated [-Wdeprecated-declarations]
  246 |                            guint nparams, GParameter *params);
      |                            ^~~~~
In file included from /usr/include/glib-2.0/gobject/gobject.h:28:
/usr/include/glib-2.0/gobject/gparam.h:278:8: note: declared here
  278 | struct _GParameter /* auxiliary structure for _setv() variants */
      |        ^~~~~~~~~~~
main.c: In function 'main':
main.c:79:57: error: passing argument 1 of 'gtk_check_menu_item_get_active' from incompatible pointer type [-Wincompatible-pointer-types]
   79 |   opt_separatedlines = gtk_check_menu_item_get_active  (lookup_widget(GTK_WIDGET (window_gdado), "menu_separatedlines1") );
      |                                                         ^~~~~~~~~~~~~~~~~~~~~~~~~~~~~~~~~~~~~~~~~~~~~~~~~~~~~~~~~~~~~~~~
      |                                                         |
      |                                                         GtkWidget * {aka struct _GtkWidget *}
In file included from /usr/include/gtk-2.0/gtk/gtk.h:67:
/usr/include/gtk-2.0/gtk/gtkcheckmenuitem.h:84:69: note: expected 'GtkCheckMenuItem *' {aka 'struct _GtkCheckMenuItem *'} but argument is of type 'GtkWidget *' {aka 'struct _GtkWidget *'}
   84 | gboolean   gtk_check_menu_item_get_active        (GtkCheckMenuItem *check_menu_item);
      |                                                   ~~~~~~~~~~~~~~~~~~^~~~~~~~~~~~~~~
main.c:80:53: error: passing argument 1 of 'gtk_check_menu_item_get_active' from incompatible pointer type [-Wincompatible-pointer-types]
   80 |   opt_sumresults = gtk_check_menu_item_get_active  (lookup_widget(GTK_WIDGET (window_gdado), "menu_sumresults1") );
      |                                                     ^~~~~~~~~~~~~~~~~~~~~~~~~~~~~~~~~~~~~~~~~~~~~~~~~~~~~~~~~~~~
      |                                                     |
      |                                                     GtkWidget * {aka struct _GtkWidget *}
/usr/include/gtk-2.0/gtk/gtkcheckmenuitem.h:84:69: note: expected 'GtkCheckMenuItem *' {aka 'struct _GtkCheckMenuItem *'} but argument is of type 'GtkWidget *' {aka 'struct _GtkWidget *'}
   84 | gboolean   gtk_check_menu_item_get_active        (GtkCheckMenuItem *check_menu_item);
      |                                                   ~~~~~~~~~~~~~~~~~~^~~~~~~~~~~~~~~
main.c:81:58: error: passing argument 1 of 'gtk_check_menu_item_get_active' from incompatible pointer type [-Wincompatible-pointer-types]
   81 |   opt_onlyfinalresult = gtk_check_menu_item_get_active  (lookup_widget(GTK_WIDGET (window_gdado), "menu_onlyfinalresult") );
      |                                                          ^~~~~~~~~~~~~~~~~~~~~~~~~~~~~~~~~~~~~~~~~~~~~~~~~~~~~~~~~~~~~~~~
      |                                                          |
      |                                                          GtkWidget * {aka struct _GtkWidget *}
/usr/include/gtk-2.0/gtk/gtkcheckmenuitem.h:84:69: note: expected 'GtkCheckMenuItem *' {aka 'struct _GtkCheckMenuItem *'} but argument is of type 'GtkWidget *' {aka 'struct _GtkWidget *'}
   84 | gboolean   gtk_check_menu_item_get_active        (GtkCheckMenuItem *check_menu_item);
      |                                                   ~~~~~~~~~~~~~~~~~~^~~~~~~~~~~~~~~
make[2]: *** [Makefile:247: main.o] Error 1
make[2]: Leaving directory '/usr/src/RPM/BUILD/gdado-2.2/src'
make[2]: Entering directory '/usr/src/RPM/BUILD/gdado-2.2/src'
x86_64-alt-linux-gcc -DHAVE_CONFIG_H -I. -I. -I.. -DPACKAGE_DATA_DIR=\""/usr/share"\" 	-DPACKAGE_LOCALE_DIR=\""/usr/share/locale"\" 	-DORBIT2=1 -pthread -I/usr/include/libgnomeui-2.0 -I/usr/include/libbonoboui-2.0 -I/usr/include/libgnome-2.0 -I/usr/include/libbonobo-2.0 -I/usr/include/bonobo-activation-2.0 -I/usr/include/orbit-2.0 -I/usr/include/libgnomecanvas-2.0 -I/usr/include/libart-2.0 -I/usr/include/gtk-2.0 -I/usr/lib64/gtk-2.0/include -I/usr/include/pango-1.0 -I/usr/include/atk-1.0 -I/usr/include/pango-1.0 -I/usr/include/harfbuzz -I/usr/include/pango-1.0 -I/usr/include/cairo -I/usr/include/freetype2 -I/usr/include/harfbuzz -I/usr/include/gdk-pixbuf-2.0 -I/usr/include/libpng16 -I/usr/include/gnome-vfs-2.0 -I/usr/lib64/gnome-vfs-2.0/include -I/usr/include/gconf/2 -I/usr/include/glib-2.0 -I/usr/lib64/glib-2.0/include    -pipe -frecord-gcc-switches -Wall -g -O2 -flto=auto -c support.c
In file included from /usr/include/gtk-2.0/gtk/gtkobject.h:37,
                 from /usr/include/gtk-2.0/gtk/gtkwidget.h:36,
                 from /usr/include/gtk-2.0/gtk/gtkcontainer.h:35,
                 from /usr/include/gtk-2.0/gtk/gtkbin.h:35,
                 from /usr/include/gtk-2.0/gtk/gtkwindow.h:36,
                 from /usr/include/gtk-2.0/gtk/gtkdialog.h:35,
                 from /usr/include/gtk-2.0/gtk/gtkaboutdialog.h:32,
                 from /usr/include/gtk-2.0/gtk/gtk.h:33,
                 from /usr/include/libgnomeui-2.0/gnome.h:4,
                 from support.c:15:
/usr/include/gtk-2.0/gtk/gtktypeutils.h:236:1: warning: 'GTypeDebugFlags' is deprecated [-Wdeprecated-declarations]
  236 | void            gtk_type_init   (GTypeDebugFlags    debug_flags);
      | ^~~~
In file included from /usr/include/glib-2.0/gobject/gobject.h:26,
                 from /usr/include/glib-2.0/gobject/gbinding.h:31,
                 from /usr/include/glib-2.0/glib-object.h:24,
                 from /usr/include/glib-2.0/gio/gioenums.h:30,
                 from /usr/include/glib-2.0/gio/giotypes.h:30,
                 from /usr/include/glib-2.0/gio/gio.h:28,
                 from /usr/include/gtk-2.0/gdk/gdkapplaunchcontext.h:30,
                 from /usr/include/gtk-2.0/gdk/gdk.h:32,
                 from /usr/include/gtk-2.0/gtk/gtk.h:32:
/usr/include/glib-2.0/gobject/gtype.h:725:1: note: declared here
  725 | {
      | ^
In file included from /usr/include/gtk-2.0/gtk/gtktoolitem.h:31,
                 from /usr/include/gtk-2.0/gtk/gtktoolbutton.h:30,
                 from /usr/include/gtk-2.0/gtk/gtkmenutoolbutton.h:30,
                 from /usr/include/gtk-2.0/gtk/gtk.h:126:
/usr/include/gtk-2.0/gtk/gtktooltips.h:73:3: warning: 'GTimeVal' is deprecated: Use 'GDateTime' instead [-Wdeprecated-declarations]
   73 |   GTimeVal last_popdown;
      |   ^~~~~~~~
In file included from /usr/include/glib-2.0/glib/galloca.h:34,
                 from /usr/include/glib-2.0/glib.h:32,
                 from /usr/include/glib-2.0/gobject/gbinding.h:30:
/usr/include/glib-2.0/glib/gtypes.h:580:8: note: declared here
  580 | struct _GTimeVal
      |        ^~~~~~~~~
In file included from /usr/include/libgnome-2.0/libgnome/libgnome.h:29,
                 from /usr/include/libgnomeui-2.0/gnome.h:5:
/usr/include/libgnome-2.0/libgnome/gnome-program.h:246:28: warning: 'GParameter' is deprecated [-Wdeprecated-declarations]
  246 |                            guint nparams, GParameter *params);
      |                            ^~~~~
In file included from /usr/include/glib-2.0/gobject/gobject.h:28:
/usr/include/glib-2.0/gobject/gparam.h:278:8: note: declared here
  278 | struct _GParameter /* auxiliary structure for _setv() variants */
      |        ^~~~~~~~~~~
make[2]: Leaving directory '/usr/src/RPM/BUILD/gdado-2.2/src'
make[2]: Entering directory '/usr/src/RPM/BUILD/gdado-2.2/src'
x86_64-alt-linux-gcc -DHAVE_CONFIG_H -I. -I. -I.. -DPACKAGE_DATA_DIR=\""/usr/share"\" 	-DPACKAGE_LOCALE_DIR=\""/usr/share/locale"\" 	-DORBIT2=1 -pthread -I/usr/include/libgnomeui-2.0 -I/usr/include/libbonoboui-2.0 -I/usr/include/libgnome-2.0 -I/usr/include/libbonobo-2.0 -I/usr/include/bonobo-activation-2.0 -I/usr/include/orbit-2.0 -I/usr/include/libgnomecanvas-2.0 -I/usr/include/libart-2.0 -I/usr/include/gtk-2.0 -I/usr/lib64/gtk-2.0/include -I/usr/include/pango-1.0 -I/usr/include/atk-1.0 -I/usr/include/pango-1.0 -I/usr/include/harfbuzz -I/usr/include/pango-1.0 -I/usr/include/cairo -I/usr/include/freetype2 -I/usr/include/harfbuzz -I/usr/include/gdk-pixbuf-2.0 -I/usr/include/libpng16 -I/usr/include/gnome-vfs-2.0 -I/usr/lib64/gnome-vfs-2.0/include -I/usr/include/gconf/2 -I/usr/include/glib-2.0 -I/usr/lib64/glib-2.0/include    -pipe -frecord-gcc-switches -Wall -g -O2 -flto=auto -c interface.c
In file included from /usr/include/gtk-2.0/gtk/gtkobject.h:37,
                 from /usr/include/gtk-2.0/gtk/gtkwidget.h:36,
                 from /usr/include/gtk-2.0/gtk/gtkcontainer.h:35,
                 from /usr/include/gtk-2.0/gtk/gtkbin.h:35,
                 from /usr/include/gtk-2.0/gtk/gtkwindow.h:36,
                 from /usr/include/gtk-2.0/gtk/gtkdialog.h:35,
                 from /usr/include/gtk-2.0/gtk/gtkaboutdialog.h:32,
                 from /usr/include/gtk-2.0/gtk/gtk.h:33,
                 from /usr/include/libbonoboui-2.0/bonobo/bonobo-widget.h:15,
                 from /usr/include/libbonoboui-2.0/libbonoboui.h:18,
                 from /usr/include/libbonoboui-2.0/bonobo.h:14,
                 from interface.c:15:
/usr/include/gtk-2.0/gtk/gtktypeutils.h:236:1: warning: 'GTypeDebugFlags' is deprecated [-Wdeprecated-declarations]
  236 | void            gtk_type_init   (GTypeDebugFlags    debug_flags);
      | ^~~~
In file included from /usr/include/glib-2.0/gobject/gobject.h:26,
                 from /usr/include/glib-2.0/gobject/gbinding.h:31,
                 from /usr/include/glib-2.0/glib-object.h:24,
                 from /usr/include/libbonobo-2.0/bonobo/bonobo-types.h:15,
                 from /usr/include/libbonobo-2.0/libbonobo.h:18,
                 from /usr/include/libbonoboui-2.0/libbonoboui.h:14:
/usr/include/glib-2.0/gobject/gtype.h:725:1: note: declared here
  725 | {
      | ^
In file included from /usr/include/gtk-2.0/gtk/gtktoolitem.h:31,
                 from /usr/include/gtk-2.0/gtk/gtktoolbutton.h:30,
                 from /usr/include/gtk-2.0/gtk/gtkmenutoolbutton.h:30,
                 from /usr/include/gtk-2.0/gtk/gtk.h:126:
/usr/include/gtk-2.0/gtk/gtktooltips.h:73:3: warning: 'GTimeVal' is deprecated: Use 'GDateTime' instead [-Wdeprecated-declarations]
   73 |   GTimeVal last_popdown;
      |   ^~~~~~~~
In file included from /usr/include/glib-2.0/glib/galloca.h:34,
                 from /usr/include/glib-2.0/glib.h:32,
                 from /usr/include/libbonobo-2.0/bonobo/bonobo-macros.h:12,
                 from /usr/include/libbonobo-2.0/libbonobo.h:14:
/usr/include/glib-2.0/glib/gtypes.h:580:8: note: declared here
  580 | struct _GTimeVal
      |        ^~~~~~~~~
In file included from /usr/include/libbonoboui-2.0/bonobo/bonobo-ui-main.h:17,
                 from /usr/include/libbonoboui-2.0/libbonoboui.h:24:
/usr/include/libgnome-2.0/libgnome/gnome-program.h:246:28: warning: 'GParameter' is deprecated [-Wdeprecated-declarations]
  246 |                            guint nparams, GParameter *params);
      |                            ^~~~~
In file included from /usr/include/glib-2.0/gobject/gobject.h:28:
/usr/include/glib-2.0/gobject/gparam.h:278:8: note: declared here
  278 | struct _GParameter /* auxiliary structure for _setv() variants */
      |        ^~~~~~~~~~~
interface.c: In function 'create_window_gdado':
interface.c:194:7: warning: 'gdk_pixbuf_unref' is deprecated: Use 'g_object_unref' instead [-Wdeprecated-declarations]
  194 |       gdk_pixbuf_unref (window_gdado_icon_pixbuf);
      |       ^~~~~~~~~~~~~~~~
In file included from /usr/include/gdk-pixbuf-2.0/gdk-pixbuf/gdk-pixbuf.h:34,
                 from /usr/include/gtk-2.0/gdk/gdkpixbuf.h:37,
                 from /usr/include/gtk-2.0/gdk/gdkcairo.h:28,
                 from /usr/include/gtk-2.0/gdk/gdk.h:33,
                 from /usr/include/gtk-2.0/gtk/gtk.h:32:
/usr/include/gdk-pixbuf-2.0/gdk-pixbuf/gdk-pixbuf-core.h:168:12: note: declared here
  168 | void       gdk_pixbuf_unref    (GdkPixbuf *pixbuf);
      |            ^~~~~~~~~~~~~~~~
interface.c: In function 'create_about1':
interface.c:388:7: warning: 'gdk_pixbuf_unref' is deprecated: Use 'g_object_unref' instead [-Wdeprecated-declarations]
  388 |       gdk_pixbuf_unref (about1_icon_pixbuf);
      |       ^~~~~~~~~~~~~~~~
/usr/include/gdk-pixbuf-2.0/gdk-pixbuf/gdk-pixbuf-core.h:168:12: note: declared here
  168 | void       gdk_pixbuf_unref    (GdkPixbuf *pixbuf);
      |            ^~~~~~~~~~~~~~~~
make[2]: Leaving directory '/usr/src/RPM/BUILD/gdado-2.2/src'
make[1]: *** [Makefile:187: all-recursive] Error 1
make: *** [Makefile:337: all-recursive-am] Error 2
error: Bad exit status from /usr/src/tmp/rpm-tmp.21285 (%build)


RPM build errors:
    Bad exit status from /usr/src/tmp/rpm-tmp.21285 (%build)
Command exited with non-zero status 1
3.36user 2.60system 0:08.19elapsed 72%CPU (0avgtext+0avgdata 110320maxresident)k
0inputs+0outputs (0major+370266minor)pagefaults 0swaps
hsh-rebuild: rebuild of `gdado-2.2-alt6.src.rpm' failed.
Command exited with non-zero status 1
6.76user 5.75system 0:44.11elapsed 28%CPU (0avgtext+0avgdata 138668maxresident)k
14264inputs+0outputs (0major+252103minor)pagefaults 0swaps