<86>Jun 14 04:13:21 userdel[91050]: delete user 'rooter'
<86>Jun 14 04:13:21 userdel[91050]: removed group 'rooter' owned by 'rooter'
<86>Jun 14 04:13:21 userdel[91050]: removed shadow group 'rooter' owned by 'rooter'
<86>Jun 14 04:13:21 groupadd[91092]: group added to /etc/group: name=rooter, GID=1805
<86>Jun 14 04:13:21 groupadd[91092]: group added to /etc/gshadow: name=rooter
<86>Jun 14 04:13:21 groupadd[91092]: new group: name=rooter, GID=1805
<86>Jun 14 04:13:21 useradd[91131]: new user: name=rooter, UID=1805, GID=1805, home=/root, shell=/bin/bash, from=none
<86>Jun 14 04:13:21 userdel[91179]: delete user 'builder'
<86>Jun 14 04:13:21 userdel[91179]: removed group 'builder' owned by 'builder'
<86>Jun 14 04:13:21 userdel[91179]: removed shadow group 'builder' owned by 'builder'
<86>Jun 14 04:13:21 groupadd[91223]: group added to /etc/group: name=builder, GID=1806
<86>Jun 14 04:13:21 groupadd[91223]: group added to /etc/gshadow: name=builder
<86>Jun 14 04:13:21 groupadd[91223]: new group: name=builder, GID=1806
<86>Jun 14 04:13:21 useradd[91259]: new user: name=builder, UID=1806, GID=1806, home=/usr/src, shell=/bin/bash, from=none
<13>Jun 14 04:13:25 rpmi: rpm-macros-java-1:6.0.0-alt2_7jpp11 sisyphus+318644.100.1.1 1681742255 installed
<13>Jun 14 04:13:25 rpmi: rpm-macros-cmake-3.29.1-alt1 sisyphus+344518.300.3.1 1712379787 installed
<13>Jun 14 04:13:31 rpmi: javapackages-filesystem-1:6.0.0-alt2_7jpp11 sisyphus+318644.100.1.1 1681742255 installed
<13>Jun 14 04:13:31 rpmi: libnspr-1:4.35-alt1 sisyphus+308164.100.1.1 1665397040 installed
<13>Jun 14 04:13:31 rpmi: libexpat-2.5.0-alt1 sisyphus+346180.200.2.1 1716349835 installed
<13>Jun 14 04:13:31 rpmi: libidn2-2.3.7-alt1 sisyphus+339505.100.1.2 1706718968 installed
<13>Jun 14 04:13:31 rpmi: libnettle8-3.9.1-alt1 sisyphus+322548.100.1.2 1686176879 installed
<13>Jun 14 04:13:31 rpmi: javapackages-tools-1:6.0.0-alt2_7jpp11 sisyphus+318644.100.1.1 1681742255 installed
<13>Jun 14 04:13:31 rpmi: libpng16-1.6.42-alt2 sisyphus+339555.100.1.1 1706781682 installed
<13>Jun 14 04:13:31 rpmi: libuv-1.48.0-alt1 sisyphus+340945.100.1.1 1708265066 installed
<13>Jun 14 04:13:31 rpmi: libjsoncpp24-1.9.4-alt2 sisyphus+346331.200.2.1 1716448551 installed
<13>Jun 14 04:13:31 rpmi: libp11-kit-1:0.25.3-alt2 sisyphus+336533.100.1.1 1702645560 installed
<13>Jun 14 04:13:31 rpmi: libtasn1-4.19.0-alt3 sisyphus+327816.100.1.1 1692802615 installed
<13>Jun 14 04:13:31 rpmi: java-common-1.7.0-alt1 sisyphus+333533.100.1.1 1699037019 installed
<13>Jun 14 04:13:31 rpmi: libhogweed6-3.9.1-alt1 sisyphus+322548.100.1.2 1686176879 installed
<13>Jun 14 04:13:31 rpmi: libgnutls30-3.8.4-alt1 sisyphus+343729.100.2.1 1711571288 installed
<13>Jun 14 04:13:31 rpmi: libngtcp2.16-1.5.0-alt1 sisyphus+347555.200.1.1 1716185826 installed
<13>Jun 14 04:13:31 rpmi: libngtcp2_crypto_gnutls8-1.5.0-alt1 sisyphus+347555.200.1.1 1716185826 installed
<13>Jun 14 04:13:31 rpmi: libnspr-devel-1:4.35-alt1 sisyphus+308164.100.1.1 1665397040 installed
<13>Jun 14 04:13:31 rpmi: hamcrest-0:2.2-alt1_5jpp11 sisyphus+301728.200.1.1 1654860789 installed
<13>Jun 14 04:13:31 rpmi: slf4j-0:1.7.32-alt1_3jpp11 sisyphus+303823.100.1.1 1657996897 installed
<13>Jun 14 04:13:31 rpmi: libxslt-1.1.39-alt1 sisyphus+349406.100.1.1 1716751806 installed
<13>Jun 14 04:13:31 rpmi: libsqlite3-3.44.2-alt1 sisyphus+335409.100.3.3 1701347810 installed
<13>Jun 14 04:13:31 rpmi: libnatspec-0.3.3-alt1 sisyphus+327088.100.1.1 1691839874 installed
<13>Jun 14 04:13:31 rpmi: libmpdec3-2.5.1-alt3 sisyphus+314490.500.5.1 1675432004 installed
<13>Jun 14 04:13:31 rpmi: libgdbm-1.8.3-alt10 sisyphus+346222.200.3.2 1716468404 installed
<13>Jun 14 04:13:31 rpmi: libb2-0.98.1-alt1_1 sisyphus+291614.100.1.1 1638962877 installed
<13>Jun 14 04:13:31 rpmi: liblcms2-2.16-alt1 sisyphus+335676.100.1.1 1701682597 installed
<13>Jun 14 04:13:31 rpmi: libjpeg-2:3.0.2-alt2.1 sisyphus+340135.100.1.1 1707449145 installed
<13>Jun 14 04:13:31 rpmi: libgraphite2-1.3.14-alt2.1 sisyphus+279571.100.1.2 1626605111 installed
<13>Jun 14 04:13:31 rpmi: javazi-2024a-alt1 sisyphus+344801.200.1.1 1712691734 installed
<13>Jun 14 04:13:31 rpmi: libgif-4.1.6-alt3 sisyphus+276911.100.1.3 1625273979 installed
<13>Jun 14 04:13:31 rpmi: libX11-locales-3:1.8.8-alt1 sisyphus+343583.100.1.1 1711440719 installed
<13>Jun 14 04:13:31 rpmi: libXdmcp-1.1.5-alt1 sisyphus+343583.700.1.1 1711441061 installed
<13>Jun 14 04:13:31 rpmi: libXau-1.0.11-alt1 sisyphus+311428.100.1.1 1670577439 installed
<13>Jun 14 04:13:31 rpmi: libxcb-1.17.0-alt1 sisyphus+345308.200.1.1 1713342004 installed
<13>Jun 14 04:13:31 rpmi: libX11-3:1.8.8-alt1 sisyphus+343583.100.1.1 1711440719 installed
<13>Jun 14 04:13:31 rpmi: libXext-1.3.6-alt1 sisyphus+343583.1000.1.1 1711441101 installed
<13>Jun 14 04:13:31 rpmi: libXi-1.8-alt1 sisyphus+285490.200.1.1 1632124174 installed
<13>Jun 14 04:13:31 rpmi: libXtst-1.2.4-alt1 sisyphus+308663.1300.1.1 1666168495 installed
<13>Jun 14 04:13:31 rpmi: libXrender-0.9.11-alt1 sisyphus+308841.100.1.1 1666436130 installed
<13>Jun 14 04:13:31 rpmi: gcc-c++-common-1.4.28-alt1 sisyphus+348678.100.1.1 1716396142 installed
<13>Jun 14 04:13:31 rpmi: libstdc++13-devel-13.2.1-alt3 sisyphus+339335.100.1.1 1706563486 installed
<13>Jun 14 04:13:32 rpmi: gcc13-c++-13.2.1-alt3 sisyphus+339335.100.1.1 1706563486 installed
<13>Jun 14 04:13:32 rpmi: cmake-modules-3.29.3-alt1 sisyphus+348648.100.2.1 1716590540 installed
<13>Jun 14 04:13:32 rpmi: librhash-1.3.5-alt3 sisyphus+286141.40.2.1 1632982456 installed
<13>Jun 14 04:13:32 rpmi: publicsuffix-list-dafsa-20240415-alt1 sisyphus+345249.100.1.1 1713270235 installed
<13>Jun 14 04:13:32 rpmi: libpsl-0.21.5-alt1 sisyphus+338474.100.1.1 1705684769 installed
<13>Jun 14 04:13:32 rpmi: libnghttp3.9-1.3.0-alt1 sisyphus+347555.300.1.1 1716185868 installed
<13>Jun 14 04:13:32 rpmi: libnghttp2-1.62.1-alt1 sisyphus+347555.100.1.1 1716185760 installed
<13>Jun 14 04:13:32 rpmi: openldap-common-2.6.7-alt2 sisyphus+347731.100.1.1 1715194911 installed
<13>Jun 14 04:13:32 rpmi: libntlm-1.5-alt1 sisyphus+278100.3300.1.1 1626058899 installed
<13>Jun 14 04:13:32 rpmi: libidn-1.37-alt2 sisyphus+300849.100.1.1 1653769687 installed
<13>Jun 14 04:13:32 rpmi: libverto-0.3.2-alt1_1 sisyphus+321176.2200.10.2 1684803947 installed
<13>Jun 14 04:13:32 rpmi: liblmdb-0.9.32-alt1 sisyphus+342426.100.1.1 1710124288 installed
<13>Jun 14 04:13:32 rpmi: libkeyutils-1.6.3-alt1 sisyphus+346336.200.2.2 1716472658 installed
<13>Jun 14 04:13:32 rpmi: libcom_err-1.46.4.0.5.4cda-alt1 sisyphus+283826.100.1.1 1629975345 installed
<13>Jun 14 04:13:32 rpmi: libbrotlicommon-1.1.0-alt1 sisyphus+328501.100.1.1 1693598419 installed
<13>Jun 14 04:13:32 rpmi: libbrotlidec-1.1.0-alt1 sisyphus+328501.100.1.1 1693598419 installed
<13>Jun 14 04:13:32 rpmi: libharfbuzz-8.5.0-alt1 sisyphus+348492.100.1.2 1716199293 installed
<13>Jun 14 04:13:32 rpmi: libfreetype-2.13.2-alt1 sisyphus+328677.100.1.1 1693834345 installed
<13>Jun 14 04:13:32 rpmi: rpm-macros-alternatives-0.5.2-alt2 sisyphus+315270.200.2.1 1676457367 installed
<13>Jun 14 04:13:32 rpmi: alternatives-0.5.2-alt2 sisyphus+315270.200.2.1 1676457367 installed
<13>Jun 14 04:13:32 rpmi: libnss-3.101-alt1 sisyphus+350631.100.1.1 1717838087 installed
<13>Jun 14 04:13:32 rpmi: ca-certificates-2024.06.08-alt1 sisyphus+350631.200.1.1 1717838162 installed
<13>Jun 14 04:13:32 rpmi: ca-trust-0.2.0-alt1 sisyphus+344843.100.1.1 1712743326 installed
<13>Jun 14 04:13:32 rpmi: p11-kit-trust-1:0.25.3-alt2 sisyphus+336533.100.1.1 1702645560 installed
<13>Jun 14 04:13:32 rpmi: libcrypto3-3.1.6-alt1 sisyphus+350419.100.1.1 1717605656 installed
<13>Jun 14 04:13:32 rpmi: libssl3-3.1.6-alt1 sisyphus+350419.100.1.1 1717605656 installed
<13>Jun 14 04:13:32 rpmi: python3-3.12.2-alt1 sisyphus+341702.200.1.1 1709232871 installed
<13>Jun 14 04:13:33 rpmi: python3-base-3.12.2-alt1 sisyphus+341702.200.1.1 1709232871 installed
<86>Jun 14 04:13:33 groupadd[114196]: group added to /etc/group: name=_keytab, GID=999
<86>Jun 14 04:13:33 groupadd[114196]: group added to /etc/gshadow: name=_keytab
<86>Jun 14 04:13:33 groupadd[114196]: new group: name=_keytab, GID=999
<13>Jun 14 04:13:33 rpmi: libkrb5-1.21.2-alt2 sisyphus+338902.100.2.1 1706700934 installed
<13>Jun 14 04:13:33 rpmi: python3-module-six-1.16.0-alt2 sisyphus+324249.100.1.1 1688484676 installed
<13>Jun 14 04:13:33 rpmi: python3-module-genshi-0.7.7-alt1 sisyphus+333513.13000.71.1 1704540725 installed
<13>Jun 14 04:13:33 rpmi: libgsasl-2.2.0-alt1 sisyphus+333173.100.1.1 1698696954 installed
<86>Jun 14 04:13:33 groupadd[114294]: group added to /etc/group: name=sasl, GID=998
<86>Jun 14 04:13:33 groupadd[114294]: group added to /etc/gshadow: name=sasl
<86>Jun 14 04:13:33 groupadd[114294]: new group: name=sasl, GID=998
<13>Jun 14 04:13:33 rpmi: libsasl2-3-2.1.28-alt2 sisyphus+343335.100.1.1 1711112544 installed
<13>Jun 14 04:13:33 rpmi: libldap2-2.6.7-alt2 sisyphus+347731.100.1.1 1715194911 installed
<13>Jun 14 04:13:33 rpmi: python3-module-cssselect-1.2.0-alt1 sisyphus+317931.100.1.1 1680503903 installed
<13>Jun 14 04:13:33 rpmi: python3-module-webencodings-0.5.1-alt2 sisyphus+276020.100.1.1 1624812421 installed
<13>Jun 14 04:13:33 rpmi: python3-module-lxml-5.2.2-alt1 sisyphus+348063.100.1.1 1715701120 installed
<13>Jun 14 04:13:33 rpmi: python3-module-html5lib-1:1.1-alt1 sisyphus+278096.120.5.1 1626086978 installed
<13>Jun 14 04:13:33 rpmi: python3-module-javapackages-1:6.0.0-alt2_7jpp11 sisyphus+318644.100.1.1 1681742255 installed
<13>Jun 14 04:13:33 rpmi: rpm-build-java-1:6.0.0-alt2_7jpp11 sisyphus+318644.100.1.1 1681742255 installed
<13>Jun 14 04:13:33 rpmi: libarchive13-3.6.1-alt2 sisyphus+324359.1300.6.1 1689326379 installed
<13>Jun 14 04:13:33 rpmi: libssh2-1.11.0-alt2 sisyphus+339356.100.1.1 1706593137 installed
<13>Jun 14 04:13:33 rpmi: libcurl-8.7.1-alt2 sisyphus+345773.100.1.1 1713974723 installed
<13>Jun 14 04:13:34 rpmi: cmake-3.29.3-alt1 sisyphus+348648.100.2.1 1716590540 installed
<13>Jun 14 04:13:34 rpmi: ca-trust-java-0.2.0-alt1 sisyphus+344843.100.1.1 1712743326 installed
<13>Jun 14 04:13:34 rpmi: java-stub-javadoc-0.1-alt1 sisyphus+276859.100.1.1 1625245070 installed
<13>Jun 14 04:13:34 rpmi: alsa-ucm-conf-1.2.10-alt2 sisyphus+337619.100.1.1 1704220124 installed
<13>Jun 14 04:13:34 rpmi: alsa-topology-conf-1.2.5.1-alt1 sisyphus+274777.100.1.1 1624089141 installed
<13>Jun 14 04:13:34 rpmi: libalsa-1:1.2.10-alt2 sisyphus+337619.200.1.1 1704220185 installed
<13>Jun 14 04:13:36 rpmi: java-21-openjdk-headless-0:21.0.2.0.13-alt2 sisyphus+339996.100.1.1 1707300603 installed
<13>Jun 14 04:13:36 rpmi: java-21-openjdk-0:21.0.2.0.13-alt2 sisyphus+339996.100.1.1 1707300603 installed
<13>Jun 14 04:13:36 rpmi: java-21-openjdk-devel-0:21.0.2.0.13-alt2 sisyphus+339996.100.1.1 1707300603 installed
<13>Jun 14 04:13:36 rpmi: jpackage-generic-compat-0.43-alt1 sisyphus+338091.100.1.2 1705652445 installed
<13>Jun 14 04:13:36 rpmi: ctest-3.29.3-alt1 sisyphus+348648.100.2.1 1716590540 installed
<13>Jun 14 04:13:36 rpmi: libnss-devel-3.101-alt1 sisyphus+350631.100.1.1 1717838087 installed
<13>Jun 14 04:13:36 rpmi: nss-utils-3.101-alt1 sisyphus+350631.100.1.1 1717838087 installed
<13>Jun 14 04:13:36 rpmi: gcc-c++-13-alt1 sisyphus+323337.300.1.1 1687267966 installed
<13>Jun 14 04:13:36 rpmi: unzip-6.0-alt5 sisyphus+308257.100.1.1 1665550038 installed
<13>Jun 14 04:13:36 rpmi: slf4j-jdk14-0:1.7.32-alt1_3jpp11 sisyphus+303823.100.1.1 1657996897 installed
<13>Jun 14 04:13:36 rpmi: junit-1:4.13.1-alt1_7jpp11 sisyphus+303013.100.1.2 1656753167 installed
<13>Jun 14 04:13:37 rpmi: apache-commons-lang3-3.12.0-alt2_7jpp11 sisyphus+332658.100.1.1 1698216832 installed
<13>Jun 14 04:13:37 rpmi: jaxb-api-2.3.3-alt1_3jpp11 sisyphus+273703.100.1.1 1622904245 installed
<13>Jun 14 04:13:37 rpmi: zip-30000000:3.0-alt3 sisyphus+279370.100.1.1 1626479197 installed
Building target platforms: x86_64
Building for target x86_64
Wrote: /usr/src/in/nosrpm/jss-5.4.2-alt2.nosrc.rpm (w1.gzdio)
Installing jss-5.4.2-alt2.src.rpm
Building target platforms: x86_64
Building for target x86_64
Executing(%prep): /bin/sh -e /usr/src/tmp/rpm-tmp.59987
+ umask 022
+ /bin/mkdir -p /usr/src/RPM/BUILD
+ cd /usr/src/RPM/BUILD
+ cd /usr/src/RPM/BUILD
+ rm -rf jss-5.4.2
+ echo 'Source #0 (jss-5.4.2.tar):'
Source #0 (jss-5.4.2.tar):
+ /bin/tar -xf /usr/src/RPM/SOURCES/jss-5.4.2.tar
+ cd jss-5.4.2
+ /bin/chmod -c -Rf u+rwX,go-w .
+ echo 'Patch #0 (jss-5.4.2-alt.patch):'
Patch #0 (jss-5.4.2-alt.patch):
+ /usr/bin/patch -p1
patching file native/src/main/native/org/mozilla/jss/ssl/SSLCipher.c
+ exit 0
Executing(%build): /bin/sh -e /usr/src/tmp/rpm-tmp.59987
+ umask 022
+ /bin/mkdir -p /usr/src/RPM/BUILD
+ cd /usr/src/RPM/BUILD
+ cd jss-5.4.2
+ export BUILD_OPT=1
+ BUILD_OPT=1
+ mkdir -p x86_64-alt-linux
+ cmake -DCMAKE_SKIP_INSTALL_RPATH:BOOL=yes '-DCMAKE_C_FLAGS:STRING=-pipe -frecord-gcc-switches -Wall -g -O2 -flto=auto' '-DCMAKE_CXX_FLAGS:STRING=-pipe -frecord-gcc-switches -Wall -g -O2 -flto=auto' '-DCMAKE_Fortran_FLAGS:STRING=-pipe -frecord-gcc-switches -Wall -g -O2 -flto=auto' -DCMAKE_INSTALL_PREFIX=/usr -DINCLUDE_INSTALL_DIR:PATH=/usr/include -DLIB_INSTALL_DIR:PATH=/usr/lib64 -DSYSCONF_INSTALL_DIR:PATH=/etc -DSHARE_INSTALL_PREFIX:PATH=/usr/share -DLIB_DESTINATION=lib64 -DLIB_SUFFIX=64 -S . -B x86_64-alt-linux -DJAVA_HOME=/usr/lib/jvm/jre -DVERSION=5.4.2 -DJNI_DIR=/usr/lib/java -DLIB_DIR=/usr/lib64 -DWITH_JAVADOC=FALSE ..
CMake Warning:
  Ignoring extra path from command line:

   ".."


CMake Warning (dev) at CMakeLists.txt:2 (project):
  cmake_minimum_required() should be called prior to this top-level project()
  call.  Please see the cmake-commands(7) manual for usage documentation of
  both commands.
This warning is for project developers.  Use -Wno-dev to suppress it.

-- The C compiler identification is GNU 13.2.1
-- The CXX compiler identification is GNU 13.2.1
-- Detecting C compiler ABI info
-- Detecting C compiler ABI info - done
-- Check for working C compiler: /usr/bin/cc - skipped
-- Detecting C compile features
-- Detecting C compile features - done
-- Detecting CXX compiler ABI info
-- Detecting CXX compiler ABI info - done
-- Check for working CXX compiler: /usr/bin/c++ - skipped
-- Detecting CXX compile features
-- Detecting CXX compile features - done
-- Found PkgConfig: /usr/bin/pkg-config (found version "0.29.2")
-- Checking for module 'nspr'
--   Found nspr, version 4.35.0
-- Found NSPR: /usr/lib64
-- Checking for module 'nss'
--   Found nss, version 3.101
-- Found NSS: /usr/lib64
-- Found Java: /usr/lib/jvm/jre/bin/java (found version "21.0.2")
-- Found JNI: /usr/lib/jvm/jre/include  found components: AWT JVM
-- Performing Test HAVE_C_FLAG
-- Performing Test HAVE_C_FLAG - Success
-- JSS C FLAGS: -flto=auto;-O2;-g;-Wall;-frecord-gcc-switches;-pipe;-O2;-Wall;-std=gnu99;-Wno-cast-function-type;-Wno-unused-parameter;-Wno-unknown-warning-option;-Wno-unused-but-set-variable;-Werror-implicit-function-declaration;-Wno-switch;-I/usr/src/RPM/BUILD/jss-5.4.2/x86_64-alt-linux/include/jss;-I/usr/lib/jvm/jre/include;-I/usr/lib/jvm/jre/include/linux;-I/usr/lib/jvm/jre/include;-I/usr/include/nspr;-I/usr/include/nss;-L/usr/lib64;-L/usr/lib64
-- JSS LD FLAGS: -lsmime3;-lssl3;-lnss3;-lnssutil3;-lplc4;-lplds4;-lnspr4;-lpthread;-ldl
-- JSS LIBRARY FLAGS: -shared;-Wl,-z,defs;-Wl,-soname;-Wl,libjss.so
-- javac classpath: /usr/share/java/slf4j/api.jar:/usr/share/java/apache-commons-lang3.jar
-- tests classpath: /usr/src/RPM/BUILD/jss-5.4.2/x86_64-alt-linux/jss.jar:/usr/src/RPM/BUILD/jss-5.4.2/x86_64-alt-linux/tests-jss.jar:/usr/share/java/slf4j/api.jar:/usr/share/java/apache-commons-lang3.jar:/usr/share/java/slf4j/jdk14.jar:/usr/share/java/junit.jar:/usr/share/java/hamcrest/hamcrest.jar
-- JSS JAVAC FLAGS: -classpath;/usr/share/java/slf4j/api.jar:/usr/share/java/apache-commons-lang3.jar;-sourcepath;/usr/src/RPM/BUILD/jss-5.4.2/base/src/main/java;-target;17;-source;17;-O
-- JSS TEST JAVAC FLAGS: -classpath;/usr/share/java/slf4j/api.jar:/usr/share/java/apache-commons-lang3.jar:/usr/share/java/junit.jar:/usr/src/RPM/BUILD/jss-5.4.2/x86_64-alt-linux/classes/jss;-sourcepath;/usr/src/RPM/BUILD/jss-5.4.2/base/src/main/java:/usr/src/RPM/BUILD/jss-5.4.2/base/src/test/java;-target;17;-source;17;-O
-- Looking for CKM_AES_CMAC
-- Looking for CKM_AES_CMAC - found
-- Looking for CKM_SP800_108_COUNTER_KDF
-- Looking for CKM_SP800_108_COUNTER_KDF - found
CMake Warning at cmake/JSSConfig.cmake:406 (message):
  Assuming OAEP support.
Call Stack (most recent call first):
  cmake/JSSConfig.cmake:22 (jss_config_symbols)
  CMakeLists.txt:83 (jss_config)


-- Performing Test HAVE_NSS_CIPHER_SUITE_INFO_KDFHASH
-- Performing Test HAVE_NSS_CIPHER_SUITE_INFO_KDFHASH - Success
-- Performing Test HAVE_NSS_CHANNEL_INFO_ORIGINAL_KEA_GROUP
-- Performing Test HAVE_NSS_CHANNEL_INFO_ORIGINAL_KEA_GROUP - Success
-- Performing Test HAVE_NSS_CHANNEL_INFO_PEER_DELEG_CRED
-- Performing Test HAVE_NSS_CHANNEL_INFO_PEER_DELEG_CRED - Success
-- Performing Test HAVE_NSS_PRELIMINARY_CHANNEL_INFO_ZERO_RTT_CIPHER_SUITE
-- Performing Test HAVE_NSS_PRELIMINARY_CHANNEL_INFO_ZERO_RTT_CIPHER_SUITE - Success
-- Performing Test HAVE_NSS_PRELIMINARY_CHANNEL_INFO_PEER_DELEG_CRED
-- Performing Test HAVE_NSS_PRELIMINARY_CHANNEL_INFO_PEER_DELEG_CRED - Success
-- Configuring done (2.2s)
-- Generating done (0.0s)
CMake Warning:
  Manually-specified variables were not used by the project:

    CMAKE_Fortran_FLAGS
    CMAKE_SKIP_INSTALL_RPATH
    INCLUDE_INSTALL_DIR
    LIB_DESTINATION
    LIB_INSTALL_DIR
    LIB_SUFFIX
    SHARE_INSTALL_PREFIX
    SYSCONF_INSTALL_DIR
    VERSION


-- Build files have been written to: /usr/src/RPM/BUILD/jss-5.4.2/x86_64-alt-linux
+ cmake --build x86_64-alt-linux --verbose --parallel 16 --target all
Change Dir: '/usr/src/RPM/BUILD/jss-5.4.2/x86_64-alt-linux'

Run Build Command(s): /usr/bin/cmake -E env VERBOSE=1 /usr/bin/gmake -f Makefile -j16 all
gmake: Entering directory '/usr/src/RPM/BUILD/jss-5.4.2/x86_64-alt-linux'
/usr/bin/cmake -S/usr/src/RPM/BUILD/jss-5.4.2 -B/usr/src/RPM/BUILD/jss-5.4.2/x86_64-alt-linux --check-build-system CMakeFiles/Makefile.cmake 0
gmake: Leaving directory '/usr/src/RPM/BUILD/jss-5.4.2/x86_64-alt-linux'
gmake: Entering directory '/usr/src/RPM/BUILD/jss-5.4.2/x86_64-alt-linux'
/usr/bin/cmake -E cmake_progress_start /usr/src/RPM/BUILD/jss-5.4.2/x86_64-alt-linux/CMakeFiles /usr/src/RPM/BUILD/jss-5.4.2/x86_64-alt-linux//CMakeFiles/progress.marks
gmake: Leaving directory '/usr/src/RPM/BUILD/jss-5.4.2/x86_64-alt-linux'
/usr/bin/gmake  -f CMakeFiles/Makefile2 all
/usr/bin/gmake  -f CMakeFiles/generate_java.dir/build.make CMakeFiles/generate_java.dir/depend
/usr/bin/gmake  -f CMakeFiles/generate_includes.dir/build.make CMakeFiles/generate_includes.dir/depend
gmake[2]: Entering directory '/usr/src/RPM/BUILD/jss-5.4.2/x86_64-alt-linux'
cd /usr/src/RPM/BUILD/jss-5.4.2/x86_64-alt-linux && /usr/bin/cmake -E cmake_depends "Unix Makefiles" /usr/src/RPM/BUILD/jss-5.4.2 /usr/src/RPM/BUILD/jss-5.4.2 /usr/src/RPM/BUILD/jss-5.4.2/x86_64-alt-linux /usr/src/RPM/BUILD/jss-5.4.2/x86_64-alt-linux /usr/src/RPM/BUILD/jss-5.4.2/x86_64-alt-linux/CMakeFiles/generate_includes.dir/DependInfo.cmake "--color="
gmake[2]: Leaving directory '/usr/src/RPM/BUILD/jss-5.4.2/x86_64-alt-linux'
/usr/bin/gmake  -f CMakeFiles/generate_includes.dir/build.make CMakeFiles/generate_includes.dir/build
gmake[2]: Nothing to be done for 'CMakeFiles/generate_includes.dir/build'.
gmake[2]: Entering directory '/usr/src/RPM/BUILD/jss-5.4.2/x86_64-alt-linux'
cd /usr/src/RPM/BUILD/jss-5.4.2/x86_64-alt-linux && /usr/bin/cmake -E cmake_depends "Unix Makefiles" /usr/src/RPM/BUILD/jss-5.4.2 /usr/src/RPM/BUILD/jss-5.4.2 /usr/src/RPM/BUILD/jss-5.4.2/x86_64-alt-linux /usr/src/RPM/BUILD/jss-5.4.2/x86_64-alt-linux /usr/src/RPM/BUILD/jss-5.4.2/x86_64-alt-linux/CMakeFiles/generate_java.dir/DependInfo.cmake "--color="
gmake[2]: Leaving directory '/usr/src/RPM/BUILD/jss-5.4.2/x86_64-alt-linux'
/usr/bin/gmake  -f CMakeFiles/generate_java.dir/build.make CMakeFiles/generate_java.dir/build
gmake[1]: Entering directory '/usr/src/RPM/BUILD/jss-5.4.2/x86_64-alt-linux'
[  0%] Built target generate_includes
gmake[1]: Leaving directory '/usr/src/RPM/BUILD/jss-5.4.2/x86_64-alt-linux'
gmake[2]: Entering directory '/usr/src/RPM/BUILD/jss-5.4.2/x86_64-alt-linux'
[  1%] Generating .targets/finished_tests_generate_java
/usr/lib/jvm/jre/bin/javac -classpath /usr/share/java/slf4j/api.jar:/usr/share/java/apache-commons-lang3.jar:/usr/share/java/junit.jar:/usr/src/RPM/BUILD/jss-5.4.2/x86_64-alt-linux/classes/jss -sourcepath /usr/src/RPM/BUILD/jss-5.4.2/base/src/main/java:/usr/src/RPM/BUILD/jss-5.4.2/base/src/test/java -target 17 -source 17 -O -d /usr/src/RPM/BUILD/jss-5.4.2/x86_64-alt-linux/classes/tests -h /usr/src/RPM/BUILD/jss-5.4.2/x86_64-alt-linux/include/jss/_jni @/usr/src/RPM/BUILD/jss-5.4.2/x86_64-alt-linux/.targets/java-test.sources
warning: [options] system modules path not set in conjunction with -source 17
/usr/src/RPM/BUILD/jss-5.4.2/base/src/main/java/org/mozilla/jss/pkcs11/PK11Cert.java:566: warning: [removal] finalize() in Object has been deprecated and marked for removal
    public void finalize() throws Throwable {
                ^
/usr/src/RPM/BUILD/jss-5.4.2/base/src/main/java/org/mozilla/jss/pkcs11/PK11Key.java:66: warning: [removal] finalize() in Object has been deprecated and marked for removal
    public void finalize() throws Throwable {
                ^
/usr/src/RPM/BUILD/jss-5.4.2/base/src/main/java/org/mozilla/jss/pkcs11/KeyType.java:118: warning: [removal] RSASignatureWithSHA1Digest in SignatureAlgorithm has been deprecated and marked for removal
                    SignatureAlgorithm.RSASignatureWithSHA1Digest,
                                      ^
/usr/src/RPM/BUILD/jss-5.4.2/base/src/main/java/org/mozilla/jss/pkcs11/KeyType.java:137: warning: [removal] DSASignatureWithSHA1Digest in SignatureAlgorithm has been deprecated and marked for removal
                    SignatureAlgorithm.DSASignatureWithSHA1Digest
                                      ^
/usr/src/RPM/BUILD/jss-5.4.2/base/src/main/java/org/mozilla/jss/pkcs11/KeyType.java:147: warning: [removal] ECSignatureWithSHA1Digest in SignatureAlgorithm has been deprecated and marked for removal
                    SignatureAlgorithm.ECSignatureWithSHA1Digest,
                                      ^
/usr/src/RPM/BUILD/jss-5.4.2/base/src/main/java/org/mozilla/jss/pkcs11/KeyType.java:249: warning: [removal] SHA1 in HMACAlgorithm has been deprecated and marked for removal
                            HMACAlgorithm.SHA1
                                         ^
/usr/src/RPM/BUILD/jss-5.4.2/base/src/main/java/org/mozilla/jss/crypto/PKCS11Algorithm.java:20: warning: [removal] CKM_PBA_SHA1_WITH_SHA1_HMAC in Algorithm has been deprecated and marked for removal
    CKM_PBA_SHA1_WITH_SHA1_HMAC (Algorithm.CKM_PBA_SHA1_WITH_SHA1_HMAC, PKCS11Constants.CKM_PBA_SHA1_WITH_SHA1_HMAC),
                                          ^
/usr/src/RPM/BUILD/jss-5.4.2/base/src/main/java/org/mozilla/jss/crypto/PKCS11Algorithm.java:26: warning: [removal] CKM_SHA_1_HMAC in Algorithm has been deprecated and marked for removal
    CKM_SHA_1_HMAC (Algorithm.CKM_SHA_1_HMAC, PKCS11Constants.CKM_SHA_1_HMAC),
                             ^
/usr/src/RPM/BUILD/jss-5.4.2/base/src/main/java/org/mozilla/jss/crypto/PKCS11Algorithm.java:39: warning: [removal] SEC_OID_SHA1 in Algorithm has been deprecated and marked for removal
    CKM_SHA_1(Algorithm.SEC_OID_SHA1, PKCS11Constants.CKM_SHA_1),
                       ^
/usr/src/RPM/BUILD/jss-5.4.2/base/src/main/java/org/mozilla/jss/util/NativeProxy.java:138: warning: [removal] finalize() in Object has been deprecated and marked for removal
    protected void finalize() throws Throwable {
                   ^
/usr/src/RPM/BUILD/jss-5.4.2/base/src/main/java/org/mozilla/jss/crypto/SignatureAlgorithm.java:128: warning: [removal] SEC_OID_PKCS1_SHA1_WITH_RSA_ENCRYPTION in Algorithm has been deprecated and marked for removal
        new SignatureAlgorithm(SEC_OID_PKCS1_SHA1_WITH_RSA_ENCRYPTION,
                               ^
/usr/src/RPM/BUILD/jss-5.4.2/base/src/main/java/org/mozilla/jss/crypto/SignatureAlgorithm.java:129: warning: [removal] SHA1 in DigestAlgorithm has been deprecated and marked for removal
            "RSASignatureWithSHA1Digest", RSASignature, DigestAlgorithm.SHA1,
                                                                       ^
/usr/src/RPM/BUILD/jss-5.4.2/base/src/main/java/org/mozilla/jss/crypto/SignatureAlgorithm.java:136: warning: [removal] SEC_OID_ANSIX9_DSA_SIGNATURE_WITH_SHA1_DIGEST in Algorithm has been deprecated and marked for removal
        new SignatureAlgorithm(SEC_OID_ANSIX9_DSA_SIGNATURE_WITH_SHA1_DIGEST,
                               ^
/usr/src/RPM/BUILD/jss-5.4.2/base/src/main/java/org/mozilla/jss/crypto/SignatureAlgorithm.java:137: warning: [removal] SHA1 in DigestAlgorithm has been deprecated and marked for removal
            "DSASignatureWithSHA1Digest", DSASignature, DigestAlgorithm.SHA1,
                                                                       ^
/usr/src/RPM/BUILD/jss-5.4.2/base/src/main/java/org/mozilla/jss/crypto/SignatureAlgorithm.java:144: warning: [removal] SEC_OID_ANSIX962_ECDSA_SHA1_SIGNATURE in Algorithm has been deprecated and marked for removal
        new SignatureAlgorithm(SEC_OID_ANSIX962_ECDSA_SHA1_SIGNATURE,
                               ^
/usr/src/RPM/BUILD/jss-5.4.2/base/src/main/java/org/mozilla/jss/crypto/SignatureAlgorithm.java:145: warning: [removal] SHA1 in DigestAlgorithm has been deprecated and marked for removal
            "ECSignatureWithSHA1Digest", ECSignature, DigestAlgorithm.SHA1,
                                                                     ^
/usr/src/RPM/BUILD/jss-5.4.2/base/src/main/java/org/mozilla/jss/crypto/DigestAlgorithm.java:71: warning: [removal] SEC_OID_SHA1 in Algorithm has been deprecated and marked for removal
        (SEC_OID_SHA1, "SHA-1", OBJECT_IDENTIFIER.ALGORITHM.subBranch(26), 20);
         ^
/usr/src/RPM/BUILD/jss-5.4.2/base/src/main/java/org/mozilla/jss/crypto/KeyGenAlgorithm.java:124: warning: [removal] CKM_PBA_SHA1_WITH_SHA1_HMAC in Algorithm has been deprecated and marked for removal
            CKM_PBA_SHA1_WITH_SHA1_HMAC,
            ^
/usr/src/RPM/BUILD/jss-5.4.2/base/src/main/java/org/mozilla/jss/crypto/KeyGenAlgorithm.java:153: warning: [removal] CKM_SHA_1_HMAC in Algorithm has been deprecated and marked for removal
            CKM_SHA_1_HMAC,
            ^
/usr/src/RPM/BUILD/jss-5.4.2/base/src/main/java/org/mozilla/jss/crypto/SymmetricKey.java:97: warning: [removal] SHA1_HMAC in KeyGenAlgorithm has been deprecated and marked for removal
                KeyGenAlgorithm.SHA1_HMAC, KeyType.SHA1_HMAC);
                               ^
/usr/src/RPM/BUILD/jss-5.4.2/base/src/main/java/org/mozilla/jss/crypto/SymmetricKey.java:97: warning: [removal] SHA1_HMAC in KeyType has been deprecated and marked for removal
                KeyGenAlgorithm.SHA1_HMAC, KeyType.SHA1_HMAC);
                                                  ^
/usr/src/RPM/BUILD/jss-5.4.2/base/src/main/java/org/mozilla/jss/crypto/SymmetricKey.java:109: warning: [removal] PBA_SHA1_HMAC in KeyGenAlgorithm has been deprecated and marked for removal
                KeyGenAlgorithm.PBA_SHA1_HMAC, null);
                               ^
/usr/src/RPM/BUILD/jss-5.4.2/base/src/main/java/org/mozilla/jss/util/Password.java:191: warning: [removal] finalize() in Object has been deprecated and marked for removal
    protected void finalize() throws Throwable {
                   ^
/usr/src/RPM/BUILD/jss-5.4.2/base/src/main/java/org/mozilla/jss/crypto/PBEAlgorithm.java:98: warning: [removal] SEC_OID_PKCS5_PBE_WITH_SHA1_AND_DES_CBC in Algorithm has been deprecated and marked for removal
        SEC_OID_PKCS5_PBE_WITH_SHA1_AND_DES_CBC, "PBE/SHA1/DES/CBC", 56,
        ^
/usr/src/RPM/BUILD/jss-5.4.2/base/src/main/java/org/mozilla/jss/crypto/PBEAlgorithm.java:105: warning: [removal] SEC_OID_PKCS12_V2_PBE_WITH_SHA1_AND_128_BIT_RC4 in Algorithm has been deprecated and marked for removal
        SEC_OID_PKCS12_V2_PBE_WITH_SHA1_AND_128_BIT_RC4,
        ^
/usr/src/RPM/BUILD/jss-5.4.2/base/src/main/java/org/mozilla/jss/crypto/PBEAlgorithm.java:113: warning: [removal] SEC_OID_PKCS12_V2_PBE_WITH_SHA1_AND_40_BIT_RC4 in Algorithm has been deprecated and marked for removal
        SEC_OID_PKCS12_V2_PBE_WITH_SHA1_AND_40_BIT_RC4,
        ^
/usr/src/RPM/BUILD/jss-5.4.2/base/src/main/java/org/mozilla/jss/crypto/PBEAlgorithm.java:121: warning: [removal] SEC_OID_PKCS12_V2_PBE_WITH_SHA1_AND_3KEY_TRIPLE_DES_CBC in Algorithm has been deprecated and marked for removal
        SEC_OID_PKCS12_V2_PBE_WITH_SHA1_AND_3KEY_TRIPLE_DES_CBC,
        ^
/usr/src/RPM/BUILD/jss-5.4.2/base/src/main/java/org/mozilla/jss/crypto/PBEAlgorithm.java:129: warning: [removal] SEC_OID_PKCS12_V2_PBE_WITH_SHA1_AND_128_BIT_RC2_CBC in Algorithm has been deprecated and marked for removal
        SEC_OID_PKCS12_V2_PBE_WITH_SHA1_AND_128_BIT_RC2_CBC,
        ^
/usr/src/RPM/BUILD/jss-5.4.2/base/src/main/java/org/mozilla/jss/crypto/PBEAlgorithm.java:137: warning: [removal] SEC_OID_PKCS12_V2_PBE_WITH_SHA1_AND_40_BIT_RC2_CBC in Algorithm has been deprecated and marked for removal
        SEC_OID_PKCS12_V2_PBE_WITH_SHA1_AND_40_BIT_RC2_CBC,
        ^
/usr/src/RPM/BUILD/jss-5.4.2/base/src/main/java/org/mozilla/jss/ssl/javax/JSSSession.java:228: warning: [removal] getPeerCertificateChain() in SSLSession has been deprecated and marked for removal
    public X509Certificate[] getPeerCertificateChain() throws SSLPeerUnverifiedException {
                             ^
/usr/src/RPM/BUILD/jss-5.4.2/base/src/main/java/org/mozilla/jss/ssl/javax/JSSSession.java:39: warning: [removal] X509Certificate in javax.security.cert has been deprecated and marked for removal
    private X509Certificate[] peerChain;
            ^
/usr/src/RPM/BUILD/jss-5.4.2/base/src/main/java/org/mozilla/jss/ssl/javax/JSSSession.java:228: warning: [removal] X509Certificate in javax.security.cert has been deprecated and marked for removal
    public X509Certificate[] getPeerCertificateChain() throws SSLPeerUnverifiedException {
           ^
/usr/src/RPM/BUILD/jss-5.4.2/base/src/main/java/org/mozilla/jss/ssl/javax/JSSSession.java:237: warning: [removal] X509Certificate in javax.security.cert has been deprecated and marked for removal
    protected void setPeerCertificateChain(X509Certificate[] chain) {
                                           ^
/usr/src/RPM/BUILD/jss-5.4.2/base/src/main/java/org/mozilla/jss/ssl/SSLSocket.java:1585: warning: [removal] finalize() in Object has been deprecated and marked for removal
    protected void finalize() throws Throwable {
                   ^
/usr/src/RPM/BUILD/jss-5.4.2/base/src/main/java/org/mozilla/jss/CryptoManager.java:637: warning: [removal] SHA1 in JSSMessageDigestSpi has been deprecated and marked for removal
        JSSMessageDigestSpi mds = new JSSMessageDigestSpi.SHA1();
                                                         ^
/usr/src/RPM/BUILD/jss-5.4.2/base/src/main/java/org/mozilla/jss/CryptoManager.java:643: warning: [removal] RSASignatureWithSHA1Digest in SignatureAlgorithm has been deprecated and marked for removal
            SignatureAlgorithm.RSASignatureWithSHA1Digest);
                              ^
/usr/src/RPM/BUILD/jss-5.4.2/base/src/test/java/org/mozilla/jss/tests/GenerateTestCert.java:94: warning: [removal] RSASignatureWithSHA1Digest in SignatureAlgorithm has been deprecated and marked for removal
            sigAlg = SignatureAlgorithm.RSASignatureWithSHA1Digest;
                                       ^
/usr/src/RPM/BUILD/jss-5.4.2/base/src/test/java/org/mozilla/jss/tests/GenerateTestCert.java:102: warning: [removal] DSASignatureWithSHA1Digest in SignatureAlgorithm has been deprecated and marked for removal
            sigAlg = SignatureAlgorithm.DSASignatureWithSHA1Digest;
                                       ^
/usr/src/RPM/BUILD/jss-5.4.2/base/src/test/java/org/mozilla/jss/tests/GenerateTestCert.java:104: warning: [removal] ECSignatureWithSHA1Digest in SignatureAlgorithm has been deprecated and marked for removal
            sigAlg = SignatureAlgorithm.ECSignatureWithSHA1Digest;
                                       ^
/usr/src/RPM/BUILD/jss-5.4.2/base/src/main/java/org/mozilla/jss/ssl/SSLServerSocket.java:227: warning: [removal] finalize() in Object has been deprecated and marked for removal
    protected void finalize() throws Throwable {
                   ^
/usr/src/RPM/BUILD/jss-5.4.2/base/src/test/java/org/mozilla/jss/tests/SymKeyGen.java:330: warning: [removal] PBE_SHA1_DES_CBC in PBEAlgorithm has been deprecated and marked for removal
        key = skg.genPBEKey(PBEAlgorithm.PBE_SHA1_DES_CBC, SymmetricKey.DES,
                                        ^
/usr/src/RPM/BUILD/jss-5.4.2/base/src/test/java/org/mozilla/jss/tests/SymKeyGen.java:337: warning: [removal] PBE_SHA1_DES3_CBC in PBEAlgorithm has been deprecated and marked for removal
        key = skg.genPBEKey(PBEAlgorithm.PBE_SHA1_DES3_CBC, SymmetricKey.DES3,
                                        ^
/usr/src/RPM/BUILD/jss-5.4.2/base/src/test/java/org/mozilla/jss/tests/SymKeyGen.java:344: warning: [removal] PBE_SHA1_RC2_40_CBC in PBEAlgorithm has been deprecated and marked for removal
        key = skg.genPBEKey(PBEAlgorithm.PBE_SHA1_RC2_40_CBC, SymmetricKey.RC2,
                                        ^
/usr/src/RPM/BUILD/jss-5.4.2/base/src/test/java/org/mozilla/jss/tests/SymKeyGen.java:350: warning: [removal] PBE_SHA1_RC2_128_CBC in PBEAlgorithm has been deprecated and marked for removal
        key = skg.genPBEKey(PBEAlgorithm.PBE_SHA1_RC2_128_CBC, SymmetricKey.RC2,
                                        ^
/usr/src/RPM/BUILD/jss-5.4.2/base/src/test/java/org/mozilla/jss/tests/SymKeyGen.java:356: warning: [removal] PBE_SHA1_RC4_40 in PBEAlgorithm has been deprecated and marked for removal
        key = skg.genPBEKey(PBEAlgorithm.PBE_SHA1_RC4_40, SymmetricKey.RC4,
                                        ^
/usr/src/RPM/BUILD/jss-5.4.2/base/src/test/java/org/mozilla/jss/tests/SymKeyGen.java:361: warning: [removal] PBE_SHA1_RC4_128 in PBEAlgorithm has been deprecated and marked for removal
        key = skg.genPBEKey(PBEAlgorithm.PBE_SHA1_RC4_128, SymmetricKey.RC4,
                                        ^
/usr/src/RPM/BUILD/jss-5.4.2/base/src/main/java/org/mozilla/jss/netscape/security/util/Cert.java:59: warning: [removal] RSASignatureWithSHA1Digest in SignatureAlgorithm has been deprecated and marked for removal
            return SignatureAlgorithm.RSASignatureWithSHA1Digest;
                                     ^
/usr/src/RPM/BUILD/jss-5.4.2/base/src/main/java/org/mozilla/jss/netscape/security/util/Cert.java:61: warning: [removal] DSASignatureWithSHA1Digest in SignatureAlgorithm has been deprecated and marked for removal
            return SignatureAlgorithm.DSASignatureWithSHA1Digest;
                                     ^
/usr/src/RPM/BUILD/jss-5.4.2/base/src/main/java/org/mozilla/jss/netscape/security/util/Cert.java:69: warning: [removal] ECSignatureWithSHA1Digest in SignatureAlgorithm has been deprecated and marked for removal
            return SignatureAlgorithm.ECSignatureWithSHA1Digest;
                                     ^
/usr/src/RPM/BUILD/jss-5.4.2/base/src/main/java/org/mozilla/jss/provider/java/security/JSSMessageDigestSpi.java:106: warning: [removal] SHA1 in DigestAlgorithm has been deprecated and marked for removal
            super( DigestAlgorithm.SHA1 );
                                  ^
/usr/src/RPM/BUILD/jss-5.4.2/base/src/main/java/org/mozilla/jss/crypto/PBEKeyGenParams.java:159: warning: [removal] finalize() in Object has been deprecated and marked for removal
    protected void finalize() throws Throwable {
                   ^
/usr/src/RPM/BUILD/jss-5.4.2/base/src/main/java/org/mozilla/jss/ssl/javax/JSSEngineReferenceImpl.java:1698: warning: [removal] finalize() in Object has been deprecated and marked for removal
    protected void finalize() {
                   ^
/usr/src/RPM/BUILD/jss-5.4.2/base/src/main/java/org/mozilla/jss/pkcs11/PK11Signature.java:409: warning: [removal] finalize() in Object has been deprecated and marked for removal
    public void finalize() throws Throwable {
                ^
/usr/src/RPM/BUILD/jss-5.4.2/base/src/main/java/org/mozilla/jss/pkcs11/PK11MessageDigest.java:125: warning: [removal] finalize() in Object has been deprecated and marked for removal
    public void finalize() throws Throwable {
                ^
/usr/src/RPM/BUILD/jss-5.4.2/base/src/main/java/org/mozilla/jss/pkcs11/PK11Cipher.java:296: warning: [removal] finalize() in Object has been deprecated and marked for removal
    public void finalize() throws Throwable {
                ^
/usr/src/RPM/BUILD/jss-5.4.2/base/src/main/java/org/mozilla/jss/util/NativeEnclosure.java:50: warning: [removal] finalize() in Object has been deprecated and marked for removal
    protected void finalize() throws Throwable {
                   ^
/usr/src/RPM/BUILD/jss-5.4.2/base/src/main/java/org/mozilla/jss/pkcs11/PK11KeyWrapper.java:685: warning: [removal] SHA1_HMAC in SymmetricKey has been deprecated and marked for removal
        } else if( type == SymmetricKey.SHA1_HMAC) {
                                       ^
/usr/src/RPM/BUILD/jss-5.4.2/base/src/main/java/org/mozilla/jss/pkcs11/PK11KeyWrapper.java:686: warning: [removal] SHA1 in HMACAlgorithm has been deprecated and marked for removal
            return HMACAlgorithm.SHA1;
                                ^
Note: Some input files use or override a deprecated API.
Note: Recompile with -Xlint:deprecation for details.
59 warnings
touch /usr/src/RPM/BUILD/jss-5.4.2/x86_64-alt-linux/.targets/finished_tests_generate_java
gmake[2]: Leaving directory '/usr/src/RPM/BUILD/jss-5.4.2/x86_64-alt-linux'
gmake[2]: Entering directory '/usr/src/RPM/BUILD/jss-5.4.2/x86_64-alt-linux'
[  0%] Generating .targets/finished_generate_java
/usr/lib/jvm/jre/bin/javac -classpath /usr/share/java/slf4j/api.jar:/usr/share/java/apache-commons-lang3.jar -sourcepath /usr/src/RPM/BUILD/jss-5.4.2/base/src/main/java -target 17 -source 17 -O -d /usr/src/RPM/BUILD/jss-5.4.2/x86_64-alt-linux/classes/jss -h /usr/src/RPM/BUILD/jss-5.4.2/x86_64-alt-linux/include/jss/_jni @/usr/src/RPM/BUILD/jss-5.4.2/x86_64-alt-linux/.targets/java.sources
warning: [options] system modules path not set in conjunction with -source 17
/usr/src/RPM/BUILD/jss-5.4.2/base/src/main/java/org/mozilla/jss/CryptoManager.java:637: warning: [removal] SHA1 in JSSMessageDigestSpi has been deprecated and marked for removal
        JSSMessageDigestSpi mds = new JSSMessageDigestSpi.SHA1();
                                                         ^
/usr/src/RPM/BUILD/jss-5.4.2/base/src/main/java/org/mozilla/jss/CryptoManager.java:643: warning: [removal] RSASignatureWithSHA1Digest in SignatureAlgorithm has been deprecated and marked for removal
            SignatureAlgorithm.RSASignatureWithSHA1Digest);
                              ^
/usr/src/RPM/BUILD/jss-5.4.2/base/src/main/java/org/mozilla/jss/pkcs11/PK11Cert.java:566: warning: [removal] finalize() in Object has been deprecated and marked for removal
    public void finalize() throws Throwable {
                ^
/usr/src/RPM/BUILD/jss-5.4.2/base/src/main/java/org/mozilla/jss/util/NativeProxy.java:138: warning: [removal] finalize() in Object has been deprecated and marked for removal
    protected void finalize() throws Throwable {
                   ^
/usr/src/RPM/BUILD/jss-5.4.2/base/src/main/java/org/mozilla/jss/util/Password.java:191: warning: [removal] finalize() in Object has been deprecated and marked for removal
    protected void finalize() throws Throwable {
                   ^
/usr/src/RPM/BUILD/jss-5.4.2/base/src/main/java/org/mozilla/jss/crypto/PKCS11Algorithm.java:20: warning: [removal] CKM_PBA_SHA1_WITH_SHA1_HMAC in Algorithm has been deprecated and marked for removal
    CKM_PBA_SHA1_WITH_SHA1_HMAC (Algorithm.CKM_PBA_SHA1_WITH_SHA1_HMAC, PKCS11Constants.CKM_PBA_SHA1_WITH_SHA1_HMAC),
                                          ^
/usr/src/RPM/BUILD/jss-5.4.2/base/src/main/java/org/mozilla/jss/crypto/PKCS11Algorithm.java:26: warning: [removal] CKM_SHA_1_HMAC in Algorithm has been deprecated and marked for removal
    CKM_SHA_1_HMAC (Algorithm.CKM_SHA_1_HMAC, PKCS11Constants.CKM_SHA_1_HMAC),
                             ^
/usr/src/RPM/BUILD/jss-5.4.2/base/src/main/java/org/mozilla/jss/crypto/PKCS11Algorithm.java:39: warning: [removal] SEC_OID_SHA1 in Algorithm has been deprecated and marked for removal
    CKM_SHA_1(Algorithm.SEC_OID_SHA1, PKCS11Constants.CKM_SHA_1),
                       ^
/usr/src/RPM/BUILD/jss-5.4.2/base/src/main/java/org/mozilla/jss/crypto/SignatureAlgorithm.java:128: warning: [removal] SEC_OID_PKCS1_SHA1_WITH_RSA_ENCRYPTION in Algorithm has been deprecated and marked for removal
        new SignatureAlgorithm(SEC_OID_PKCS1_SHA1_WITH_RSA_ENCRYPTION,
                               ^
/usr/src/RPM/BUILD/jss-5.4.2/base/src/main/java/org/mozilla/jss/crypto/SignatureAlgorithm.java:129: warning: [removal] SHA1 in DigestAlgorithm has been deprecated and marked for removal
            "RSASignatureWithSHA1Digest", RSASignature, DigestAlgorithm.SHA1,
                                                                       ^
/usr/src/RPM/BUILD/jss-5.4.2/base/src/main/java/org/mozilla/jss/crypto/SignatureAlgorithm.java:136: warning: [removal] SEC_OID_ANSIX9_DSA_SIGNATURE_WITH_SHA1_DIGEST in Algorithm has been deprecated and marked for removal
        new SignatureAlgorithm(SEC_OID_ANSIX9_DSA_SIGNATURE_WITH_SHA1_DIGEST,
                               ^
/usr/src/RPM/BUILD/jss-5.4.2/base/src/main/java/org/mozilla/jss/crypto/SignatureAlgorithm.java:137: warning: [removal] SHA1 in DigestAlgorithm has been deprecated and marked for removal
            "DSASignatureWithSHA1Digest", DSASignature, DigestAlgorithm.SHA1,
                                                                       ^
/usr/src/RPM/BUILD/jss-5.4.2/base/src/main/java/org/mozilla/jss/crypto/SignatureAlgorithm.java:144: warning: [removal] SEC_OID_ANSIX962_ECDSA_SHA1_SIGNATURE in Algorithm has been deprecated and marked for removal
        new SignatureAlgorithm(SEC_OID_ANSIX962_ECDSA_SHA1_SIGNATURE,
                               ^
/usr/src/RPM/BUILD/jss-5.4.2/base/src/main/java/org/mozilla/jss/crypto/SignatureAlgorithm.java:145: warning: [removal] SHA1 in DigestAlgorithm has been deprecated and marked for removal
            "ECSignatureWithSHA1Digest", ECSignature, DigestAlgorithm.SHA1,
                                                                     ^
/usr/src/RPM/BUILD/jss-5.4.2/base/src/main/java/org/mozilla/jss/crypto/DigestAlgorithm.java:71: warning: [removal] SEC_OID_SHA1 in Algorithm has been deprecated and marked for removal
        (SEC_OID_SHA1, "SHA-1", OBJECT_IDENTIFIER.ALGORITHM.subBranch(26), 20);
         ^
/usr/src/RPM/BUILD/jss-5.4.2/base/src/main/java/org/mozilla/jss/crypto/KeyGenAlgorithm.java:124: warning: [removal] CKM_PBA_SHA1_WITH_SHA1_HMAC in Algorithm has been deprecated and marked for removal
            CKM_PBA_SHA1_WITH_SHA1_HMAC,
            ^
/usr/src/RPM/BUILD/jss-5.4.2/base/src/main/java/org/mozilla/jss/crypto/KeyGenAlgorithm.java:153: warning: [removal] CKM_SHA_1_HMAC in Algorithm has been deprecated and marked for removal
            CKM_SHA_1_HMAC,
            ^
/usr/src/RPM/BUILD/jss-5.4.2/base/src/main/java/org/mozilla/jss/crypto/SymmetricKey.java:97: warning: [removal] SHA1_HMAC in KeyGenAlgorithm has been deprecated and marked for removal
                KeyGenAlgorithm.SHA1_HMAC, KeyType.SHA1_HMAC);
                               ^
/usr/src/RPM/BUILD/jss-5.4.2/base/src/main/java/org/mozilla/jss/crypto/SymmetricKey.java:97: warning: [removal] SHA1_HMAC in KeyType has been deprecated and marked for removal
                KeyGenAlgorithm.SHA1_HMAC, KeyType.SHA1_HMAC);
                                                  ^
/usr/src/RPM/BUILD/jss-5.4.2/base/src/main/java/org/mozilla/jss/crypto/SymmetricKey.java:109: warning: [removal] PBA_SHA1_HMAC in KeyGenAlgorithm has been deprecated and marked for removal
                KeyGenAlgorithm.PBA_SHA1_HMAC, null);
                               ^
/usr/src/RPM/BUILD/jss-5.4.2/base/src/main/java/org/mozilla/jss/crypto/PBEAlgorithm.java:98: warning: [removal] SEC_OID_PKCS5_PBE_WITH_SHA1_AND_DES_CBC in Algorithm has been deprecated and marked for removal
        SEC_OID_PKCS5_PBE_WITH_SHA1_AND_DES_CBC, "PBE/SHA1/DES/CBC", 56,
        ^
/usr/src/RPM/BUILD/jss-5.4.2/base/src/main/java/org/mozilla/jss/crypto/PBEAlgorithm.java:105: warning: [removal] SEC_OID_PKCS12_V2_PBE_WITH_SHA1_AND_128_BIT_RC4 in Algorithm has been deprecated and marked for removal
        SEC_OID_PKCS12_V2_PBE_WITH_SHA1_AND_128_BIT_RC4,
        ^
/usr/src/RPM/BUILD/jss-5.4.2/base/src/main/java/org/mozilla/jss/crypto/PBEAlgorithm.java:113: warning: [removal] SEC_OID_PKCS12_V2_PBE_WITH_SHA1_AND_40_BIT_RC4 in Algorithm has been deprecated and marked for removal
        SEC_OID_PKCS12_V2_PBE_WITH_SHA1_AND_40_BIT_RC4,
        ^
/usr/src/RPM/BUILD/jss-5.4.2/base/src/main/java/org/mozilla/jss/crypto/PBEAlgorithm.java:121: warning: [removal] SEC_OID_PKCS12_V2_PBE_WITH_SHA1_AND_3KEY_TRIPLE_DES_CBC in Algorithm has been deprecated and marked for removal
        SEC_OID_PKCS12_V2_PBE_WITH_SHA1_AND_3KEY_TRIPLE_DES_CBC,
        ^
/usr/src/RPM/BUILD/jss-5.4.2/base/src/main/java/org/mozilla/jss/crypto/PBEAlgorithm.java:129: warning: [removal] SEC_OID_PKCS12_V2_PBE_WITH_SHA1_AND_128_BIT_RC2_CBC in Algorithm has been deprecated and marked for removal
        SEC_OID_PKCS12_V2_PBE_WITH_SHA1_AND_128_BIT_RC2_CBC,
        ^
/usr/src/RPM/BUILD/jss-5.4.2/base/src/main/java/org/mozilla/jss/crypto/PBEAlgorithm.java:137: warning: [removal] SEC_OID_PKCS12_V2_PBE_WITH_SHA1_AND_40_BIT_RC2_CBC in Algorithm has been deprecated and marked for removal
        SEC_OID_PKCS12_V2_PBE_WITH_SHA1_AND_40_BIT_RC2_CBC,
        ^
/usr/src/RPM/BUILD/jss-5.4.2/base/src/main/java/org/mozilla/jss/pkcs11/KeyType.java:118: warning: [removal] RSASignatureWithSHA1Digest in SignatureAlgorithm has been deprecated and marked for removal
                    SignatureAlgorithm.RSASignatureWithSHA1Digest,
                                      ^
/usr/src/RPM/BUILD/jss-5.4.2/base/src/main/java/org/mozilla/jss/pkcs11/KeyType.java:137: warning: [removal] DSASignatureWithSHA1Digest in SignatureAlgorithm has been deprecated and marked for removal
                    SignatureAlgorithm.DSASignatureWithSHA1Digest
                                      ^
/usr/src/RPM/BUILD/jss-5.4.2/base/src/main/java/org/mozilla/jss/pkcs11/KeyType.java:147: warning: [removal] ECSignatureWithSHA1Digest in SignatureAlgorithm has been deprecated and marked for removal
                    SignatureAlgorithm.ECSignatureWithSHA1Digest,
                                      ^
/usr/src/RPM/BUILD/jss-5.4.2/base/src/main/java/org/mozilla/jss/pkcs11/KeyType.java:249: warning: [removal] SHA1 in HMACAlgorithm has been deprecated and marked for removal
                            HMACAlgorithm.SHA1
                                         ^
/usr/src/RPM/BUILD/jss-5.4.2/base/src/main/java/org/mozilla/jss/util/NativeEnclosure.java:50: warning: [removal] finalize() in Object has been deprecated and marked for removal
    protected void finalize() throws Throwable {
                   ^
/usr/src/RPM/BUILD/jss-5.4.2/base/src/main/java/org/mozilla/jss/crypto/PBEKeyGenParams.java:159: warning: [removal] finalize() in Object has been deprecated and marked for removal
    protected void finalize() throws Throwable {
                   ^
/usr/src/RPM/BUILD/jss-5.4.2/base/src/main/java/org/mozilla/jss/netscape/security/pkcs/PKCS12Util.java:81: warning: [removal] PBE_SHA1_RC2_40_CBC in PBEAlgorithm has been deprecated and marked for removal
            PBEAlgorithm.PBE_SHA1_RC2_40_CBC
                        ^
/usr/src/RPM/BUILD/jss-5.4.2/base/src/main/java/org/mozilla/jss/netscape/security/pkcs/PKCS12Util.java:86: warning: [removal] PBE_SHA1_DES3_CBC in PBEAlgorithm has been deprecated and marked for removal
            PBEAlgorithm.PBE_SHA1_DES3_CBC
                        ^
/usr/src/RPM/BUILD/jss-5.4.2/base/src/main/java/org/mozilla/jss/netscape/security/pkcs/PKCS12Util.java:226: warning: [removal] PBE_SHA1_DES3_CBC in PBEAlgorithm has been deprecated and marked for removal
            if (keyEncryption == PBEAlgorithm.PBE_SHA1_DES3_CBC) {
                                             ^
/usr/src/RPM/BUILD/jss-5.4.2/base/src/main/java/org/mozilla/jss/netscape/security/pkcs/PKCS12Util.java:252: warning: [removal] PBE_SHA1_DES3_CBC in PBEAlgorithm has been deprecated and marked for removal
                PBEAlgorithm.PBE_SHA1_DES3_CBC,
                            ^
/usr/src/RPM/BUILD/jss-5.4.2/base/src/main/java/org/mozilla/jss/netscape/security/pkcs/PKCS12Util.java:583: warning: [removal] PBE_SHA1_RC2_40_CBC in PBEAlgorithm has been deprecated and marked for removal
            } else if (certEncryption == PBEAlgorithm.PBE_SHA1_RC2_40_CBC) {
                                                     ^
/usr/src/RPM/BUILD/jss-5.4.2/base/src/main/java/org/mozilla/jss/pkcs12/PFX.java:426: warning: [removal] PBE_SHA1_DES3_CBC in PBEAlgorithm has been deprecated and marked for removal
                            PBEAlgorithm.PBE_SHA1_DES3_CBC, newPass,
                                        ^
/usr/src/RPM/BUILD/jss-5.4.2/base/src/main/java/org/mozilla/jss/pkcs12/PFX.java:459: warning: [removal] DEFAULT_KEY_GEN_ALG in AuthenticatedSafes has been deprecated and marked for removal
                        AuthenticatedSafes.DEFAULT_KEY_GEN_ALG, newPass,
                                          ^
/usr/src/RPM/BUILD/jss-5.4.2/base/src/main/java/org/mozilla/jss/pkcs12/SafeBag.java:288: warning: [removal] PBE_SHA1_DES3_CBC in PBEAlgorithm has been deprecated and marked for removal
        PBEAlgorithm pbeAlg = PBEAlgorithm.PBE_SHA1_DES3_CBC;
                                          ^
/usr/src/RPM/BUILD/jss-5.4.2/base/src/main/java/org/mozilla/jss/pkcs12/SafeBag.java:296: warning: [removal] PBE_SHA1_DES3_CBC in PBEAlgorithm has been deprecated and marked for removal
                PBEAlgorithm.PBE_SHA1_DES3_CBC, password, salt,
                            ^
/usr/src/RPM/BUILD/jss-5.4.2/base/src/main/java/org/mozilla/jss/pkcs12/AuthenticatedSafes.java:58: warning: [removal] PBE_SHA1_RC2_40_CBC in PBEAlgorithm has been deprecated and marked for removal
                PBEAlgorithm.PBE_SHA1_RC2_40_CBC;
                            ^
/usr/src/RPM/BUILD/jss-5.4.2/base/src/main/java/org/mozilla/jss/pkcs12/MacData.java:145: warning: [removal] SHA1 in DigestAlgorithm has been deprecated and marked for removal
                algID = new AlgorithmIdentifier(DigestAlgorithm.SHA1.toOID());
                                                               ^
/usr/src/RPM/BUILD/jss-5.4.2/base/src/main/java/org/mozilla/jss/pkcs12/MacData.java:149: warning: [removal] SHA1 in DigestAlgorithm has been deprecated and marked for removal
            if(DigestAlgorithm.SHA1.toOID().equals(algID.getOID())){
                              ^
/usr/src/RPM/BUILD/jss-5.4.2/base/src/main/java/org/mozilla/jss/pkcs12/MacData.java:150: warning: [removal] PBA_SHA1_HMAC in KeyGenAlgorithm has been deprecated and marked for removal
                kg = token.getKeyGenerator(KeyGenAlgorithm.PBA_SHA1_HMAC);
                                                          ^
/usr/src/RPM/BUILD/jss-5.4.2/base/src/main/java/org/mozilla/jss/pkcs12/MacData.java:151: warning: [removal] SHA1 in HMACAlgorithm has been deprecated and marked for removal
                digest = token.getDigestContext(HMACAlgorithm.SHA1);
                                                             ^
/usr/src/RPM/BUILD/jss-5.4.2/base/src/main/java/org/mozilla/jss/netscape/security/provider/CMS.java:39: warning: [removal] AccessController in java.security has been deprecated and marked for removal
        AccessController.doPrivileged(new java.security.PrivilegedAction<>() {
        ^
/usr/src/RPM/BUILD/jss-5.4.2/base/src/main/java/org/mozilla/jss/netscape/security/util/Cert.java:59: warning: [removal] RSASignatureWithSHA1Digest in SignatureAlgorithm has been deprecated and marked for removal
            return SignatureAlgorithm.RSASignatureWithSHA1Digest;
                                     ^
/usr/src/RPM/BUILD/jss-5.4.2/base/src/main/java/org/mozilla/jss/netscape/security/util/Cert.java:61: warning: [removal] DSASignatureWithSHA1Digest in SignatureAlgorithm has been deprecated and marked for removal
            return SignatureAlgorithm.DSASignatureWithSHA1Digest;
                                     ^
/usr/src/RPM/BUILD/jss-5.4.2/base/src/main/java/org/mozilla/jss/netscape/security/util/Cert.java:69: warning: [removal] ECSignatureWithSHA1Digest in SignatureAlgorithm has been deprecated and marked for removal
            return SignatureAlgorithm.ECSignatureWithSHA1Digest;
                                     ^
/usr/src/RPM/BUILD/jss-5.4.2/base/src/main/java/org/mozilla/jss/ssl/SSLSocket.java:1585: warning: [removal] finalize() in Object has been deprecated and marked for removal
    protected void finalize() throws Throwable {
                   ^
/usr/src/RPM/BUILD/jss-5.4.2/base/src/main/java/org/mozilla/jss/pkcs11/PK11Key.java:66: warning: [removal] finalize() in Object has been deprecated and marked for removal
    public void finalize() throws Throwable {
                ^
/usr/src/RPM/BUILD/jss-5.4.2/base/src/main/java/org/mozilla/jss/ssl/javax/JSSSession.java:228: warning: [removal] getPeerCertificateChain() in SSLSession has been deprecated and marked for removal
    public X509Certificate[] getPeerCertificateChain() throws SSLPeerUnverifiedException {
                             ^
/usr/src/RPM/BUILD/jss-5.4.2/base/src/main/java/org/mozilla/jss/ssl/javax/JSSSession.java:39: warning: [removal] X509Certificate in javax.security.cert has been deprecated and marked for removal
    private X509Certificate[] peerChain;
            ^
/usr/src/RPM/BUILD/jss-5.4.2/base/src/main/java/org/mozilla/jss/ssl/javax/JSSSession.java:228: warning: [removal] X509Certificate in javax.security.cert has been deprecated and marked for removal
    public X509Certificate[] getPeerCertificateChain() throws SSLPeerUnverifiedException {
           ^
/usr/src/RPM/BUILD/jss-5.4.2/base/src/main/java/org/mozilla/jss/ssl/javax/JSSSession.java:237: warning: [removal] X509Certificate in javax.security.cert has been deprecated and marked for removal
    protected void setPeerCertificateChain(X509Certificate[] chain) {
                                           ^
/usr/src/RPM/BUILD/jss-5.4.2/base/src/main/java/org/mozilla/jss/pkcs11/PK11Cipher.java:296: warning: [removal] finalize() in Object has been deprecated and marked for removal
    public void finalize() throws Throwable {
                ^
/usr/src/RPM/BUILD/jss-5.4.2/base/src/main/java/org/mozilla/jss/pkcs11/PK11KeyWrapper.java:685: warning: [removal] SHA1_HMAC in SymmetricKey has been deprecated and marked for removal
        } else if( type == SymmetricKey.SHA1_HMAC) {
                                       ^
/usr/src/RPM/BUILD/jss-5.4.2/base/src/main/java/org/mozilla/jss/pkcs11/PK11KeyWrapper.java:686: warning: [removal] SHA1 in HMACAlgorithm has been deprecated and marked for removal
            return HMACAlgorithm.SHA1;
                                ^
/usr/src/RPM/BUILD/jss-5.4.2/base/src/main/java/org/mozilla/jss/pkcs11/PK11MessageDigest.java:125: warning: [removal] finalize() in Object has been deprecated and marked for removal
    public void finalize() throws Throwable {
                ^
/usr/src/RPM/BUILD/jss-5.4.2/base/src/main/java/org/mozilla/jss/pkcs11/PK11Signature.java:409: warning: [removal] finalize() in Object has been deprecated and marked for removal
    public void finalize() throws Throwable {
                ^
/usr/src/RPM/BUILD/jss-5.4.2/base/src/main/java/org/mozilla/jss/provider/java/security/JSSMessageDigestSpi.java:106: warning: [removal] SHA1 in DigestAlgorithm has been deprecated and marked for removal
            super( DigestAlgorithm.SHA1 );
                                  ^
/usr/src/RPM/BUILD/jss-5.4.2/base/src/main/java/org/mozilla/jss/provider/java/security/JSSSignatureSpi.java:197: warning: [removal] DSASignatureWithSHA1Digest in SignatureAlgorithm has been deprecated and marked for removal
            super(SignatureAlgorithm.DSASignatureWithSHA1Digest);
                                    ^
/usr/src/RPM/BUILD/jss-5.4.2/base/src/main/java/org/mozilla/jss/provider/java/security/JSSSignatureSpi.java:203: warning: [removal] ECSignatureWithSHA1Digest in SignatureAlgorithm has been deprecated and marked for removal
            super(SignatureAlgorithm.ECSignatureWithSHA1Digest);
                                    ^
/usr/src/RPM/BUILD/jss-5.4.2/base/src/main/java/org/mozilla/jss/provider/java/security/JSSSignatureSpi.java:233: warning: [removal] RSASignatureWithSHA1Digest in SignatureAlgorithm has been deprecated and marked for removal
            super(SignatureAlgorithm.RSASignatureWithSHA1Digest);
                                    ^
/usr/src/RPM/BUILD/jss-5.4.2/base/src/main/java/org/mozilla/jss/provider/java/security/RSAPSSAlgorithmParameters.java:49: warning: [removal] SHA_oid in AlgorithmId has been deprecated and marked for removal
    public final static AlgorithmId defaultHashAlg = new AlgorithmId(AlgorithmId.SHA_oid);
                                                                                ^
/usr/src/RPM/BUILD/jss-5.4.2/base/src/main/java/org/mozilla/jss/provider/java/security/RSAPSSAlgorithmParameters.java:221: warning: [removal] SHA_oid in AlgorithmId has been deprecated and marked for removal
            hashAlg = new AlgorithmId(AlgorithmId.SHA_oid);
                                                 ^
/usr/src/RPM/BUILD/jss-5.4.2/base/src/main/java/org/mozilla/jss/provider/javax/crypto/JSSKeyGeneratorSpi.java:109: warning: [removal] SHA1_HMAC in KeyGenAlgorithm has been deprecated and marked for removal
            super(KeyGenAlgorithm.SHA1_HMAC);
                                 ^
/usr/src/RPM/BUILD/jss-5.4.2/base/src/main/java/org/mozilla/jss/provider/javax/crypto/JSSKeyGeneratorSpi.java:115: warning: [removal] PBA_SHA1_HMAC in KeyGenAlgorithm has been deprecated and marked for removal
            super(KeyGenAlgorithm.PBA_SHA1_HMAC);
                                 ^
/usr/src/RPM/BUILD/jss-5.4.2/base/src/main/java/org/mozilla/jss/provider/javax/crypto/JSSMacSpi.java:145: warning: [removal] SHA1 in HMACAlgorithm has been deprecated and marked for removal
            super(HMACAlgorithm.SHA1, "HmacSHA1");
                               ^
/usr/src/RPM/BUILD/jss-5.4.2/base/src/main/java/org/mozilla/jss/provider/javax/crypto/JSSSecretKeyFactorySpi.java:332: warning: [removal] PBE_SHA1_DES3_CBC in PBEAlgorithm has been deprecated and marked for removal
        keygen = tok.getKeyGenerator(PBEAlgorithm.PBE_SHA1_DES3_CBC);
                                                 ^
/usr/src/RPM/BUILD/jss-5.4.2/base/src/main/java/org/mozilla/jss/provider/javax/crypto/JSSSecretKeyFactorySpi.java:402: warning: [removal] PBE_SHA1_DES_CBC in PBEAlgorithm has been deprecated and marked for removal
            super(PBEAlgorithm.PBE_SHA1_DES_CBC);
                              ^
/usr/src/RPM/BUILD/jss-5.4.2/base/src/main/java/org/mozilla/jss/provider/javax/crypto/JSSSecretKeyFactorySpi.java:412: warning: [removal] PBE_SHA1_DES3_CBC in PBEAlgorithm has been deprecated and marked for removal
            super(PBEAlgorithm.PBE_SHA1_DES3_CBC);
                              ^
/usr/src/RPM/BUILD/jss-5.4.2/base/src/main/java/org/mozilla/jss/provider/javax/crypto/JSSSecretKeyFactorySpi.java:422: warning: [removal] PBE_SHA1_RC4_128 in PBEAlgorithm has been deprecated and marked for removal
            super(PBEAlgorithm.PBE_SHA1_RC4_128);
                              ^
/usr/src/RPM/BUILD/jss-5.4.2/base/src/main/java/org/mozilla/jss/provider/javax/crypto/JSSSecretKeyFactorySpi.java:432: warning: [removal] SHA1_HMAC in KeyGenAlgorithm has been deprecated and marked for removal
            super(KeyGenAlgorithm.SHA1_HMAC);
                                 ^
/usr/src/RPM/BUILD/jss-5.4.2/base/src/main/java/org/mozilla/jss/provider/javax/crypto/JSSSecretKeyFactorySpi.java:442: warning: [removal] PBA_SHA1_HMAC in KeyGenAlgorithm has been deprecated and marked for removal
            super(KeyGenAlgorithm.PBA_SHA1_HMAC);
                                 ^
/usr/src/RPM/BUILD/jss-5.4.2/base/src/main/java/org/mozilla/jss/ssl/SSLServerSocket.java:227: warning: [removal] finalize() in Object has been deprecated and marked for removal
    protected void finalize() throws Throwable {
                   ^
/usr/src/RPM/BUILD/jss-5.4.2/base/src/main/java/org/mozilla/jss/ssl/javax/JSSEngineReferenceImpl.java:1698: warning: [removal] finalize() in Object has been deprecated and marked for removal
    protected void finalize() {
                   ^
Note: Some input files use or override a deprecated API.
Note: Recompile with -Xlint:deprecation for details.
79 warnings
touch /usr/src/RPM/BUILD/jss-5.4.2/x86_64-alt-linux/.targets/finished_generate_java
gmake[2]: Leaving directory '/usr/src/RPM/BUILD/jss-5.4.2/x86_64-alt-linux'
gmake[1]: Entering directory '/usr/src/RPM/BUILD/jss-5.4.2/x86_64-alt-linux'
[  1%] Built target generate_java
gmake[1]: Leaving directory '/usr/src/RPM/BUILD/jss-5.4.2/x86_64-alt-linux'
/usr/bin/gmake  -f CMakeFiles/generate_build_jar.dir/build.make CMakeFiles/generate_build_jar.dir/depend
/usr/bin/gmake  -f CMakeFiles/generate_c.dir/build.make CMakeFiles/generate_c.dir/depend
gmake[2]: Entering directory '/usr/src/RPM/BUILD/jss-5.4.2/x86_64-alt-linux'
cd /usr/src/RPM/BUILD/jss-5.4.2/x86_64-alt-linux && /usr/bin/cmake -E cmake_depends "Unix Makefiles" /usr/src/RPM/BUILD/jss-5.4.2 /usr/src/RPM/BUILD/jss-5.4.2 /usr/src/RPM/BUILD/jss-5.4.2/x86_64-alt-linux /usr/src/RPM/BUILD/jss-5.4.2/x86_64-alt-linux /usr/src/RPM/BUILD/jss-5.4.2/x86_64-alt-linux/CMakeFiles/generate_build_jar.dir/DependInfo.cmake "--color="
gmake[2]: Leaving directory '/usr/src/RPM/BUILD/jss-5.4.2/x86_64-alt-linux'
gmake[2]: Entering directory '/usr/src/RPM/BUILD/jss-5.4.2/x86_64-alt-linux'
cd /usr/src/RPM/BUILD/jss-5.4.2/x86_64-alt-linux && /usr/bin/cmake -E cmake_depends "Unix Makefiles" /usr/src/RPM/BUILD/jss-5.4.2 /usr/src/RPM/BUILD/jss-5.4.2 /usr/src/RPM/BUILD/jss-5.4.2/x86_64-alt-linux /usr/src/RPM/BUILD/jss-5.4.2/x86_64-alt-linux /usr/src/RPM/BUILD/jss-5.4.2/x86_64-alt-linux/CMakeFiles/generate_c.dir/DependInfo.cmake "--color="
gmake[2]: Leaving directory '/usr/src/RPM/BUILD/jss-5.4.2/x86_64-alt-linux'
/usr/bin/gmake  -f CMakeFiles/generate_build_jar.dir/build.make CMakeFiles/generate_build_jar.dir/build
/usr/bin/gmake  -f CMakeFiles/generate_c.dir/build.make CMakeFiles/generate_c.dir/build
gmake[2]: Entering directory '/usr/src/RPM/BUILD/jss-5.4.2/x86_64-alt-linux'
[ 14%] Generating lib/Policy.o
cd /usr/src/RPM/BUILD/jss-5.4.2/native/src/main/native/org/mozilla/jss/crypto && /usr/bin/cc -fPIC -flto=auto -O2 -g -Wall -frecord-gcc-switches -pipe -O2 -Wall -std=gnu99 -Wno-cast-function-type -Wno-unused-parameter -Wno-unknown-warning-option -Wno-unused-but-set-variable -Werror-implicit-function-declaration -Wno-switch -I/usr/src/RPM/BUILD/jss-5.4.2/x86_64-alt-linux/include/jss -I/usr/lib/jvm/jre/include -I/usr/lib/jvm/jre/include/linux -I/usr/lib/jvm/jre/include -I/usr/include/nspr -I/usr/include/nss -L/usr/lib64 -L/usr/lib64 -o /usr/src/RPM/BUILD/jss-5.4.2/x86_64-alt-linux/lib/Policy.o -c /usr/src/RPM/BUILD/jss-5.4.2/native/src/main/native/org/mozilla/jss/crypto/Policy.c
gmake[2]: Leaving directory '/usr/src/RPM/BUILD/jss-5.4.2/x86_64-alt-linux'
gmake[2]: Entering directory '/usr/src/RPM/BUILD/jss-5.4.2/x86_64-alt-linux'
[  8%] Generating lib/JSSOAEPParameterSpec.o
cd /usr/src/RPM/BUILD/jss-5.4.2/native/src/main/native/org/mozilla/jss/crypto && /usr/bin/cc -fPIC -flto=auto -O2 -g -Wall -frecord-gcc-switches -pipe -O2 -Wall -std=gnu99 -Wno-cast-function-type -Wno-unused-parameter -Wno-unknown-warning-option -Wno-unused-but-set-variable -Werror-implicit-function-declaration -Wno-switch -I/usr/src/RPM/BUILD/jss-5.4.2/x86_64-alt-linux/include/jss -I/usr/lib/jvm/jre/include -I/usr/lib/jvm/jre/include/linux -I/usr/lib/jvm/jre/include -I/usr/include/nspr -I/usr/include/nss -L/usr/lib64 -L/usr/lib64 -o /usr/src/RPM/BUILD/jss-5.4.2/x86_64-alt-linux/lib/JSSOAEPParameterSpec.o -c /usr/src/RPM/BUILD/jss-5.4.2/native/src/main/native/org/mozilla/jss/crypto/JSSOAEPParameterSpec.c
gmake[2]: Leaving directory '/usr/src/RPM/BUILD/jss-5.4.2/x86_64-alt-linux'
gmake[2]: Entering directory '/usr/src/RPM/BUILD/jss-5.4.2/x86_64-alt-linux'
[ 15%] Generating lib/BufferProxy.o
cd /usr/src/RPM/BUILD/jss-5.4.2/native/src/main/native/org/mozilla/jss/nss && /usr/bin/cc -fPIC -flto=auto -O2 -g -Wall -frecord-gcc-switches -pipe -O2 -Wall -std=gnu99 -Wno-cast-function-type -Wno-unused-parameter -Wno-unknown-warning-option -Wno-unused-but-set-variable -Werror-implicit-function-declaration -Wno-switch -I/usr/src/RPM/BUILD/jss-5.4.2/x86_64-alt-linux/include/jss -I/usr/lib/jvm/jre/include -I/usr/lib/jvm/jre/include/linux -I/usr/lib/jvm/jre/include -I/usr/include/nspr -I/usr/include/nss -L/usr/lib64 -L/usr/lib64 -o /usr/src/RPM/BUILD/jss-5.4.2/x86_64-alt-linux/lib/BufferProxy.o -c /usr/src/RPM/BUILD/jss-5.4.2/native/src/main/native/org/mozilla/jss/nss/BufferProxy.c
gmake[2]: Leaving directory '/usr/src/RPM/BUILD/jss-5.4.2/x86_64-alt-linux'
gmake[2]: Entering directory '/usr/src/RPM/BUILD/jss-5.4.2/x86_64-alt-linux'
[ 22%] Generating lib/PRErrors.o
cd /usr/src/RPM/BUILD/jss-5.4.2/native/src/main/native/org/mozilla/jss/nss && /usr/bin/cc -fPIC -flto=auto -O2 -g -Wall -frecord-gcc-switches -pipe -O2 -Wall -std=gnu99 -Wno-cast-function-type -Wno-unused-parameter -Wno-unknown-warning-option -Wno-unused-but-set-variable -Werror-implicit-function-declaration -Wno-switch -I/usr/src/RPM/BUILD/jss-5.4.2/x86_64-alt-linux/include/jss -I/usr/lib/jvm/jre/include -I/usr/lib/jvm/jre/include/linux -I/usr/lib/jvm/jre/include -I/usr/include/nspr -I/usr/include/nss -L/usr/lib64 -L/usr/lib64 -o /usr/src/RPM/BUILD/jss-5.4.2/x86_64-alt-linux/lib/PRErrors.o -c /usr/src/RPM/BUILD/jss-5.4.2/native/src/main/native/org/mozilla/jss/nss/PRErrors.c
gmake[2]: Leaving directory '/usr/src/RPM/BUILD/jss-5.4.2/x86_64-alt-linux'
gmake[2]: Entering directory '/usr/src/RPM/BUILD/jss-5.4.2/x86_64-alt-linux'
[  8%] Generating lib/Algorithm.o
cd /usr/src/RPM/BUILD/jss-5.4.2/native/src/main/native/org/mozilla/jss/crypto && /usr/bin/cc -fPIC -flto=auto -O2 -g -Wall -frecord-gcc-switches -pipe -O2 -Wall -std=gnu99 -Wno-cast-function-type -Wno-unused-parameter -Wno-unknown-warning-option -Wno-unused-but-set-variable -Werror-implicit-function-declaration -Wno-switch -I/usr/src/RPM/BUILD/jss-5.4.2/x86_64-alt-linux/include/jss -I/usr/lib/jvm/jre/include -I/usr/lib/jvm/jre/include/linux -I/usr/lib/jvm/jre/include -I/usr/include/nspr -I/usr/include/nss -L/usr/lib64 -L/usr/lib64 -o /usr/src/RPM/BUILD/jss-5.4.2/x86_64-alt-linux/lib/Algorithm.o -c /usr/src/RPM/BUILD/jss-5.4.2/native/src/main/native/org/mozilla/jss/crypto/Algorithm.c
gmake[2]: Leaving directory '/usr/src/RPM/BUILD/jss-5.4.2/x86_64-alt-linux'
gmake[2]: Entering directory '/usr/src/RPM/BUILD/jss-5.4.2/x86_64-alt-linux'
[ 17%] Generating lib/Buffer.o
cd /usr/src/RPM/BUILD/jss-5.4.2/native/src/main/native/org/mozilla/jss/nss && /usr/bin/cc -fPIC -flto=auto -O2 -g -Wall -frecord-gcc-switches -pipe -O2 -Wall -std=gnu99 -Wno-cast-function-type -Wno-unused-parameter -Wno-unknown-warning-option -Wno-unused-but-set-variable -Werror-implicit-function-declaration -Wno-switch -I/usr/src/RPM/BUILD/jss-5.4.2/x86_64-alt-linux/include/jss -I/usr/lib/jvm/jre/include -I/usr/lib/jvm/jre/include/linux -I/usr/lib/jvm/jre/include -I/usr/include/nspr -I/usr/include/nss -L/usr/lib64 -L/usr/lib64 -o /usr/src/RPM/BUILD/jss-5.4.2/x86_64-alt-linux/lib/Buffer.o -c /usr/src/RPM/BUILD/jss-5.4.2/native/src/main/native/org/mozilla/jss/nss/Buffer.c
gmake[2]: Leaving directory '/usr/src/RPM/BUILD/jss-5.4.2/x86_64-alt-linux'
gmake[2]: Entering directory '/usr/src/RPM/BUILD/jss-5.4.2/x86_64-alt-linux'
[ 10%] Generating lib/KeyManager.o
cd /usr/src/RPM/BUILD/jss-5.4.2/native/src/main/native/org/mozilla/jss/SecretDecoderRing && /usr/bin/cc -fPIC -flto=auto -O2 -g -Wall -frecord-gcc-switches -pipe -O2 -Wall -std=gnu99 -Wno-cast-function-type -Wno-unused-parameter -Wno-unknown-warning-option -Wno-unused-but-set-variable -Werror-implicit-function-declaration -Wno-switch -I/usr/src/RPM/BUILD/jss-5.4.2/x86_64-alt-linux/include/jss -I/usr/lib/jvm/jre/include -I/usr/lib/jvm/jre/include/linux -I/usr/lib/jvm/jre/include -I/usr/include/nspr -I/usr/include/nss -L/usr/lib64 -L/usr/lib64 -o /usr/src/RPM/BUILD/jss-5.4.2/x86_64-alt-linux/lib/KeyManager.o -c /usr/src/RPM/BUILD/jss-5.4.2/native/src/main/native/org/mozilla/jss/SecretDecoderRing/KeyManager.c
gmake[2]: Leaving directory '/usr/src/RPM/BUILD/jss-5.4.2/x86_64-alt-linux'
gmake[2]: Entering directory '/usr/src/RPM/BUILD/jss-5.4.2/x86_64-alt-linux'
[ 12%] Generating lib/PQGParams.o
cd /usr/src/RPM/BUILD/jss-5.4.2/native/src/main/native/org/mozilla/jss/crypto && /usr/bin/cc -fPIC -flto=auto -O2 -g -Wall -frecord-gcc-switches -pipe -O2 -Wall -std=gnu99 -Wno-cast-function-type -Wno-unused-parameter -Wno-unknown-warning-option -Wno-unused-but-set-variable -Werror-implicit-function-declaration -Wno-switch -I/usr/src/RPM/BUILD/jss-5.4.2/x86_64-alt-linux/include/jss -I/usr/lib/jvm/jre/include -I/usr/lib/jvm/jre/include/linux -I/usr/lib/jvm/jre/include -I/usr/include/nspr -I/usr/include/nss -L/usr/lib64 -L/usr/lib64 -o /usr/src/RPM/BUILD/jss-5.4.2/x86_64-alt-linux/lib/PQGParams.o -c /usr/src/RPM/BUILD/jss-5.4.2/native/src/main/native/org/mozilla/jss/crypto/PQGParams.c
gmake[2]: Leaving directory '/usr/src/RPM/BUILD/jss-5.4.2/x86_64-alt-linux'
gmake[2]: Entering directory '/usr/src/RPM/BUILD/jss-5.4.2/x86_64-alt-linux'
[  7%] Generating lib/ASN1Util.o
cd /usr/src/RPM/BUILD/jss-5.4.2/native/src/main/native/org/mozilla/jss/asn1 && /usr/bin/cc -fPIC -flto=auto -O2 -g -Wall -frecord-gcc-switches -pipe -O2 -Wall -std=gnu99 -Wno-cast-function-type -Wno-unused-parameter -Wno-unknown-warning-option -Wno-unused-but-set-variable -Werror-implicit-function-declaration -Wno-switch -I/usr/src/RPM/BUILD/jss-5.4.2/x86_64-alt-linux/include/jss -I/usr/lib/jvm/jre/include -I/usr/lib/jvm/jre/include/linux -I/usr/lib/jvm/jre/include -I/usr/include/nspr -I/usr/include/nss -L/usr/lib64 -L/usr/lib64 -o /usr/src/RPM/BUILD/jss-5.4.2/x86_64-alt-linux/lib/ASN1Util.o -c /usr/src/RPM/BUILD/jss-5.4.2/native/src/main/native/org/mozilla/jss/asn1/ASN1Util.c
gmake[2]: Leaving directory '/usr/src/RPM/BUILD/jss-5.4.2/x86_64-alt-linux'
gmake[2]: Entering directory '/usr/src/RPM/BUILD/jss-5.4.2/x86_64-alt-linux'
[ 21%] Generating lib/PRFDProxy.o
cd /usr/src/RPM/BUILD/jss-5.4.2/native/src/main/native/org/mozilla/jss/nss && /usr/bin/cc -fPIC -flto=auto -O2 -g -Wall -frecord-gcc-switches -pipe -O2 -Wall -std=gnu99 -Wno-cast-function-type -Wno-unused-parameter -Wno-unknown-warning-option -Wno-unused-but-set-variable -Werror-implicit-function-declaration -Wno-switch -I/usr/src/RPM/BUILD/jss-5.4.2/x86_64-alt-linux/include/jss -I/usr/lib/jvm/jre/include -I/usr/lib/jvm/jre/include/linux -I/usr/lib/jvm/jre/include -I/usr/include/nspr -I/usr/include/nss -L/usr/lib64 -L/usr/lib64 -o /usr/src/RPM/BUILD/jss-5.4.2/x86_64-alt-linux/lib/PRFDProxy.o -c /usr/src/RPM/BUILD/jss-5.4.2/native/src/main/native/org/mozilla/jss/nss/PRFDProxy.c
gmake[2]: Leaving directory '/usr/src/RPM/BUILD/jss-5.4.2/x86_64-alt-linux'
gmake[2]: Entering directory '/usr/src/RPM/BUILD/jss-5.4.2/x86_64-alt-linux'
[ 15%] Generating lib/SecretDecoderRing.o
cd /usr/src/RPM/BUILD/jss-5.4.2/native/src/main/native/org/mozilla/jss/crypto && /usr/bin/cc -fPIC -flto=auto -O2 -g -Wall -frecord-gcc-switches -pipe -O2 -Wall -std=gnu99 -Wno-cast-function-type -Wno-unused-parameter -Wno-unknown-warning-option -Wno-unused-but-set-variable -Werror-implicit-function-declaration -Wno-switch -I/usr/src/RPM/BUILD/jss-5.4.2/x86_64-alt-linux/include/jss -I/usr/lib/jvm/jre/include -I/usr/lib/jvm/jre/include/linux -I/usr/lib/jvm/jre/include -I/usr/include/nspr -I/usr/include/nss -L/usr/lib64 -L/usr/lib64 -o /usr/src/RPM/BUILD/jss-5.4.2/x86_64-alt-linux/lib/SecretDecoderRing.o -c /usr/src/RPM/BUILD/jss-5.4.2/native/src/main/native/org/mozilla/jss/crypto/SecretDecoderRing.c
gmake[2]: Leaving directory '/usr/src/RPM/BUILD/jss-5.4.2/x86_64-alt-linux'
gmake[2]: Entering directory '/usr/src/RPM/BUILD/jss-5.4.2/x86_64-alt-linux'
[ 21%] Generating lib/PR.o
cd /usr/src/RPM/BUILD/jss-5.4.2/native/src/main/native/org/mozilla/jss/nss && /usr/bin/cc -fPIC -flto=auto -O2 -g -Wall -frecord-gcc-switches -pipe -O2 -Wall -std=gnu99 -Wno-cast-function-type -Wno-unused-parameter -Wno-unknown-warning-option -Wno-unused-but-set-variable -Werror-implicit-function-declaration -Wno-switch -I/usr/src/RPM/BUILD/jss-5.4.2/x86_64-alt-linux/include/jss -I/usr/lib/jvm/jre/include -I/usr/lib/jvm/jre/include/linux -I/usr/lib/jvm/jre/include -I/usr/include/nspr -I/usr/include/nss -L/usr/lib64 -L/usr/lib64 -o /usr/src/RPM/BUILD/jss-5.4.2/x86_64-alt-linux/lib/PR.o -c /usr/src/RPM/BUILD/jss-5.4.2/native/src/main/native/org/mozilla/jss/nss/PR.c
gmake[2]: Leaving directory '/usr/src/RPM/BUILD/jss-5.4.2/x86_64-alt-linux'
gmake[2]: Entering directory '/usr/src/RPM/BUILD/jss-5.4.2/x86_64-alt-linux'
[ 14%] Generating lib/KBKDF.o
cd /usr/src/RPM/BUILD/jss-5.4.2/native/src/main/native/org/mozilla/jss/crypto && /usr/bin/cc -fPIC -flto=auto -O2 -g -Wall -frecord-gcc-switches -pipe -O2 -Wall -std=gnu99 -Wno-cast-function-type -Wno-unused-parameter -Wno-unknown-warning-option -Wno-unused-but-set-variable -Werror-implicit-function-declaration -Wno-switch -I/usr/src/RPM/BUILD/jss-5.4.2/x86_64-alt-linux/include/jss -I/usr/lib/jvm/jre/include -I/usr/lib/jvm/jre/include/linux -I/usr/lib/jvm/jre/include -I/usr/include/nspr -I/usr/include/nss -L/usr/lib64 -L/usr/lib64 -o /usr/src/RPM/BUILD/jss-5.4.2/x86_64-alt-linux/lib/KBKDF.o -c /usr/src/RPM/BUILD/jss-5.4.2/native/src/main/native/org/mozilla/jss/crypto/KBKDF.c
gmake[2]: Leaving directory '/usr/src/RPM/BUILD/jss-5.4.2/x86_64-alt-linux'
gmake[2]: Entering directory '/usr/src/RPM/BUILD/jss-5.4.2/x86_64-alt-linux'
[  3%] Generating lib/CryptoManager.o
cd /usr/src/RPM/BUILD/jss-5.4.2/native/src/main/native/org/mozilla/jss && /usr/bin/cc -fPIC -flto=auto -O2 -g -Wall -frecord-gcc-switches -pipe -O2 -Wall -std=gnu99 -Wno-cast-function-type -Wno-unused-parameter -Wno-unknown-warning-option -Wno-unused-but-set-variable -Werror-implicit-function-declaration -Wno-switch -I/usr/src/RPM/BUILD/jss-5.4.2/x86_64-alt-linux/include/jss -I/usr/lib/jvm/jre/include -I/usr/lib/jvm/jre/include/linux -I/usr/lib/jvm/jre/include -I/usr/include/nspr -I/usr/include/nss -L/usr/lib64 -L/usr/lib64 -o /usr/src/RPM/BUILD/jss-5.4.2/x86_64-alt-linux/lib/CryptoManager.o -c /usr/src/RPM/BUILD/jss-5.4.2/native/src/main/native/org/mozilla/jss/CryptoManager.c
gmake[2]: Leaving directory '/usr/src/RPM/BUILD/jss-5.4.2/x86_64-alt-linux'
gmake[2]: Entering directory '/usr/src/RPM/BUILD/jss-5.4.2/x86_64-alt-linux'
[  5%] Generating lib/PK11Finder.o
cd /usr/src/RPM/BUILD/jss-5.4.2/native/src/main/native/org/mozilla/jss && /usr/bin/cc -fPIC -flto=auto -O2 -g -Wall -frecord-gcc-switches -pipe -O2 -Wall -std=gnu99 -Wno-cast-function-type -Wno-unused-parameter -Wno-unknown-warning-option -Wno-unused-but-set-variable -Werror-implicit-function-declaration -Wno-switch -I/usr/src/RPM/BUILD/jss-5.4.2/x86_64-alt-linux/include/jss -I/usr/lib/jvm/jre/include -I/usr/lib/jvm/jre/include/linux -I/usr/lib/jvm/jre/include -I/usr/include/nspr -I/usr/include/nss -L/usr/lib64 -L/usr/lib64 -o /usr/src/RPM/BUILD/jss-5.4.2/x86_64-alt-linux/lib/PK11Finder.o -c /usr/src/RPM/BUILD/jss-5.4.2/native/src/main/native/org/mozilla/jss/PK11Finder.c
gmake[2]: Leaving directory '/usr/src/RPM/BUILD/jss-5.4.2/x86_64-alt-linux'
gmake[2]: Entering directory '/usr/src/RPM/BUILD/jss-5.4.2/x86_64-alt-linux'
[ 24%] Generating lib/SECErrors.o
cd /usr/src/RPM/BUILD/jss-5.4.2/native/src/main/native/org/mozilla/jss/nss && /usr/bin/cc -fPIC -flto=auto -O2 -g -Wall -frecord-gcc-switches -pipe -O2 -Wall -std=gnu99 -Wno-cast-function-type -Wno-unused-parameter -Wno-unknown-warning-option -Wno-unused-but-set-variable -Werror-implicit-function-declaration -Wno-switch -I/usr/src/RPM/BUILD/jss-5.4.2/x86_64-alt-linux/include/jss -I/usr/lib/jvm/jre/include -I/usr/lib/jvm/jre/include/linux -I/usr/lib/jvm/jre/include -I/usr/include/nspr -I/usr/include/nss -L/usr/lib64 -L/usr/lib64 -o /usr/src/RPM/BUILD/jss-5.4.2/x86_64-alt-linux/lib/SECErrors.o -c /usr/src/RPM/BUILD/jss-5.4.2/native/src/main/native/org/mozilla/jss/nss/SECErrors.c
gmake[2]: Leaving directory '/usr/src/RPM/BUILD/jss-5.4.2/x86_64-alt-linux'
gmake[2]: Entering directory '/usr/src/RPM/BUILD/jss-5.4.2/x86_64-alt-linux'
[ 28%] Generating lib/SSLErrors.o
cd /usr/src/RPM/BUILD/jss-5.4.2/native/src/main/native/org/mozilla/jss/nss && /usr/bin/cc -fPIC -flto=auto -O2 -g -Wall -frecord-gcc-switches -pipe -O2 -Wall -std=gnu99 -Wno-cast-function-type -Wno-unused-parameter -Wno-unknown-warning-option -Wno-unused-but-set-variable -Werror-implicit-function-declaration -Wno-switch -I/usr/src/RPM/BUILD/jss-5.4.2/x86_64-alt-linux/include/jss -I/usr/lib/jvm/jre/include -I/usr/lib/jvm/jre/include/linux -I/usr/lib/jvm/jre/include -I/usr/include/nspr -I/usr/include/nss -L/usr/lib64 -L/usr/lib64 -o /usr/src/RPM/BUILD/jss-5.4.2/x86_64-alt-linux/lib/SSLErrors.o -c /usr/src/RPM/BUILD/jss-5.4.2/native/src/main/native/org/mozilla/jss/nss/SSLErrors.c
gmake[2]: Leaving directory '/usr/src/RPM/BUILD/jss-5.4.2/x86_64-alt-linux'
gmake[2]: Entering directory '/usr/src/RPM/BUILD/jss-5.4.2/x86_64-alt-linux'
[ 29%] Generating lib/PK11Cipher.o
cd /usr/src/RPM/BUILD/jss-5.4.2/native/src/main/native/org/mozilla/jss/pkcs11 && /usr/bin/cc -fPIC -flto=auto -O2 -g -Wall -frecord-gcc-switches -pipe -O2 -Wall -std=gnu99 -Wno-cast-function-type -Wno-unused-parameter -Wno-unknown-warning-option -Wno-unused-but-set-variable -Werror-implicit-function-declaration -Wno-switch -I/usr/src/RPM/BUILD/jss-5.4.2/x86_64-alt-linux/include/jss -I/usr/lib/jvm/jre/include -I/usr/lib/jvm/jre/include/linux -I/usr/lib/jvm/jre/include -I/usr/include/nspr -I/usr/include/nss -L/usr/lib64 -L/usr/lib64 -o /usr/src/RPM/BUILD/jss-5.4.2/x86_64-alt-linux/lib/PK11Cipher.o -c /usr/src/RPM/BUILD/jss-5.4.2/native/src/main/native/org/mozilla/jss/pkcs11/PK11Cipher.c
gmake[2]: Leaving directory '/usr/src/RPM/BUILD/jss-5.4.2/x86_64-alt-linux'
gmake[2]: Entering directory '/usr/src/RPM/BUILD/jss-5.4.2/x86_64-alt-linux'
[ 36%] Generating lib/PK11MessageDigest.o
cd /usr/src/RPM/BUILD/jss-5.4.2/native/src/main/native/org/mozilla/jss/pkcs11 && /usr/bin/cc -fPIC -flto=auto -O2 -g -Wall -frecord-gcc-switches -pipe -O2 -Wall -std=gnu99 -Wno-cast-function-type -Wno-unused-parameter -Wno-unknown-warning-option -Wno-unused-but-set-variable -Werror-implicit-function-declaration -Wno-switch -I/usr/src/RPM/BUILD/jss-5.4.2/x86_64-alt-linux/include/jss -I/usr/lib/jvm/jre/include -I/usr/lib/jvm/jre/include/linux -I/usr/lib/jvm/jre/include -I/usr/include/nspr -I/usr/include/nss -L/usr/lib64 -L/usr/lib64 -o /usr/src/RPM/BUILD/jss-5.4.2/x86_64-alt-linux/lib/PK11MessageDigest.o -c /usr/src/RPM/BUILD/jss-5.4.2/native/src/main/native/org/mozilla/jss/pkcs11/PK11MessageDigest.c
gmake[2]: Leaving directory '/usr/src/RPM/BUILD/jss-5.4.2/x86_64-alt-linux'
gmake[2]: Entering directory '/usr/src/RPM/BUILD/jss-5.4.2/x86_64-alt-linux'
[ 40%] Generating lib/PK11SecureRandom.o
cd /usr/src/RPM/BUILD/jss-5.4.2/native/src/main/native/org/mozilla/jss/pkcs11 && /usr/bin/cc -fPIC -flto=auto -O2 -g -Wall -frecord-gcc-switches -pipe -O2 -Wall -std=gnu99 -Wno-cast-function-type -Wno-unused-parameter -Wno-unknown-warning-option -Wno-unused-but-set-variable -Werror-implicit-function-declaration -Wno-switch -I/usr/src/RPM/BUILD/jss-5.4.2/x86_64-alt-linux/include/jss -I/usr/lib/jvm/jre/include -I/usr/lib/jvm/jre/include/linux -I/usr/lib/jvm/jre/include -I/usr/include/nspr -I/usr/include/nss -L/usr/lib64 -L/usr/lib64 -o /usr/src/RPM/BUILD/jss-5.4.2/x86_64-alt-linux/lib/PK11SecureRandom.o -c /usr/src/RPM/BUILD/jss-5.4.2/native/src/main/native/org/mozilla/jss/pkcs11/PK11SecureRandom.c
gmake[2]: Leaving directory '/usr/src/RPM/BUILD/jss-5.4.2/x86_64-alt-linux'
gmake[2]: Entering directory '/usr/src/RPM/BUILD/jss-5.4.2/x86_64-alt-linux'
[ 36%] Generating lib/PK11KeyPairGenerator.o
cd /usr/src/RPM/BUILD/jss-5.4.2/native/src/main/native/org/mozilla/jss/pkcs11 && /usr/bin/cc -fPIC -flto=auto -O2 -g -Wall -frecord-gcc-switches -pipe -O2 -Wall -std=gnu99 -Wno-cast-function-type -Wno-unused-parameter -Wno-unknown-warning-option -Wno-unused-but-set-variable -Werror-implicit-function-declaration -Wno-switch -I/usr/src/RPM/BUILD/jss-5.4.2/x86_64-alt-linux/include/jss -I/usr/lib/jvm/jre/include -I/usr/lib/jvm/jre/include/linux -I/usr/lib/jvm/jre/include -I/usr/include/nspr -I/usr/include/nss -L/usr/lib64 -L/usr/lib64 -o /usr/src/RPM/BUILD/jss-5.4.2/x86_64-alt-linux/lib/PK11KeyPairGenerator.o -c /usr/src/RPM/BUILD/jss-5.4.2/native/src/main/native/org/mozilla/jss/pkcs11/PK11KeyPairGenerator.c
gmake[2]: Leaving directory '/usr/src/RPM/BUILD/jss-5.4.2/x86_64-alt-linux'
gmake[2]: Entering directory '/usr/src/RPM/BUILD/jss-5.4.2/x86_64-alt-linux'
[ 28%] Generating lib/SSLFDProxy.o
cd /usr/src/RPM/BUILD/jss-5.4.2/native/src/main/native/org/mozilla/jss/nss && /usr/bin/cc -fPIC -flto=auto -O2 -g -Wall -frecord-gcc-switches -pipe -O2 -Wall -std=gnu99 -Wno-cast-function-type -Wno-unused-parameter -Wno-unknown-warning-option -Wno-unused-but-set-variable -Werror-implicit-function-declaration -Wno-switch -I/usr/src/RPM/BUILD/jss-5.4.2/x86_64-alt-linux/include/jss -I/usr/lib/jvm/jre/include -I/usr/lib/jvm/jre/include/linux -I/usr/lib/jvm/jre/include -I/usr/include/nspr -I/usr/include/nss -L/usr/lib64 -L/usr/lib64 -o /usr/src/RPM/BUILD/jss-5.4.2/x86_64-alt-linux/lib/SSLFDProxy.o -c /usr/src/RPM/BUILD/jss-5.4.2/native/src/main/native/org/mozilla/jss/nss/SSLFDProxy.c
gmake[2]: Leaving directory '/usr/src/RPM/BUILD/jss-5.4.2/x86_64-alt-linux'
gmake[2]: Entering directory '/usr/src/RPM/BUILD/jss-5.4.2/x86_64-alt-linux'
[ 29%] Generating lib/PK11KeyWrapper.o
cd /usr/src/RPM/BUILD/jss-5.4.2/native/src/main/native/org/mozilla/jss/pkcs11 && /usr/bin/cc -fPIC -flto=auto -O2 -g -Wall -frecord-gcc-switches -pipe -O2 -Wall -std=gnu99 -Wno-cast-function-type -Wno-unused-parameter -Wno-unknown-warning-option -Wno-unused-but-set-variable -Werror-implicit-function-declaration -Wno-switch -I/usr/src/RPM/BUILD/jss-5.4.2/x86_64-alt-linux/include/jss -I/usr/lib/jvm/jre/include -I/usr/lib/jvm/jre/include/linux -I/usr/lib/jvm/jre/include -I/usr/include/nspr -I/usr/include/nss -L/usr/lib64 -L/usr/lib64 -o /usr/src/RPM/BUILD/jss-5.4.2/x86_64-alt-linux/lib/PK11KeyWrapper.o -c /usr/src/RPM/BUILD/jss-5.4.2/native/src/main/native/org/mozilla/jss/pkcs11/PK11KeyWrapper.c
gmake[2]: Leaving directory '/usr/src/RPM/BUILD/jss-5.4.2/x86_64-alt-linux'
gmake[2]: Entering directory '/usr/src/RPM/BUILD/jss-5.4.2/x86_64-alt-linux'
[ 33%] Generating lib/PK11KeyGenerator.o
cd /usr/src/RPM/BUILD/jss-5.4.2/native/src/main/native/org/mozilla/jss/pkcs11 && /usr/bin/cc -fPIC -flto=auto -O2 -g -Wall -frecord-gcc-switches -pipe -O2 -Wall -std=gnu99 -Wno-cast-function-type -Wno-unused-parameter -Wno-unknown-warning-option -Wno-unused-but-set-variable -Werror-implicit-function-declaration -Wno-switch -I/usr/src/RPM/BUILD/jss-5.4.2/x86_64-alt-linux/include/jss -I/usr/lib/jvm/jre/include -I/usr/lib/jvm/jre/include/linux -I/usr/lib/jvm/jre/include -I/usr/include/nspr -I/usr/include/nss -L/usr/lib64 -L/usr/lib64 -o /usr/src/RPM/BUILD/jss-5.4.2/x86_64-alt-linux/lib/PK11KeyGenerator.o -c /usr/src/RPM/BUILD/jss-5.4.2/native/src/main/native/org/mozilla/jss/pkcs11/PK11KeyGenerator.c
gmake[2]: Leaving directory '/usr/src/RPM/BUILD/jss-5.4.2/x86_64-alt-linux'
gmake[2]: Entering directory '/usr/src/RPM/BUILD/jss-5.4.2/x86_64-alt-linux'
[ 40%] Generating lib/PK11PubKey.o
cd /usr/src/RPM/BUILD/jss-5.4.2/native/src/main/native/org/mozilla/jss/pkcs11 && /usr/bin/cc -fPIC -flto=auto -O2 -g -Wall -frecord-gcc-switches -pipe -O2 -Wall -std=gnu99 -Wno-cast-function-type -Wno-unused-parameter -Wno-unknown-warning-option -Wno-unused-but-set-variable -Werror-implicit-function-declaration -Wno-switch -I/usr/src/RPM/BUILD/jss-5.4.2/x86_64-alt-linux/include/jss -I/usr/lib/jvm/jre/include -I/usr/lib/jvm/jre/include/linux -I/usr/lib/jvm/jre/include -I/usr/include/nspr -I/usr/include/nss -L/usr/lib64 -L/usr/lib64 -o /usr/src/RPM/BUILD/jss-5.4.2/x86_64-alt-linux/lib/PK11PubKey.o -c /usr/src/RPM/BUILD/jss-5.4.2/native/src/main/native/org/mozilla/jss/pkcs11/PK11PubKey.c
gmake[2]: Leaving directory '/usr/src/RPM/BUILD/jss-5.4.2/x86_64-alt-linux'
gmake[2]: Entering directory '/usr/src/RPM/BUILD/jss-5.4.2/x86_64-alt-linux'
[ 31%] Generating lib/PK11Module.o
cd /usr/src/RPM/BUILD/jss-5.4.2/native/src/main/native/org/mozilla/jss/pkcs11 && /usr/bin/cc -fPIC -flto=auto -O2 -g -Wall -frecord-gcc-switches -pipe -O2 -Wall -std=gnu99 -Wno-cast-function-type -Wno-unused-parameter -Wno-unknown-warning-option -Wno-unused-but-set-variable -Werror-implicit-function-declaration -Wno-switch -I/usr/src/RPM/BUILD/jss-5.4.2/x86_64-alt-linux/include/jss -I/usr/lib/jvm/jre/include -I/usr/lib/jvm/jre/include/linux -I/usr/lib/jvm/jre/include -I/usr/include/nspr -I/usr/include/nss -L/usr/lib64 -L/usr/lib64 -o /usr/src/RPM/BUILD/jss-5.4.2/x86_64-alt-linux/lib/PK11Module.o -c /usr/src/RPM/BUILD/jss-5.4.2/native/src/main/native/org/mozilla/jss/pkcs11/PK11Module.c
gmake[2]: Leaving directory '/usr/src/RPM/BUILD/jss-5.4.2/x86_64-alt-linux'
gmake[2]: Entering directory '/usr/src/RPM/BUILD/jss-5.4.2/x86_64-alt-linux'
[ 38%] Generating lib/PK11PrivKey.o
cd /usr/src/RPM/BUILD/jss-5.4.2/native/src/main/native/org/mozilla/jss/pkcs11 && /usr/bin/cc -fPIC -flto=auto -O2 -g -Wall -frecord-gcc-switches -pipe -O2 -Wall -std=gnu99 -Wno-cast-function-type -Wno-unused-parameter -Wno-unknown-warning-option -Wno-unused-but-set-variable -Werror-implicit-function-declaration -Wno-switch -I/usr/src/RPM/BUILD/jss-5.4.2/x86_64-alt-linux/include/jss -I/usr/lib/jvm/jre/include -I/usr/lib/jvm/jre/include/linux -I/usr/lib/jvm/jre/include -I/usr/include/nspr -I/usr/include/nss -L/usr/lib64 -L/usr/lib64 -o /usr/src/RPM/BUILD/jss-5.4.2/x86_64-alt-linux/lib/PK11PrivKey.o -c /usr/src/RPM/BUILD/jss-5.4.2/native/src/main/native/org/mozilla/jss/pkcs11/PK11PrivKey.c
gmake[2]: Leaving directory '/usr/src/RPM/BUILD/jss-5.4.2/x86_64-alt-linux'
gmake[2]: Entering directory '/usr/src/RPM/BUILD/jss-5.4.2/x86_64-alt-linux'
[ 29%] Generating lib/PK11Cert.o
cd /usr/src/RPM/BUILD/jss-5.4.2/native/src/main/native/org/mozilla/jss/pkcs11 && /usr/bin/cc -fPIC -flto=auto -O2 -g -Wall -frecord-gcc-switches -pipe -O2 -Wall -std=gnu99 -Wno-cast-function-type -Wno-unused-parameter -Wno-unknown-warning-option -Wno-unused-but-set-variable -Werror-implicit-function-declaration -Wno-switch -I/usr/src/RPM/BUILD/jss-5.4.2/x86_64-alt-linux/include/jss -I/usr/lib/jvm/jre/include -I/usr/lib/jvm/jre/include/linux -I/usr/lib/jvm/jre/include -I/usr/include/nspr -I/usr/include/nss -L/usr/lib64 -L/usr/lib64 -o /usr/src/RPM/BUILD/jss-5.4.2/x86_64-alt-linux/lib/PK11Cert.o -c /usr/src/RPM/BUILD/jss-5.4.2/native/src/main/native/org/mozilla/jss/pkcs11/PK11Cert.c
gmake[2]: Leaving directory '/usr/src/RPM/BUILD/jss-5.4.2/x86_64-alt-linux'
gmake[2]: Entering directory '/usr/src/RPM/BUILD/jss-5.4.2/x86_64-alt-linux'
[ 26%] Generating lib/SSL.o
cd /usr/src/RPM/BUILD/jss-5.4.2/native/src/main/native/org/mozilla/jss/nss && /usr/bin/cc -fPIC -flto=auto -O2 -g -Wall -frecord-gcc-switches -pipe -O2 -Wall -std=gnu99 -Wno-cast-function-type -Wno-unused-parameter -Wno-unknown-warning-option -Wno-unused-but-set-variable -Werror-implicit-function-declaration -Wno-switch -I/usr/src/RPM/BUILD/jss-5.4.2/x86_64-alt-linux/include/jss -I/usr/lib/jvm/jre/include -I/usr/lib/jvm/jre/include/linux -I/usr/lib/jvm/jre/include -I/usr/include/nspr -I/usr/include/nss -L/usr/lib64 -L/usr/lib64 -o /usr/src/RPM/BUILD/jss-5.4.2/x86_64-alt-linux/lib/SSL.o -c /usr/src/RPM/BUILD/jss-5.4.2/native/src/main/native/org/mozilla/jss/nss/SSL.c
gmake[2]: Leaving directory '/usr/src/RPM/BUILD/jss-5.4.2/x86_64-alt-linux'
gmake[2]: Entering directory '/usr/src/RPM/BUILD/jss-5.4.2/x86_64-alt-linux'
[ 42%] Generating lib/PK11Signature.o
cd /usr/src/RPM/BUILD/jss-5.4.2/native/src/main/native/org/mozilla/jss/pkcs11 && /usr/bin/cc -fPIC -flto=auto -O2 -g -Wall -frecord-gcc-switches -pipe -O2 -Wall -std=gnu99 -Wno-cast-function-type -Wno-unused-parameter -Wno-unknown-warning-option -Wno-unused-but-set-variable -Werror-implicit-function-declaration -Wno-switch -I/usr/src/RPM/BUILD/jss-5.4.2/x86_64-alt-linux/include/jss -I/usr/lib/jvm/jre/include -I/usr/lib/jvm/jre/include/linux -I/usr/lib/jvm/jre/include -I/usr/include/nspr -I/usr/include/nss -L/usr/lib64 -L/usr/lib64 -o /usr/src/RPM/BUILD/jss-5.4.2/x86_64-alt-linux/lib/PK11Signature.o -c /usr/src/RPM/BUILD/jss-5.4.2/native/src/main/native/org/mozilla/jss/pkcs11/PK11Signature.c
gmake[2]: Leaving directory '/usr/src/RPM/BUILD/jss-5.4.2/x86_64-alt-linux'
gmake[2]: Entering directory '/usr/src/RPM/BUILD/jss-5.4.2/x86_64-alt-linux'
[ 43%] Generating lib/PK11Store.o
cd /usr/src/RPM/BUILD/jss-5.4.2/native/src/main/native/org/mozilla/jss/pkcs11 && /usr/bin/cc -fPIC -flto=auto -O2 -g -Wall -frecord-gcc-switches -pipe -O2 -Wall -std=gnu99 -Wno-cast-function-type -Wno-unused-parameter -Wno-unknown-warning-option -Wno-unused-but-set-variable -Werror-implicit-function-declaration -Wno-switch -I/usr/src/RPM/BUILD/jss-5.4.2/x86_64-alt-linux/include/jss -I/usr/lib/jvm/jre/include -I/usr/lib/jvm/jre/include/linux -I/usr/lib/jvm/jre/include -I/usr/include/nspr -I/usr/include/nss -L/usr/lib64 -L/usr/lib64 -o /usr/src/RPM/BUILD/jss-5.4.2/x86_64-alt-linux/lib/PK11Store.o -c /usr/src/RPM/BUILD/jss-5.4.2/native/src/main/native/org/mozilla/jss/pkcs11/PK11Store.c
gmake[2]: Leaving directory '/usr/src/RPM/BUILD/jss-5.4.2/x86_64-alt-linux'
gmake[2]: Entering directory '/usr/src/RPM/BUILD/jss-5.4.2/x86_64-alt-linux'
[  1%] Generating staging.jar
/usr/lib/jvm/jre/bin/jar cmf /usr/src/RPM/BUILD/jss-5.4.2/x86_64-alt-linux/MANIFEST.MF /usr/src/RPM/BUILD/jss-5.4.2/x86_64-alt-linux/staging.jar -C /usr/src/RPM/BUILD/jss-5.4.2/x86_64-alt-linux/classes/jss org -C /usr/src/RPM/BUILD/jss-5.4.2/x86_64-alt-linux/classes/jss META-INF
gmake[2]: Leaving directory '/usr/src/RPM/BUILD/jss-5.4.2/x86_64-alt-linux'
gmake[1]: Entering directory '/usr/src/RPM/BUILD/jss-5.4.2/x86_64-alt-linux'
[ 66%] Built target generate_build_jar
gmake[1]: Leaving directory '/usr/src/RPM/BUILD/jss-5.4.2/x86_64-alt-linux'
/usr/bin/gmake  -f CMakeFiles/generate_jar.dir/build.make CMakeFiles/generate_jar.dir/depend
gmake[2]: Entering directory '/usr/src/RPM/BUILD/jss-5.4.2/x86_64-alt-linux'
[ 49%] Generating lib/CKAttribute.o
cd /usr/src/RPM/BUILD/jss-5.4.2/native/src/main/native/org/mozilla/jss/pkcs11/attrs && /usr/bin/cc -fPIC -flto=auto -O2 -g -Wall -frecord-gcc-switches -pipe -O2 -Wall -std=gnu99 -Wno-cast-function-type -Wno-unused-parameter -Wno-unknown-warning-option -Wno-unused-but-set-variable -Werror-implicit-function-declaration -Wno-switch -I/usr/src/RPM/BUILD/jss-5.4.2/x86_64-alt-linux/include/jss -I/usr/lib/jvm/jre/include -I/usr/lib/jvm/jre/include/linux -I/usr/lib/jvm/jre/include -I/usr/include/nspr -I/usr/include/nss -L/usr/lib64 -L/usr/lib64 -o /usr/src/RPM/BUILD/jss-5.4.2/x86_64-alt-linux/lib/CKAttribute.o -c /usr/src/RPM/BUILD/jss-5.4.2/native/src/main/native/org/mozilla/jss/pkcs11/attrs/CKAttribute.c
gmake[2]: Leaving directory '/usr/src/RPM/BUILD/jss-5.4.2/x86_64-alt-linux'
gmake[2]: Entering directory '/usr/src/RPM/BUILD/jss-5.4.2/x86_64-alt-linux'
[ 47%] Generating lib/PK11SymmetricKeyDeriver.o
cd /usr/src/RPM/BUILD/jss-5.4.2/native/src/main/native/org/mozilla/jss/pkcs11 && /usr/bin/cc -fPIC -flto=auto -O2 -g -Wall -frecord-gcc-switches -pipe -O2 -Wall -std=gnu99 -Wno-cast-function-type -Wno-unused-parameter -Wno-unknown-warning-option -Wno-unused-but-set-variable -Werror-implicit-function-declaration -Wno-switch -I/usr/src/RPM/BUILD/jss-5.4.2/x86_64-alt-linux/include/jss -I/usr/lib/jvm/jre/include -I/usr/lib/jvm/jre/include/linux -I/usr/lib/jvm/jre/include -I/usr/include/nspr -I/usr/include/nss -L/usr/lib64 -L/usr/lib64 -o /usr/src/RPM/BUILD/jss-5.4.2/x86_64-alt-linux/lib/PK11SymmetricKeyDeriver.o -c /usr/src/RPM/BUILD/jss-5.4.2/native/src/main/native/org/mozilla/jss/pkcs11/PK11SymmetricKeyDeriver.c
gmake[2]: Leaving directory '/usr/src/RPM/BUILD/jss-5.4.2/x86_64-alt-linux'
gmake[2]: Entering directory '/usr/src/RPM/BUILD/jss-5.4.2/x86_64-alt-linux'
[ 47%] Generating lib/PK11SymKey.o
cd /usr/src/RPM/BUILD/jss-5.4.2/native/src/main/native/org/mozilla/jss/pkcs11 && /usr/bin/cc -fPIC -flto=auto -O2 -g -Wall -frecord-gcc-switches -pipe -O2 -Wall -std=gnu99 -Wno-cast-function-type -Wno-unused-parameter -Wno-unknown-warning-option -Wno-unused-but-set-variable -Werror-implicit-function-declaration -Wno-switch -I/usr/src/RPM/BUILD/jss-5.4.2/x86_64-alt-linux/include/jss -I/usr/lib/jvm/jre/include -I/usr/lib/jvm/jre/include/linux -I/usr/lib/jvm/jre/include -I/usr/include/nspr -I/usr/include/nss -L/usr/lib64 -L/usr/lib64 -o /usr/src/RPM/BUILD/jss-5.4.2/x86_64-alt-linux/lib/PK11SymKey.o -c /usr/src/RPM/BUILD/jss-5.4.2/native/src/main/native/org/mozilla/jss/pkcs11/PK11SymKey.c
gmake[2]: Leaving directory '/usr/src/RPM/BUILD/jss-5.4.2/x86_64-alt-linux'
gmake[2]: Entering directory '/usr/src/RPM/BUILD/jss-5.4.2/x86_64-alt-linux'
[ 64%] Generating lib/j_buffer.o
cd /usr/src/RPM/BUILD/jss-5.4.2/native/src/main/native/org/mozilla/jss/ssl/javax && /usr/bin/cc -fPIC -flto=auto -O2 -g -Wall -frecord-gcc-switches -pipe -O2 -Wall -std=gnu99 -Wno-cast-function-type -Wno-unused-parameter -Wno-unknown-warning-option -Wno-unused-but-set-variable -Werror-implicit-function-declaration -Wno-switch -I/usr/src/RPM/BUILD/jss-5.4.2/x86_64-alt-linux/include/jss -I/usr/lib/jvm/jre/include -I/usr/lib/jvm/jre/include/linux -I/usr/lib/jvm/jre/include -I/usr/include/nspr -I/usr/include/nss -L/usr/lib64 -L/usr/lib64 -o /usr/src/RPM/BUILD/jss-5.4.2/x86_64-alt-linux/lib/j_buffer.o -c /usr/src/RPM/BUILD/jss-5.4.2/native/src/main/native/org/mozilla/jss/ssl/javax/j_buffer.c
gmake[2]: Leaving directory '/usr/src/RPM/BUILD/jss-5.4.2/x86_64-alt-linux'
gmake[2]: Entering directory '/usr/src/RPM/BUILD/jss-5.4.2/x86_64-alt-linux'
cd /usr/src/RPM/BUILD/jss-5.4.2/x86_64-alt-linux && /usr/bin/cmake -E cmake_depends "Unix Makefiles" /usr/src/RPM/BUILD/jss-5.4.2 /usr/src/RPM/BUILD/jss-5.4.2 /usr/src/RPM/BUILD/jss-5.4.2/x86_64-alt-linux /usr/src/RPM/BUILD/jss-5.4.2/x86_64-alt-linux /usr/src/RPM/BUILD/jss-5.4.2/x86_64-alt-linux/CMakeFiles/generate_jar.dir/DependInfo.cmake "--color="
gmake[2]: Leaving directory '/usr/src/RPM/BUILD/jss-5.4.2/x86_64-alt-linux'
/usr/bin/gmake  -f CMakeFiles/generate_jar.dir/build.make CMakeFiles/generate_jar.dir/build
gmake[2]: Entering directory '/usr/src/RPM/BUILD/jss-5.4.2/x86_64-alt-linux'
[ 63%] Generating lib/BufferPRFD.o
cd /usr/src/RPM/BUILD/jss-5.4.2/native/src/main/native/org/mozilla/jss/ssl/javax && /usr/bin/cc -fPIC -flto=auto -O2 -g -Wall -frecord-gcc-switches -pipe -O2 -Wall -std=gnu99 -Wno-cast-function-type -Wno-unused-parameter -Wno-unknown-warning-option -Wno-unused-but-set-variable -Werror-implicit-function-declaration -Wno-switch -I/usr/src/RPM/BUILD/jss-5.4.2/x86_64-alt-linux/include/jss -I/usr/lib/jvm/jre/include -I/usr/lib/jvm/jre/include/linux -I/usr/lib/jvm/jre/include -I/usr/include/nspr -I/usr/include/nss -L/usr/lib64 -L/usr/lib64 -o /usr/src/RPM/BUILD/jss-5.4.2/x86_64-alt-linux/lib/BufferPRFD.o -c /usr/src/RPM/BUILD/jss-5.4.2/native/src/main/native/org/mozilla/jss/ssl/javax/BufferPRFD.c
gmake[2]: Leaving directory '/usr/src/RPM/BUILD/jss-5.4.2/x86_64-alt-linux'
gmake[2]: Entering directory '/usr/src/RPM/BUILD/jss-5.4.2/x86_64-alt-linux'
[ 52%] Generating lib/SSLCipher.o
cd /usr/src/RPM/BUILD/jss-5.4.2/native/src/main/native/org/mozilla/jss/ssl && /usr/bin/cc -fPIC -flto=auto -O2 -g -Wall -frecord-gcc-switches -pipe -O2 -Wall -std=gnu99 -Wno-cast-function-type -Wno-unused-parameter -Wno-unknown-warning-option -Wno-unused-but-set-variable -Werror-implicit-function-declaration -Wno-switch -I/usr/src/RPM/BUILD/jss-5.4.2/x86_64-alt-linux/include/jss -I/usr/lib/jvm/jre/include -I/usr/lib/jvm/jre/include/linux -I/usr/lib/jvm/jre/include -I/usr/include/nspr -I/usr/include/nss -L/usr/lib64 -L/usr/lib64 -o /usr/src/RPM/BUILD/jss-5.4.2/x86_64-alt-linux/lib/SSLCipher.o -c /usr/src/RPM/BUILD/jss-5.4.2/native/src/main/native/org/mozilla/jss/ssl/SSLCipher.c
gmake[2]: Leaving directory '/usr/src/RPM/BUILD/jss-5.4.2/x86_64-alt-linux'
gmake[2]: Entering directory '/usr/src/RPM/BUILD/jss-5.4.2/x86_64-alt-linux'
[ 59%] Generating lib/SSLVersionRange.o
cd /usr/src/RPM/BUILD/jss-5.4.2/native/src/main/native/org/mozilla/jss/ssl && /usr/bin/cc -fPIC -flto=auto -O2 -g -Wall -frecord-gcc-switches -pipe -O2 -Wall -std=gnu99 -Wno-cast-function-type -Wno-unused-parameter -Wno-unknown-warning-option -Wno-unused-but-set-variable -Werror-implicit-function-declaration -Wno-switch -I/usr/src/RPM/BUILD/jss-5.4.2/x86_64-alt-linux/include/jss -I/usr/lib/jvm/jre/include -I/usr/lib/jvm/jre/include/linux -I/usr/lib/jvm/jre/include -I/usr/include/nspr -I/usr/include/nss -L/usr/lib64 -L/usr/lib64 -o /usr/src/RPM/BUILD/jss-5.4.2/x86_64-alt-linux/lib/SSLVersionRange.o -c /usr/src/RPM/BUILD/jss-5.4.2/native/src/main/native/org/mozilla/jss/ssl/SSLVersionRange.c
gmake[2]: Leaving directory '/usr/src/RPM/BUILD/jss-5.4.2/x86_64-alt-linux'
gmake[2]: Entering directory '/usr/src/RPM/BUILD/jss-5.4.2/x86_64-alt-linux'
[ 47%] Generating lib/PK11Token.o
cd /usr/src/RPM/BUILD/jss-5.4.2/native/src/main/native/org/mozilla/jss/pkcs11 && /usr/bin/cc -fPIC -flto=auto -O2 -g -Wall -frecord-gcc-switches -pipe -O2 -Wall -std=gnu99 -Wno-cast-function-type -Wno-unused-parameter -Wno-unknown-warning-option -Wno-unused-but-set-variable -Werror-implicit-function-declaration -Wno-switch -I/usr/src/RPM/BUILD/jss-5.4.2/x86_64-alt-linux/include/jss -I/usr/lib/jvm/jre/include -I/usr/lib/jvm/jre/include/linux -I/usr/lib/jvm/jre/include -I/usr/include/nspr -I/usr/include/nss -L/usr/lib64 -L/usr/lib64 -o /usr/src/RPM/BUILD/jss-5.4.2/x86_64-alt-linux/lib/PK11Token.o -c /usr/src/RPM/BUILD/jss-5.4.2/native/src/main/native/org/mozilla/jss/pkcs11/PK11Token.c
gmake[2]: Leaving directory '/usr/src/RPM/BUILD/jss-5.4.2/x86_64-alt-linux'
gmake[2]: Entering directory '/usr/src/RPM/BUILD/jss-5.4.2/x86_64-alt-linux'
[ 54%] Generating lib/SSLServerSocket.o
cd /usr/src/RPM/BUILD/jss-5.4.2/native/src/main/native/org/mozilla/jss/ssl && /usr/bin/cc -fPIC -flto=auto -O2 -g -Wall -frecord-gcc-switches -pipe -O2 -Wall -std=gnu99 -Wno-cast-function-type -Wno-unused-parameter -Wno-unknown-warning-option -Wno-unused-but-set-variable -Werror-implicit-function-declaration -Wno-switch -I/usr/src/RPM/BUILD/jss-5.4.2/x86_64-alt-linux/include/jss -I/usr/lib/jvm/jre/include -I/usr/lib/jvm/jre/include/linux -I/usr/lib/jvm/jre/include -I/usr/include/nspr -I/usr/include/nss -L/usr/lib64 -L/usr/lib64 -o /usr/src/RPM/BUILD/jss-5.4.2/x86_64-alt-linux/lib/SSLServerSocket.o -c /usr/src/RPM/BUILD/jss-5.4.2/native/src/main/native/org/mozilla/jss/ssl/SSLServerSocket.c
gmake[2]: Leaving directory '/usr/src/RPM/BUILD/jss-5.4.2/x86_64-alt-linux'
gmake[2]: Entering directory '/usr/src/RPM/BUILD/jss-5.4.2/x86_64-alt-linux'
[ 50%] Generating lib/JSSKeyStoreSpi.o
cd /usr/src/RPM/BUILD/jss-5.4.2/native/src/main/native/org/mozilla/jss/provider/java/security && /usr/bin/cc -fPIC -flto=auto -O2 -g -Wall -frecord-gcc-switches -pipe -O2 -Wall -std=gnu99 -Wno-cast-function-type -Wno-unused-parameter -Wno-unknown-warning-option -Wno-unused-but-set-variable -Werror-implicit-function-declaration -Wno-switch -I/usr/src/RPM/BUILD/jss-5.4.2/x86_64-alt-linux/include/jss -I/usr/lib/jvm/jre/include -I/usr/lib/jvm/jre/include/linux -I/usr/lib/jvm/jre/include -I/usr/include/nspr -I/usr/include/nss -L/usr/lib64 -L/usr/lib64 -o /usr/src/RPM/BUILD/jss-5.4.2/x86_64-alt-linux/lib/JSSKeyStoreSpi.o -c /usr/src/RPM/BUILD/jss-5.4.2/native/src/main/native/org/mozilla/jss/provider/java/security/JSSKeyStoreSpi.c
gmake[2]: Leaving directory '/usr/src/RPM/BUILD/jss-5.4.2/x86_64-alt-linux'
gmake[2]: Entering directory '/usr/src/RPM/BUILD/jss-5.4.2/x86_64-alt-linux'
[ 66%] Generating lib/GlobalRefProxy.o
cd /usr/src/RPM/BUILD/jss-5.4.2/native/src/main/native/org/mozilla/jss/util && /usr/bin/cc -fPIC -flto=auto -O2 -g -Wall -frecord-gcc-switches -pipe -O2 -Wall -std=gnu99 -Wno-cast-function-type -Wno-unused-parameter -Wno-unknown-warning-option -Wno-unused-but-set-variable -Werror-implicit-function-declaration -Wno-switch -I/usr/src/RPM/BUILD/jss-5.4.2/x86_64-alt-linux/include/jss -I/usr/lib/jvm/jre/include -I/usr/lib/jvm/jre/include/linux -I/usr/lib/jvm/jre/include -I/usr/include/nspr -I/usr/include/nss -L/usr/lib64 -L/usr/lib64 -o /usr/src/RPM/BUILD/jss-5.4.2/x86_64-alt-linux/lib/GlobalRefProxy.o -c /usr/src/RPM/BUILD/jss-5.4.2/native/src/main/native/org/mozilla/jss/util/GlobalRefProxy.c
gmake[2]: Leaving directory '/usr/src/RPM/BUILD/jss-5.4.2/x86_64-alt-linux'
gmake[2]: Entering directory '/usr/src/RPM/BUILD/jss-5.4.2/x86_64-alt-linux'
[ 77%] Generating lib/jssver.o
cd /usr/src/RPM/BUILD/jss-5.4.2/native/src/main/native/org/mozilla/jss/util && /usr/bin/cc -fPIC -flto=auto -O2 -g -Wall -frecord-gcc-switches -pipe -O2 -Wall -std=gnu99 -Wno-cast-function-type -Wno-unused-parameter -Wno-unknown-warning-option -Wno-unused-but-set-variable -Werror-implicit-function-declaration -Wno-switch -I/usr/src/RPM/BUILD/jss-5.4.2/x86_64-alt-linux/include/jss -I/usr/lib/jvm/jre/include -I/usr/lib/jvm/jre/include/linux -I/usr/lib/jvm/jre/include -I/usr/include/nspr -I/usr/include/nss -L/usr/lib64 -L/usr/lib64 -o /usr/src/RPM/BUILD/jss-5.4.2/x86_64-alt-linux/lib/jssver.o -c /usr/src/RPM/BUILD/jss-5.4.2/native/src/main/native/org/mozilla/jss/util/jssver.c
gmake[2]: Leaving directory '/usr/src/RPM/BUILD/jss-5.4.2/x86_64-alt-linux'
gmake[2]: Entering directory '/usr/src/RPM/BUILD/jss-5.4.2/x86_64-alt-linux'
[ 61%] Generating lib/callbacks.o
cd /usr/src/RPM/BUILD/jss-5.4.2/native/src/main/native/org/mozilla/jss/ssl && /usr/bin/cc -fPIC -flto=auto -O2 -g -Wall -frecord-gcc-switches -pipe -O2 -Wall -std=gnu99 -Wno-cast-function-type -Wno-unused-parameter -Wno-unknown-warning-option -Wno-unused-but-set-variable -Werror-implicit-function-declaration -Wno-switch -I/usr/src/RPM/BUILD/jss-5.4.2/x86_64-alt-linux/include/jss -I/usr/lib/jvm/jre/include -I/usr/lib/jvm/jre/include/linux -I/usr/lib/jvm/jre/include -I/usr/include/nspr -I/usr/include/nss -L/usr/lib64 -L/usr/lib64 -o /usr/src/RPM/BUILD/jss-5.4.2/x86_64-alt-linux/lib/callbacks.o -c /usr/src/RPM/BUILD/jss-5.4.2/native/src/main/native/org/mozilla/jss/ssl/callbacks.c
gmake[2]: Leaving directory '/usr/src/RPM/BUILD/jss-5.4.2/x86_64-alt-linux'
gmake[2]: Entering directory '/usr/src/RPM/BUILD/jss-5.4.2/x86_64-alt-linux'
[ 61%] Generating lib/javasock.o
cd /usr/src/RPM/BUILD/jss-5.4.2/native/src/main/native/org/mozilla/jss/ssl && /usr/bin/cc -fPIC -flto=auto -O2 -g -Wall -frecord-gcc-switches -pipe -O2 -Wall -std=gnu99 -Wno-cast-function-type -Wno-unused-parameter -Wno-unknown-warning-option -Wno-unused-but-set-variable -Werror-implicit-function-declaration -Wno-switch -I/usr/src/RPM/BUILD/jss-5.4.2/x86_64-alt-linux/include/jss -I/usr/lib/jvm/jre/include -I/usr/lib/jvm/jre/include/linux -I/usr/lib/jvm/jre/include -I/usr/include/nspr -I/usr/include/nss -L/usr/lib64 -L/usr/lib64 -o /usr/src/RPM/BUILD/jss-5.4.2/x86_64-alt-linux/lib/javasock.o -c /usr/src/RPM/BUILD/jss-5.4.2/native/src/main/native/org/mozilla/jss/ssl/javasock.c
gmake[2]: Leaving directory '/usr/src/RPM/BUILD/jss-5.4.2/x86_64-alt-linux'
gmake[2]: Entering directory '/usr/src/RPM/BUILD/jss-5.4.2/x86_64-alt-linux'
[ 57%] Generating lib/common.o
cd /usr/src/RPM/BUILD/jss-5.4.2/native/src/main/native/org/mozilla/jss/ssl && /usr/bin/cc -fPIC -flto=auto -O2 -g -Wall -frecord-gcc-switches -pipe -O2 -Wall -std=gnu99 -Wno-cast-function-type -Wno-unused-parameter -Wno-unknown-warning-option -Wno-unused-but-set-variable -Werror-implicit-function-declaration -Wno-switch -I/usr/src/RPM/BUILD/jss-5.4.2/x86_64-alt-linux/include/jss -I/usr/lib/jvm/jre/include -I/usr/lib/jvm/jre/include/linux -I/usr/lib/jvm/jre/include -I/usr/include/nspr -I/usr/include/nss -L/usr/lib64 -L/usr/lib64 -o /usr/src/RPM/BUILD/jss-5.4.2/x86_64-alt-linux/lib/common.o -c /usr/src/RPM/BUILD/jss-5.4.2/native/src/main/native/org/mozilla/jss/ssl/common.c
gmake[2]: Leaving directory '/usr/src/RPM/BUILD/jss-5.4.2/x86_64-alt-linux'
gmake[2]: Entering directory '/usr/src/RPM/BUILD/jss-5.4.2/x86_64-alt-linux'
[ 68%] Generating lib/NativeEnclosure.o
cd /usr/src/RPM/BUILD/jss-5.4.2/native/src/main/native/org/mozilla/jss/util && /usr/bin/cc -fPIC -flto=auto -O2 -g -Wall -frecord-gcc-switches -pipe -O2 -Wall -std=gnu99 -Wno-cast-function-type -Wno-unused-parameter -Wno-unknown-warning-option -Wno-unused-but-set-variable -Werror-implicit-function-declaration -Wno-switch -I/usr/src/RPM/BUILD/jss-5.4.2/x86_64-alt-linux/include/jss -I/usr/lib/jvm/jre/include -I/usr/lib/jvm/jre/include/linux -I/usr/lib/jvm/jre/include -I/usr/include/nspr -I/usr/include/nss -L/usr/lib64 -L/usr/lib64 -o /usr/src/RPM/BUILD/jss-5.4.2/x86_64-alt-linux/lib/NativeEnclosure.o -c /usr/src/RPM/BUILD/jss-5.4.2/native/src/main/native/org/mozilla/jss/util/NativeEnclosure.c
gmake[2]: Leaving directory '/usr/src/RPM/BUILD/jss-5.4.2/x86_64-alt-linux'
gmake[2]: Entering directory '/usr/src/RPM/BUILD/jss-5.4.2/x86_64-alt-linux'
[ 56%] Generating lib/SSLSocket.o
cd /usr/src/RPM/BUILD/jss-5.4.2/native/src/main/native/org/mozilla/jss/ssl && /usr/bin/cc -fPIC -flto=auto -O2 -g -Wall -frecord-gcc-switches -pipe -O2 -Wall -std=gnu99 -Wno-cast-function-type -Wno-unused-parameter -Wno-unknown-warning-option -Wno-unused-but-set-variable -Werror-implicit-function-declaration -Wno-switch -I/usr/src/RPM/BUILD/jss-5.4.2/x86_64-alt-linux/include/jss -I/usr/lib/jvm/jre/include -I/usr/lib/jvm/jre/include/linux -I/usr/lib/jvm/jre/include -I/usr/include/nspr -I/usr/include/nss -L/usr/lib64 -L/usr/lib64 -o /usr/src/RPM/BUILD/jss-5.4.2/x86_64-alt-linux/lib/SSLSocket.o -c /usr/src/RPM/BUILD/jss-5.4.2/native/src/main/native/org/mozilla/jss/ssl/SSLSocket.c
gmake[2]: Leaving directory '/usr/src/RPM/BUILD/jss-5.4.2/x86_64-alt-linux'
gmake[2]: Entering directory '/usr/src/RPM/BUILD/jss-5.4.2/x86_64-alt-linux'
[ 70%] Generating lib/NativeErrcodes.o
cd /usr/src/RPM/BUILD/jss-5.4.2/native/src/main/native/org/mozilla/jss/util && /usr/bin/cc -fPIC -flto=auto -O2 -g -Wall -frecord-gcc-switches -pipe -O2 -Wall -std=gnu99 -Wno-cast-function-type -Wno-unused-parameter -Wno-unknown-warning-option -Wno-unused-but-set-variable -Werror-implicit-function-declaration -Wno-switch -I/usr/src/RPM/BUILD/jss-5.4.2/x86_64-alt-linux/include/jss -I/usr/lib/jvm/jre/include -I/usr/lib/jvm/jre/include/linux -I/usr/lib/jvm/jre/include -I/usr/include/nspr -I/usr/include/nss -L/usr/lib64 -L/usr/lib64 -o /usr/src/RPM/BUILD/jss-5.4.2/x86_64-alt-linux/lib/NativeErrcodes.o -c /usr/src/RPM/BUILD/jss-5.4.2/native/src/main/native/org/mozilla/jss/util/NativeErrcodes.c
gmake[2]: Leaving directory '/usr/src/RPM/BUILD/jss-5.4.2/x86_64-alt-linux'
gmake[2]: Entering directory '/usr/src/RPM/BUILD/jss-5.4.2/x86_64-alt-linux'
[ 71%] Generating lib/errstrings.o
cd /usr/src/RPM/BUILD/jss-5.4.2/native/src/main/native/org/mozilla/jss/util && /usr/bin/cc -fPIC -flto=auto -O2 -g -Wall -frecord-gcc-switches -pipe -O2 -Wall -std=gnu99 -Wno-cast-function-type -Wno-unused-parameter -Wno-unknown-warning-option -Wno-unused-but-set-variable -Werror-implicit-function-declaration -Wno-switch -I/usr/src/RPM/BUILD/jss-5.4.2/x86_64-alt-linux/include/jss -I/usr/lib/jvm/jre/include -I/usr/lib/jvm/jre/include/linux -I/usr/lib/jvm/jre/include -I/usr/include/nspr -I/usr/include/nss -L/usr/lib64 -L/usr/lib64 -o /usr/src/RPM/BUILD/jss-5.4.2/x86_64-alt-linux/lib/errstrings.o -c /usr/src/RPM/BUILD/jss-5.4.2/native/src/main/native/org/mozilla/jss/util/errstrings.c
gmake[2]: Leaving directory '/usr/src/RPM/BUILD/jss-5.4.2/x86_64-alt-linux'
gmake[2]: Entering directory '/usr/src/RPM/BUILD/jss-5.4.2/x86_64-alt-linux'
[ 70%] Generating lib/StaticVoidPointer.o
cd /usr/src/RPM/BUILD/jss-5.4.2/native/src/main/native/org/mozilla/jss/util && /usr/bin/cc -fPIC -flto=auto -O2 -g -Wall -frecord-gcc-switches -pipe -O2 -Wall -std=gnu99 -Wno-cast-function-type -Wno-unused-parameter -Wno-unknown-warning-option -Wno-unused-but-set-variable -Werror-implicit-function-declaration -Wno-switch -I/usr/src/RPM/BUILD/jss-5.4.2/x86_64-alt-linux/include/jss -I/usr/lib/jvm/jre/include -I/usr/lib/jvm/jre/include/linux -I/usr/lib/jvm/jre/include -I/usr/include/nspr -I/usr/include/nss -L/usr/lib64 -L/usr/lib64 -o /usr/src/RPM/BUILD/jss-5.4.2/x86_64-alt-linux/lib/StaticVoidPointer.o -c /usr/src/RPM/BUILD/jss-5.4.2/native/src/main/native/org/mozilla/jss/util/StaticVoidPointer.c
gmake[2]: Leaving directory '/usr/src/RPM/BUILD/jss-5.4.2/x86_64-alt-linux'
gmake[2]: Entering directory '/usr/src/RPM/BUILD/jss-5.4.2/x86_64-alt-linux'
[ 75%] Generating lib/jssutil.o
cd /usr/src/RPM/BUILD/jss-5.4.2/native/src/main/native/org/mozilla/jss/util && /usr/bin/cc -fPIC -flto=auto -O2 -g -Wall -frecord-gcc-switches -pipe -O2 -Wall -std=gnu99 -Wno-cast-function-type -Wno-unused-parameter -Wno-unknown-warning-option -Wno-unused-but-set-variable -Werror-implicit-function-declaration -Wno-switch -I/usr/src/RPM/BUILD/jss-5.4.2/x86_64-alt-linux/include/jss -I/usr/lib/jvm/jre/include -I/usr/lib/jvm/jre/include/linux -I/usr/lib/jvm/jre/include -I/usr/include/nspr -I/usr/include/nss -L/usr/lib64 -L/usr/lib64 -o /usr/src/RPM/BUILD/jss-5.4.2/x86_64-alt-linux/lib/jssutil.o -c /usr/src/RPM/BUILD/jss-5.4.2/native/src/main/native/org/mozilla/jss/util/jssutil.c
gmake[2]: Leaving directory '/usr/src/RPM/BUILD/jss-5.4.2/x86_64-alt-linux'
gmake[1]: Entering directory '/usr/src/RPM/BUILD/jss-5.4.2/x86_64-alt-linux'
[ 78%] Built target generate_c
gmake[1]: Leaving directory '/usr/src/RPM/BUILD/jss-5.4.2/x86_64-alt-linux'
/usr/bin/gmake  -f CMakeFiles/generate_c_TestBufferPRFDSSL.dir/build.make CMakeFiles/generate_c_TestBufferPRFDSSL.dir/depend
/usr/bin/gmake  -f CMakeFiles/generate_c_buffer_size_1.dir/build.make CMakeFiles/generate_c_buffer_size_1.dir/depend
/usr/bin/gmake  -f CMakeFiles/generate_c_buffer_size_4.dir/build.make CMakeFiles/generate_c_buffer_size_4.dir/depend
/usr/bin/gmake  -f CMakeFiles/generate_c_TestBufferPRFD.dir/build.make CMakeFiles/generate_c_TestBufferPRFD.dir/depend
gmake[2]: Entering directory '/usr/src/RPM/BUILD/jss-5.4.2/x86_64-alt-linux'
cd /usr/src/RPM/BUILD/jss-5.4.2/x86_64-alt-linux && /usr/bin/cmake -E cmake_depends "Unix Makefiles" /usr/src/RPM/BUILD/jss-5.4.2 /usr/src/RPM/BUILD/jss-5.4.2 /usr/src/RPM/BUILD/jss-5.4.2/x86_64-alt-linux /usr/src/RPM/BUILD/jss-5.4.2/x86_64-alt-linux /usr/src/RPM/BUILD/jss-5.4.2/x86_64-alt-linux/CMakeFiles/generate_c_buffer_size_4.dir/DependInfo.cmake "--color="
gmake[2]: Leaving directory '/usr/src/RPM/BUILD/jss-5.4.2/x86_64-alt-linux'
gmake[2]: Entering directory '/usr/src/RPM/BUILD/jss-5.4.2/x86_64-alt-linux'
cd /usr/src/RPM/BUILD/jss-5.4.2/x86_64-alt-linux && /usr/bin/cmake -E cmake_depends "Unix Makefiles" /usr/src/RPM/BUILD/jss-5.4.2 /usr/src/RPM/BUILD/jss-5.4.2 /usr/src/RPM/BUILD/jss-5.4.2/x86_64-alt-linux /usr/src/RPM/BUILD/jss-5.4.2/x86_64-alt-linux /usr/src/RPM/BUILD/jss-5.4.2/x86_64-alt-linux/CMakeFiles/generate_c_TestBufferPRFDSSL.dir/DependInfo.cmake "--color="
gmake[2]: Leaving directory '/usr/src/RPM/BUILD/jss-5.4.2/x86_64-alt-linux'
/usr/bin/gmake  -f CMakeFiles/generate_c_buffer_size_4.dir/build.make CMakeFiles/generate_c_buffer_size_4.dir/build
gmake[2]: Entering directory '/usr/src/RPM/BUILD/jss-5.4.2/x86_64-alt-linux'
cd /usr/src/RPM/BUILD/jss-5.4.2/x86_64-alt-linux && /usr/bin/cmake -E cmake_depends "Unix Makefiles" /usr/src/RPM/BUILD/jss-5.4.2 /usr/src/RPM/BUILD/jss-5.4.2 /usr/src/RPM/BUILD/jss-5.4.2/x86_64-alt-linux /usr/src/RPM/BUILD/jss-5.4.2/x86_64-alt-linux /usr/src/RPM/BUILD/jss-5.4.2/x86_64-alt-linux/CMakeFiles/generate_c_buffer_size_1.dir/DependInfo.cmake "--color="
gmake[2]: Leaving directory '/usr/src/RPM/BUILD/jss-5.4.2/x86_64-alt-linux'
/usr/bin/gmake  -f CMakeFiles/generate_c_TestBufferPRFDSSL.dir/build.make CMakeFiles/generate_c_TestBufferPRFDSSL.dir/build
/usr/bin/gmake  -f CMakeFiles/generate_c_buffer_size_1.dir/build.make CMakeFiles/generate_c_buffer_size_1.dir/build
gmake[2]: Entering directory '/usr/src/RPM/BUILD/jss-5.4.2/x86_64-alt-linux'
cd /usr/src/RPM/BUILD/jss-5.4.2/x86_64-alt-linux && /usr/bin/cmake -E cmake_depends "Unix Makefiles" /usr/src/RPM/BUILD/jss-5.4.2 /usr/src/RPM/BUILD/jss-5.4.2 /usr/src/RPM/BUILD/jss-5.4.2/x86_64-alt-linux /usr/src/RPM/BUILD/jss-5.4.2/x86_64-alt-linux /usr/src/RPM/BUILD/jss-5.4.2/x86_64-alt-linux/CMakeFiles/generate_c_TestBufferPRFD.dir/DependInfo.cmake "--color="
gmake[2]: Leaving directory '/usr/src/RPM/BUILD/jss-5.4.2/x86_64-alt-linux'
/usr/bin/gmake  -f CMakeFiles/generate_c_TestBufferPRFD.dir/build.make CMakeFiles/generate_c_TestBufferPRFD.dir/build
gmake[2]: Entering directory '/usr/src/RPM/BUILD/jss-5.4.2/x86_64-alt-linux'
[ 78%] Generating tests-jss.jar
/usr/lib/jvm/jre/bin/jar cmf /usr/src/RPM/BUILD/jss-5.4.2/x86_64-alt-linux/MANIFEST.MF /usr/src/RPM/BUILD/jss-5.4.2/x86_64-alt-linux/tests-jss.jar -C /usr/src/RPM/BUILD/jss-5.4.2/x86_64-alt-linux/classes/tests org
gmake[2]: Leaving directory '/usr/src/RPM/BUILD/jss-5.4.2/x86_64-alt-linux'
gmake[2]: Entering directory '/usr/src/RPM/BUILD/jss-5.4.2/x86_64-alt-linux'
[ 82%] Generating libjss.so, lib/libjss.so
/usr/bin/cc -o /usr/src/RPM/BUILD/jss-5.4.2/x86_64-alt-linux/lib/libjss.so /usr/src/RPM/BUILD/jss-5.4.2/x86_64-alt-linux/lib/*.o -lsmime3 -lssl3 -lnss3 -lnssutil3 -lplc4 -lplds4 -lnspr4 -lpthread -ldl -shared -Wl,-z,defs -Wl,-soname -Wl,libjss.so
/usr/bin/cc -o /usr/src/RPM/BUILD/jss-5.4.2/x86_64-alt-linux/libjss.so /usr/src/RPM/BUILD/jss-5.4.2/x86_64-alt-linux/lib/*.o -lsmime3 -lssl3 -lnss3 -lnssutil3 -lplc4 -lplds4 -lnspr4 -lpthread -ldl -Wl,--version-script,/usr/src/RPM/BUILD/jss-5.4.2/lib/jss.map -shared -Wl,-z,defs -Wl,-soname -Wl,libjss.so
gmake[2]: Leaving directory '/usr/src/RPM/BUILD/jss-5.4.2/x86_64-alt-linux'
gmake[2]: Entering directory '/usr/src/RPM/BUILD/jss-5.4.2/x86_64-alt-linux'
[ 84%] Generating libjss.so, lib/libjss.so
/usr/bin/cc -o /usr/src/RPM/BUILD/jss-5.4.2/x86_64-alt-linux/lib/libjss.so /usr/src/RPM/BUILD/jss-5.4.2/x86_64-alt-linux/lib/*.o -lsmime3 -lssl3 -lnss3 -lnssutil3 -lplc4 -lplds4 -lnspr4 -lpthread -ldl -shared -Wl,-z,defs -Wl,-soname -Wl,libjss.so
/usr/bin/cc -o /usr/src/RPM/BUILD/jss-5.4.2/x86_64-alt-linux/libjss.so /usr/src/RPM/BUILD/jss-5.4.2/x86_64-alt-linux/lib/*.o -lsmime3 -lssl3 -lnss3 -lnssutil3 -lplc4 -lplds4 -lnspr4 -lpthread -ldl -Wl,--version-script,/usr/src/RPM/BUILD/jss-5.4.2/lib/jss.map -shared -Wl,-z,defs -Wl,-soname -Wl,libjss.so
gmake[2]: Leaving directory '/usr/src/RPM/BUILD/jss-5.4.2/x86_64-alt-linux'
gmake[2]: Entering directory '/usr/src/RPM/BUILD/jss-5.4.2/x86_64-alt-linux'
[ 78%] Generating libjss.so, lib/libjss.so
/usr/bin/cc -o /usr/src/RPM/BUILD/jss-5.4.2/x86_64-alt-linux/lib/libjss.so /usr/src/RPM/BUILD/jss-5.4.2/x86_64-alt-linux/lib/*.o -lsmime3 -lssl3 -lnss3 -lnssutil3 -lplc4 -lplds4 -lnspr4 -lpthread -ldl -shared -Wl,-z,defs -Wl,-soname -Wl,libjss.so
/usr/bin/cc -o /usr/src/RPM/BUILD/jss-5.4.2/x86_64-alt-linux/libjss.so /usr/src/RPM/BUILD/jss-5.4.2/x86_64-alt-linux/lib/*.o -lsmime3 -lssl3 -lnss3 -lnssutil3 -lplc4 -lplds4 -lnspr4 -lpthread -ldl -Wl,--version-script,/usr/src/RPM/BUILD/jss-5.4.2/lib/jss.map -shared -Wl,-z,defs -Wl,-soname -Wl,libjss.so
gmake[2]: Leaving directory '/usr/src/RPM/BUILD/jss-5.4.2/x86_64-alt-linux'
gmake[2]: Entering directory '/usr/src/RPM/BUILD/jss-5.4.2/x86_64-alt-linux'
[ 80%] Generating libjss.so, lib/libjss.so
/usr/bin/cc -o /usr/src/RPM/BUILD/jss-5.4.2/x86_64-alt-linux/lib/libjss.so /usr/src/RPM/BUILD/jss-5.4.2/x86_64-alt-linux/lib/*.o -lsmime3 -lssl3 -lnss3 -lnssutil3 -lplc4 -lplds4 -lnspr4 -lpthread -ldl -shared -Wl,-z,defs -Wl,-soname -Wl,libjss.so
/usr/bin/cc -o /usr/src/RPM/BUILD/jss-5.4.2/x86_64-alt-linux/libjss.so /usr/src/RPM/BUILD/jss-5.4.2/x86_64-alt-linux/lib/*.o -lsmime3 -lssl3 -lnss3 -lnssutil3 -lplc4 -lplds4 -lnspr4 -lpthread -ldl -Wl,--version-script,/usr/src/RPM/BUILD/jss-5.4.2/lib/jss.map -shared -Wl,-z,defs -Wl,-soname -Wl,libjss.so
gmake[2]: Leaving directory '/usr/src/RPM/BUILD/jss-5.4.2/x86_64-alt-linux'
gmake[2]: Entering directory '/usr/src/RPM/BUILD/jss-5.4.2/x86_64-alt-linux'
[ 87%] Generating bin/TestBufferPRFD
cd /usr/src/RPM/BUILD/jss-5.4.2/native/src/main/native/org/mozilla/jss/util && /usr/bin/cc -flto=auto -O2 -g -Wall -frecord-gcc-switches -pipe -O2 -Wall -std=gnu99 -Wno-cast-function-type -Wno-unused-parameter -Wno-unknown-warning-option -Wno-unused-but-set-variable -Werror-implicit-function-declaration -Wno-switch -I/usr/src/RPM/BUILD/jss-5.4.2/x86_64-alt-linux/include/jss -I/usr/lib/jvm/jre/include -I/usr/lib/jvm/jre/include/linux -I/usr/lib/jvm/jre/include -I/usr/include/nspr -I/usr/include/nss -L/usr/lib64 -L/usr/lib64 -o /usr/src/RPM/BUILD/jss-5.4.2/x86_64-alt-linux/bin/TestBufferPRFD /usr/src/RPM/BUILD/jss-5.4.2/native/src/test/native/org/mozilla/jss/tests/TestBufferPRFD.c -L/usr/src/RPM/BUILD/jss-5.4.2/x86_64-alt-linux/lib -ljss -lsmime3 -lssl3 -lnss3 -lnssutil3 -lplc4 -lplds4 -lnspr4 -lpthread -ldl
gmake[2]: Leaving directory '/usr/src/RPM/BUILD/jss-5.4.2/x86_64-alt-linux'
gmake[1]: Entering directory '/usr/src/RPM/BUILD/jss-5.4.2/x86_64-alt-linux'
[ 89%] Built target generate_c_TestBufferPRFD
gmake[1]: Leaving directory '/usr/src/RPM/BUILD/jss-5.4.2/x86_64-alt-linux'
gmake[2]: Entering directory '/usr/src/RPM/BUILD/jss-5.4.2/x86_64-alt-linux'
[ 85%] Generating bin/buffer_size_1
cd /usr/src/RPM/BUILD/jss-5.4.2/native/src/main/native/org/mozilla/jss/util && /usr/bin/cc -flto=auto -O2 -g -Wall -frecord-gcc-switches -pipe -O2 -Wall -std=gnu99 -Wno-cast-function-type -Wno-unused-parameter -Wno-unknown-warning-option -Wno-unused-but-set-variable -Werror-implicit-function-declaration -Wno-switch -I/usr/src/RPM/BUILD/jss-5.4.2/x86_64-alt-linux/include/jss -I/usr/lib/jvm/jre/include -I/usr/lib/jvm/jre/include/linux -I/usr/lib/jvm/jre/include -I/usr/include/nspr -I/usr/include/nss -L/usr/lib64 -L/usr/lib64 -o /usr/src/RPM/BUILD/jss-5.4.2/x86_64-alt-linux/bin/buffer_size_1 /usr/src/RPM/BUILD/jss-5.4.2/native/src/test/native/org/mozilla/jss/tests/buffer_size_1.c -L/usr/src/RPM/BUILD/jss-5.4.2/x86_64-alt-linux/lib -ljss -lsmime3 -lssl3 -lnss3 -lnssutil3 -lplc4 -lplds4 -lnspr4 -lpthread -ldl
gmake[2]: Leaving directory '/usr/src/RPM/BUILD/jss-5.4.2/x86_64-alt-linux'
gmake[1]: Entering directory '/usr/src/RPM/BUILD/jss-5.4.2/x86_64-alt-linux'
[ 89%] Built target generate_c_buffer_size_1
gmake[1]: Leaving directory '/usr/src/RPM/BUILD/jss-5.4.2/x86_64-alt-linux'
gmake[2]: Entering directory '/usr/src/RPM/BUILD/jss-5.4.2/x86_64-alt-linux'
[ 89%] Generating bin/TestBufferPRFDSSL
cd /usr/src/RPM/BUILD/jss-5.4.2/native/src/main/native/org/mozilla/jss/util && /usr/bin/cc -flto=auto -O2 -g -Wall -frecord-gcc-switches -pipe -O2 -Wall -std=gnu99 -Wno-cast-function-type -Wno-unused-parameter -Wno-unknown-warning-option -Wno-unused-but-set-variable -Werror-implicit-function-declaration -Wno-switch -I/usr/src/RPM/BUILD/jss-5.4.2/x86_64-alt-linux/include/jss -I/usr/lib/jvm/jre/include -I/usr/lib/jvm/jre/include/linux -I/usr/lib/jvm/jre/include -I/usr/include/nspr -I/usr/include/nss -L/usr/lib64 -L/usr/lib64 -o /usr/src/RPM/BUILD/jss-5.4.2/x86_64-alt-linux/bin/TestBufferPRFDSSL /usr/src/RPM/BUILD/jss-5.4.2/native/src/test/native/org/mozilla/jss/tests/TestBufferPRFDSSL.c -L/usr/src/RPM/BUILD/jss-5.4.2/x86_64-alt-linux/lib -ljss -lsmime3 -lssl3 -lnss3 -lnssutil3 -lplc4 -lplds4 -lnspr4 -lpthread -ldl
gmake[2]: Leaving directory '/usr/src/RPM/BUILD/jss-5.4.2/x86_64-alt-linux'
gmake[2]: Entering directory '/usr/src/RPM/BUILD/jss-5.4.2/x86_64-alt-linux'
[ 75%] Generating jss.jar
/usr/src/RPM/BUILD/jss-5.4.2/tools/reproducible_jar.sh /usr/src/RPM/BUILD/jss-5.4.2/x86_64-alt-linux/staging.jar /usr/src/RPM/BUILD/jss-5.4.2/x86_64-alt-linux/reproducible /usr/src/RPM/BUILD/jss-5.4.2/x86_64-alt-linux/jss.jar
gmake[2]: Leaving directory '/usr/src/RPM/BUILD/jss-5.4.2/x86_64-alt-linux'
gmake[1]: Entering directory '/usr/src/RPM/BUILD/jss-5.4.2/x86_64-alt-linux'
[ 89%] Built target generate_c_TestBufferPRFDSSL
gmake[1]: Leaving directory '/usr/src/RPM/BUILD/jss-5.4.2/x86_64-alt-linux'
gmake[1]: Entering directory '/usr/src/RPM/BUILD/jss-5.4.2/x86_64-alt-linux'
[ 89%] Built target generate_jar
gmake[1]: Leaving directory '/usr/src/RPM/BUILD/jss-5.4.2/x86_64-alt-linux'
/usr/bin/gmake  -f CMakeFiles/java.dir/build.make CMakeFiles/java.dir/depend
gmake[2]: Entering directory '/usr/src/RPM/BUILD/jss-5.4.2/x86_64-alt-linux'
cd /usr/src/RPM/BUILD/jss-5.4.2/x86_64-alt-linux && /usr/bin/cmake -E cmake_depends "Unix Makefiles" /usr/src/RPM/BUILD/jss-5.4.2 /usr/src/RPM/BUILD/jss-5.4.2 /usr/src/RPM/BUILD/jss-5.4.2/x86_64-alt-linux /usr/src/RPM/BUILD/jss-5.4.2/x86_64-alt-linux /usr/src/RPM/BUILD/jss-5.4.2/x86_64-alt-linux/CMakeFiles/java.dir/DependInfo.cmake "--color="
gmake[2]: Leaving directory '/usr/src/RPM/BUILD/jss-5.4.2/x86_64-alt-linux'
/usr/bin/gmake  -f CMakeFiles/java.dir/build.make CMakeFiles/java.dir/build
gmake[2]: Nothing to be done for 'CMakeFiles/java.dir/build'.
gmake[1]: Entering directory '/usr/src/RPM/BUILD/jss-5.4.2/x86_64-alt-linux'
[ 89%] Built target java
gmake[1]: Leaving directory '/usr/src/RPM/BUILD/jss-5.4.2/x86_64-alt-linux'
gmake[2]: Entering directory '/usr/src/RPM/BUILD/jss-5.4.2/x86_64-alt-linux'
[ 89%] Generating bin/buffer_size_4
cd /usr/src/RPM/BUILD/jss-5.4.2/native/src/main/native/org/mozilla/jss/util && /usr/bin/cc -flto=auto -O2 -g -Wall -frecord-gcc-switches -pipe -O2 -Wall -std=gnu99 -Wno-cast-function-type -Wno-unused-parameter -Wno-unknown-warning-option -Wno-unused-but-set-variable -Werror-implicit-function-declaration -Wno-switch -I/usr/src/RPM/BUILD/jss-5.4.2/x86_64-alt-linux/include/jss -I/usr/lib/jvm/jre/include -I/usr/lib/jvm/jre/include/linux -I/usr/lib/jvm/jre/include -I/usr/include/nspr -I/usr/include/nss -L/usr/lib64 -L/usr/lib64 -o /usr/src/RPM/BUILD/jss-5.4.2/x86_64-alt-linux/bin/buffer_size_4 /usr/src/RPM/BUILD/jss-5.4.2/native/src/test/native/org/mozilla/jss/tests/buffer_size_4.c -L/usr/src/RPM/BUILD/jss-5.4.2/x86_64-alt-linux/lib -ljss -lsmime3 -lssl3 -lnss3 -lnssutil3 -lplc4 -lplds4 -lnspr4 -lpthread -ldl
gmake[2]: Leaving directory '/usr/src/RPM/BUILD/jss-5.4.2/x86_64-alt-linux'
gmake[1]: Entering directory '/usr/src/RPM/BUILD/jss-5.4.2/x86_64-alt-linux'
[ 89%] Built target generate_c_buffer_size_4
gmake[1]: Leaving directory '/usr/src/RPM/BUILD/jss-5.4.2/x86_64-alt-linux'
/usr/bin/gmake  -f CMakeFiles/generate_so.dir/build.make CMakeFiles/generate_so.dir/depend
gmake[2]: Entering directory '/usr/src/RPM/BUILD/jss-5.4.2/x86_64-alt-linux'
cd /usr/src/RPM/BUILD/jss-5.4.2/x86_64-alt-linux && /usr/bin/cmake -E cmake_depends "Unix Makefiles" /usr/src/RPM/BUILD/jss-5.4.2 /usr/src/RPM/BUILD/jss-5.4.2 /usr/src/RPM/BUILD/jss-5.4.2/x86_64-alt-linux /usr/src/RPM/BUILD/jss-5.4.2/x86_64-alt-linux /usr/src/RPM/BUILD/jss-5.4.2/x86_64-alt-linux/CMakeFiles/generate_so.dir/DependInfo.cmake "--color="
gmake[2]: Leaving directory '/usr/src/RPM/BUILD/jss-5.4.2/x86_64-alt-linux'
/usr/bin/gmake  -f CMakeFiles/generate_so.dir/build.make CMakeFiles/generate_so.dir/build
gmake[2]: Nothing to be done for 'CMakeFiles/generate_so.dir/build'.
gmake[1]: Entering directory '/usr/src/RPM/BUILD/jss-5.4.2/x86_64-alt-linux'
[ 91%] Built target generate_so
gmake[1]: Leaving directory '/usr/src/RPM/BUILD/jss-5.4.2/x86_64-alt-linux'
/usr/bin/gmake  -f symkey/CMakeFiles/symkey_library.dir/build.make symkey/CMakeFiles/symkey_library.dir/depend
gmake[2]: Entering directory '/usr/src/RPM/BUILD/jss-5.4.2/x86_64-alt-linux'
cd /usr/src/RPM/BUILD/jss-5.4.2/x86_64-alt-linux && /usr/bin/cmake -E cmake_depends "Unix Makefiles" /usr/src/RPM/BUILD/jss-5.4.2 /usr/src/RPM/BUILD/jss-5.4.2/symkey /usr/src/RPM/BUILD/jss-5.4.2/x86_64-alt-linux /usr/src/RPM/BUILD/jss-5.4.2/x86_64-alt-linux/symkey /usr/src/RPM/BUILD/jss-5.4.2/x86_64-alt-linux/symkey/CMakeFiles/symkey_library.dir/DependInfo.cmake "--color="
gmake[2]: Leaving directory '/usr/src/RPM/BUILD/jss-5.4.2/x86_64-alt-linux'
/usr/bin/gmake  -f symkey/CMakeFiles/symkey_library.dir/build.make symkey/CMakeFiles/symkey_library.dir/build
gmake[2]: Entering directory '/usr/src/RPM/BUILD/jss-5.4.2/x86_64-alt-linux'
[ 92%] Building CXX object symkey/CMakeFiles/symkey_library.dir/src/main/native/org/mozilla/jss/symkey/Buffer.cpp.o
cd /usr/src/RPM/BUILD/jss-5.4.2/x86_64-alt-linux/symkey && /usr/bin/c++ -Dsymkey_library_EXPORTS -I/usr/src/RPM/BUILD/jss-5.4.2/x86_64-alt-linux/symkey/include -I/usr/lib/jvm/jre/include -I/usr/lib/jvm/jre/include/linux -I/usr/include/nspr -I/usr/include/nss -pipe -frecord-gcc-switches -Wall -g -O2 -flto=auto -fPIC -MD -MT symkey/CMakeFiles/symkey_library.dir/src/main/native/org/mozilla/jss/symkey/Buffer.cpp.o -MF CMakeFiles/symkey_library.dir/src/main/native/org/mozilla/jss/symkey/Buffer.cpp.o.d -o CMakeFiles/symkey_library.dir/src/main/native/org/mozilla/jss/symkey/Buffer.cpp.o -c /usr/src/RPM/BUILD/jss-5.4.2/symkey/src/main/native/org/mozilla/jss/symkey/Buffer.cpp
gmake[2]: Leaving directory '/usr/src/RPM/BUILD/jss-5.4.2/x86_64-alt-linux'
gmake[2]: Entering directory '/usr/src/RPM/BUILD/jss-5.4.2/x86_64-alt-linux'
[ 94%] Building CXX object symkey/CMakeFiles/symkey_library.dir/src/main/native/org/mozilla/jss/symkey/EncryptData.cpp.o
cd /usr/src/RPM/BUILD/jss-5.4.2/x86_64-alt-linux/symkey && /usr/bin/c++ -Dsymkey_library_EXPORTS -I/usr/src/RPM/BUILD/jss-5.4.2/x86_64-alt-linux/symkey/include -I/usr/lib/jvm/jre/include -I/usr/lib/jvm/jre/include/linux -I/usr/include/nspr -I/usr/include/nss -pipe -frecord-gcc-switches -Wall -g -O2 -flto=auto -fPIC -MD -MT symkey/CMakeFiles/symkey_library.dir/src/main/native/org/mozilla/jss/symkey/EncryptData.cpp.o -MF CMakeFiles/symkey_library.dir/src/main/native/org/mozilla/jss/symkey/EncryptData.cpp.o.d -o CMakeFiles/symkey_library.dir/src/main/native/org/mozilla/jss/symkey/EncryptData.cpp.o -c /usr/src/RPM/BUILD/jss-5.4.2/symkey/src/main/native/org/mozilla/jss/symkey/EncryptData.cpp
gmake[2]: Leaving directory '/usr/src/RPM/BUILD/jss-5.4.2/x86_64-alt-linux'
gmake[2]: Entering directory '/usr/src/RPM/BUILD/jss-5.4.2/x86_64-alt-linux'
[ 98%] Building CXX object symkey/CMakeFiles/symkey_library.dir/src/main/native/org/mozilla/jss/symkey/SymKey.cpp.o
cd /usr/src/RPM/BUILD/jss-5.4.2/x86_64-alt-linux/symkey && /usr/bin/c++ -Dsymkey_library_EXPORTS -I/usr/src/RPM/BUILD/jss-5.4.2/x86_64-alt-linux/symkey/include -I/usr/lib/jvm/jre/include -I/usr/lib/jvm/jre/include/linux -I/usr/include/nspr -I/usr/include/nss -pipe -frecord-gcc-switches -Wall -g -O2 -flto=auto -fPIC -MD -MT symkey/CMakeFiles/symkey_library.dir/src/main/native/org/mozilla/jss/symkey/SymKey.cpp.o -MF CMakeFiles/symkey_library.dir/src/main/native/org/mozilla/jss/symkey/SymKey.cpp.o.d -o CMakeFiles/symkey_library.dir/src/main/native/org/mozilla/jss/symkey/SymKey.cpp.o -c /usr/src/RPM/BUILD/jss-5.4.2/symkey/src/main/native/org/mozilla/jss/symkey/SymKey.cpp
/usr/src/RPM/BUILD/jss-5.4.2/symkey/src/main/native/org/mozilla/jss/symkey/SymKey.cpp: In function '_jbyteArray* Java_org_mozilla_jss_symkey_SessionKey_DiversifyKey(JNIEnv*, jclass, jstring, jstring, jstring, jstring, jbyteArray, jbyteArray, jbyte, jboolean, jbyteArray, jbyteArray, jbyteArray, jstring, jstring, jbyte)':
/usr/src/RPM/BUILD/jss-5.4.2/symkey/src/main/native/org/mozilla/jss/symkey/SymKey.cpp:1457:30: warning: the address of 'fullNewMasterKeyName' will never be NULL [-Waddress]
 1457 |     if (fullNewMasterKeyName != NULL && strcmp(fullNewMasterKeyName, "#01#01") == 0)
      |                              ^
/usr/src/RPM/BUILD/jss-5.4.2/symkey/src/main/native/org/mozilla/jss/symkey/SymKey.cpp:1133:10: note: 'fullNewMasterKeyName' declared here
 1133 |     char fullNewMasterKeyName[KEYNAMELENGTH];
      |          ^~~~~~~~~~~~~~~~~~~~
gmake[2]: Leaving directory '/usr/src/RPM/BUILD/jss-5.4.2/x86_64-alt-linux'
gmake[2]: Entering directory '/usr/src/RPM/BUILD/jss-5.4.2/x86_64-alt-linux'
[ 94%] Building CXX object symkey/CMakeFiles/symkey_library.dir/src/main/native/org/mozilla/jss/symkey/SessionKey.cpp.o
cd /usr/src/RPM/BUILD/jss-5.4.2/x86_64-alt-linux/symkey && /usr/bin/c++ -Dsymkey_library_EXPORTS -I/usr/src/RPM/BUILD/jss-5.4.2/x86_64-alt-linux/symkey/include -I/usr/lib/jvm/jre/include -I/usr/lib/jvm/jre/include/linux -I/usr/include/nspr -I/usr/include/nss -pipe -frecord-gcc-switches -Wall -g -O2 -flto=auto -fPIC -MD -MT symkey/CMakeFiles/symkey_library.dir/src/main/native/org/mozilla/jss/symkey/SessionKey.cpp.o -MF CMakeFiles/symkey_library.dir/src/main/native/org/mozilla/jss/symkey/SessionKey.cpp.o.d -o CMakeFiles/symkey_library.dir/src/main/native/org/mozilla/jss/symkey/SessionKey.cpp.o -c /usr/src/RPM/BUILD/jss-5.4.2/symkey/src/main/native/org/mozilla/jss/symkey/SessionKey.cpp
/usr/src/RPM/BUILD/jss-5.4.2/symkey/src/main/native/org/mozilla/jss/symkey/SessionKey.cpp: In function 'JSS_PK11_wrapSymKey(JNIEnv_*, PK11SymKeyStr**)':
/usr/src/RPM/BUILD/jss-5.4.2/symkey/src/main/native/org/mozilla/jss/symkey/SessionKey.cpp:120:1: warning: infinite recursion detected [-Winfinite-recursion]
  120 | JSS_PK11_wrapSymKey(JNIEnv *env, PK11SymKey **symKey)
      | ^~~~~~~~~~~~~~~~~~~
/usr/src/RPM/BUILD/jss-5.4.2/symkey/src/main/native/org/mozilla/jss/symkey/SessionKey.cpp:124:31: note: recursive call
  124 |     return JSS_PK11_wrapSymKey(env, symKey);
      |            ~~~~~~~~~~~~~~~~~~~^~~~~~~~~~~~~
gmake[2]: Leaving directory '/usr/src/RPM/BUILD/jss-5.4.2/x86_64-alt-linux'
gmake[2]: Entering directory '/usr/src/RPM/BUILD/jss-5.4.2/x86_64-alt-linux'
[ 96%] Building CXX object symkey/CMakeFiles/symkey_library.dir/src/main/native/org/mozilla/jss/symkey/NistSP800_108KDF.cpp.o
cd /usr/src/RPM/BUILD/jss-5.4.2/x86_64-alt-linux/symkey && /usr/bin/c++ -Dsymkey_library_EXPORTS -I/usr/src/RPM/BUILD/jss-5.4.2/x86_64-alt-linux/symkey/include -I/usr/lib/jvm/jre/include -I/usr/lib/jvm/jre/include/linux -I/usr/include/nspr -I/usr/include/nss -pipe -frecord-gcc-switches -Wall -g -O2 -flto=auto -fPIC -MD -MT symkey/CMakeFiles/symkey_library.dir/src/main/native/org/mozilla/jss/symkey/NistSP800_108KDF.cpp.o -MF CMakeFiles/symkey_library.dir/src/main/native/org/mozilla/jss/symkey/NistSP800_108KDF.cpp.o.d -o CMakeFiles/symkey_library.dir/src/main/native/org/mozilla/jss/symkey/NistSP800_108KDF.cpp.o -c /usr/src/RPM/BUILD/jss-5.4.2/symkey/src/main/native/org/mozilla/jss/symkey/NistSP800_108KDF.cpp
gmake[2]: Leaving directory '/usr/src/RPM/BUILD/jss-5.4.2/x86_64-alt-linux'
gmake[2]: Entering directory '/usr/src/RPM/BUILD/jss-5.4.2/x86_64-alt-linux'
[100%] Linking CXX shared library libjss-symkey.so
cd /usr/src/RPM/BUILD/jss-5.4.2/x86_64-alt-linux/symkey && /usr/bin/cmake -E cmake_link_script CMakeFiles/symkey_library.dir/link.txt --verbose=1
/usr/bin/c++ -fPIC -pipe -frecord-gcc-switches -Wall -g -O2 -flto=auto -shared -Wl,-soname,libjss-symkey.so -o libjss-symkey.so CMakeFiles/symkey_library.dir/src/main/native/org/mozilla/jss/symkey/Buffer.cpp.o CMakeFiles/symkey_library.dir/src/main/native/org/mozilla/jss/symkey/EncryptData.cpp.o CMakeFiles/symkey_library.dir/src/main/native/org/mozilla/jss/symkey/SessionKey.cpp.o CMakeFiles/symkey_library.dir/src/main/native/org/mozilla/jss/symkey/SymKey.cpp.o CMakeFiles/symkey_library.dir/src/main/native/org/mozilla/jss/symkey/NistSP800_108KDF.cpp.o  -lsmime3 -lssl3 -lnss3 -lnssutil3 -lplc4 -lplds4 -lnspr4 -lpthread -ldl
gmake[2]: Leaving directory '/usr/src/RPM/BUILD/jss-5.4.2/x86_64-alt-linux'
gmake[1]: Entering directory '/usr/src/RPM/BUILD/jss-5.4.2/x86_64-alt-linux'
[100%] Built target symkey_library
gmake[1]: Leaving directory '/usr/src/RPM/BUILD/jss-5.4.2/x86_64-alt-linux'
/usr/bin/gmake  -f CMakeFiles/native.dir/build.make CMakeFiles/native.dir/depend
gmake[2]: Entering directory '/usr/src/RPM/BUILD/jss-5.4.2/x86_64-alt-linux'
cd /usr/src/RPM/BUILD/jss-5.4.2/x86_64-alt-linux && /usr/bin/cmake -E cmake_depends "Unix Makefiles" /usr/src/RPM/BUILD/jss-5.4.2 /usr/src/RPM/BUILD/jss-5.4.2 /usr/src/RPM/BUILD/jss-5.4.2/x86_64-alt-linux /usr/src/RPM/BUILD/jss-5.4.2/x86_64-alt-linux /usr/src/RPM/BUILD/jss-5.4.2/x86_64-alt-linux/CMakeFiles/native.dir/DependInfo.cmake "--color="
gmake[2]: Leaving directory '/usr/src/RPM/BUILD/jss-5.4.2/x86_64-alt-linux'
/usr/bin/gmake  -f CMakeFiles/native.dir/build.make CMakeFiles/native.dir/build
gmake[2]: Nothing to be done for 'CMakeFiles/native.dir/build'.
gmake[1]: Entering directory '/usr/src/RPM/BUILD/jss-5.4.2/x86_64-alt-linux'
[100%] Built target native
gmake[1]: Leaving directory '/usr/src/RPM/BUILD/jss-5.4.2/x86_64-alt-linux'
gmake: Entering directory '/usr/src/RPM/BUILD/jss-5.4.2/x86_64-alt-linux'
/usr/bin/cmake -E cmake_progress_start /usr/src/RPM/BUILD/jss-5.4.2/x86_64-alt-linux/CMakeFiles 0
gmake: Leaving directory '/usr/src/RPM/BUILD/jss-5.4.2/x86_64-alt-linux'

+ exit 0
Executing(%install): /bin/sh -e /usr/src/tmp/rpm-tmp.91805
+ umask 022
+ /bin/mkdir -p /usr/src/RPM/BUILD
+ cd /usr/src/RPM/BUILD
+ /bin/chmod -Rf u+rwX -- /usr/src/tmp/jss-buildroot
+ :
+ /bin/rm -rf -- /usr/src/tmp/jss-buildroot
+ PATH=/usr/libexec/rpm-build:/usr/src/bin:/usr/bin:/bin:/usr/local/bin:/usr/games
+ cd jss-5.4.2
+ DESTDIR=/usr/src/tmp/jss-buildroot
+ cmake --install x86_64-alt-linux --verbose
-- Install configuration: ""
-- Installing: /usr/src/tmp/jss-buildroot/usr/lib64/jss/libjss-symkey.so
-- Installing: /usr/src/tmp/jss-buildroot/usr/lib/java/jss.jar
-- Installing: /usr/src/tmp/jss-buildroot/usr/lib64/jss/jss.jar
-- Installing: /usr/src/tmp/jss-buildroot/usr/lib64/jss/libjss.so
+ /usr/lib/rpm/brp-alt
Cleaning files in /usr/src/tmp/jss-buildroot (auto)
mode of './usr/lib64/jss/libjss.so' changed from 0755 (rwxr-xr-x) to 0644 (rw-r--r--)
mode of './usr/lib64/jss/libjss-symkey.so' changed from 0755 (rwxr-xr-x) to 0644 (rw-r--r--)
Verifying and fixing files in /usr/src/tmp/jss-buildroot (binconfig,pkgconfig,libtool,desktop,gnuconfig)
Checking contents of files in /usr/src/tmp/jss-buildroot/ (default)
Compressing files in /usr/src/tmp/jss-buildroot (auto)
Adjusting library links in /usr/src/tmp/jss-buildroot
./usr/lib: (from <cmdline>:0)
./usr/lib64: (from <cmdline>:0)
Verifying ELF objects in /usr/src/tmp/jss-buildroot (arch=normal,fhs=normal,lfs=relaxed,lint=relaxed,rpath=normal,stack=normal,textrel=normal,unresolved=normal)
Splitting links to aliased files under /{,s}bin in /usr/src/tmp/jss-buildroot
Executing(%check): /bin/sh -e /usr/src/tmp/rpm-tmp.44075
+ umask 022
+ /bin/mkdir -p /usr/src/RPM/BUILD
+ cd /usr/src/RPM/BUILD
+ cd jss-5.4.2
+ cat
+ CTEST_OUTPUT_ON_FAILURE=1
+ cmake --build x86_64-alt-linux --verbose --parallel 16 --target test
Change Dir: '/usr/src/RPM/BUILD/jss-5.4.2/x86_64-alt-linux'

Run Build Command(s): /usr/bin/cmake -E env VERBOSE=1 /usr/bin/gmake -f Makefile -j16 test
gmake: Entering directory '/usr/src/RPM/BUILD/jss-5.4.2/x86_64-alt-linux'
Running tests...
/usr/bin/ctest --force-new-ctest-process 
Test project /usr/src/RPM/BUILD/jss-5.4.2/x86_64-alt-linux
Connected to MAKE jobserver
      Start  1: Clean_Data_Dir
 1/70 Test  #1: Clean_Data_Dir ....................................   Passed    0.01 sec
      Start  2: Create_Data_Dir
 2/70 Test  #2: Create_Data_Dir ...................................   Passed    0.01 sec
      Start  3: Clean_Setup_DBs
 3/70 Test  #3: Clean_Setup_DBs ...................................   Passed    0.01 sec
      Start  4: Create_Setup_DBs
 4/70 Test  #4: Create_Setup_DBs ..................................   Passed    0.01 sec
      Start  5: Setup_DBs
 5/70 Test  #5: Setup_DBs .........................................   Passed    0.20 sec
      Start  6: Clean_FIPS_Setup_DBs
 6/70 Test  #6: Clean_FIPS_Setup_DBs ..............................   Passed    0.01 sec
      Start  7: Create_FIPS_Setup_DBs
 7/70 Test  #7: Create_FIPS_Setup_DBs .............................   Passed    0.01 sec
      Start  8: Setup_FIPS_DBs
 8/70 Test  #8: Setup_FIPS_DBs ....................................   Passed    0.20 sec
      Start  9: TestBufferPRFD
 9/70 Test  #9: TestBufferPRFD ....................................   Passed    0.00 sec
      Start 10: Test_UTF-8_Converter
10/70 Test #10: Test_UTF-8_Converter ..............................   Passed    0.10 sec
      Start 11: Test_Base64_Parsing
11/70 Test #11: Test_Base64_Parsing ...............................   Passed    0.10 sec
      Start 12: JSS_DER_Encoding_of_Enumeration_regression_test
12/70 Test #12: JSS_DER_Encoding_of_Enumeration_regression_test ...   Passed    0.51 sec
      Start 13: JSS_Test_DER_Encoding_Functionality
13/70 Test #13: JSS_Test_DER_Encoding_Functionality ...............   Passed    0.10 sec
      Start 14: JSS_Test_Empty_DER_Value
14/70 Test #14: JSS_Test_Empty_DER_Value ..........................   Passed    0.07 sec
      Start 15: BigObjectIdentifier
15/70 Test #15: BigObjectIdentifier ...............................   Passed    0.08 sec
      Start 16: JSS_Test_PR_FileDesc
16/70 Test #16: JSS_Test_PR_FileDesc ..............................   Passed    0.11 sec
      Start 17: JSS_Test_Raw_SSL
17/70 Test #17: JSS_Test_Raw_SSL ..................................***Failed    0.12 sec
Calling TestSSLImportFD()...
Exception in thread "main" java.lang.NullPointerException: SSL_ImportFD failed:  (-8038)
	at org.mozilla.jss.nss.SSL.ImportFD(SSL.java:169)
	at org.mozilla.jss.tests.TestRawSSL.TestSSLImportFD(TestRawSSL.java:17)
	at org.mozilla.jss.tests.TestRawSSL.main(TestRawSSL.java:165)

      Start 18: JSS_Test_Buffer
18/70 Test #18: JSS_Test_Buffer ...................................   Passed    0.11 sec
      Start 19: JSS_Test_GlobalRefProxy
19/70 Test #19: JSS_Test_GlobalRefProxy ...........................   Passed    5.13 sec
      Start 20: JUnit_BMPStringTest
20/70 Test #20: JUnit_BMPStringTest ...............................   Passed    0.37 sec
      Start 21: JUnit_IA5StringTest
21/70 Test #21: JUnit_IA5StringTest ...............................   Passed    0.27 sec
      Start 22: JUnit_PrintableStringTest
22/70 Test #22: JUnit_PrintableStringTest .........................   Passed    0.27 sec
      Start 23: JUnit_TeletexStringTest
23/70 Test #23: JUnit_TeletexStringTest ...........................   Passed    0.26 sec
      Start 24: JUnit_UniversalStringTest
24/70 Test #24: JUnit_UniversalStringTest .........................   Passed    0.33 sec
      Start 25: JUnit_UTF8StringTest
25/70 Test #25: JUnit_UTF8StringTest ..............................   Passed    0.28 sec
      Start 26: buffer_size_1
26/70 Test #26: buffer_size_1 .....................................   Passed    0.00 sec
      Start 27: buffer_size_4
27/70 Test #27: buffer_size_4 .....................................   Passed    0.00 sec
      Start 28: JUnit_CertificateChainTest
28/70 Test #28: JUnit_CertificateChainTest ........................   Passed    0.30 sec
      Start 29: JUnit_ChainSortingTest
29/70 Test #29: JUnit_ChainSortingTest ............................   Passed    0.30 sec
      Start 30: Generate_known_RSA_cert_pair
30/70 Test #30: Generate_known_RSA_cert_pair ......................   Passed    2.83 sec
      Start 31: Generate_known_ECDSA_cert_pair
31/70 Test #31: Generate_known_ECDSA_cert_pair ....................   Passed    0.32 sec
      Start 32: Create_PKCS11_cert_to_PKCS12_rsa.pfx
32/70 Test #32: Create_PKCS11_cert_to_PKCS12_rsa.pfx ..............   Passed    0.39 sec
      Start 33: Create_PKCS11_cert_to_PKCS12_ecdsa.pfx
33/70 Test #33: Create_PKCS11_cert_to_PKCS12_ecdsa.pfx ............   Passed    0.36 sec
      Start 34: List_CA_certs
34/70 Test #34: List_CA_certs .....................................   Passed    0.20 sec
      Start 35: Key_Generation
35/70 Test #35: Key_Generation ....................................   Passed    0.45 sec
      Start 36: Digest
36/70 Test #36: Digest ............................................   Passed    0.22 sec
      Start 37: HMAC
37/70 Test #37: HMAC ..............................................   Passed    0.23 sec
      Start 38: KeyWrapping
38/70 Test #38: KeyWrapping .......................................   Passed    0.43 sec
      Start 39: JSS-KeyWrapping
39/70 Test #39: JSS-KeyWrapping ...................................   Passed    0.25 sec
      Start 40: Mozilla_JSS_JCA_Signature
40/70 Test #40: Mozilla_JSS_JCA_Signature .........................   Passed    0.37 sec
      Start 41: Mozilla_JSS_NSS_Signature
41/70 Test #41: Mozilla_JSS_NSS_Signature .........................   Passed    0.28 sec
      Start 42: Mozilla_JSS_NSS_Context
42/70 Test #42: Mozilla_JSS_NSS_Context ...........................   Passed    0.30 sec
      Start 43: JSS_Signature_test
43/70 Test #43: JSS_Signature_test ................................   Passed    0.28 sec
      Start 44: Secret_Decoder_Ring
44/70 Test #44: Secret_Decoder_Ring ...............................   Passed    0.23 sec
      Start 45: List_cert_by_certnick
45/70 Test #45: List_cert_by_certnick .............................   Passed    0.24 sec
      Start 46: Verify_cert_by_certnick
46/70 Test #46: Verify_cert_by_certnick ...........................   Passed    0.19 sec
      Start 47: Secret_Key_Generation
47/70 Test #47: Secret_Key_Generation .............................   Passed    0.20 sec
      Start 48: Symmetric_Key_Deriving
48/70 Test #48: Symmetric_Key_Deriving ............................   Passed    0.22 sec
      Start 49: X509CertTest
49/70 Test #49: X509CertTest ......................................   Passed    2.56 sec
      Start 50: KeyStoreTest
50/70 Test #50: KeyStoreTest ......................................   Passed    0.25 sec
      Start 51: JSSProvider
51/70 Test #51: JSSProvider .......................................   Passed    0.23 sec
      Start 52: SSLEngine_ECDSA
52/70 Test #52: SSLEngine_ECDSA ...................................   Passed    1.39 sec
      Start 53: Key_Factory
53/70 Test #53: Key_Factory .......................................   Passed    0.35 sec
      Start 54: HMAC_Unwrap
54/70 Test #54: HMAC_Unwrap .......................................   Passed    0.22 sec
      Start 55: CMAC_Test
55/70 Test #55: CMAC_Test .........................................   Passed    0.21 sec
      Start 56: KBKDF_Test
56/70 Test #56: KBKDF_Test ........................................   Passed    0.21 sec
      Start 57: Mozilla_JSS_Secret_Key_Generation
57/70 Test #57: Mozilla_JSS_Secret_Key_Generation .................   Passed    0.27 sec
      Start 58: TestBufferPRFDSSL_ECDSA
58/70 Test #58: TestBufferPRFDSSL_ECDSA ...........................   Passed    0.02 sec
      Start 59: Generate_FIPS_known_RSA_cert_pair
59/70 Test #59: Generate_FIPS_known_RSA_cert_pair .................   Passed    4.36 sec
      Start 60: Generate_FIPS_known_ECDSA_cert_pair
60/70 Test #60: Generate_FIPS_known_ECDSA_cert_pair ...............   Passed    0.33 sec
      Start 61: check_FipsMODE
61/70 Test #61: check_FipsMODE ....................................   Passed    0.21 sec
      Start 62: HMAC_FIPSMODE
62/70 Test #62: HMAC_FIPSMODE .....................................   Passed    0.24 sec
      Start 63: KeyWrapping_FIPSMODE
63/70 Test #63: KeyWrapping_FIPSMODE ..............................   Passed    0.39 sec
      Start 64: Mozilla_JSS_JCA_Signature_FIPSMODE
64/70 Test #64: Mozilla_JSS_JCA_Signature_FIPSMODE ................   Passed    0.42 sec
      Start 65: JSS_Signature_test_FipsMODE
65/70 Test #65: JSS_Signature_test_FipsMODE .......................   Passed    0.32 sec
      Start 66: SSLEngine_ECDSA_FIPSMODE
66/70 Test #66: SSLEngine_ECDSA_FIPSMODE ..........................   Passed    1.43 sec
      Start 67: Disable_FipsMODE
67/70 Test #67: Disable_FipsMODE ..................................   Passed    0.23 sec
      Start 68: JUnit_GenericValueConverterTest
68/70 Test #68: JUnit_GenericValueConverterTest ...................   Passed    0.22 sec
      Start 69: JUnit_IA5StringConverterTest
69/70 Test #69: JUnit_IA5StringConverterTest ......................   Passed    0.22 sec
      Start 70: JUnit_PrintableConverterTest
70/70 Test #70: JUnit_PrintableConverterTest ......................   Passed    0.19 sec

99% tests passed, 1 tests failed out of 70

Total Test time (real) =  31.54 sec

The following tests FAILED:
	 17 - JSS_Test_Raw_SSL (Failed)
Errors while running CTest
gmake: *** [Makefile:71: test] Error 8
gmake: Leaving directory '/usr/src/RPM/BUILD/jss-5.4.2/x86_64-alt-linux'

error: Bad exit status from /usr/src/tmp/rpm-tmp.44075 (%check)


RPM build errors:
    Bad exit status from /usr/src/tmp/rpm-tmp.44075 (%check)
Command exited with non-zero status 1
116.47user 28.89system 0:50.35elapsed 288%CPU (0avgtext+0avgdata 560996maxresident)k
0inputs+0outputs (0major+2755776minor)pagefaults 0swaps
hsh-rebuild: rebuild of `jss-5.4.2-alt2.src.rpm' failed.
Command exited with non-zero status 1
4.64user 3.19system 1:11.97elapsed 10%CPU (0avgtext+0avgdata 132092maxresident)k
32inputs+0outputs (0major+305702minor)pagefaults 0swaps