<86>Apr 15 04:23:36 userdel[1913954]: delete user 'rooter'
<86>Apr 15 04:23:36 userdel[1913954]: removed group 'rooter' owned by 'rooter'
<86>Apr 15 04:23:36 userdel[1913954]: removed shadow group 'rooter' owned by 'rooter'
<86>Apr 15 04:23:36 groupadd[1913963]: group added to /etc/group: name=rooter, GID=1244
<86>Apr 15 04:23:36 groupadd[1913963]: group added to /etc/gshadow: name=rooter
<86>Apr 15 04:23:36 groupadd[1913963]: new group: name=rooter, GID=1244
<86>Apr 15 04:23:36 useradd[1913972]: new user: name=rooter, UID=1244, GID=1244, home=/root, shell=/bin/bash, from=none
<86>Apr 15 04:23:36 userdel[1913985]: delete user 'builder'
<86>Apr 15 04:23:36 userdel[1913985]: removed group 'builder' owned by 'builder'
<86>Apr 15 04:23:36 userdel[1913985]: removed shadow group 'builder' owned by 'builder'
<86>Apr 15 04:23:36 groupadd[1913995]: group added to /etc/group: name=builder, GID=1245
<86>Apr 15 04:23:36 groupadd[1913995]: group added to /etc/gshadow: name=builder
<86>Apr 15 04:23:36 groupadd[1913995]: new group: name=builder, GID=1245
<86>Apr 15 04:23:36 useradd[1914004]: new user: name=builder, UID=1245, GID=1245, home=/usr/src, shell=/bin/bash, from=none
/usr/src/in/srpm/yacas-1.4.1-alt1.src.rpm: The use of such a license name is ambiguous: GPL
warning: user mike does not exist - using root
warning: group mike does not exist - using root
warning: user mike does not exist - using root
warning: group mike does not exist - using root
warning: user mike does not exist - using root
warning: group mike does not exist - using root
<13>Apr 15 04:23:42 rpmi: libpng16-1.6.42-alt2 sisyphus+339555.100.1.1 1706781682 installed
<13>Apr 15 04:23:43 rpmi: libjpeg-2:3.0.2-alt2.1 sisyphus+340135.100.1.1 1707449145 installed
<13>Apr 15 04:23:43 rpmi: libexpat-2.5.0-alt1 sisyphus+309227.100.1.1 1667075764 installed
<13>Apr 15 04:23:43 rpmi: perl-HTTP-Date-6.06-alt1 sisyphus+324527.100.1.1 1688834564 installed
<13>Apr 15 04:23:43 rpmi: perl-Unicode-Normalize-1:5.38.2-alt0.2 sisyphus+344512.40.2.1 1712358015 installed
<13>Apr 15 04:23:43 rpmi: perl-Term-ANSIColor-5.01-alt1 sisyphus+244783.100.1.2 1579747505 installed
<13>Apr 15 04:23:43 rpmi: libidn2-2.3.7-alt1 sisyphus+339505.100.1.2 1706718968 installed
<13>Apr 15 04:23:43 rpmi: libnettle8-3.9.1-alt1 sisyphus+322548.100.1.2 1686176879 installed
<13>Apr 15 04:23:43 rpmi: less-633-alt1 sisyphus+328181.300.2.1 1693321749 installed
<13>Apr 15 04:23:43 rpmi: perl-Tie-RefHash-1.40-alt1 sisyphus+260329.100.1.1 1603548550 installed
<13>Apr 15 04:23:43 rpmi: perl-IO-Stringy-2.113-alt1 sisyphus+289915.300.2.1 1637124493 installed
<13>Apr 15 04:23:43 rpmi: perl-IO-Socket-IP-0.42-alt1 sisyphus+325815.100.1.2 1690571193 installed
<13>Apr 15 04:23:43 rpmi: perl-LWP-MediaTypes-6.04-alt1 sisyphus+225468.100.1.1 1553186684 installed
<13>Apr 15 04:23:43 rpmi: perl-libnet-1:3.15-alt1 sisyphus+317310.100.1.1 1679580208 installed
<13>Apr 15 04:23:43 rpmi: perl-HTML-Tagset-3.24-alt1 sisyphus+343117.100.1.3 1710883587 installed
<13>Apr 15 04:23:43 rpmi: perl-Compress-Raw-Zlib-2.206-alt1 sisyphus+335067.600.1.1 1700901499 installed
<13>Apr 15 04:23:43 rpmi: libtcl-8.6.13-alt1 sisyphus+310696.100.1.1 1669548266 installed
<13>Apr 15 04:23:43 rpmi: libnspr-1:4.35-alt1 sisyphus+308164.100.1.1 1665397040 installed
<13>Apr 15 04:23:43 rpmi: liblcms2-2.16-alt1 sisyphus+335676.100.1.1 1701682597 installed
<13>Apr 15 04:23:43 rpmi: libsqlite3-3.44.2-alt1 sisyphus+335409.100.3.3 1701347810 installed
<13>Apr 15 04:23:43 rpmi: libgdbm-1.8.3-alt10 sisyphus+278100.1600.1.1 1626058413 installed
<13>Apr 15 04:23:43 rpmi: libpixman-3:0.43.4-alt2 sisyphus+344164.100.1.1 1711987977 installed
<13>Apr 15 04:23:43 rpmi: libassuan-2.5.6-alt1 sisyphus+327218.300.1.1 1692093921 installed
<13>Apr 15 04:23:43 rpmi: libxxhash-0.8.2-alt1 sisyphus+336514.200.7.1 1702672118 installed
<13>Apr 15 04:23:43 rpmi: libICE-1.1.1-alt1 sisyphus+311428.500.1.1 1670577555 installed
<13>Apr 15 04:23:43 rpmi: libwebp7-1.3.2-alt1 sisyphus+329541.100.1.1 1694676223 installed
<13>Apr 15 04:23:43 rpmi: libpaper2-2:2.1.3-alt1 sisyphus+340967.100.1.1 1708276732 installed
<13>Apr 15 04:23:43 rpmi: libopenjpeg2.0-2.5.2-alt1 sisyphus+341637.100.1.1 1709150017 installed
<13>Apr 15 04:23:43 rpmi: liblz4-1:1.9.4-alt1 sisyphus+309416.100.1.1 1667412981 installed
<13>Apr 15 04:23:43 rpmi: libbrotlicommon-1.1.0-alt1 sisyphus+328501.100.1.1 1693598419 installed
<13>Apr 15 04:23:43 rpmi: libbrotlidec-1.1.0-alt1 sisyphus+328501.100.1.1 1693598419 installed
<13>Apr 15 04:23:43 rpmi: libbrotlienc-1.1.0-alt1 sisyphus+328501.100.1.1 1693598419 installed
<13>Apr 15 04:23:43 rpmi: libgraphite2-1.3.14-alt2.1 sisyphus+279571.100.1.2 1626605111 installed
<13>Apr 15 04:23:43 rpmi: libharfbuzz-8.4.0-alt1 sisyphus+344161.100.1.1 1711987962 installed
<13>Apr 15 04:23:43 rpmi: libfreetype-2.13.2-alt1 sisyphus+328677.100.1.1 1693834345 installed
<13>Apr 15 04:23:43 rpmi: libfontconfig1-2.14.2-alt8 sisyphus+328444.100.1.1 1693553402 installed
<13>Apr 15 04:23:43 rpmi: libp11-kit-1:0.25.3-alt2 sisyphus+336533.100.1.1 1702645560 installed
<13>Apr 15 04:23:43 rpmi: libtasn1-4.19.0-alt3 sisyphus+327816.100.1.1 1692802615 installed
<13>Apr 15 04:23:43 rpmi: libwoff2-1.0.2-alt3 sisyphus+302729.100.1.1 1656351540 installed
<13>Apr 15 04:23:43 rpmi: libsystemd-1:254.10-alt1 sisyphus+343748.100.3.1 1711611773 installed
<13>Apr 15 04:23:43 rpmi: libdbus-1.14.10-alt1 sisyphus+327286.5700.14.1 1711487401 installed
<13>Apr 15 04:23:43 rpmi: libavahi-0.8-alt4 sisyphus+344258.100.1.1 1712133856 installed
<13>Apr 15 04:23:43 rpmi: libSM-1.2.4-alt1 sisyphus+312057.200.1.1 1671526916 installed
<13>Apr 15 04:23:43 rpmi: tcl-8.6.13-alt1 sisyphus+310696.100.1.1 1669548266 installed
<13>Apr 15 04:23:43 rpmi: perl-OLE-Storage_Lite-0.22-alt1 sisyphus+315433.100.1.1 1676717427 installed
<13>Apr 15 04:23:43 rpmi: perl-autodie-2.37-alt1 sisyphus+337625.100.1.1 1704230186 installed
<13>Apr 15 04:23:43 rpmi: libhogweed6-3.9.1-alt1 sisyphus+322548.100.1.2 1686176879 installed
<13>Apr 15 04:23:43 rpmi: libgnutls30-3.8.4-alt1 sisyphus+343729.100.2.1 1711571288 installed
<13>Apr 15 04:23:43 rpmi: libngtcp2.16-1.4.0-alt1 sisyphus+343912.100.1.1 1711714683 installed
<13>Apr 15 04:23:43 rpmi: libngtcp2_crypto_gnutls8-1.4.0-alt1 sisyphus+343912.100.1.1 1711714683 installed
<13>Apr 15 04:23:43 rpmi: perl-Data-Dump-1.25-alt1 sisyphus+276551.100.1.1 1625126880 installed
<13>Apr 15 04:23:43 rpmi: perl-unicore-1:5.38.2-alt0.2 sisyphus+344512.40.2.1 1712358015 installed
<13>Apr 15 04:23:43 rpmi: perl-Net-IDN-Encode-2.500-alt2 sisyphus+335067.2600.1.1 1700901862 installed
<13>Apr 15 04:23:43 rpmi: perl-File-Listing-6.16-alt1 sisyphus+325783.100.1.1 1690559356 installed
<13>Apr 15 04:23:43 rpmi: groff-base-1.22.3-alt2 sisyphus+275306.100.2.1 1624538375 installed
<13>Apr 15 04:23:43 rpmi: zziplib-0.13.72-alt1 sisyphus+278032.100.1.2 1625982008 installed
<13>Apr 15 04:23:43 rpmi: tex-common-0.2-alt4 sisyphus+276869.100.1.1 1625246366 installed
<13>Apr 15 04:23:43 rpmi: t1utils-1.42-alt1 sisyphus+278458.100.1.1 1626102085 installed
<13>Apr 15 04:23:43 rpmi: ttf2pt1-3.4.4-alt1.qa1 sisyphus+275192.100.2.1 1624905844 installed
<13>Apr 15 04:23:43 rpmi: perl-TimeDate-2.33-alt1 sisyphus+252901.100.1.1 1591387378 installed
<13>Apr 15 04:23:43 rpmi: perl-Text-Unidecode-1.30-alt1 1480505027 installed
<13>Apr 15 04:23:43 rpmi: perl-Unicode-Map-0.112-alt8 sisyphus+335067.5100.2.2 1701151359 installed
<13>Apr 15 04:23:43 rpmi: perl-Math-Complex-1.59-alt1 1334229876 installed
<13>Apr 15 04:23:43 rpmi: perl-Locale-Maketext-Simple-0.21-alt3 1321333616 installed
<13>Apr 15 04:23:43 rpmi: perl-IPC-System-Simple-1.30-alt1 sisyphus+248544.100.1.1 1585154078 installed
<13>Apr 15 04:23:43 rpmi: perl-IPC-Run3-0.049-alt1 sisyphus+343743.100.2.1 1711555032 installed
<13>Apr 15 04:23:43 rpmi: psutils-2:2.10-alt2 sisyphus+336930.2400.2.1 1703147004 installed
<13>Apr 15 04:23:43 rpmi: perl-Try-Tiny-0.31-alt1 sisyphus+290597.100.1.1 1637915507 installed
<13>Apr 15 04:23:43 rpmi: perl-Module-Load-0.36-alt1 sisyphus+258992.100.1.1 1601543407 installed
<13>Apr 15 04:23:44 rpmi: perl-IO-Compress-Brotli-2:0.004001-alt3 sisyphus+335067.1200.1.1 1700901589 installed
<13>Apr 15 04:23:44 rpmi: perl-File-Which-1.27-alt1 sisyphus+271986.100.1.1 1621196035 installed
<13>Apr 15 04:23:44 rpmi: perl-File-Copy-Recursive-0.45-alt1 sisyphus+235291.100.1.1 1564606222 installed
<13>Apr 15 04:23:44 rpmi: perl-Digest-SHA1-2.13-alt5.2 sisyphus+335067.4700.2.2 1701151286 installed
<13>Apr 15 04:23:44 rpmi: perl-Digest-Perl-MD5-1.9-alt1 1394057208 installed
<13>Apr 15 04:23:44 rpmi: perl-Crypt-RC4-2.02-alt1 1319549646 installed
<13>Apr 15 04:23:44 rpmi: perl-Clone-0.46-alt1 sisyphus+335067.1100.1.1 1700901562 installed
<13>Apr 15 04:23:44 rpmi: perl-Term-Cap-1.18-alt1 sisyphus+315126.100.1.1 1676227129 installed
<13>Apr 15 04:23:44 rpmi: perl-Pod-Escapes-1.07-alt1 1418767892 installed
<13>Apr 15 04:23:44 rpmi: perl-IO-String-1.08-alt2 1321677915 installed
<13>Apr 15 04:23:44 rpmi: perl-Filter-1.64-alt1 sisyphus+335067.400.1.1 1700901412 installed
<13>Apr 15 04:23:44 rpmi: perl-Encode-3.21-alt1 sisyphus+343095.100.1.1 1710875477 installed
<13>Apr 15 04:23:44 rpmi: perl-URI-5.27-alt1 sisyphus+340901.100.1.1 1708180683 installed
<13>Apr 15 04:23:44 rpmi: perl-HTML-Parser-3.82-alt1 sisyphus+343116.100.1.3 1710883258 installed
<13>Apr 15 04:23:44 rpmi: perl-WWW-RobotRules-6.02-alt1 1329756211 installed
<13>Apr 15 04:23:44 rpmi: perl-Pod-Simple-3.45-alt1 sisyphus+321554.100.1.1 1684663135 installed
<13>Apr 15 04:23:44 rpmi: perl-Pod-Usage-2.03-alt1 sisyphus+300436.100.1.3 1653292807 installed
<13>Apr 15 04:23:44 rpmi: perl-podlators-5.01-alt1 sisyphus+312638.100.1.1 1672339228 installed
<13>Apr 15 04:23:44 rpmi: perl-Encode-Locale-1.05-alt1 1444608613 installed
<13>Apr 15 04:23:44 rpmi: perl-IO-HTML-1.004-alt1 sisyphus+258983.100.1.1 1601542619 installed
<13>Apr 15 04:23:44 rpmi: perl-Text-CSV_XS-1.53-alt1 sisyphus+335870.100.1.1 1701794985 installed
<13>Apr 15 04:23:44 rpmi: perl-Spreadsheet-ParseExcel-1:0.66-alt1 sisyphus+337637.100.1.1 1704230912 installed
<13>Apr 15 04:23:44 rpmi: perl-Compress-Raw-Bzip2-2.210-alt1 sisyphus+343108.100.1.3 1710881036 installed
<13>Apr 15 04:23:44 rpmi: perl-IO-Compress-2.206-alt1 sisyphus+325819.100.1.1 1690563199 installed
<13>Apr 15 04:23:44 rpmi: perl-HTTP-Message-6.45-alt1 sisyphus+330728.100.1.1 1696162276 installed
<13>Apr 15 04:23:44 rpmi: perl-Net-HTTP-6.23-alt1 sisyphus+323470.100.1.1 1687422469 installed
<13>Apr 15 04:23:44 rpmi: perl-HTML-Form-6.11-alt1 sisyphus+315122.100.1.1 1676226686 installed
<13>Apr 15 04:23:44 rpmi: perl-HTTP-Negotiate-6.01-alt1 1329760563 installed
<13>Apr 15 04:23:44 rpmi: perl-libwww-6.77-alt1 sisyphus+343120.100.1.2 1710884405 installed
<13>Apr 15 04:23:44 rpmi: perl-HTML-Formatter-2.16-alt2 sisyphus+306600.100.1.1 1663005434 installed
<13>Apr 15 04:23:44 rpmi: perl-HTML-Tree-5.07-alt1 sisyphus+277105.100.1.1 1625402682 installed
<13>Apr 15 04:23:44 rpmi: perl-XML-Parser-2.47-alt1 sisyphus+337612.100.1.1 1704201438 installed
<13>Apr 15 04:23:44 rpmi: perl-XML-XPath-1.48-alt1 sisyphus+305097.100.1.2 1660226797 installed
<13>Apr 15 04:23:44 rpmi: perl-HTTP-Cookies-6.11-alt1 sisyphus+336115.100.1.1 1702044494 installed
<13>Apr 15 04:23:44 rpmi: perl-WWW-Mechanize-2.18-alt1 sisyphus+339965.100.1.3 1707245616 installed
<13>Apr 15 04:23:44 rpmi: perl-IO-Zlib-1.15-alt1 sisyphus+343119.100.1.3 1710884191 installed
<13>Apr 15 04:23:44 rpmi: perl-Archive-Tar-3.02-alt1 sisyphus+318647.100.1.1 1681742479 installed
<13>Apr 15 04:23:44 rpmi: libtexlua5-2022-alt0_10 sisyphus+342516.200.3.2 1710234717 installed
<13>Apr 15 04:23:44 rpmi: libteckit-2.5.1-alt2.1 sisyphus+275250.100.2.1 1624906328 installed
<13>Apr 15 04:23:44 rpmi: libteckit-utils-2.5.1-alt2.1 sisyphus+275250.100.2.1 1624906328 installed
<13>Apr 15 04:23:44 rpmi: libsynctex2-2022-alt0_10 sisyphus+342516.200.3.2 1710234717 installed
<13>Apr 15 04:23:44 rpmi: libqqwing-1.3.4-alt2 sisyphus+275255.100.2.1 1624562960 installed
<13>Apr 15 04:23:44 rpmi: qqwing-1.3.4-alt2 sisyphus+275255.100.2.1 1624562960 installed
<13>Apr 15 04:23:44 rpmi: libpotrace-1.16-alt2 sisyphus+328401.100.1.1 1693483624 installed
<13>Apr 15 04:23:44 rpmi: poppler-data-0.4.12-alt1 sisyphus+322151.100.1.1 1685438511 installed
<13>Apr 15 04:23:44 rpmi: libpipeline-1.5.7-alt1_1 sisyphus+312433.100.1.1 1671879773 installed
<13>Apr 15 04:23:44 rpmi: man-db-2.12.0-alt1 sisyphus+336930.2100.1.1 1703107121 installed
<13>Apr 15 04:23:44 rpmi: libmpdec3-2.5.1-alt3 sisyphus+314490.500.5.1 1675432004 installed
<13>Apr 15 04:23:44 rpmi: libkpathsea6-2022-alt0_10 sisyphus+342516.200.3.2 1710234717 installed
<13>Apr 15 04:23:44 rpmi: libptexenc1-2022-alt0_10 sisyphus+342516.200.3.2 1710234717 installed
<13>Apr 15 04:23:45 rpmi: libicu74-1:7.4.2-alt1 sisyphus+336372.200.1.1 1702423005 installed
<13>Apr 15 04:23:45 rpmi: libusb-1.0.26-alt3 sisyphus+340691.100.3.1 1708466435 installed
<13>Apr 15 04:23:45 rpmi: libreadline7-7.0.3-alt5 sisyphus+328858.200.1.1 1694010737 installed
<13>Apr 15 04:23:45 rpmi: libnpth-1.6.0.20.g7e45b50-alt3 sisyphus+278566.100.1.1 1626114690 installed
<13>Apr 15 04:23:45 rpmi: libksba-1.6.4-alt1 sisyphus+327218.400.1.1 1692093956 installed
<13>Apr 15 04:23:45 rpmi: libnuma-2.0.14-alt2 sisyphus+278485.100.1.1 1626104244 installed
<13>Apr 15 04:23:45 rpmi: libx265-199-3.5-alt1.1 sisyphus+277560.100.1.1 1625697230 installed
<13>Apr 15 04:23:45 rpmi: desktop-file-utils-0.26-alt6 sisyphus+331944.100.1.3 1697550026 installed
<13>Apr 15 04:23:45 rpmi: shared-mime-info-2.4-alt1 sisyphus+334259.100.1.1 1699787316 installed
<13>Apr 15 04:23:45 rpmi: libgdk-pixbuf-locales-2.42.10-alt1 sisyphus+308991.100.1.1 1666721198 installed
<13>Apr 15 04:23:45 rpmi: libde265-1.0.15-alt1 sisyphus+337190.100.1.1 1703502096 installed
<13>Apr 15 04:23:45 rpmi: libb2-0.98.1-alt1_1 sisyphus+291614.100.1.1 1638962877 installed
<13>Apr 15 04:23:45 rpmi: libaom3-3.5.0-alt2 sisyphus+335780.100.1.1 1701761281 installed
<13>Apr 15 04:23:45 rpmi: hd2u-1.0.3-alt2 sisyphus+275312.100.2.1 1624906676 installed
<13>Apr 15 04:23:45 rpmi: gsettings-desktop-schemas-data-46.0-alt1 sisyphus+343025.100.4.2 1710847127 installed
<13>Apr 15 04:23:45 rpmi: libgio-2.80.0-alt2.1 sisyphus+343856.100.1.1 1711642821 installed
<13>Apr 15 04:23:45 rpmi: gsettings-desktop-schemas-46.0-alt1 sisyphus+343025.100.4.2 1710847127 installed
<13>Apr 15 04:23:45 rpmi: gpgme-common-1.23.2-alt1 sisyphus+340628.100.1.1 1707840001 installed
<13>Apr 15 04:23:45 rpmi: publicsuffix-list-dafsa-20240130-alt1 sisyphus+339506.100.1.1 1706719111 installed
<13>Apr 15 04:23:45 rpmi: libpsl-0.21.5-alt1 sisyphus+338474.100.1.1 1705684769 installed
<13>Apr 15 04:23:45 rpmi: libnghttp3.9-1.2.0-alt1 sisyphus+343912.200.1.1 1711714725 installed
<13>Apr 15 04:23:45 rpmi: libnghttp2-1.61.0-alt1 sisyphus+344450.100.1.1 1712304117 installed
<13>Apr 15 04:23:45 rpmi: openldap-common-2.6.7-alt1 sisyphus+343335.200.1.1 1711113916 installed
<13>Apr 15 04:23:45 rpmi: libntlm-1.5-alt1 sisyphus+278100.3300.1.1 1626058899 installed
<13>Apr 15 04:23:45 rpmi: libidn-1.37-alt2 sisyphus+300849.100.1.1 1653769687 installed
<13>Apr 15 04:23:45 rpmi: libedit3-3.1.20230828-alt1 sisyphus+330914.200.3.1 1696922743 installed
<13>Apr 15 04:23:45 rpmi: libX11-locales-3:1.8.8-alt1 sisyphus+343583.100.1.1 1711440719 installed
<13>Apr 15 04:23:45 rpmi: libXdmcp-1.1.5-alt1 sisyphus+343583.700.1.1 1711441061 installed
<13>Apr 15 04:23:45 rpmi: libXau-1.0.11-alt1 sisyphus+311428.100.1.1 1670577439 installed
<13>Apr 15 04:23:45 rpmi: libxcb-1.16.1-alt1 sisyphus+343583.500.1.1 1711440979 installed
<13>Apr 15 04:23:45 rpmi: libX11-3:1.8.8-alt1 sisyphus+343583.100.1.1 1711440719 installed
<13>Apr 15 04:23:45 rpmi: libXt-1.3.0-alt1 sisyphus+331490.500.1.1 1697023310 installed
<13>Apr 15 04:23:45 rpmi: libXext-1.3.6-alt1 sisyphus+343583.1000.1.1 1711441101 installed
<13>Apr 15 04:23:45 rpmi: libXmu-1.2.0-alt1 sisyphus+343583.1200.1.1 1711441172 installed
<13>Apr 15 04:23:45 rpmi: libXpm-3.5.17-alt1 sisyphus+330921.100.1.1 1696400257 installed
<13>Apr 15 04:23:46 rpmi: libXrender-0.9.11-alt1 sisyphus+308841.100.1.1 1666436130 installed
<13>Apr 15 04:23:46 rpmi: libXft-2.3.8-alt1 sisyphus+331490.400.1.1 1697023269 installed
<13>Apr 15 04:23:46 rpmi: libcairo-1:1.18.0-alt1 sisyphus+330227.100.1.1 1695539090 installed
<13>Apr 15 04:23:46 rpmi: libtk-8.6.13-alt1 sisyphus+310696.200.1.1 1669548530 installed
<13>Apr 15 04:23:46 rpmi: tk-8.6.13-alt1 sisyphus+310696.200.1.1 1669548530 installed
<13>Apr 15 04:23:46 rpmi: perl-Tk-804.036-alt1 sisyphus+335067.4600.2.2 1701151239 installed
<13>Apr 15 04:23:46 rpmi: libXaw-1.0.16-alt1 sisyphus+343583.400.1.1 1711440833 installed
<13>Apr 15 04:23:46 rpmi: libdeflate-1.20-alt1 sisyphus+343488.100.1.1 1711323991 installed
<13>Apr 15 04:23:46 rpmi: libtiff5-4.4.0-alt4 sisyphus+322581.100.1.2 1686180089 installed
<13>Apr 15 04:23:46 rpmi: libgdk-pixbuf-2.42.10-alt1 sisyphus+308991.100.1.1 1666721198 installed
<13>Apr 15 04:23:46 rpmi: libheif-1.17.6-alt1 sisyphus+337190.200.1.1 1703502141 installed
<13>Apr 15 04:23:46 rpmi: libgd3-2.3.3-alt2 sisyphus+335387.100.1.1 1701278641 installed
<13>Apr 15 04:23:46 rpmi: libverto-0.3.2-alt1_1 sisyphus+321176.2200.10.2 1684803947 installed
<13>Apr 15 04:23:46 rpmi: liblmdb-0.9.32-alt1 sisyphus+342426.100.1.1 1710124288 installed
<13>Apr 15 04:23:46 rpmi: libkeyutils-1.6.3-alt1 sisyphus+266061.100.1.1 1612919566 installed
<13>Apr 15 04:23:46 rpmi: libcom_err-1.46.4.0.5.4cda-alt1 sisyphus+283826.100.1.1 1629975345 installed
<13>Apr 15 04:23:46 rpmi: xml-utils-1:2.12.5-alt1 sisyphus+342268.100.2.1 1710156411 installed
<13>Apr 15 04:23:46 rpmi: fontconfig-2.14.2-alt8 sisyphus+328444.100.1.1 1693553402 installed
Updating fonts cache: <29>Apr 15 04:23:47 fontconfig: Updating fonts cache: succeeded
[ DONE ]
<13>Apr 15 04:23:47 rpmi: fonts-type1-urw-3:1.0.7pre44-alt3 sisyphus+224082.100.2.1 1552406640 installed
<13>Apr 15 04:23:47 rpmi: gcc-c++-common-1.4.27-alt1 sisyphus+278099.1300.1.1 1626028636 installed
<13>Apr 15 04:23:48 rpmi: libstdc++13-devel-13.2.1-alt3 sisyphus+339335.100.1.1 1706563486 installed
<13>Apr 15 04:23:48 rpmi: gcc13-c++-13.2.1-alt3 sisyphus+339335.100.1.1 1706563486 installed
<13>Apr 15 04:23:49 rpmi: ed-1:0.2-alt10 sisyphus+278100.1100.1.1 1626056843 installed
<13>Apr 15 04:23:49 rpmi: diffstat-1.64-alt1 sisyphus+278100.700.1.1 1626056683 installed
<13>Apr 15 04:23:49 rpmi: libdialog-1.3.20171209-alt2 sisyphus+328094.100.1.1 1693228848 installed
<13>Apr 15 04:23:49 rpmi: dialog-1.3.20171209-alt2 sisyphus+328094.100.1.1 1693228848 installed
<13>Apr 15 04:23:49 rpmi: rpm-macros-alternatives-0.5.2-alt2 sisyphus+315270.200.2.1 1676457367 installed
<13>Apr 15 04:23:49 rpmi: alternatives-0.5.2-alt2 sisyphus+315270.200.2.1 1676457367 installed
<13>Apr 15 04:23:49 rpmi: ca-certificates-2024.02.24-alt1 sisyphus+341362.100.1.1 1708791001 installed
<13>Apr 15 04:23:49 rpmi: ca-trust-0.2.0-alt1 sisyphus+344843.100.1.1 1712743326 installed
<13>Apr 15 04:23:49 rpmi: p11-kit-trust-1:0.25.3-alt2 sisyphus+336533.100.1.1 1702645560 installed
<13>Apr 15 04:23:49 rpmi: libcrypto3-3.1.5-alt2 sisyphus+343320.140.3.1 1711982212 installed
<13>Apr 15 04:23:49 rpmi: libssl3-3.1.5-alt2 sisyphus+343320.140.3.1 1711982212 installed
<86>Apr 15 04:23:49 groupadd[1922486]: group added to /etc/group: name=_keytab, GID=999
<86>Apr 15 04:23:49 groupadd[1922486]: group added to /etc/gshadow: name=_keytab
<86>Apr 15 04:23:49 groupadd[1922486]: new group: name=_keytab, GID=999
<13>Apr 15 04:23:49 rpmi: libkrb5-1.21.2-alt2 sisyphus+338902.100.2.1 1706700934 installed
<13>Apr 15 04:23:49 rpmi: libcups-2.4.7-alt2 sisyphus+333092.100.1.1 1698654160 installed
<13>Apr 15 04:23:50 rpmi: libgs-10.01.1-alt2 sisyphus+337968.300.3.1 1705654974 installed
<13>Apr 15 04:23:51 rpmi: ghostscript-common-10.01.1-alt2 sisyphus+337968.300.3.1 1705654974 installed
<13>Apr 15 04:23:51 rpmi: ghostscript-classic-10.01.1-alt2 sisyphus+337968.300.3.1 1705654974 installed
<13>Apr 15 04:23:52 rpmi: ghostscript-10.01.1-alt2 sisyphus+337968.300.3.1 1705654974 installed
<13>Apr 15 04:23:52 rpmi: ghostscript-module-X-10.01.1-alt2 sisyphus+337968.300.3.1 1705654974 installed
<13>Apr 15 04:23:52 rpmi: libgsasl-2.2.0-alt1 sisyphus+333173.100.1.1 1698696954 installed
<86>Apr 15 04:23:52 groupadd[1925166]: group added to /etc/group: name=sasl, GID=998
<86>Apr 15 04:23:52 groupadd[1925166]: group added to /etc/gshadow: name=sasl
<86>Apr 15 04:23:52 groupadd[1925166]: new group: name=sasl, GID=998
<13>Apr 15 04:23:52 rpmi: libsasl2-3-2.1.28-alt2 sisyphus+343335.100.1.1 1711112544 installed
<13>Apr 15 04:23:52 rpmi: libldap2-2.6.7-alt1 sisyphus+343335.200.1.1 1711113916 installed
<86>Apr 15 04:23:52 groupadd[1925225]: group added to /etc/group: name=_gnupg, GID=997
<86>Apr 15 04:23:52 groupadd[1925225]: group added to /etc/gshadow: name=_gnupg
<86>Apr 15 04:23:52 groupadd[1925225]: new group: name=_gnupg, GID=997
<13>Apr 15 04:23:52 rpmi: gnupg2-2.4.3-alt1 sisyphus+327229.100.1.1 1692102992 installed
<13>Apr 15 04:23:52 rpmi: libgpgme11-1.23.2-alt1 sisyphus+340628.100.1.1 1707840001 installed
<13>Apr 15 04:23:52 rpmi: libgpgmepp6-1.23.2-alt1 sisyphus+340628.100.1.1 1707840001 installed
<13>Apr 15 04:23:52 rpmi: perl-Net-SSLeay-1.94-alt1 sisyphus+340982.100.1.1 1708280650 installed
<13>Apr 15 04:23:52 rpmi: perl-IO-Socket-SSL-2.085-alt1 sisyphus+339115.100.1.1 1706295283 installed
<13>Apr 15 04:23:52 rpmi: perl-Net-HTTPS-6.23-alt1 sisyphus+323470.100.1.1 1687422469 installed
<13>Apr 15 04:23:52 rpmi: perl-LWP-Protocol-https-6.14-alt1 sisyphus+343123.100.1.3 1710885316 installed
<13>Apr 15 04:23:52 rpmi: python3-3.12.2-alt1 sisyphus+341702.200.1.1 1709232871 installed
<13>Apr 15 04:23:53 rpmi: python3-base-3.12.2-alt1 sisyphus+341702.200.1.1 1709232871 installed
<13>Apr 15 04:23:53 rpmi: openssh-common-9.6p1-alt1 sisyphus+338324.200.2.1 1706093654 installed
<86>Apr 15 04:23:53 groupadd[1926442]: group added to /etc/group: name=sshagent, GID=996
<86>Apr 15 04:23:53 groupadd[1926442]: group added to /etc/gshadow: name=sshagent
<86>Apr 15 04:23:53 groupadd[1926442]: new group: name=sshagent, GID=996
<13>Apr 15 04:23:53 rpmi: openssh-clients-9.6p1-alt1 sisyphus+338324.200.2.1 1706093654 installed
<13>Apr 15 04:23:53 rpmi: rsync-3.2.7-alt1 sisyphus+325006.2000.1.1 1689497333 installed
<13>Apr 15 04:23:53 rpmi: libssh2-1.11.0-alt2 sisyphus+339356.100.1.1 1706593137 installed
<13>Apr 15 04:23:53 rpmi: libcurl-8.7.1-alt1 sisyphus+343696.100.2.2 1711555843 installed
<13>Apr 15 04:23:53 rpmi: git-core-2.42.1-alt1 sisyphus+333661.100.1.1 1699193182 installed
<13>Apr 15 04:23:53 rpmi: libnss-3.99-alt1 sisyphus+344230.420.10.1 1712504446 installed
<13>Apr 15 04:23:54 rpmi: libpoppler130-23.08.0-alt4 sisyphus+341496.100.1.1 1709026260 installed
<13>Apr 15 04:23:54 rpmi: poppler-23.08.0-alt4 sisyphus+341496.100.1.1 1709026260 installed
<13>Apr 15 04:23:54 rpmi: foomatic-db-engine-4.0.12-alt1 sisyphus+278189.100.1.1 1626076171 installed
<13>Apr 15 04:23:55 rpmi: texlive-2022-alt0_10 sisyphus+342516.200.3.2 1710234717 installed
<13>Apr 15 04:24:09 rpmi: texlive-collection-basic-2022-alt0_12 sisyphus+342303.200.3.1 1710171325 installed
<13>Apr 15 04:24:09 rpmi: gcc-c++-13-alt1 sisyphus+323337.300.1.1 1687267966 installed
egrep: warning: egrep is obsolescent; using grep -E
Building target platforms: x86_64
Building for target x86_64
Wrote: /usr/src/in/nosrpm/yacas-1.4.1-alt1.nosrc.rpm (w1.gzdio)
Installing yacas-1.4.1-alt1.src.rpm
Building target platforms: x86_64
Building for target x86_64
Executing(%prep): /bin/sh -e /usr/src/tmp/rpm-tmp.73815
+ umask 022
+ /bin/mkdir -p /usr/src/RPM/BUILD
+ cd /usr/src/RPM/BUILD
+ cd /usr/src/RPM/BUILD
+ rm -rf yacas-1.4.1
+ echo 'Source #0 (yacas-1.4.1.tar.gz):'
Source #0 (yacas-1.4.1.tar.gz):
+ /bin/gzip -dc /usr/src/RPM/SOURCES/yacas-1.4.1.tar.gz
+ /bin/tar -xf -
+ cd yacas-1.4.1
+ /bin/chmod -c -Rf u+rwX,go-w .
+ touch README
+ exit 0
Executing(%build): /bin/sh -e /usr/src/tmp/rpm-tmp.73815
+ umask 022
+ /bin/mkdir -p /usr/src/RPM/BUILD
+ cd /usr/src/RPM/BUILD
+ cd yacas-1.4.1
+ autoreconf -fisv
autoreconf-default: export WARNINGS=
autoreconf-default: Entering directory '.'
autoreconf-default: configure.ac: not using Gettext
autoreconf-default: running: aclocal --force -I m4
aclocal-default: warning: couldn't open directory 'm4': No such file or directory
autoreconf-default: configure.ac: tracing
autoreconf-default: running: libtoolize --force --install
libtoolize-default: putting auxiliary files in '.'.
libtoolize-default: linking file './config.guess'
libtoolize-default: linking file './config.sub'
libtoolize-default: linking file './install-sh'
libtoolize-default: linking file './ltmain.sh'
libtoolize-default: putting macros in AC_CONFIG_MACRO_DIRS, 'm4'.
libtoolize-default: linking file 'm4/libtool.m4'
libtoolize-default: You should add the contents of 'm4/libtool.m4' to 'aclocal.m4'.
libtoolize-default: linking file 'm4/ltoptions.m4'
libtoolize-default: You should add the contents of 'm4/ltoptions.m4' to 'aclocal.m4'.
libtoolize-default: linking file 'm4/ltsugar.m4'
libtoolize-default: You should add the contents of 'm4/ltsugar.m4' to 'aclocal.m4'.
libtoolize-default: linking file 'm4/ltversion.m4'
libtoolize-default: linking file 'm4/lt~obsolete.m4'
libtoolize-default: You should add the contents of 'm4/lt~obsolete.m4' to 'aclocal.m4'.
autoreconf-default: configure.ac: not using Intltool
autoreconf-default: configure.ac: not using Gtkdoc
autoreconf-default: running: aclocal --force -I m4
autoreconf-default: running: /usr/bin/autoconf-2.71 --force
configure.ac:6: warning: 'AM_CONFIG_HEADER': this macro is obsolete.
configure.ac:6: You should use the 'AC_CONFIG_HEADERS' macro instead.
./lib/autoconf/general.m4:2434: AC_DIAGNOSE is expanded from...
aclocal.m4:745: AM_CONFIG_HEADER is expanded from...
configure.ac:6: the top level
configure.ac:38: warning: The macro `AC_HEADER_STDC' is obsolete.
configure.ac:38: You should run autoupdate.
./lib/autoconf/headers.m4:704: AC_HEADER_STDC is expanded from...
configure.ac:38: the top level
configure.ac:47: warning: The macro `AC_HEADER_TIME' is obsolete.
configure.ac:47: You should run autoupdate.
./lib/autoconf/headers.m4:743: AC_HEADER_TIME is expanded from...
configure.ac:47: the top level
configure.ac:130: warning: The macro `AC_TRY_COMPILE' is obsolete.
configure.ac:130: You should run autoupdate.
./lib/autoconf/general.m4:2847: AC_TRY_COMPILE is expanded from...
lib/m4sugar/m4sh.m4:692: _AS_IF_ELSE is expanded from...
lib/m4sugar/m4sh.m4:699: AS_IF is expanded from...
./lib/autoconf/general.m4:2249: AC_CACHE_VAL is expanded from...
lib/m4sugar/m4sh.m4:692: _AS_IF_ELSE is expanded from...
lib/m4sugar/m4sh.m4:699: AS_IF is expanded from...
./lib/autoconf/general.m4:2249: AC_CACHE_VAL is expanded from...
lib/m4sugar/m4sh.m4:692: _AS_IF_ELSE is expanded from...
lib/m4sugar/m4sh.m4:699: AS_IF is expanded from...
./lib/autoconf/general.m4:2249: AC_CACHE_VAL is expanded from...
acinclude.m4:20: AC_FUNC_ACCEPT_ARGTYPES is expanded from...
configure.ac:130: the top level
configure.ac:207: warning: AC_OUTPUT should be used without arguments.
configure.ac:207: You should run autoupdate.
autoreconf-default: running: /usr/bin/autoheader-2.71 --force
autoreconf-default: running: automake --add-missing --force-missing
configure.ac:10: installing './compile'
configure.ac:8: installing './missing'
docs/Makefile.am: installing './depcomp'
autoreconf-default: Leaving directory '.'
+ CXXFLAGS='-pipe -frecord-gcc-switches -Wall -g -O2 -flto=auto'
+ CFLAGS='-pipe -frecord-gcc-switches -Wall -g -O2 -flto=auto'
+ export CFLAGS
+ CXXFLAGS='-pipe -frecord-gcc-switches -Wall -g -O2 -flto=auto'
+ export CXXFLAGS
+ FFLAGS='-pipe -frecord-gcc-switches -Wall -g -O2 -flto=auto'
+ export FFLAGS
+ FCFLAGS='-pipe -frecord-gcc-switches -Wall -g -O2 -flto=auto'
+ export FCFLAGS
+ '[' -n '' ']'
++ printf %s '-pipe -frecord-gcc-switches -Wall -g -O2 -flto=auto'
++ sed -r 's/(^|[[:space:]]+)-[^m][^[:space:]]*//g'
+ ASFLAGS=
+ export ASFLAGS
+ export lt_cv_deplibs_check_method=pass_all
+ lt_cv_deplibs_check_method=pass_all
+ readlink -e -- ./configure
+ xargs -ri dirname -- '{}'
+ xargs -ri find '{}' -type f '(' -name config.sub -or -name config.guess ')' -printf '%h/\n'
+ sort -u
+ xargs -rn1 install -pm755 -- /usr/share/gnu-config/config.sub /usr/share/gnu-config/config.guess
+ configure_runstatedir_flags=
+ grep -qF runstatedir=DIR ./configure
+ configure_runstatedir_flags=--runstatedir=/var/run
+ ./configure --build=x86_64-alt-linux --host=x86_64-alt-linux --prefix=/usr --exec-prefix=/usr --bindir=/usr/bin --sbindir=/usr/sbin --sysconfdir=/etc --datadir=/usr/share --includedir=/usr/include --libdir=/usr/lib64 --libexecdir=/usr/lib --localstatedir=/var/lib --sharedstatedir=/var/lib --mandir=/usr/share/man --infodir=/usr/share/info --disable-dependency-tracking --disable-silent-rules --runstatedir=/var/run --without-included-gettext --enable-gmp --disable-static
configure: WARNING: unrecognized options: --without-included-gettext, --enable-gmp
checking for a BSD-compatible install... /bin/install -c
checking whether build environment is sane... yes
checking for a race-free mkdir -p... /bin/mkdir -p
checking for gawk... gawk
checking whether make sets $(MAKE)... yes
checking whether make supports nested variables... yes
checking build system type... x86_64-alt-linux-gnu
checking host system type... x86_64-alt-linux-gnu
checking how to print strings... printf
checking whether make supports the include directive... yes (GNU style)
checking for x86_64-alt-linux-gcc... x86_64-alt-linux-gcc
checking whether the C compiler works... yes
checking for C compiler default output file name... a.out
checking for suffix of executables... 
checking whether we are cross compiling... no
checking for suffix of object files... o
checking whether the compiler supports GNU C... yes
checking whether x86_64-alt-linux-gcc accepts -g... yes
checking for x86_64-alt-linux-gcc option to enable C11 features... none needed
checking whether x86_64-alt-linux-gcc understands -c and -o together... yes
checking dependency style of x86_64-alt-linux-gcc... none
checking for a sed that does not truncate output... /bin/sed
checking for grep that handles long lines and -e... /bin/grep
checking for egrep... /bin/grep -E
checking for fgrep... /bin/grep -F
checking for ld used by x86_64-alt-linux-gcc... /usr/bin/ld
checking if the linker (/usr/bin/ld) is GNU ld... yes
checking for BSD- or MS-compatible name lister (nm)... /usr/bin/nm -B
checking the name lister (/usr/bin/nm -B) interface... BSD nm
checking whether ln -s works... yes
checking the maximum length of command line arguments... 1572864
checking how to convert x86_64-alt-linux-gnu file names to x86_64-alt-linux-gnu format... func_convert_file_noop
checking how to convert x86_64-alt-linux-gnu file names to toolchain format... func_convert_file_noop
checking for /usr/bin/ld option to reload object files... -r
checking for x86_64-alt-linux-file... no
checking for file... file
checking for x86_64-alt-linux-objdump... no
checking for objdump... objdump
checking how to recognize dependent libraries... (cached) pass_all
checking for x86_64-alt-linux-dlltool... no
checking for dlltool... no
checking how to associate runtime and link libraries... printf %s\n
checking for x86_64-alt-linux-ar... no
checking for ar... ar
checking for archiver @FILE support... @
checking for x86_64-alt-linux-strip... no
checking for strip... strip
checking for x86_64-alt-linux-ranlib... no
checking for ranlib... ranlib
checking command to parse /usr/bin/nm -B output from x86_64-alt-linux-gcc object... ok
checking for sysroot... no
checking for a working dd... /bin/dd
checking how to truncate binary pipes... /bin/dd bs=4096 count=1
checking for x86_64-alt-linux-mt... no
checking for mt... no
checking if : is a manifest tool... no
checking for stdio.h... yes
checking for stdlib.h... yes
checking for string.h... yes
checking for inttypes.h... yes
checking for stdint.h... yes
checking for strings.h... yes
checking for sys/stat.h... yes
checking for sys/types.h... yes
checking for unistd.h... yes
checking for sys/time.h... yes
checking for dlfcn.h... yes
checking for objdir... .libs
checking if x86_64-alt-linux-gcc supports -fno-rtti -fno-exceptions... no
checking for x86_64-alt-linux-gcc option to produce PIC... -fPIC -DPIC
checking if x86_64-alt-linux-gcc PIC flag -fPIC -DPIC works... yes
checking if x86_64-alt-linux-gcc static flag -static works... no
checking if x86_64-alt-linux-gcc supports -c -o file.o... yes
checking if x86_64-alt-linux-gcc supports -c -o file.o... (cached) yes
checking whether the x86_64-alt-linux-gcc linker (/usr/bin/ld -m elf_x86_64) supports shared libraries... yes
checking whether -lc should be explicitly linked in... no
checking dynamic linker characteristics... GNU/Linux ld.so
checking how to hardcode library paths into programs... immediate
checking whether stripping libraries is possible... yes
checking if libtool supports shared libraries... yes
checking whether to build shared libraries... yes
checking whether to build static libraries... no
checking for x86_64-alt-linux-gcc... (cached) x86_64-alt-linux-gcc
checking whether the compiler supports GNU C... (cached) yes
checking whether x86_64-alt-linux-gcc accepts -g... (cached) yes
checking for x86_64-alt-linux-gcc option to enable C11 features... (cached) none needed
checking whether x86_64-alt-linux-gcc understands -c and -o together... (cached) yes
checking dependency style of x86_64-alt-linux-gcc... (cached) none
checking how to run the C preprocessor... x86_64-alt-linux-gcc -E
checking for x86_64-alt-linux-g++... x86_64-alt-linux-g++
checking whether the compiler supports GNU C++... yes
checking whether x86_64-alt-linux-g++ accepts -g... yes
checking for x86_64-alt-linux-g++ option to enable C++11 features... none needed
checking dependency style of x86_64-alt-linux-g++... none
checking how to run the C++ preprocessor... x86_64-alt-linux-g++ -E
checking for ld used by x86_64-alt-linux-g++... /usr/bin/ld -m elf_x86_64
checking if the linker (/usr/bin/ld -m elf_x86_64) is GNU ld... yes
checking whether the x86_64-alt-linux-g++ linker (/usr/bin/ld -m elf_x86_64) supports shared libraries... yes
checking for x86_64-alt-linux-g++ option to produce PIC... -fPIC -DPIC
checking if x86_64-alt-linux-g++ PIC flag -fPIC -DPIC works... yes
checking if x86_64-alt-linux-g++ static flag -static works... no
checking if x86_64-alt-linux-g++ supports -c -o file.o... yes
checking if x86_64-alt-linux-g++ supports -c -o file.o... (cached) yes
checking whether the x86_64-alt-linux-g++ linker (/usr/bin/ld -m elf_x86_64) supports shared libraries... yes
checking dynamic linker characteristics... (cached) GNU/Linux ld.so
checking how to hardcode library paths into programs... immediate
checking for perl... yes
checking for pdflatex... yes
checking for makeindex... yes
checking for gzip... yes
checking for x86_64-alt-linux-ar... ar
checking for egrep... (cached) /bin/grep -E
checking for unistd.h... (cached) yes
checking for sys/ioctl.h... yes
checking for sys/socket.h... yes
checking for sys/time.h... (cached) yes
checking for sys/types.h... (cached) yes
checking for sys/sysinfo.h... yes
checking for malloc.h... yes
checking for memory.h... yes
checking for stdlib.h... (cached) yes
checking for stdio.h... (cached) yes
checking for ctype.h... yes
checking for dirent.h... yes
checking for signal.h... yes
checking for string.h... (cached) yes
checking for an ANSI C-conforming const... yes
checking for inline... inline
checking for select... yes
checking for socket... yes
checking for strchr... yes
checking type of argument of signal handler... int
checking whether to build the debug version... 
checking whether to enable the server mode... 
checking that generated files are newer than configure... done
configure: creating ./config.status
config.status: creating Makefile
config.status: creating docs/Makefile
config.status: creating scripts/Makefile
config.status: creating JavaYacas/Makefile
config.status: creating tests/Makefile
config.status: creating manmake/Makefile
config.status: creating src/Makefile
config.status: creating config.h
config.status: executing depfiles commands
config.status: executing libtool commands
configure: WARNING: unrecognized options: --without-included-gettext, --enable-gmp
+ make -j8
make  all-recursive
Making all in .
Making all in docs
make[2]: Entering directory '/usr/src/RPM/BUILD/yacas-1.4.1/docs'
x86_64-alt-linux-g++ -DHAVE_CONFIG_H -I. -I..     -pipe -frecord-gcc-switches -Wall -g -O2 -flto=auto -std=c++11 -Wall -pedantic  -c -o riptestfromyart.o riptestfromyart.cpp
make[2]: Leaving directory '/usr/src/RPM/BUILD/yacas-1.4.1/docs'
make[2]: Entering directory '/usr/src/RPM/BUILD/yacas-1.4.1/docs'
x86_64-alt-linux-g++ -DHAVE_CONFIG_H -I. -I..     -pipe -frecord-gcc-switches -Wall -g -O2 -flto=auto -std=c++11 -Wall -pedantic  -c -o autocompleter.o autocompleter.cpp
make[2]: Leaving directory '/usr/src/RPM/BUILD/yacas-1.4.1/docs'
make[2]: Entering directory '/usr/src/RPM/BUILD/yacas-1.4.1/docs'
/bin/sh ../libtool  --tag=CXX   --mode=link x86_64-alt-linux-g++  -pipe -frecord-gcc-switches -Wall -g -O2 -flto=auto -std=c++11 -Wall -pedantic    -o riptestfromyart riptestfromyart.o  
libtool: link: x86_64-alt-linux-g++ -pipe -frecord-gcc-switches -Wall -g -O2 -flto=auto -std=c++11 -Wall -pedantic -o riptestfromyart riptestfromyart.o 
make[2]: Leaving directory '/usr/src/RPM/BUILD/yacas-1.4.1/docs'
make[2]: Entering directory '/usr/src/RPM/BUILD/yacas-1.4.1/docs'
/bin/sh ../libtool  --tag=CXX   --mode=link x86_64-alt-linux-g++  -pipe -frecord-gcc-switches -Wall -g -O2 -flto=auto -std=c++11 -Wall -pedantic    -o autocompleter autocompleter.o  
libtool: link: x86_64-alt-linux-g++ -pipe -frecord-gcc-switches -Wall -g -O2 -flto=auto -std=c++11 -Wall -pedantic -o autocompleter autocompleter.o 
make[2]: Leaving directory '/usr/src/RPM/BUILD/yacas-1.4.1/docs'
Making all in src
make[2]: Entering directory '/usr/src/RPM/BUILD/yacas-1.4.1/src'
mkdir -p ./../include/yacas
echo -e "#ifndef YACAS_VERSION_H\n#define YACAS_VERSION \"1.4.1\"\n#endif" > ./../include/yacas/yacas_version.h
make[2]: Leaving directory '/usr/src/RPM/BUILD/yacas-1.4.1/src'
make[2]: Entering directory '/usr/src/RPM/BUILD/yacas-1.4.1/src'
/bin/sh ../libtool  --tag=CXX   --mode=compile x86_64-alt-linux-g++ -DHAVE_CONFIG_H -I. -I..  -I ./../include -I ../include   -pipe -frecord-gcc-switches -Wall -g -O2 -flto=auto -std=c++11 -Wall -pedantic  -c -o stdcommandline.lo stdcommandline.cpp
libtool: compile:  x86_64-alt-linux-g++ -DHAVE_CONFIG_H -I. -I.. -I ./../include -I ../include -pipe -frecord-gcc-switches -Wall -g -O2 -flto=auto -std=c++11 -Wall -pedantic -c stdcommandline.cpp  -fPIC -DPIC -o .libs/stdcommandline.o
make[2]: Leaving directory '/usr/src/RPM/BUILD/yacas-1.4.1/src'
make[2]: Entering directory '/usr/src/RPM/BUILD/yacas-1.4.1/src'
x86_64-alt-linux-g++ -DHAVE_CONFIG_H -I. -I..  -I ./../include -I ../include   -pipe -frecord-gcc-switches -Wall -g -O2 -flto=auto -std=c++11 -Wall -pedantic  -c -o unixcommandline.o unixcommandline.cpp
make[2]: Leaving directory '/usr/src/RPM/BUILD/yacas-1.4.1/src'
make[2]: Entering directory '/usr/src/RPM/BUILD/yacas-1.4.1/src'
/bin/sh ../libtool  --tag=CXX   --mode=compile x86_64-alt-linux-g++ -DHAVE_CONFIG_H -I. -I..  -I ./../include -I ../include   -pipe -frecord-gcc-switches -Wall -g -O2 -flto=auto -std=c++11 -Wall -pedantic  -c -o lispatom.lo lispatom.cpp
libtool: compile:  x86_64-alt-linux-g++ -DHAVE_CONFIG_H -I. -I.. -I ./../include -I ../include -pipe -frecord-gcc-switches -Wall -g -O2 -flto=auto -std=c++11 -Wall -pedantic -c lispatom.cpp  -fPIC -DPIC -o .libs/lispatom.o
make[2]: Leaving directory '/usr/src/RPM/BUILD/yacas-1.4.1/src'
make[2]: Entering directory '/usr/src/RPM/BUILD/yacas-1.4.1/src'
/bin/sh ../libtool  --tag=CXX   --mode=compile x86_64-alt-linux-g++ -DHAVE_CONFIG_H -I. -I..  -I ./../include -I ../include   -pipe -frecord-gcc-switches -Wall -g -O2 -flto=auto -std=c++11 -Wall -pedantic  -c -o infixparser.lo infixparser.cpp
libtool: compile:  x86_64-alt-linux-g++ -DHAVE_CONFIG_H -I. -I.. -I ./../include -I ../include -pipe -frecord-gcc-switches -Wall -g -O2 -flto=auto -std=c++11 -Wall -pedantic -c infixparser.cpp  -fPIC -DPIC -o .libs/infixparser.o
make[2]: Leaving directory '/usr/src/RPM/BUILD/yacas-1.4.1/src'
make[2]: Entering directory '/usr/src/RPM/BUILD/yacas-1.4.1/src'
/bin/sh ../libtool  --tag=CXX   --mode=compile x86_64-alt-linux-g++ -DHAVE_CONFIG_H -I. -I..  -I ./../include -I ../include   -pipe -frecord-gcc-switches -Wall -g -O2 -flto=auto -std=c++11 -Wall -pedantic  -c -o deffile.lo deffile.cpp
libtool: compile:  x86_64-alt-linux-g++ -DHAVE_CONFIG_H -I. -I.. -I ./../include -I ../include -pipe -frecord-gcc-switches -Wall -g -O2 -flto=auto -std=c++11 -Wall -pedantic -c deffile.cpp  -fPIC -DPIC -o .libs/deffile.o
make[2]: Leaving directory '/usr/src/RPM/BUILD/yacas-1.4.1/src'
make[2]: Entering directory '/usr/src/RPM/BUILD/yacas-1.4.1/src'
/bin/sh ../libtool  --tag=CXX   --mode=compile x86_64-alt-linux-g++ -DHAVE_CONFIG_H -I. -I..  -I ./../include -I ../include   -pipe -frecord-gcc-switches -Wall -g -O2 -flto=auto -std=c++11 -Wall -pedantic  -c -o lisperror.lo lisperror.cpp
libtool: compile:  x86_64-alt-linux-g++ -DHAVE_CONFIG_H -I. -I.. -I ./../include -I ../include -pipe -frecord-gcc-switches -Wall -g -O2 -flto=auto -std=c++11 -Wall -pedantic -c lisperror.cpp  -fPIC -DPIC -o .libs/lisperror.o
make[2]: Leaving directory '/usr/src/RPM/BUILD/yacas-1.4.1/src'
make[2]: Entering directory '/usr/src/RPM/BUILD/yacas-1.4.1/src'
/bin/sh ../libtool  --tag=CXX   --mode=compile x86_64-alt-linux-g++ -DHAVE_CONFIG_H -I. -I..  -I ./../include -I ../include   -pipe -frecord-gcc-switches -Wall -g -O2 -flto=auto -std=c++11 -Wall -pedantic  -c -o lispeval.lo lispeval.cpp
libtool: compile:  x86_64-alt-linux-g++ -DHAVE_CONFIG_H -I. -I.. -I ./../include -I ../include -pipe -frecord-gcc-switches -Wall -g -O2 -flto=auto -std=c++11 -Wall -pedantic -c lispeval.cpp  -fPIC -DPIC -o .libs/lispeval.o
make[2]: Leaving directory '/usr/src/RPM/BUILD/yacas-1.4.1/src'
make[2]: Entering directory '/usr/src/RPM/BUILD/yacas-1.4.1/src'
x86_64-alt-linux-g++ -DHAVE_CONFIG_H -I. -I..  -I ./../include -I ../include   -pipe -frecord-gcc-switches -Wall -g -O2 -flto=auto -std=c++11 -Wall -pedantic  -c -o yacasmain.o yacasmain.cpp
In file included from yacasmain.cpp:85:
./../include/yacas/string_utils.h: In function 'std::string& ltrim(std::string&)':
./../include/yacas/string_utils.h:19:89: warning: 'std::pointer_to_unary_function<_Arg, _Result> std::ptr_fun(_Result (*)(_Arg)) [with _Arg = int; _Result = int]' is deprecated: use 'std::function' instead [-Wdeprecated-declarations]
   19 |     s.erase(s.begin(), std::find_if(s.begin(), s.end(), std::not1(std::ptr_fun<int, int>(std::isspace))));
      |                                                                   ~~~~~~~~~~~~~~~~~~~~~~^~~~~~~~~~~~~~
In file included from /usr/include/c++/13/string:49,
                 from /usr/include/c++/13/bits/locale_classes.h:40,
                 from /usr/include/c++/13/bits/ios_base.h:41,
                 from /usr/include/c++/13/ios:44,
                 from /usr/include/c++/13/istream:40,
                 from /usr/include/c++/13/fstream:40,
                 from yacasmain.cpp:43:
/usr/include/c++/13/bits/stl_function.h:1126:5: note: declared here
 1126 |     ptr_fun(_Result (*__x)(_Arg))
      |     ^~~~~~~
./../include/yacas/string_utils.h: In function 'std::string& rtrim(std::string&)':
./../include/yacas/string_utils.h:26:80: warning: 'std::pointer_to_unary_function<_Arg, _Result> std::ptr_fun(_Result (*)(_Arg)) [with _Arg = int; _Result = int]' is deprecated: use 'std::function' instead [-Wdeprecated-declarations]
   26 |     s.erase(std::find_if(s.rbegin(), s.rend(), std::not1(std::ptr_fun<int, int>(std::isspace))).base(), s.end());
      |                                                          ~~~~~~~~~~~~~~~~~~~~~~^~~~~~~~~~~~~~
/usr/include/c++/13/bits/stl_function.h:1126:5: note: declared here
 1126 |     ptr_fun(_Result (*__x)(_Arg))
      |     ^~~~~~~
make[2]: Leaving directory '/usr/src/RPM/BUILD/yacas-1.4.1/src'
make[2]: Entering directory '/usr/src/RPM/BUILD/yacas-1.4.1/src'
/bin/sh ../libtool  --tag=CXX   --mode=compile x86_64-alt-linux-g++ -DHAVE_CONFIG_H -I. -I..  -I ./../include -I ../include   -pipe -frecord-gcc-switches -Wall -g -O2 -flto=auto -std=c++11 -Wall -pedantic  -c -o lispio.lo lispio.cpp
libtool: compile:  x86_64-alt-linux-g++ -DHAVE_CONFIG_H -I. -I.. -I ./../include -I ../include -pipe -frecord-gcc-switches -Wall -g -O2 -flto=auto -std=c++11 -Wall -pedantic -c lispio.cpp  -fPIC -DPIC -o .libs/lispio.o
make[2]: Leaving directory '/usr/src/RPM/BUILD/yacas-1.4.1/src'
make[2]: Entering directory '/usr/src/RPM/BUILD/yacas-1.4.1/src'
/bin/sh ../libtool  --tag=CXX   --mode=compile x86_64-alt-linux-g++ -DHAVE_CONFIG_H -I. -I..  -I ./../include -I ../include   -pipe -frecord-gcc-switches -Wall -g -O2 -flto=auto -std=c++11 -Wall -pedantic  -c -o lispobject.lo lispobject.cpp
libtool: compile:  x86_64-alt-linux-g++ -DHAVE_CONFIG_H -I. -I.. -I ./../include -I ../include -pipe -frecord-gcc-switches -Wall -g -O2 -flto=auto -std=c++11 -Wall -pedantic -c lispobject.cpp  -fPIC -DPIC -o .libs/lispobject.o
make[2]: Leaving directory '/usr/src/RPM/BUILD/yacas-1.4.1/src'
make[2]: Entering directory '/usr/src/RPM/BUILD/yacas-1.4.1/src'
/bin/sh ../libtool  --tag=CXX   --mode=compile x86_64-alt-linux-g++ -DHAVE_CONFIG_H -I. -I..  -I ./../include -I ../include   -pipe -frecord-gcc-switches -Wall -g -O2 -flto=auto -std=c++11 -Wall -pedantic  -c -o lispuserfunc.lo lispuserfunc.cpp
libtool: compile:  x86_64-alt-linux-g++ -DHAVE_CONFIG_H -I. -I.. -I ./../include -I ../include -pipe -frecord-gcc-switches -Wall -g -O2 -flto=auto -std=c++11 -Wall -pedantic -c lispuserfunc.cpp  -fPIC -DPIC -o .libs/lispuserfunc.o
make[2]: Leaving directory '/usr/src/RPM/BUILD/yacas-1.4.1/src'
make[2]: Entering directory '/usr/src/RPM/BUILD/yacas-1.4.1/src'
/bin/sh ../libtool  --tag=CXX   --mode=compile x86_64-alt-linux-g++ -DHAVE_CONFIG_H -I. -I..  -I ./../include -I ../include   -pipe -frecord-gcc-switches -Wall -g -O2 -flto=auto -std=c++11 -Wall -pedantic  -c -o lispenvironment.lo lispenvironment.cpp
libtool: compile:  x86_64-alt-linux-g++ -DHAVE_CONFIG_H -I. -I.. -I ./../include -I ../include -pipe -frecord-gcc-switches -Wall -g -O2 -flto=auto -std=c++11 -Wall -pedantic -c lispenvironment.cpp  -fPIC -DPIC -o .libs/lispenvironment.o
make[2]: Leaving directory '/usr/src/RPM/BUILD/yacas-1.4.1/src'
make[2]: Entering directory '/usr/src/RPM/BUILD/yacas-1.4.1/src'
/bin/sh ../libtool  --tag=CXX   --mode=compile x86_64-alt-linux-g++ -DHAVE_CONFIG_H -I. -I..  -I ./../include -I ../include   -pipe -frecord-gcc-switches -Wall -g -O2 -flto=auto -std=c++11 -Wall -pedantic  -c -o lispparser.lo lispparser.cpp
libtool: compile:  x86_64-alt-linux-g++ -DHAVE_CONFIG_H -I. -I.. -I ./../include -I ../include -pipe -frecord-gcc-switches -Wall -g -O2 -flto=auto -std=c++11 -Wall -pedantic -c lispparser.cpp  -fPIC -DPIC -o .libs/lispparser.o
make[2]: Leaving directory '/usr/src/RPM/BUILD/yacas-1.4.1/src'
make[2]: Entering directory '/usr/src/RPM/BUILD/yacas-1.4.1/src'
/bin/sh ../libtool  --tag=CXX   --mode=compile x86_64-alt-linux-g++ -DHAVE_CONFIG_H -I. -I..  -I ./../include -I ../include   -pipe -frecord-gcc-switches -Wall -g -O2 -flto=auto -std=c++11 -Wall -pedantic  -c -o arggetter.lo arggetter.cpp
libtool: compile:  x86_64-alt-linux-g++ -DHAVE_CONFIG_H -I. -I.. -I ./../include -I ../include -pipe -frecord-gcc-switches -Wall -g -O2 -flto=auto -std=c++11 -Wall -pedantic -c arggetter.cpp  -fPIC -DPIC -o .libs/arggetter.o
make[2]: Leaving directory '/usr/src/RPM/BUILD/yacas-1.4.1/src'
make[2]: Entering directory '/usr/src/RPM/BUILD/yacas-1.4.1/src'
/bin/sh ../libtool  --tag=CXX   --mode=compile x86_64-alt-linux-g++ -DHAVE_CONFIG_H -I. -I..  -I ./../include -I ../include   -pipe -frecord-gcc-switches -Wall -g -O2 -flto=auto -std=c++11 -Wall -pedantic  -c -o stringio.lo stringio.cpp
libtool: compile:  x86_64-alt-linux-g++ -DHAVE_CONFIG_H -I. -I.. -I ./../include -I ../include -pipe -frecord-gcc-switches -Wall -g -O2 -flto=auto -std=c++11 -Wall -pedantic -c stringio.cpp  -fPIC -DPIC -o .libs/stringio.o
make[2]: Leaving directory '/usr/src/RPM/BUILD/yacas-1.4.1/src'
make[2]: Entering directory '/usr/src/RPM/BUILD/yacas-1.4.1/src'
/bin/sh ../libtool  --tag=CXX   --mode=compile x86_64-alt-linux-g++ -DHAVE_CONFIG_H -I. -I..  -I ./../include -I ../include   -pipe -frecord-gcc-switches -Wall -g -O2 -flto=auto -std=c++11 -Wall -pedantic  -c -o tokenizer.lo tokenizer.cpp
libtool: compile:  x86_64-alt-linux-g++ -DHAVE_CONFIG_H -I. -I.. -I ./../include -I ../include -pipe -frecord-gcc-switches -Wall -g -O2 -flto=auto -std=c++11 -Wall -pedantic -c tokenizer.cpp  -fPIC -DPIC -o .libs/tokenizer.o
make[2]: Leaving directory '/usr/src/RPM/BUILD/yacas-1.4.1/src'
make[2]: Entering directory '/usr/src/RPM/BUILD/yacas-1.4.1/src'
/bin/sh ../libtool  --tag=CXX   --mode=compile x86_64-alt-linux-g++ -DHAVE_CONFIG_H -I. -I..  -I ./../include -I ../include   -pipe -frecord-gcc-switches -Wall -g -O2 -flto=auto -std=c++11 -Wall -pedantic  -c -o stdfileio.lo stdfileio.cpp
libtool: compile:  x86_64-alt-linux-g++ -DHAVE_CONFIG_H -I. -I.. -I ./../include -I ../include -pipe -frecord-gcc-switches -Wall -g -O2 -flto=auto -std=c++11 -Wall -pedantic -c stdfileio.cpp  -fPIC -DPIC -o .libs/stdfileio.o
make[2]: Leaving directory '/usr/src/RPM/BUILD/yacas-1.4.1/src'
make[2]: Entering directory '/usr/src/RPM/BUILD/yacas-1.4.1/src'
/bin/sh ../libtool  --tag=CXX   --mode=compile x86_64-alt-linux-g++ -DHAVE_CONFIG_H -I. -I..  -I ./../include -I ../include   -pipe -frecord-gcc-switches -Wall -g -O2 -flto=auto -std=c++11 -Wall -pedantic  -c -o standard.lo standard.cpp
libtool: compile:  x86_64-alt-linux-g++ -DHAVE_CONFIG_H -I. -I.. -I ./../include -I ../include -pipe -frecord-gcc-switches -Wall -g -O2 -flto=auto -std=c++11 -Wall -pedantic -c standard.cpp  -fPIC -DPIC -o .libs/standard.o
make[2]: Leaving directory '/usr/src/RPM/BUILD/yacas-1.4.1/src'
make[2]: Entering directory '/usr/src/RPM/BUILD/yacas-1.4.1/src'
/bin/sh ../libtool  --tag=CXX   --mode=compile x86_64-alt-linux-g++ -DHAVE_CONFIG_H -I. -I..  -I ./../include -I ../include   -pipe -frecord-gcc-switches -Wall -g -O2 -flto=auto -std=c++11 -Wall -pedantic  -c -o mathuserfunc.lo mathuserfunc.cpp
libtool: compile:  x86_64-alt-linux-g++ -DHAVE_CONFIG_H -I. -I.. -I ./../include -I ../include -pipe -frecord-gcc-switches -Wall -g -O2 -flto=auto -std=c++11 -Wall -pedantic -c mathuserfunc.cpp  -fPIC -DPIC -o .libs/mathuserfunc.o
make[2]: Leaving directory '/usr/src/RPM/BUILD/yacas-1.4.1/src'
make[2]: Entering directory '/usr/src/RPM/BUILD/yacas-1.4.1/src'
/bin/sh ../libtool  --tag=CXX   --mode=compile x86_64-alt-linux-g++ -DHAVE_CONFIG_H -I. -I..  -I ./../include -I ../include   -pipe -frecord-gcc-switches -Wall -g -O2 -flto=auto -std=c++11 -Wall -pedantic  -c -o mathcommands.lo mathcommands.cpp
libtool: compile:  x86_64-alt-linux-g++ -DHAVE_CONFIG_H -I. -I.. -I ./../include -I ../include -pipe -frecord-gcc-switches -Wall -g -O2 -flto=auto -std=c++11 -Wall -pedantic -c mathcommands.cpp  -fPIC -DPIC -o .libs/mathcommands.o
In file included from mathcommands.cpp:24:
./../include/yacas/string_utils.h: In function 'std::string& ltrim(std::string&)':
./../include/yacas/string_utils.h:19:89: warning: 'std::pointer_to_unary_function<_Arg, _Result> std::ptr_fun(_Result (*)(_Arg)) [with _Arg = int; _Result = int]' is deprecated: use 'std::function' instead [-Wdeprecated-declarations]
   19 |     s.erase(s.begin(), std::find_if(s.begin(), s.end(), std::not1(std::ptr_fun<int, int>(std::isspace))));
      |                                                                   ~~~~~~~~~~~~~~~~~~~~~~^~~~~~~~~~~~~~
In file included from /usr/include/c++/13/string:49,
                 from ./../include/yacas/lispstring.h:11,
                 from ./../include/yacas/lispobject.h:18,
                 from ./../include/yacas/lispenvironment.h:10,
                 from mathcommands.cpp:5:
/usr/include/c++/13/bits/stl_function.h:1126:5: note: declared here
 1126 |     ptr_fun(_Result (*__x)(_Arg))
      |     ^~~~~~~
./../include/yacas/string_utils.h: In function 'std::string& rtrim(std::string&)':
./../include/yacas/string_utils.h:26:80: warning: 'std::pointer_to_unary_function<_Arg, _Result> std::ptr_fun(_Result (*)(_Arg)) [with _Arg = int; _Result = int]' is deprecated: use 'std::function' instead [-Wdeprecated-declarations]
   26 |     s.erase(std::find_if(s.rbegin(), s.rend(), std::not1(std::ptr_fun<int, int>(std::isspace))).base(), s.end());
      |                                                          ~~~~~~~~~~~~~~~~~~~~~~^~~~~~~~~~~~~~
/usr/include/c++/13/bits/stl_function.h:1126:5: note: declared here
 1126 |     ptr_fun(_Result (*__x)(_Arg))
      |     ^~~~~~~
make[2]: Leaving directory '/usr/src/RPM/BUILD/yacas-1.4.1/src'
make[2]: Entering directory '/usr/src/RPM/BUILD/yacas-1.4.1/src'
/bin/sh ../libtool  --tag=CXX   --mode=compile x86_64-alt-linux-g++ -DHAVE_CONFIG_H -I. -I..  -I ./../include -I ../include   -pipe -frecord-gcc-switches -Wall -g -O2 -flto=auto -std=c++11 -Wall -pedantic  -c -o substitute.lo substitute.cpp
libtool: compile:  x86_64-alt-linux-g++ -DHAVE_CONFIG_H -I. -I.. -I ./../include -I ../include -pipe -frecord-gcc-switches -Wall -g -O2 -flto=auto -std=c++11 -Wall -pedantic -c substitute.cpp  -fPIC -DPIC -o .libs/substitute.o
make[2]: Leaving directory '/usr/src/RPM/BUILD/yacas-1.4.1/src'
make[2]: Entering directory '/usr/src/RPM/BUILD/yacas-1.4.1/src'
/bin/sh ../libtool  --tag=CXX   --mode=compile x86_64-alt-linux-g++ -DHAVE_CONFIG_H -I. -I..  -I ./../include -I ../include   -pipe -frecord-gcc-switches -Wall -g -O2 -flto=auto -std=c++11 -Wall -pedantic  -c -o lispevalhash.lo lispevalhash.cpp
libtool: compile:  x86_64-alt-linux-g++ -DHAVE_CONFIG_H -I. -I.. -I ./../include -I ../include -pipe -frecord-gcc-switches -Wall -g -O2 -flto=auto -std=c++11 -Wall -pedantic -c lispevalhash.cpp  -fPIC -DPIC -o .libs/lispevalhash.o
make[2]: Leaving directory '/usr/src/RPM/BUILD/yacas-1.4.1/src'
make[2]: Entering directory '/usr/src/RPM/BUILD/yacas-1.4.1/src'
/bin/sh ../libtool  --tag=CXX   --mode=compile x86_64-alt-linux-g++ -DHAVE_CONFIG_H -I. -I..  -I ./../include -I ../include   -pipe -frecord-gcc-switches -Wall -g -O2 -flto=auto -std=c++11 -Wall -pedantic  -c -o genericstructs.lo genericstructs.cpp
libtool: compile:  x86_64-alt-linux-g++ -DHAVE_CONFIG_H -I. -I.. -I ./../include -I ../include -pipe -frecord-gcc-switches -Wall -g -O2 -flto=auto -std=c++11 -Wall -pedantic -c genericstructs.cpp  -fPIC -DPIC -o .libs/genericstructs.o
make[2]: Leaving directory '/usr/src/RPM/BUILD/yacas-1.4.1/src'
make[2]: Entering directory '/usr/src/RPM/BUILD/yacas-1.4.1/src'
/bin/sh ../libtool  --tag=CXX   --mode=compile x86_64-alt-linux-g++ -DHAVE_CONFIG_H -I. -I..  -I ./../include -I ../include   -pipe -frecord-gcc-switches -Wall -g -O2 -flto=auto -std=c++11 -Wall -pedantic  -c -o patterns.lo patterns.cpp
libtool: compile:  x86_64-alt-linux-g++ -DHAVE_CONFIG_H -I. -I.. -I ./../include -I ../include -pipe -frecord-gcc-switches -Wall -g -O2 -flto=auto -std=c++11 -Wall -pedantic -c patterns.cpp  -fPIC -DPIC -o .libs/patterns.o
make[2]: Leaving directory '/usr/src/RPM/BUILD/yacas-1.4.1/src'
make[2]: Entering directory '/usr/src/RPM/BUILD/yacas-1.4.1/src'
/bin/sh ../libtool  --tag=CXX   --mode=compile x86_64-alt-linux-g++ -DHAVE_CONFIG_H -I. -I..  -I ./../include -I ../include   -pipe -frecord-gcc-switches -Wall -g -O2 -flto=auto -std=c++11 -Wall -pedantic  -c -o patternclass.lo patternclass.cpp
libtool: compile:  x86_64-alt-linux-g++ -DHAVE_CONFIG_H -I. -I.. -I ./../include -I ../include -pipe -frecord-gcc-switches -Wall -g -O2 -flto=auto -std=c++11 -Wall -pedantic -c patternclass.cpp  -fPIC -DPIC -o .libs/patternclass.o
make[2]: Leaving directory '/usr/src/RPM/BUILD/yacas-1.4.1/src'
make[2]: Entering directory '/usr/src/RPM/BUILD/yacas-1.4.1/src'
/bin/sh ../libtool  --tag=CXX   --mode=compile x86_64-alt-linux-g++ -DHAVE_CONFIG_H -I. -I..  -I ./../include -I ../include   -pipe -frecord-gcc-switches -Wall -g -O2 -flto=auto -std=c++11 -Wall -pedantic  -c -o yacasapi.lo yacasapi.cpp
libtool: compile:  x86_64-alt-linux-g++ -DHAVE_CONFIG_H -I. -I.. -I ./../include -I ../include -pipe -frecord-gcc-switches -Wall -g -O2 -flto=auto -std=c++11 -Wall -pedantic -c yacasapi.cpp  -fPIC -DPIC -o .libs/yacasapi.o
make[2]: Leaving directory '/usr/src/RPM/BUILD/yacas-1.4.1/src'
make[2]: Entering directory '/usr/src/RPM/BUILD/yacas-1.4.1/src'
/bin/sh ../libtool  --tag=CXX   --mode=compile x86_64-alt-linux-g++ -DHAVE_CONFIG_H -I. -I..  -I ./../include -I ../include   -pipe -frecord-gcc-switches -Wall -g -O2 -flto=auto -std=c++11 -Wall -pedantic  -c -o mathcommands2.lo mathcommands2.cpp
libtool: compile:  x86_64-alt-linux-g++ -DHAVE_CONFIG_H -I. -I.. -I ./../include -I ../include -pipe -frecord-gcc-switches -Wall -g -O2 -flto=auto -std=c++11 -Wall -pedantic -c mathcommands2.cpp  -fPIC -DPIC -o .libs/mathcommands2.o
make[2]: Leaving directory '/usr/src/RPM/BUILD/yacas-1.4.1/src'
make[2]: Entering directory '/usr/src/RPM/BUILD/yacas-1.4.1/src'
/bin/sh ../libtool  --tag=CXX   --mode=compile x86_64-alt-linux-g++ -DHAVE_CONFIG_H -I. -I..  -I ./../include -I ../include   -pipe -frecord-gcc-switches -Wall -g -O2 -flto=auto -std=c++11 -Wall -pedantic  -c -o xmltokenizer.lo xmltokenizer.cpp
libtool: compile:  x86_64-alt-linux-g++ -DHAVE_CONFIG_H -I. -I.. -I ./../include -I ../include -pipe -frecord-gcc-switches -Wall -g -O2 -flto=auto -std=c++11 -Wall -pedantic -c xmltokenizer.cpp  -fPIC -DPIC -o .libs/xmltokenizer.o
make[2]: Leaving directory '/usr/src/RPM/BUILD/yacas-1.4.1/src'
make[2]: Entering directory '/usr/src/RPM/BUILD/yacas-1.4.1/src'
/bin/sh ../libtool  --tag=CXX   --mode=compile x86_64-alt-linux-g++ -DHAVE_CONFIG_H -I. -I..  -I ./../include -I ../include   -pipe -frecord-gcc-switches -Wall -g -O2 -flto=auto -std=c++11 -Wall -pedantic  -c -o patcher.lo patcher.cpp
libtool: compile:  x86_64-alt-linux-g++ -DHAVE_CONFIG_H -I. -I.. -I ./../include -I ../include -pipe -frecord-gcc-switches -Wall -g -O2 -flto=auto -std=c++11 -Wall -pedantic -c patcher.cpp  -fPIC -DPIC -o .libs/patcher.o
make[2]: Leaving directory '/usr/src/RPM/BUILD/yacas-1.4.1/src'
make[2]: Entering directory '/usr/src/RPM/BUILD/yacas-1.4.1/src'
/bin/sh ../libtool  --tag=CXX   --mode=compile x86_64-alt-linux-g++ -DHAVE_CONFIG_H -I. -I..  -I ./../include -I ../include   -pipe -frecord-gcc-switches -Wall -g -O2 -flto=auto -std=c++11 -Wall -pedantic  -c -o mathcommands3.lo mathcommands3.cpp
libtool: compile:  x86_64-alt-linux-g++ -DHAVE_CONFIG_H -I. -I.. -I ./../include -I ../include -pipe -frecord-gcc-switches -Wall -g -O2 -flto=auto -std=c++11 -Wall -pedantic -c mathcommands3.cpp  -fPIC -DPIC -o .libs/mathcommands3.o
In file included from mathcommands3.cpp:23:
./../include/yacas/string_utils.h: In function 'std::string& ltrim(std::string&)':
./../include/yacas/string_utils.h:19:89: warning: 'std::pointer_to_unary_function<_Arg, _Result> std::ptr_fun(_Result (*)(_Arg)) [with _Arg = int; _Result = int]' is deprecated: use 'std::function' instead [-Wdeprecated-declarations]
   19 |     s.erase(s.begin(), std::find_if(s.begin(), s.end(), std::not1(std::ptr_fun<int, int>(std::isspace))));
      |                                                                   ~~~~~~~~~~~~~~~~~~~~~~^~~~~~~~~~~~~~
In file included from /usr/include/c++/13/string:49,
                 from ./../include/yacas/lispstring.h:11,
                 from ./../include/yacas/lispobject.h:18,
                 from ./../include/yacas/lispenvironment.h:10,
                 from mathcommands3.cpp:5:
/usr/include/c++/13/bits/stl_function.h:1126:5: note: declared here
 1126 |     ptr_fun(_Result (*__x)(_Arg))
      |     ^~~~~~~
./../include/yacas/string_utils.h: In function 'std::string& rtrim(std::string&)':
./../include/yacas/string_utils.h:26:80: warning: 'std::pointer_to_unary_function<_Arg, _Result> std::ptr_fun(_Result (*)(_Arg)) [with _Arg = int; _Result = int]' is deprecated: use 'std::function' instead [-Wdeprecated-declarations]
   26 |     s.erase(std::find_if(s.rbegin(), s.rend(), std::not1(std::ptr_fun<int, int>(std::isspace))).base(), s.end());
      |                                                          ~~~~~~~~~~~~~~~~~~~~~~^~~~~~~~~~~~~~
/usr/include/c++/13/bits/stl_function.h:1126:5: note: declared here
 1126 |     ptr_fun(_Result (*__x)(_Arg))
      |     ^~~~~~~
make[2]: Leaving directory '/usr/src/RPM/BUILD/yacas-1.4.1/src'
make[2]: Entering directory '/usr/src/RPM/BUILD/yacas-1.4.1/src'
/bin/sh ../libtool  --tag=CXX   --mode=compile x86_64-alt-linux-g++ -DHAVE_CONFIG_H -I. -I..  -I ./../include -I ../include   -pipe -frecord-gcc-switches -Wall -g -O2 -flto=auto -std=c++11 -Wall -pedantic  -c -o errors.lo errors.cpp
libtool: compile:  x86_64-alt-linux-g++ -DHAVE_CONFIG_H -I. -I.. -I ./../include -I ../include -pipe -frecord-gcc-switches -Wall -g -O2 -flto=auto -std=c++11 -Wall -pedantic -c errors.cpp  -fPIC -DPIC -o .libs/errors.o
make[2]: Leaving directory '/usr/src/RPM/BUILD/yacas-1.4.1/src'
make[2]: Entering directory '/usr/src/RPM/BUILD/yacas-1.4.1/src'
/bin/sh ../libtool  --tag=CXX   --mode=compile x86_64-alt-linux-g++ -DHAVE_CONFIG_H -I. -I..  -I ./../include -I ../include   -pipe -frecord-gcc-switches -Wall -g -O2 -flto=auto -std=c++11 -Wall -pedantic  -c -o commandline.lo commandline.cpp
libtool: compile:  x86_64-alt-linux-g++ -DHAVE_CONFIG_H -I. -I.. -I ./../include -I ../include -pipe -frecord-gcc-switches -Wall -g -O2 -flto=auto -std=c++11 -Wall -pedantic -c commandline.cpp  -fPIC -DPIC -o .libs/commandline.o
make[2]: Leaving directory '/usr/src/RPM/BUILD/yacas-1.4.1/src'
make[2]: Entering directory '/usr/src/RPM/BUILD/yacas-1.4.1/src'
/bin/sh ../libtool  --tag=CXX   --mode=compile x86_64-alt-linux-g++ -DHAVE_CONFIG_H -I. -I..  -I ./../include -I ../include   -pipe -frecord-gcc-switches -Wall -g -O2 -flto=auto -std=c++11 -Wall -pedantic  -c -o obmalloc.lo obmalloc.cpp
libtool: compile:  x86_64-alt-linux-g++ -DHAVE_CONFIG_H -I. -I.. -I ./../include -I ../include -pipe -frecord-gcc-switches -Wall -g -O2 -flto=auto -std=c++11 -Wall -pedantic -c obmalloc.cpp  -fPIC -DPIC -o .libs/obmalloc.o
make[2]: Leaving directory '/usr/src/RPM/BUILD/yacas-1.4.1/src'
make[2]: Entering directory '/usr/src/RPM/BUILD/yacas-1.4.1/src'
/bin/sh ../libtool  --tag=CXX   --mode=compile x86_64-alt-linux-g++ -DHAVE_CONFIG_H -I. -I..  -I ./../include -I ../include   -pipe -frecord-gcc-switches -Wall -g -O2 -flto=auto -std=c++11 -Wall -pedantic  -c -o anumber.lo anumber.cpp
libtool: compile:  x86_64-alt-linux-g++ -DHAVE_CONFIG_H -I. -I.. -I ./../include -I ../include -pipe -frecord-gcc-switches -Wall -g -O2 -flto=auto -std=c++11 -Wall -pedantic -c anumber.cpp  -fPIC -DPIC -o .libs/anumber.o
In file included from /usr/include/c++/13/cassert:44,
                 from ./../include/yacas/anumber.h:7,
                 from anumber.cpp:10:
./../include/yacas/anumber.inl: In instantiation of 'void BaseSubtract(T&, T&, LispInt) [with T = ANumber; LispInt = int]':
anumber.cpp:698:17:   required from here
./../include/yacas/anumber.inl:184:25: warning: comparison of integer expressions of different signedness: 'LispInt' {aka 'int'} and 'std::vector<short unsigned int>::size_type' {aka 'long unsigned int'} [-Wsign-compare]
  184 |         assert(nr+offset<aResult.size());
      |                ~~~~~~~~~^~~~~~~~~~~~~~~
make[2]: Leaving directory '/usr/src/RPM/BUILD/yacas-1.4.1/src'
make[2]: Entering directory '/usr/src/RPM/BUILD/yacas-1.4.1/src'
/bin/sh ../libtool  --tag=CXX   --mode=compile x86_64-alt-linux-g++ -DHAVE_CONFIG_H -I. -I..  -I ./../include -I ../include   -pipe -frecord-gcc-switches -Wall -g -O2 -flto=auto -std=c++11 -Wall -pedantic  -c -o yacasbase.lo yacasbase.cpp
libtool: compile:  x86_64-alt-linux-g++ -DHAVE_CONFIG_H -I. -I.. -I ./../include -I ../include -pipe -frecord-gcc-switches -Wall -g -O2 -flto=auto -std=c++11 -Wall -pedantic -c yacasbase.cpp  -fPIC -DPIC -o .libs/yacasbase.o
make[2]: Leaving directory '/usr/src/RPM/BUILD/yacas-1.4.1/src'
make[2]: Entering directory '/usr/src/RPM/BUILD/yacas-1.4.1/src'
/bin/sh ../libtool  --tag=CXX   --mode=compile x86_64-alt-linux-g++ -DHAVE_CONFIG_H -I. -I..  -I ./../include -I ../include   -pipe -frecord-gcc-switches -Wall -g -O2 -flto=auto -std=c++11 -Wall -pedantic  -c -o stdstubs.lo stdstubs.cpp
libtool: compile:  x86_64-alt-linux-g++ -DHAVE_CONFIG_H -I. -I.. -I ./../include -I ../include -pipe -frecord-gcc-switches -Wall -g -O2 -flto=auto -std=c++11 -Wall -pedantic -c stdstubs.cpp  -fPIC -DPIC -o .libs/stdstubs.o
make[2]: Leaving directory '/usr/src/RPM/BUILD/yacas-1.4.1/src'
make[2]: Entering directory '/usr/src/RPM/BUILD/yacas-1.4.1/src'
/bin/sh ../libtool  --tag=CXX   --mode=compile x86_64-alt-linux-g++ -DHAVE_CONFIG_H -I. -I..  -I ./../include -I ../include   -pipe -frecord-gcc-switches -Wall -g -O2 -flto=auto -std=c++11 -Wall -pedantic  -c -o debugmem.lo debugmem.cpp
libtool: compile:  x86_64-alt-linux-g++ -DHAVE_CONFIG_H -I. -I.. -I ./../include -I ../include -pipe -frecord-gcc-switches -Wall -g -O2 -flto=auto -std=c++11 -Wall -pedantic -c debugmem.cpp  -fPIC -DPIC -o .libs/debugmem.o
make[2]: Leaving directory '/usr/src/RPM/BUILD/yacas-1.4.1/src'
make[2]: Entering directory '/usr/src/RPM/BUILD/yacas-1.4.1/src'
x86_64-alt-linux-g++ -DHAVE_CONFIG_H -I. -I..  -I ./../include -I ../include   -pipe -frecord-gcc-switches -Wall -g -O2 -flto=auto -std=c++11 -Wall -pedantic  -c -o gencorefunctions.o gencorefunctions.cpp
make[2]: Leaving directory '/usr/src/RPM/BUILD/yacas-1.4.1/src'
make[2]: Entering directory '/usr/src/RPM/BUILD/yacas-1.4.1/src'
/bin/sh ../libtool  --tag=CXX   --mode=compile x86_64-alt-linux-g++ -DHAVE_CONFIG_H -I. -I..  -I ./../include -I ../include   -pipe -frecord-gcc-switches -Wall -g -O2 -flto=auto -std=c++11 -Wall -pedantic  -c -o yacasnumbers.lo yacasnumbers.cpp
libtool: compile:  x86_64-alt-linux-g++ -DHAVE_CONFIG_H -I. -I.. -I ./../include -I ../include -pipe -frecord-gcc-switches -Wall -g -O2 -flto=auto -std=c++11 -Wall -pedantic -c yacasnumbers.cpp  -fPIC -DPIC -o .libs/yacasnumbers.o
make[2]: Leaving directory '/usr/src/RPM/BUILD/yacas-1.4.1/src'
make[2]: Entering directory '/usr/src/RPM/BUILD/yacas-1.4.1/src'
/bin/sh ../libtool  --tag=CXX   --mode=compile x86_64-alt-linux-g++ -DHAVE_CONFIG_H -I. -I..  -I ./../include -I ../include   -pipe -frecord-gcc-switches -Wall -g -O2 -flto=auto -std=c++11 -Wall -pedantic  -c -o lisphash.lo lisphash.cpp
libtool: compile:  x86_64-alt-linux-g++ -DHAVE_CONFIG_H -I. -I.. -I ./../include -I ../include -pipe -frecord-gcc-switches -Wall -g -O2 -flto=auto -std=c++11 -Wall -pedantic -c lisphash.cpp  -fPIC -DPIC -o .libs/lisphash.o
make[2]: Leaving directory '/usr/src/RPM/BUILD/yacas-1.4.1/src'
make[2]: Entering directory '/usr/src/RPM/BUILD/yacas-1.4.1/src'
/bin/sh ../libtool  --tag=CXX   --mode=compile x86_64-alt-linux-g++ -DHAVE_CONFIG_H -I. -I..  -I ./../include -I ../include   -pipe -frecord-gcc-switches -Wall -g -O2 -flto=auto -std=c++11 -Wall -pedantic  -c -o numbers.lo numbers.cpp
libtool: compile:  x86_64-alt-linux-g++ -DHAVE_CONFIG_H -I. -I.. -I ./../include -I ../include -pipe -frecord-gcc-switches -Wall -g -O2 -flto=auto -std=c++11 -Wall -pedantic -c numbers.cpp  -fPIC -DPIC -o .libs/numbers.o
make[2]: Leaving directory '/usr/src/RPM/BUILD/yacas-1.4.1/src'
make[2]: Entering directory '/usr/src/RPM/BUILD/yacas-1.4.1/src'
/bin/sh ../libtool  --tag=CXX   --mode=link x86_64-alt-linux-g++  -pipe -frecord-gcc-switches -Wall -g -O2 -flto=auto -std=c++11 -Wall -pedantic    -o gencorefunctions gencorefunctions.o  
libtool: link: x86_64-alt-linux-g++ -pipe -frecord-gcc-switches -Wall -g -O2 -flto=auto -std=c++11 -Wall -pedantic -o gencorefunctions gencorefunctions.o 
make[2]: Leaving directory '/usr/src/RPM/BUILD/yacas-1.4.1/src'
make[2]: Entering directory '/usr/src/RPM/BUILD/yacas-1.4.1/src'
/bin/sh ../libtool  --tag=CXX   --mode=compile x86_64-alt-linux-g++ -DHAVE_CONFIG_H -I. -I..  -I ./../include -I ../include   -pipe -frecord-gcc-switches -Wall -g -O2 -flto=auto -std=c++11 -Wall -pedantic  -c -o platmath.lo platmath.cpp
libtool: compile:  x86_64-alt-linux-g++ -DHAVE_CONFIG_H -I. -I.. -I ./../include -I ../include -pipe -frecord-gcc-switches -Wall -g -O2 -flto=auto -std=c++11 -Wall -pedantic -c platmath.cpp  -fPIC -DPIC -o .libs/platmath.o
make[2]: Leaving directory '/usr/src/RPM/BUILD/yacas-1.4.1/src'
make[2]: Entering directory '/usr/src/RPM/BUILD/yacas-1.4.1/src'
/bin/sh ../libtool  --tag=CXX   --mode=link x86_64-alt-linux-g++  -pipe -frecord-gcc-switches -Wall -g -O2 -flto=auto -std=c++11 -Wall -pedantic  -version-info 14:1:0  -o libyacas.la -rpath /usr/lib64 stdcommandline.lo deffile.lo infixparser.lo lispatom.lo lispenvironment.lo lispeval.lo lisperror.lo lispio.lo lispobject.lo lispparser.lo lispuserfunc.lo mathcommands.lo mathuserfunc.lo standard.lo stdfileio.lo arggetter.lo stringio.lo tokenizer.lo yacasapi.lo lispevalhash.lo patterns.lo patternclass.lo substitute.lo mathcommands2.lo mathcommands3.lo errors.lo patcher.lo genericstructs.lo xmltokenizer.lo commandline.lo anumber.lo yacasnumbers.lo numbers.lo platmath.lo stdstubs.lo obmalloc.lo lisphash.lo yacasbase.lo debugmem.lo  
libtool: link: x86_64-alt-linux-g++  -fPIC -DPIC -shared -nostdlib /usr/lib64/gcc/x86_64-alt-linux/13/../../../../lib64/crti.o /usr/lib64/gcc/x86_64-alt-linux/13/crtbeginS.o  .libs/stdcommandline.o .libs/deffile.o .libs/infixparser.o .libs/lispatom.o .libs/lispenvironment.o .libs/lispeval.o .libs/lisperror.o .libs/lispio.o .libs/lispobject.o .libs/lispparser.o .libs/lispuserfunc.o .libs/mathcommands.o .libs/mathuserfunc.o .libs/standard.o .libs/stdfileio.o .libs/arggetter.o .libs/stringio.o .libs/tokenizer.o .libs/yacasapi.o .libs/lispevalhash.o .libs/patterns.o .libs/patternclass.o .libs/substitute.o .libs/mathcommands2.o .libs/mathcommands3.o .libs/errors.o .libs/patcher.o .libs/genericstructs.o .libs/xmltokenizer.o .libs/commandline.o .libs/anumber.o .libs/yacasnumbers.o .libs/numbers.o .libs/platmath.o .libs/stdstubs.o .libs/obmalloc.o .libs/lisphash.o .libs/yacasbase.o .libs/debugmem.o   -L/usr/lib64/gcc/x86_64-alt-linux/13 -L/usr/lib64/gcc/x86_64-alt-linux/13/../../../../lib64 -L/lib/../lib64 -L/usr/lib/../lib64 -L/usr/lib64/gcc/x86_64-alt-linux/13/../../.. -lstdc++ -lm -lc -lgcc_s /usr/lib64/gcc/x86_64-alt-linux/13/crtendS.o /usr/lib64/gcc/x86_64-alt-linux/13/../../../../lib64/crtn.o  -g -O2 -flto=auto   -Wl,-soname -Wl,libyacas.so.14 -o .libs/libyacas.so.14.0.1
libtool: link: (cd ".libs" && rm -f "libyacas.so.14" && ln -s "libyacas.so.14.0.1" "libyacas.so.14")
libtool: link: (cd ".libs" && rm -f "libyacas.so" && ln -s "libyacas.so.14.0.1" "libyacas.so")
libtool: link: ( cd ".libs" && rm -f "libyacas.la" && ln -s "../libyacas.la" "libyacas.la" )
make[2]: Leaving directory '/usr/src/RPM/BUILD/yacas-1.4.1/src'
make[2]: Entering directory '/usr/src/RPM/BUILD/yacas-1.4.1/src'
/bin/sh ../libtool  --tag=CXX   --mode=link x86_64-alt-linux-g++  -pipe -frecord-gcc-switches -Wall -g -O2 -flto=auto -std=c++11 -Wall -pedantic    -o yacas yacasmain.o unixcommandline.o  libyacas.la 
libtool: link: x86_64-alt-linux-g++ -pipe -frecord-gcc-switches -Wall -g -O2 -flto=auto -std=c++11 -Wall -pedantic -o .libs/yacas yacasmain.o unixcommandline.o  ./.libs/libyacas.so
make[2]: Leaving directory '/usr/src/RPM/BUILD/yacas-1.4.1/src'
Making all in scripts
make[2]: Nothing to be done for 'all'.
Making all in manmake
make[2]: Entering directory '/usr/src/RPM/BUILD/yacas-1.4.1/manmake'
perl ./txt2yacasdoc.pl < intro.book.txt > intro.book
make[2]: Leaving directory '/usr/src/RPM/BUILD/yacas-1.4.1/manmake'
make[2]: Entering directory '/usr/src/RPM/BUILD/yacas-1.4.1/manmake'
perl ./txt2yacasdoc.pl < ref.book.txt > ref.book
make[2]: Leaving directory '/usr/src/RPM/BUILD/yacas-1.4.1/manmake'
make[2]: Entering directory '/usr/src/RPM/BUILD/yacas-1.4.1/manmake'
perl ./txt2yacasdoc.pl < refprog.book.txt > refprog.book
make[2]: Leaving directory '/usr/src/RPM/BUILD/yacas-1.4.1/manmake'
make[2]: Entering directory '/usr/src/RPM/BUILD/yacas-1.4.1/manmake'
perl ./txt2yacasdoc.pl < Algo.book.txt > Algo.book
make[2]: Leaving directory '/usr/src/RPM/BUILD/yacas-1.4.1/manmake'
make[2]: Entering directory '/usr/src/RPM/BUILD/yacas-1.4.1/manmake'
perl ./txt2yacasdoc.pl < essays.book.txt > essays.book
make[2]: Leaving directory '/usr/src/RPM/BUILD/yacas-1.4.1/manmake'
make[2]: Entering directory '/usr/src/RPM/BUILD/yacas-1.4.1/manmake'
perl ./txt2yacasdoc.pl < FDL.chapt.txt > FDL.chapt
make[2]: Leaving directory '/usr/src/RPM/BUILD/yacas-1.4.1/manmake'
make[2]: Entering directory '/usr/src/RPM/BUILD/yacas-1.4.1/manmake'
perl ./txt2yacasdoc.pl < cl-options.chapt.txt > cl-options.chapt
make[2]: Leaving directory '/usr/src/RPM/BUILD/yacas-1.4.1/manmake'
make[2]: Entering directory '/usr/src/RPM/BUILD/yacas-1.4.1/manmake'
perl ./txt2yacasdoc.pl < addons.chapt.txt > addons.chapt
make[2]: Leaving directory '/usr/src/RPM/BUILD/yacas-1.4.1/manmake'
make[2]: Entering directory '/usr/src/RPM/BUILD/yacas-1.4.1/manmake'
perl ./txt2yacasdoc.pl < coding.book.txt > coding.book
make[2]: Leaving directory '/usr/src/RPM/BUILD/yacas-1.4.1/manmake'
make[2]: Entering directory '/usr/src/RPM/BUILD/yacas-1.4.1/manmake'
perl ./txt2yacasdoc.pl < YacasDebugger.chapt.txt > YacasDebugger.chapt
make[2]: Leaving directory '/usr/src/RPM/BUILD/yacas-1.4.1/manmake'
make[2]: Entering directory '/usr/src/RPM/BUILD/yacas-1.4.1/manmake'
perl ./txt2yacasdoc.pl < config.chapt.txt > config.chapt
make[2]: Leaving directory '/usr/src/RPM/BUILD/yacas-1.4.1/manmake'
make[2]: Entering directory '/usr/src/RPM/BUILD/yacas-1.4.1/manmake'
perl ./txt2yacasdoc.pl < ABIN-grammar.chapt.txt > ABIN-grammar.chapt
make[2]: Leaving directory '/usr/src/RPM/BUILD/yacas-1.4.1/manmake'
make[2]: Entering directory '/usr/src/RPM/BUILD/yacas-1.4.1/manmake'
x86_64-alt-linux-g++ -DHAVE_CONFIG_H -I. -I..     -pipe -frecord-gcc-switches -Wall -g -O2 -flto=auto -std=c++11 -Wall -pedantic  -c -o removeduplicates.o removeduplicates.cpp
make[2]: Leaving directory '/usr/src/RPM/BUILD/yacas-1.4.1/manmake'
make[2]: Entering directory '/usr/src/RPM/BUILD/yacas-1.4.1/manmake'
perl ./txt2yacasdoc.pl < SimpleTools.chapt.txt > SimpleTools.chapt
make[2]: Leaving directory '/usr/src/RPM/BUILD/yacas-1.4.1/manmake'
make[2]: Entering directory '/usr/src/RPM/BUILD/yacas-1.4.1/manmake'
perl ./txt2yacasdoc.pl < CVS-Howto.chapt.txt > CVS-Howto.chapt
make[2]: Leaving directory '/usr/src/RPM/BUILD/yacas-1.4.1/manmake'
make[2]: Entering directory '/usr/src/RPM/BUILD/yacas-1.4.1/manmake'
perl ./txt2yacasdoc.pl < wester-1994.chapt.txt > wester-1994.chapt
make[2]: Leaving directory '/usr/src/RPM/BUILD/yacas-1.4.1/manmake'
make[2]: Entering directory '/usr/src/RPM/BUILD/yacas-1.4.1/manmake'
perl ./txt2yacasdoc.pl < YacasDocs.chapt.txt > YacasDocs.chapt
make[2]: Leaving directory '/usr/src/RPM/BUILD/yacas-1.4.1/manmake'
make[2]: Entering directory '/usr/src/RPM/BUILD/yacas-1.4.1/manmake'
perl ./txt2yacasdoc.pl < wordproblems.chapt.txt > wordproblems.chapt
make[2]: Leaving directory '/usr/src/RPM/BUILD/yacas-1.4.1/manmake'
make[2]: Entering directory '/usr/src/RPM/BUILD/yacas-1.4.1/manmake'
perl ./txt2yacasdoc.pl < paper.chapt.txt > paper.chapt
make[2]: Leaving directory '/usr/src/RPM/BUILD/yacas-1.4.1/manmake'
make[2]: Entering directory '/usr/src/RPM/BUILD/yacas-1.4.1/manmake'
perl ./txt2yacasdoc.pl < new.chapt.txt > new.chapt
make[2]: Leaving directory '/usr/src/RPM/BUILD/yacas-1.4.1/manmake'
make[2]: Entering directory '/usr/src/RPM/BUILD/yacas-1.4.1/manmake'
perl ./txt2yacasdoc.pl < BuildSystem.chapt.txt > BuildSystem.chapt
make[2]: Leaving directory '/usr/src/RPM/BUILD/yacas-1.4.1/manmake'
make[2]: Entering directory '/usr/src/RPM/BUILD/yacas-1.4.1/manmake'
perl ./txt2yacasdoc.pl < arith.chapt.txt > arith.chapt
make[2]: Leaving directory '/usr/src/RPM/BUILD/yacas-1.4.1/manmake'
make[2]: Entering directory '/usr/src/RPM/BUILD/yacas-1.4.1/manmake'
perl ./txt2yacasdoc.pl < complex.chapt.txt > complex.chapt
make[2]: Leaving directory '/usr/src/RPM/BUILD/yacas-1.4.1/manmake'
make[2]: Entering directory '/usr/src/RPM/BUILD/yacas-1.4.1/manmake'
perl ./txt2yacasdoc.pl < solvers.chapt.txt > solvers.chapt
make[2]: Leaving directory '/usr/src/RPM/BUILD/yacas-1.4.1/manmake'
make[2]: Entering directory '/usr/src/RPM/BUILD/yacas-1.4.1/manmake'
perl ./txt2yacasdoc.pl < simplify.chapt.txt > simplify.chapt
make[2]: Leaving directory '/usr/src/RPM/BUILD/yacas-1.4.1/manmake'
make[2]: Entering directory '/usr/src/RPM/BUILD/yacas-1.4.1/manmake'
perl ./txt2yacasdoc.pl < ode.chapt.txt > ode.chapt
make[2]: Leaving directory '/usr/src/RPM/BUILD/yacas-1.4.1/manmake'
make[2]: Entering directory '/usr/src/RPM/BUILD/yacas-1.4.1/manmake'
perl ./txt2yacasdoc.pl < calc.chapt.txt > calc.chapt
make[2]: Leaving directory '/usr/src/RPM/BUILD/yacas-1.4.1/manmake'
make[2]: Entering directory '/usr/src/RPM/BUILD/yacas-1.4.1/manmake'
perl ./txt2yacasdoc.pl < linalg.chapt.txt > linalg.chapt
make[2]: Leaving directory '/usr/src/RPM/BUILD/yacas-1.4.1/manmake'
make[2]: Entering directory '/usr/src/RPM/BUILD/yacas-1.4.1/manmake'
perl ./txt2yacasdoc.pl < univar.chapt.txt > univar.chapt
make[2]: Leaving directory '/usr/src/RPM/BUILD/yacas-1.4.1/manmake'
make[2]: Entering directory '/usr/src/RPM/BUILD/yacas-1.4.1/manmake'
perl ./txt2yacasdoc.pl < functional.chapt.txt > functional.chapt
make[2]: Leaving directory '/usr/src/RPM/BUILD/yacas-1.4.1/manmake'
make[2]: Entering directory '/usr/src/RPM/BUILD/yacas-1.4.1/manmake'
perl ./txt2yacasdoc.pl < lists.chapt.txt > lists.chapt
make[2]: Leaving directory '/usr/src/RPM/BUILD/yacas-1.4.1/manmake'
make[2]: Entering directory '/usr/src/RPM/BUILD/yacas-1.4.1/manmake'
perl ./txt2yacasdoc.pl < logic.chapt.txt > logic.chapt
make[2]: Leaving directory '/usr/src/RPM/BUILD/yacas-1.4.1/manmake'
make[2]: Entering directory '/usr/src/RPM/BUILD/yacas-1.4.1/manmake'
perl ./txt2yacasdoc.pl < const.chapt.txt > const.chapt
make[2]: Leaving directory '/usr/src/RPM/BUILD/yacas-1.4.1/manmake'
make[2]: Entering directory '/usr/src/RPM/BUILD/yacas-1.4.1/manmake'
perl ./txt2yacasdoc.pl < controlflow.chapt.txt > controlflow.chapt
make[2]: Leaving directory '/usr/src/RPM/BUILD/yacas-1.4.1/manmake'
make[2]: Entering directory '/usr/src/RPM/BUILD/yacas-1.4.1/manmake'
perl ./txt2yacasdoc.pl < preds.chapt.txt > preds.chapt
make[2]: Leaving directory '/usr/src/RPM/BUILD/yacas-1.4.1/manmake'
make[2]: Entering directory '/usr/src/RPM/BUILD/yacas-1.4.1/manmake'
perl ./txt2yacasdoc.pl < vars.chapt.txt > vars.chapt
make[2]: Leaving directory '/usr/src/RPM/BUILD/yacas-1.4.1/manmake'
make[2]: Entering directory '/usr/src/RPM/BUILD/yacas-1.4.1/manmake'
perl ./txt2yacasdoc.pl < io.chapt.txt > io.chapt
make[2]: Leaving directory '/usr/src/RPM/BUILD/yacas-1.4.1/manmake'
make[2]: Entering directory '/usr/src/RPM/BUILD/yacas-1.4.1/manmake'
perl ./txt2yacasdoc.pl < numtheory.chapt.txt > numtheory.chapt
make[2]: Leaving directory '/usr/src/RPM/BUILD/yacas-1.4.1/manmake'
make[2]: Entering directory '/usr/src/RPM/BUILD/yacas-1.4.1/manmake'
perl ./txt2yacasdoc.pl < transforms.chapt.txt > transforms.chapt
make[2]: Leaving directory '/usr/src/RPM/BUILD/yacas-1.4.1/manmake'
make[2]: Entering directory '/usr/src/RPM/BUILD/yacas-1.4.1/manmake'
perl ./txt2yacasdoc.pl < probability-and-statistics.chapt.txt > probability-and-statistics.chapt
make[2]: Leaving directory '/usr/src/RPM/BUILD/yacas-1.4.1/manmake'
make[2]: Entering directory '/usr/src/RPM/BUILD/yacas-1.4.1/manmake'
perl ./txt2yacasdoc.pl < glossary.chapt.txt > glossary.chapt
make[2]: Leaving directory '/usr/src/RPM/BUILD/yacas-1.4.1/manmake'
make[2]: Entering directory '/usr/src/RPM/BUILD/yacas-1.4.1/manmake'
perl ./txt2yacasdoc.pl < strings.chapt.txt > strings.chapt
make[2]: Leaving directory '/usr/src/RPM/BUILD/yacas-1.4.1/manmake'
make[2]: Entering directory '/usr/src/RPM/BUILD/yacas-1.4.1/manmake'
perl ./txt2yacasdoc.pl < GPL.chapt.txt > GPL.chapt
make[2]: Leaving directory '/usr/src/RPM/BUILD/yacas-1.4.1/manmake'
make[2]: Entering directory '/usr/src/RPM/BUILD/yacas-1.4.1/manmake'
perl ./txt2yacasdoc.pl < numerics.chapt.txt > numerics.chapt
make[2]: Leaving directory '/usr/src/RPM/BUILD/yacas-1.4.1/manmake'
make[2]: Entering directory '/usr/src/RPM/BUILD/yacas-1.4.1/manmake'
perl ./txt2yacasdoc.pl < algo-basic.chapt.txt > algo-basic.chapt
make[2]: Leaving directory '/usr/src/RPM/BUILD/yacas-1.4.1/manmake'
make[2]: Entering directory '/usr/src/RPM/BUILD/yacas-1.4.1/manmake'
perl ./txt2yacasdoc.pl < algorithms-elemfunc.chapt.txt > algorithms-elemfunc.chapt
make[2]: Leaving directory '/usr/src/RPM/BUILD/yacas-1.4.1/manmake'
make[2]: Entering directory '/usr/src/RPM/BUILD/yacas-1.4.1/manmake'
perl ./txt2yacasdoc.pl < algo-numapprox.chapt.txt > algo-numapprox.chapt
make[2]: Leaving directory '/usr/src/RPM/BUILD/yacas-1.4.1/manmake'
make[2]: Entering directory '/usr/src/RPM/BUILD/yacas-1.4.1/manmake'
perl ./txt2yacasdoc.pl < algorithms-specfunc.chapt.txt > algorithms-specfunc.chapt
make[2]: Leaving directory '/usr/src/RPM/BUILD/yacas-1.4.1/manmake'
make[2]: Entering directory '/usr/src/RPM/BUILD/yacas-1.4.1/manmake'
perl ./txt2yacasdoc.pl < SturmSequences.chapt.txt > SturmSequences.chapt
make[2]: Leaving directory '/usr/src/RPM/BUILD/yacas-1.4.1/manmake'
make[2]: Entering directory '/usr/src/RPM/BUILD/yacas-1.4.1/manmake'
perl ./txt2yacasdoc.pl < algorithms-integration.chapt.txt > algorithms-integration.chapt
make[2]: Leaving directory '/usr/src/RPM/BUILD/yacas-1.4.1/manmake'
make[2]: Entering directory '/usr/src/RPM/BUILD/yacas-1.4.1/manmake'
perl ./txt2yacasdoc.pl < algo-refs.chapt.txt > algo-refs.chapt
make[2]: Leaving directory '/usr/src/RPM/BUILD/yacas-1.4.1/manmake'
make[2]: Entering directory '/usr/src/RPM/BUILD/yacas-1.4.1/manmake'
perl ./txt2yacasdoc.pl < algorithms-multivar.chapt.txt > algorithms-multivar.chapt
make[2]: Leaving directory '/usr/src/RPM/BUILD/yacas-1.4.1/manmake'
make[2]: Entering directory '/usr/src/RPM/BUILD/yacas-1.4.1/manmake'
perl ./txt2yacasdoc.pl < algo-contfrac.chapt.txt > algo-contfrac.chapt
make[2]: Leaving directory '/usr/src/RPM/BUILD/yacas-1.4.1/manmake'
make[2]: Entering directory '/usr/src/RPM/BUILD/yacas-1.4.1/manmake'
perl ./txt2yacasdoc.pl < algorithms-transforms.chapt.txt > algorithms-transforms.chapt
make[2]: Leaving directory '/usr/src/RPM/BUILD/yacas-1.4.1/manmake'
make[2]: Entering directory '/usr/src/RPM/BUILD/yacas-1.4.1/manmake'
perl ./txt2yacasdoc.pl < algorithms-numtheory.chapt.txt > algorithms-numtheory.chapt
make[2]: Leaving directory '/usr/src/RPM/BUILD/yacas-1.4.1/manmake'
make[2]: Entering directory '/usr/src/RPM/BUILD/yacas-1.4.1/manmake'
x86_64-alt-linux-g++ -DHAVE_CONFIG_H -I. -I..     -pipe -frecord-gcc-switches -Wall -g -O2 -flto=auto -std=c++11 -Wall -pedantic  -c -o manripper.o manripper.cpp
make[2]: Leaving directory '/usr/src/RPM/BUILD/yacas-1.4.1/manmake'
make[2]: Entering directory '/usr/src/RPM/BUILD/yacas-1.4.1/manmake'
/bin/sh ../libtool  --tag=CXX   --mode=link x86_64-alt-linux-g++  -pipe -frecord-gcc-switches -Wall -g -O2 -flto=auto -std=c++11 -Wall -pedantic    -o removeduplicates removeduplicates.o  
libtool: link: x86_64-alt-linux-g++ -pipe -frecord-gcc-switches -Wall -g -O2 -flto=auto -std=c++11 -Wall -pedantic -o removeduplicates removeduplicates.o 
make[2]: Leaving directory '/usr/src/RPM/BUILD/yacas-1.4.1/manmake'
make[2]: Entering directory '/usr/src/RPM/BUILD/yacas-1.4.1/manmake'
yacas: failed to stat /proc/self/exe, bailing out
make[2]: [Makefile:855: refmanual.html] Error 1 (ignored)
make[2]: Leaving directory '/usr/src/RPM/BUILD/yacas-1.4.1/manmake'
make[2]: Entering directory '/usr/src/RPM/BUILD/yacas-1.4.1/manmake'
yacas: failed to stat /proc/self/exe, bailing out
make[2]: [Makefile:852: essaysmanual.html] Error 1 (ignored)
make[2]: Leaving directory '/usr/src/RPM/BUILD/yacas-1.4.1/manmake'
make[2]: Entering directory '/usr/src/RPM/BUILD/yacas-1.4.1/manmake'
yacas: failed to stat /proc/self/exe, bailing out
make[2]: [Makefile:846: intromanual.html] Error 1 (ignored)
make[2]: Leaving directory '/usr/src/RPM/BUILD/yacas-1.4.1/manmake'
make[2]: Entering directory '/usr/src/RPM/BUILD/yacas-1.4.1/manmake'
yacas: failed to stat /proc/self/exe, bailing out
make[2]: [Makefile:849: codingmanual.html] Error 1 (ignored)
make[2]: Leaving directory '/usr/src/RPM/BUILD/yacas-1.4.1/manmake'
make[2]: Entering directory '/usr/src/RPM/BUILD/yacas-1.4.1/manmake'
/bin/sh ../libtool  --tag=CXX   --mode=link x86_64-alt-linux-g++  -pipe -frecord-gcc-switches -Wall -g -O2 -flto=auto -std=c++11 -Wall -pedantic    -o manripper manripper.o  
libtool: link: x86_64-alt-linux-g++ -pipe -frecord-gcc-switches -Wall -g -O2 -flto=auto -std=c++11 -Wall -pedantic -o manripper manripper.o 
make[2]: Leaving directory '/usr/src/RPM/BUILD/yacas-1.4.1/manmake'
make[2]: Entering directory '/usr/src/RPM/BUILD/yacas-1.4.1/manmake'
rm -f hints.unsorted
for file in ref.book.txt arith.chapt.txt calc.chapt.txt complex.chapt.txt solvers.chapt.txt simplify.chapt.txt ode.chapt.txt linalg.chapt.txt univar.chapt.txt lists.chapt.txt cl-options.chapt.txt functional.chapt.txt controlflow.chapt.txt preds.chapt.txt logic.chapt.txt const.chapt.txt vars.chapt.txt io.chapt.txt numtheory.chapt.txt strings.chapt.txt transforms.chapt.txt probability-and-statistics.chapt.txt FDL.chapt.txt  refprog.book.txt FDL.chapt.txt GPL.chapt.txt glossary.chapt.txt numerics.chapt.txt; do \
./manripper ./"$file" >> hints.unsorted ; done
BOOK ./ref.book.txt
	FILE ./ref.book.txt
	FILE arith.chapt.txt
	FILE calc.chapt.txt
	FILE complex.chapt.txt
	FILE transforms.chapt.txt
	FILE simplify.chapt.txt
	FILE solvers.chapt.txt
	FILE logic.chapt.txt
	FILE ode.chapt.txt
	FILE linalg.chapt.txt
	FILE univar.chapt.txt
	FILE lists.chapt.txt
	FILE functional.chapt.txt
	FILE controlflow.chapt.txt
	FILE preds.chapt.txt
	FILE const.chapt.txt
	FILE vars.chapt.txt
	FILE io.chapt.txt
	FILE strings.chapt.txt
	FILE probability-and-statistics.chapt.txt
	FILE numtheory.chapt.txt
	FILE FDL.chapt.txt
WARNING: no call sequences for function  (vars.chapt.txt)
WARNING: no call sequences for function ! (calc.chapt.txt)
WARNING: no call sequences for function !! (calc.chapt.txt)
WARNING: no call sequences for function != (preds.chapt.txt)
WARNING: no call sequences for function % (const.chapt.txt)
WARNING: no call sequences for function * (arith.chapt.txt)
WARNING: no call sequences for function *** (calc.chapt.txt)
WARNING: no call sequences for function + (arith.chapt.txt)
WARNING: no call sequences for function ++ (vars.chapt.txt)
WARNING: no call sequences for function - (arith.chapt.txt)
WARNING: no call sequences for function -- (vars.chapt.txt)
WARNING: no call sequences for function . (linalg.chapt.txt)
WARNING: no call sequences for function .. (functional.chapt.txt)
WARNING: no call sequences for function / (controlflow.chapt.txt)
WARNING: no call sequences for function /@ (functional.chapt.txt)
WARNING: no call sequences for function < (arith.chapt.txt)
WARNING: no call sequences for function << (arith.chapt.txt)
WARNING: no call sequences for function <= (arith.chapt.txt)
WARNING: no call sequences for function = (preds.chapt.txt)
WARNING: no call sequences for function > (arith.chapt.txt)
WARNING: no call sequences for function >= (arith.chapt.txt)
WARNING: no call sequences for function >> (arith.chapt.txt)
WARNING: no call sequences for function @ (functional.chapt.txt)
WARNING: no call sequences for function AddTo (functional.chapt.txt)
WARNING: no call sequences for function And (preds.chapt.txt)
WARNING: no call sequences for function Or (preds.chapt.txt)
WARNING: no call sequences for function StirlingNumber2 (numtheory.chapt.txt)
WARNING: no call sequences for function Where (functional.chapt.txt)
WARNING: no call sequences for function ^ (arith.chapt.txt)
WARNING: no call sequences for function gamma (const.chapt.txt)
WARNING: no call sequences for function o (linalg.chapt.txt)
WARNING: no call sequences for function tDistribution (probability-and-statistics.chapt.txt)
BOOK ./arith.chapt.txt
	FILE ./arith.chapt.txt
WARNING: no call sequences for function * (./arith.chapt.txt)
WARNING: no call sequences for function + (./arith.chapt.txt)
WARNING: no call sequences for function - (./arith.chapt.txt)
WARNING: no call sequences for function / (./arith.chapt.txt)
WARNING: no call sequences for function < (./arith.chapt.txt)
WARNING: no call sequences for function << (./arith.chapt.txt)
WARNING: no call sequences for function <= (./arith.chapt.txt)
WARNING: no call sequences for function > (./arith.chapt.txt)
WARNING: no call sequences for function >= (./arith.chapt.txt)
WARNING: no call sequences for function >> (./arith.chapt.txt)
WARNING: no call sequences for function ^ (./arith.chapt.txt)
BOOK ./calc.chapt.txt
	FILE ./calc.chapt.txt
	FILE complex.chapt.txt
	FILE transforms.chapt.txt
WARNING: no call sequences for function ! (./calc.chapt.txt)
WARNING: no call sequences for function !! (./calc.chapt.txt)
WARNING: no call sequences for function *** (./calc.chapt.txt)
BOOK ./complex.chapt.txt
	FILE ./complex.chapt.txt
BOOK ./solvers.chapt.txt
	FILE ./solvers.chapt.txt
	FILE logic.chapt.txt
	FILE ode.chapt.txt
BOOK ./simplify.chapt.txt
	FILE ./simplify.chapt.txt
BOOK ./ode.chapt.txt
	FILE ./ode.chapt.txt
BOOK ./linalg.chapt.txt
	FILE ./linalg.chapt.txt
WARNING: no call sequences for function . (./linalg.chapt.txt)
WARNING: no call sequences for function o (./linalg.chapt.txt)
BOOK ./univar.chapt.txt
	FILE ./univar.chapt.txt
BOOK ./lists.chapt.txt
	FILE ./lists.chapt.txt
BOOK ./cl-options.chapt.txt
	FILE ./cl-options.chapt.txt
BOOK ./functional.chapt.txt
	FILE ./functional.chapt.txt
WARNING: no call sequences for function  (./functional.chapt.txt)
WARNING: no call sequences for function .. (./functional.chapt.txt)
WARNING: no call sequences for function /@ (./functional.chapt.txt)
WARNING: no call sequences for function @ (./functional.chapt.txt)
WARNING: no call sequences for function AddTo (./functional.chapt.txt)
WARNING: no call sequences for function Where (./functional.chapt.txt)
BOOK ./controlflow.chapt.txt
	FILE ./controlflow.chapt.txt
WARNING: no call sequences for function / (./controlflow.chapt.txt)
BOOK ./preds.chapt.txt
	FILE ./preds.chapt.txt
WARNING: no call sequences for function != (./preds.chapt.txt)
WARNING: no call sequences for function = (./preds.chapt.txt)
WARNING: no call sequences for function And (./preds.chapt.txt)
WARNING: no call sequences for function Or (./preds.chapt.txt)
BOOK ./logic.chapt.txt
	FILE ./logic.chapt.txt
BOOK ./const.chapt.txt
	FILE ./const.chapt.txt
WARNING: no call sequences for function % (./const.chapt.txt)
WARNING: no call sequences for function gamma (./const.chapt.txt)
BOOK ./vars.chapt.txt
	FILE ./vars.chapt.txt
WARNING: no call sequences for function  (./vars.chapt.txt)
WARNING: no call sequences for function ++ (./vars.chapt.txt)
WARNING: no call sequences for function -- (./vars.chapt.txt)
BOOK ./io.chapt.txt
	FILE ./io.chapt.txt
BOOK ./numtheory.chapt.txt
	FILE ./numtheory.chapt.txt
WARNING: no call sequences for function StirlingNumber2 (./numtheory.chapt.txt)
BOOK ./strings.chapt.txt
	FILE ./strings.chapt.txt
BOOK ./transforms.chapt.txt
	FILE ./transforms.chapt.txt
BOOK ./probability-and-statistics.chapt.txt
	FILE ./probability-and-statistics.chapt.txt
WARNING: no call sequences for function tDistribution (./probability-and-statistics.chapt.txt)
BOOK ./FDL.chapt.txt
	FILE ./FDL.chapt.txt
BOOK ./refprog.book.txt
	FILE ./refprog.book.txt
	FILE numerics.chapt.txt
WARNING: function MathGcd does not have a short description (./refprog.book.txt:1551)
WARNING: function MathAdd does not have a short description (./refprog.book.txt:1552)
WARNING: function MathSubtract does not have a short description (./refprog.book.txt:1553)
WARNING: function MathMultiply does not have a short description (./refprog.book.txt:1554)
WARNING: function MathDivide does not have a short description (./refprog.book.txt:1555)
WARNING: function MathSqrt does not have a short description (./refprog.book.txt:1556)
WARNING: function MathFloor does not have a short description (./refprog.book.txt:1557)
WARNING: function MathCeil does not have a short description (./refprog.book.txt:1558)
WARNING: function MathAbs does not have a short description (./refprog.book.txt:1559)
WARNING: function MathExp does not have a short description (./refprog.book.txt:1560)
WARNING: function MathLog does not have a short description (./refprog.book.txt:1561)
WARNING: function MathPower does not have a short description (./refprog.book.txt:1562)
WARNING: function MathSin does not have a short description (./refprog.book.txt:1563)
WARNING: function MathCos does not have a short description (./refprog.book.txt:1564)
WARNING: function MathTan does not have a short description (./refprog.book.txt:1565)
WARNING: function MathSinh does not have a short description (./refprog.book.txt:1566)
WARNING: function MathCosh does not have a short description (./refprog.book.txt:1567)
WARNING: function MathTanh does not have a short description (./refprog.book.txt:1568)
WARNING: function MathArcSin does not have a short description (./refprog.book.txt:1569)
WARNING: function MathArcCos does not have a short description (./refprog.book.txt:1570)
WARNING: function MathArcTan does not have a short description (./refprog.book.txt:1571)
WARNING: function MathArcSinh does not have a short description (./refprog.book.txt:1572)
WARNING: function MathArcCosh does not have a short description (./refprog.book.txt:1573)
WARNING: function MathArcTanh does not have a short description (./refprog.book.txt:1574)
WARNING: function MathDiv does not have a short description (./refprog.book.txt:1575)
WARNING: function MathMod does not have a short description (./refprog.book.txt:1576)
WARNING: function ShiftLeft does not have a short description (./refprog.book.txt:1630)
WARNING: function ShiftRight does not have a short description (./refprog.book.txt:1631)
	FILE glossary.chapt.txt
	FILE GPL.chapt.txt
	FILE FDL.chapt.txt
WARNING: no call sequences for function */ (./refprog.book.txt)
WARNING: no call sequences for function /* (./refprog.book.txt)
WARNING: no call sequences for function // (./refprog.book.txt)
WARNING: no call sequences for function Backquoting (./refprog.book.txt)
WARNING: no call sequences for function Fast... (./refprog.book.txt)
WARNING: no call sequences for function MacroClear (./refprog.book.txt)
WARNING: no call sequences for function MacroLocal (./refprog.book.txt)
WARNING: no call sequences for function MacroRule (./refprog.book.txt)
WARNING: no call sequences for function MacroRuleBase (./refprog.book.txt)
WARNING: no call sequences for function MacroRuleBaseListed (./refprog.book.txt)
WARNING: no call sequences for function MacroSet (./refprog.book.txt)
WARNING: no call sequences for function Math... (./refprog.book.txt)
WARNING: no call sequences for function [ (./refprog.book.txt)
WARNING: no call sequences for function ] (./refprog.book.txt)
BOOK ./FDL.chapt.txt
	FILE ./FDL.chapt.txt
BOOK ./GPL.chapt.txt
	FILE ./GPL.chapt.txt
BOOK ./glossary.chapt.txt
	FILE ./glossary.chapt.txt
BOOK ./numerics.chapt.txt
	FILE ./numerics.chapt.txt
LC_ALL=C sort -t ":" hints.unsorted > hints.sorted
./removeduplicates hints.sorted hints.singlesorted
echo "::::" > tail.txt
cat hints.singlesorted tail.txt > hints
make[2]: Leaving directory '/usr/src/RPM/BUILD/yacas-1.4.1/manmake'
make[2]: Entering directory '/usr/src/RPM/BUILD/yacas-1.4.1/manmake'
yacas: failed to stat /proc/self/exe, bailing out
make[2]: [Makefile:858: refprogmanual.html] Error 1 (ignored)
make[2]: Leaving directory '/usr/src/RPM/BUILD/yacas-1.4.1/manmake'
make[2]: Entering directory '/usr/src/RPM/BUILD/yacas-1.4.1/manmake'
echo '[DefaultDirectory("./"); Use("styleplain"); Use("indexmaker"); GenerateIndex();];' | ../src/yacas --rootdir ../scripts/:../scripts/ -fpc
yacas: failed to stat /proc/self/exe, bailing out
make[2]: [Makefile:843: books.html] Error 1 (ignored)
make[2]: Leaving directory '/usr/src/RPM/BUILD/yacas-1.4.1/manmake'
make[2]: Entering directory '/usr/src/RPM/BUILD/yacas-1.4.1/manmake'
yacas: failed to stat /proc/self/exe, bailing out
make[2]: [Makefile:861: Algomanual.html] Error 1 (ignored)
make[2]: Leaving directory '/usr/src/RPM/BUILD/yacas-1.4.1/manmake'
Making all in tests
make[2]: Nothing to be done for 'all'.
Making all in JavaYacas
make[2]: Nothing to be done for 'all'.
+ exit 0
Executing(%install): /bin/sh -e /usr/src/tmp/rpm-tmp.78607
+ umask 022
+ /bin/mkdir -p /usr/src/RPM/BUILD
+ cd /usr/src/RPM/BUILD
+ /bin/chmod -Rf u+rwX -- /usr/src/tmp/yacas-buildroot
+ :
+ /bin/rm -rf -- /usr/src/tmp/yacas-buildroot
+ PATH=/usr/libexec/rpm-build:/usr/src/bin:/bin:/usr/bin:/usr/X11R6/bin:/usr/games
+ cd yacas-1.4.1
+ make 'INSTALL=/usr/libexec/rpm-build/install -p' install DESTDIR=/usr/src/tmp/yacas-buildroot
make: Entering directory '/usr/src/RPM/BUILD/yacas-1.4.1'
Making install in .
make[1]: Entering directory '/usr/src/RPM/BUILD/yacas-1.4.1'
make[2]: Entering directory '/usr/src/RPM/BUILD/yacas-1.4.1'
make[2]: Nothing to be done for 'install-data-am'.
make[2]: Leaving directory '/usr/src/RPM/BUILD/yacas-1.4.1'
make[1]: Leaving directory '/usr/src/RPM/BUILD/yacas-1.4.1'
Making install in docs
make[1]: Entering directory '/usr/src/RPM/BUILD/yacas-1.4.1/docs'
make[2]: Entering directory '/usr/src/RPM/BUILD/yacas-1.4.1/docs'
make[2]: Nothing to be done for 'install-exec-am'.
 /bin/mkdir -p '/usr/src/tmp/yacas-buildroot/usr/share/yacas/documentation/'
 /usr/libexec/rpm-build/install -p -m 644 yacaslogo.png '/usr/src/tmp/yacas-buildroot/usr/share/yacas/documentation/'
make[2]: Leaving directory '/usr/src/RPM/BUILD/yacas-1.4.1/docs'
make[1]: Leaving directory '/usr/src/RPM/BUILD/yacas-1.4.1/docs'
Making install in src
make[1]: Entering directory '/usr/src/RPM/BUILD/yacas-1.4.1/src'
make[2]: Entering directory '/usr/src/RPM/BUILD/yacas-1.4.1/src'
 /bin/mkdir -p '/usr/src/tmp/yacas-buildroot/usr/lib64'
 /bin/sh ../libtool   --mode=install /usr/libexec/rpm-build/install -p   libyacas.la '/usr/src/tmp/yacas-buildroot/usr/lib64'
libtool: install: /usr/libexec/rpm-build/install -p .libs/libyacas.so.14.0.1 /usr/src/tmp/yacas-buildroot/usr/lib64/libyacas.so.14.0.1
libtool: install: (cd /usr/src/tmp/yacas-buildroot/usr/lib64 && { ln -s -f libyacas.so.14.0.1 libyacas.so.14 || { rm -f libyacas.so.14 && ln -s libyacas.so.14.0.1 libyacas.so.14; }; })
libtool: install: (cd /usr/src/tmp/yacas-buildroot/usr/lib64 && { ln -s -f libyacas.so.14.0.1 libyacas.so || { rm -f libyacas.so && ln -s libyacas.so.14.0.1 libyacas.so; }; })
libtool: install: /usr/libexec/rpm-build/install -p .libs/libyacas.lai /usr/src/tmp/yacas-buildroot/usr/lib64/libyacas.la
libtool: warning: remember to run 'libtool --finish /usr/lib64'
 /bin/mkdir -p '/usr/src/tmp/yacas-buildroot/usr/bin'
  /bin/sh ../libtool   --mode=install /usr/libexec/rpm-build/install -p yacas '/usr/src/tmp/yacas-buildroot/usr/bin'
libtool: warning: 'libyacas.la' has not been installed in '/usr/lib64'
libtool: install: /usr/libexec/rpm-build/install -p .libs/yacas /usr/src/tmp/yacas-buildroot/usr/bin/yacas
 /bin/mkdir -p '/usr/src/tmp/yacas-buildroot/usr/include/yacas'
 /usr/libexec/rpm-build/install -p -m 644 ../include/yacas/anumber.h ../include/yacas/associationclass.h ../include/yacas/choices.h ../include/yacas/deffile.h ../include/yacas/infixparser.h ../include/yacas/lispatom.h ../include/yacas/lispenvironment.h ../include/yacas/lisperror.h ../include/yacas/lispeval.h ../include/yacas/lispevalhash.h ../include/yacas/lispglobals.h ../include/yacas/lisphash.h ../include/yacas/lispio.h ../include/yacas/lispobject.h ../include/yacas/lispparser.h ../include/yacas/lispstring.h ../include/yacas/lispuserfunc.h ../include/yacas/corefunctions.h ../include/yacas/core_yacasmain.h ../include/yacas/mathcommands.h ../include/yacas/patcher.h ../include/yacas/mathuserfunc.h ../include/yacas/numbers.h ../include/yacas/platmath.h ../include/yacas/standard.h ../include/yacas/patterns.h ../include/yacas/errors.h ../include/yacas/arggetter.h ../include/yacas/stdfileio.h ../include/yacas/stringio.h ../include/yacas/stubs.h ../include/yacas/tokenizer.h ../include/yacas/yacas.h ../include/yacas/refcount.h ../include/yacas/genericobject.h ../include/yacas/arrayclass.h ../include/yacas/evalfunc.h ../include/yacas/commandline.h ../include/yacas/unixcommandline.h ../include/yacas/patternclass.h '/usr/src/tmp/yacas-buildroot/usr/include/yacas'
 /usr/libexec/rpm-build/install -p -m 644 ../include/yacas/substitute.h ../include/yacas/stdcommandline.h ../include/yacas/genericstructs.h ../include/yacas/yacasprivate.h ../include/yacas/yacasbase.h ../include/yacas/xmltokenizer.h ../include/yacas/GPL_stuff.h ../include/yacas/anumber.inl ../include/yacas/lispobject.inl ../include/yacas/standard.inl ../include/yacas/yacas_version.h ../include/yacas/lisptype.h ../include/yacas/platfileio.h ../include/yacas/debugmem.h ../include/yacas/noncopyable.h ../include/yacas/string_utils.h ../include/yacas/utf8.h ../include/yacas/utf8/checked.h ../include/yacas/utf8/core.h ../include/yacas/utf8/unchecked.h '/usr/src/tmp/yacas-buildroot/usr/include/yacas'
make[2]: Leaving directory '/usr/src/RPM/BUILD/yacas-1.4.1/src'
make[1]: Leaving directory '/usr/src/RPM/BUILD/yacas-1.4.1/src'
Making install in scripts
make[1]: Entering directory '/usr/src/RPM/BUILD/yacas-1.4.1/scripts'
make[2]: Entering directory '/usr/src/RPM/BUILD/yacas-1.4.1/scripts'
make[2]: Nothing to be done for 'install-exec-am'.
/bin/sh ../mkinstalldirs /usr/src/tmp/yacas-buildroot/usr/share/yacas/scripts/
mkdir -p -- /usr/src/tmp/yacas-buildroot/usr/share/yacas/scripts/
 /usr/libexec/rpm-build/install -p -m 644 packages.ys /usr/src/tmp/yacas-buildroot/usr/share/yacas/scripts//packages.ys
 /usr/libexec/rpm-build/install -p -m 644 standard.ys /usr/src/tmp/yacas-buildroot/usr/share/yacas/scripts//standard.ys
 /usr/libexec/rpm-build/install -p -m 644 standard.ys.def /usr/src/tmp/yacas-buildroot/usr/share/yacas/scripts//standard.ys.def
 /usr/libexec/rpm-build/install -p -m 644 stdopers.ys /usr/src/tmp/yacas-buildroot/usr/share/yacas/scripts//stdopers.ys
 /usr/libexec/rpm-build/install -p -m 644 yacasinit.ys /usr/src/tmp/yacas-buildroot/usr/share/yacas/scripts//yacasinit.ys
mkdir -p -- /usr/src/tmp/yacas-buildroot/usr/share/yacas/scripts//array.rep
 /usr/libexec/rpm-build/install -p -m 644 array.rep/code.ys /usr/src/tmp/yacas-buildroot/usr/share/yacas/scripts//array.rep/code.ys
 /usr/libexec/rpm-build/install -p -m 644 array.rep/code.ys.def /usr/src/tmp/yacas-buildroot/usr/share/yacas/scripts//array.rep/code.ys.def
mkdir -p -- /usr/src/tmp/yacas-buildroot/usr/share/yacas/scripts//assoc.rep
 /usr/libexec/rpm-build/install -p -m 644 assoc.rep/code.ys /usr/src/tmp/yacas-buildroot/usr/share/yacas/scripts//assoc.rep/code.ys
 /usr/libexec/rpm-build/install -p -m 644 assoc.rep/code.ys.def /usr/src/tmp/yacas-buildroot/usr/share/yacas/scripts//assoc.rep/code.ys.def
mkdir -p -- /usr/src/tmp/yacas-buildroot/usr/share/yacas/scripts//c_form.rep
 /usr/libexec/rpm-build/install -p -m 644 c_form.rep/code.ys /usr/src/tmp/yacas-buildroot/usr/share/yacas/scripts//c_form.rep/code.ys
 /usr/libexec/rpm-build/install -p -m 644 c_form.rep/code.ys.def /usr/src/tmp/yacas-buildroot/usr/share/yacas/scripts//c_form.rep/code.ys.def
mkdir -p -- /usr/src/tmp/yacas-buildroot/usr/share/yacas/scripts//complex.rep
 /usr/libexec/rpm-build/install -p -m 644 complex.rep/code.ys /usr/src/tmp/yacas-buildroot/usr/share/yacas/scripts//complex.rep/code.ys
 /usr/libexec/rpm-build/install -p -m 644 complex.rep/code.ys.def /usr/src/tmp/yacas-buildroot/usr/share/yacas/scripts//complex.rep/code.ys.def
 /usr/libexec/rpm-build/install -p -m 644 complex.rep/om.ys /usr/src/tmp/yacas-buildroot/usr/share/yacas/scripts//complex.rep/om.ys
mkdir -p -- /usr/src/tmp/yacas-buildroot/usr/share/yacas/scripts//constants.rep
 /usr/libexec/rpm-build/install -p -m 644 constants.rep/code.ys /usr/src/tmp/yacas-buildroot/usr/share/yacas/scripts//constants.rep/code.ys
 /usr/libexec/rpm-build/install -p -m 644 constants.rep/code.ys.def /usr/src/tmp/yacas-buildroot/usr/share/yacas/scripts//constants.rep/code.ys.def
 /usr/libexec/rpm-build/install -p -m 644 constants.rep/om.ys /usr/src/tmp/yacas-buildroot/usr/share/yacas/scripts//constants.rep/om.ys
mkdir -p -- /usr/src/tmp/yacas-buildroot/usr/share/yacas/scripts//controlflow.rep
 /usr/libexec/rpm-build/install -p -m 644 controlflow.rep/code.ys /usr/src/tmp/yacas-buildroot/usr/share/yacas/scripts//controlflow.rep/code.ys
 /usr/libexec/rpm-build/install -p -m 644 controlflow.rep/code.ys.def /usr/src/tmp/yacas-buildroot/usr/share/yacas/scripts//controlflow.rep/code.ys.def
mkdir -p -- /usr/src/tmp/yacas-buildroot/usr/share/yacas/scripts//deffunc.rep
 /usr/libexec/rpm-build/install -p -m 644 deffunc.rep/code.ys /usr/src/tmp/yacas-buildroot/usr/share/yacas/scripts//deffunc.rep/code.ys
 /usr/libexec/rpm-build/install -p -m 644 deffunc.rep/code.ys.def /usr/src/tmp/yacas-buildroot/usr/share/yacas/scripts//deffunc.rep/code.ys.def
mkdir -p -- /usr/src/tmp/yacas-buildroot/usr/share/yacas/scripts//deriv.rep
 /usr/libexec/rpm-build/install -p -m 644 deriv.rep/code.ys /usr/src/tmp/yacas-buildroot/usr/share/yacas/scripts//deriv.rep/code.ys
 /usr/libexec/rpm-build/install -p -m 644 deriv.rep/code.ys.def /usr/src/tmp/yacas-buildroot/usr/share/yacas/scripts//deriv.rep/code.ys.def
mkdir -p -- /usr/src/tmp/yacas-buildroot/usr/share/yacas/scripts//example.rep
 /usr/libexec/rpm-build/install -p -m 644 example.rep/code.ys /usr/src/tmp/yacas-buildroot/usr/share/yacas/scripts//example.rep/code.ys
 /usr/libexec/rpm-build/install -p -m 644 example.rep/code.ys.def /usr/src/tmp/yacas-buildroot/usr/share/yacas/scripts//example.rep/code.ys.def
mkdir -p -- /usr/src/tmp/yacas-buildroot/usr/share/yacas/scripts//factors.rep
 /usr/libexec/rpm-build/install -p -m 644 factors.rep/code.ys /usr/src/tmp/yacas-buildroot/usr/share/yacas/scripts//factors.rep/code.ys
 /usr/libexec/rpm-build/install -p -m 644 factors.rep/code.ys.def /usr/src/tmp/yacas-buildroot/usr/share/yacas/scripts//factors.rep/code.ys.def
 /usr/libexec/rpm-build/install -p -m 644 factors.rep/binaryfactors.ys /usr/src/tmp/yacas-buildroot/usr/share/yacas/scripts//factors.rep/binaryfactors.ys
 /usr/libexec/rpm-build/install -p -m 644 factors.rep/binaryfactors.ys.def /usr/src/tmp/yacas-buildroot/usr/share/yacas/scripts//factors.rep/binaryfactors.ys.def
mkdir -p -- /usr/src/tmp/yacas-buildroot/usr/share/yacas/scripts//functional.rep
 /usr/libexec/rpm-build/install -p -m 644 functional.rep/code.ys /usr/src/tmp/yacas-buildroot/usr/share/yacas/scripts//functional.rep/code.ys
 /usr/libexec/rpm-build/install -p -m 644 functional.rep/code.ys.def /usr/src/tmp/yacas-buildroot/usr/share/yacas/scripts//functional.rep/code.ys.def
 /usr/libexec/rpm-build/install -p -m 644 functional.rep/om.ys /usr/src/tmp/yacas-buildroot/usr/share/yacas/scripts//functional.rep/om.ys
mkdir -p -- /usr/src/tmp/yacas-buildroot/usr/share/yacas/scripts//graph.rep
 /usr/libexec/rpm-build/install -p -m 644 graph.rep/code.ys /usr/src/tmp/yacas-buildroot/usr/share/yacas/scripts//graph.rep/code.ys
 /usr/libexec/rpm-build/install -p -m 644 graph.rep/code.ys.def /usr/src/tmp/yacas-buildroot/usr/share/yacas/scripts//graph.rep/code.ys.def
mkdir -p -- /usr/src/tmp/yacas-buildroot/usr/share/yacas/scripts//html.rep
 /usr/libexec/rpm-build/install -p -m 644 html.rep/code.ys /usr/src/tmp/yacas-buildroot/usr/share/yacas/scripts//html.rep/code.ys
 /usr/libexec/rpm-build/install -p -m 644 html.rep/code.ys.def /usr/src/tmp/yacas-buildroot/usr/share/yacas/scripts//html.rep/code.ys.def
mkdir -p -- /usr/src/tmp/yacas-buildroot/usr/share/yacas/scripts//integrate.rep
 /usr/libexec/rpm-build/install -p -m 644 integrate.rep/code.ys /usr/src/tmp/yacas-buildroot/usr/share/yacas/scripts//integrate.rep/code.ys
 /usr/libexec/rpm-build/install -p -m 644 integrate.rep/code.ys.def /usr/src/tmp/yacas-buildroot/usr/share/yacas/scripts//integrate.rep/code.ys.def
 /usr/libexec/rpm-build/install -p -m 644 integrate.rep/om.ys /usr/src/tmp/yacas-buildroot/usr/share/yacas/scripts//integrate.rep/om.ys
mkdir -p -- /usr/src/tmp/yacas-buildroot/usr/share/yacas/scripts//nintegrate.rep
 /usr/libexec/rpm-build/install -p -m 644 nintegrate.rep/code.ys /usr/src/tmp/yacas-buildroot/usr/share/yacas/scripts//nintegrate.rep/code.ys
 /usr/libexec/rpm-build/install -p -m 644 nintegrate.rep/code.ys.def /usr/src/tmp/yacas-buildroot/usr/share/yacas/scripts//nintegrate.rep/code.ys.def
mkdir -p -- /usr/src/tmp/yacas-buildroot/usr/share/yacas/scripts//io.rep
 /usr/libexec/rpm-build/install -p -m 644 io.rep/code.ys /usr/src/tmp/yacas-buildroot/usr/share/yacas/scripts//io.rep/code.ys
 /usr/libexec/rpm-build/install -p -m 644 io.rep/code.ys.def /usr/src/tmp/yacas-buildroot/usr/share/yacas/scripts//io.rep/code.ys.def
 /usr/libexec/rpm-build/install -p -m 644 io.rep/print.ys /usr/src/tmp/yacas-buildroot/usr/share/yacas/scripts//io.rep/print.ys
 /usr/libexec/rpm-build/install -p -m 644 io.rep/formula.ys /usr/src/tmp/yacas-buildroot/usr/share/yacas/scripts//io.rep/formula.ys
 /usr/libexec/rpm-build/install -p -m 644 io.rep/errors.ys /usr/src/tmp/yacas-buildroot/usr/share/yacas/scripts//io.rep/errors.ys
 /usr/libexec/rpm-build/install -p -m 644 io.rep/defaultprint.ys /usr/src/tmp/yacas-buildroot/usr/share/yacas/scripts//io.rep/defaultprint.ys
 /usr/libexec/rpm-build/install -p -m 644 io.rep/defaultprint.ys.def /usr/src/tmp/yacas-buildroot/usr/share/yacas/scripts//io.rep/defaultprint.ys.def
mkdir -p -- /usr/src/tmp/yacas-buildroot/usr/share/yacas/scripts//limit.rep
 /usr/libexec/rpm-build/install -p -m 644 limit.rep/code.ys /usr/src/tmp/yacas-buildroot/usr/share/yacas/scripts//limit.rep/code.ys
 /usr/libexec/rpm-build/install -p -m 644 limit.rep/code.ys.def /usr/src/tmp/yacas-buildroot/usr/share/yacas/scripts//limit.rep/code.ys.def
 /usr/libexec/rpm-build/install -p -m 644 limit.rep/om.ys /usr/src/tmp/yacas-buildroot/usr/share/yacas/scripts//limit.rep/om.ys
mkdir -p -- /usr/src/tmp/yacas-buildroot/usr/share/yacas/scripts//linalg.rep
 /usr/libexec/rpm-build/install -p -m 644 linalg.rep/code.ys /usr/src/tmp/yacas-buildroot/usr/share/yacas/scripts//linalg.rep/code.ys
 /usr/libexec/rpm-build/install -p -m 644 linalg.rep/code.ys.def /usr/src/tmp/yacas-buildroot/usr/share/yacas/scripts//linalg.rep/code.ys.def
mkdir -p -- /usr/src/tmp/yacas-buildroot/usr/share/yacas/scripts//lists.rep
 /usr/libexec/rpm-build/install -p -m 644 lists.rep/code.ys /usr/src/tmp/yacas-buildroot/usr/share/yacas/scripts//lists.rep/code.ys
 /usr/libexec/rpm-build/install -p -m 644 lists.rep/code.ys.def /usr/src/tmp/yacas-buildroot/usr/share/yacas/scripts//lists.rep/code.ys.def
 /usr/libexec/rpm-build/install -p -m 644 lists.rep/scopestack.ys /usr/src/tmp/yacas-buildroot/usr/share/yacas/scripts//lists.rep/scopestack.ys
 /usr/libexec/rpm-build/install -p -m 644 lists.rep/scopestack.ys.def /usr/src/tmp/yacas-buildroot/usr/share/yacas/scripts//lists.rep/scopestack.ys.def
mkdir -p -- /usr/src/tmp/yacas-buildroot/usr/share/yacas/scripts//localrules.rep
 /usr/libexec/rpm-build/install -p -m 644 localrules.rep/code.ys /usr/src/tmp/yacas-buildroot/usr/share/yacas/scripts//localrules.rep/code.ys
 /usr/libexec/rpm-build/install -p -m 644 localrules.rep/code.ys.def /usr/src/tmp/yacas-buildroot/usr/share/yacas/scripts//localrules.rep/code.ys.def
mkdir -p -- /usr/src/tmp/yacas-buildroot/usr/share/yacas/scripts//logic.rep
 /usr/libexec/rpm-build/install -p -m 644 logic.rep/code.ys /usr/src/tmp/yacas-buildroot/usr/share/yacas/scripts//logic.rep/code.ys
 /usr/libexec/rpm-build/install -p -m 644 logic.rep/code.ys.def /usr/src/tmp/yacas-buildroot/usr/share/yacas/scripts//logic.rep/code.ys.def
 /usr/libexec/rpm-build/install -p -m 644 logic.rep/om.ys /usr/src/tmp/yacas-buildroot/usr/share/yacas/scripts//logic.rep/om.ys
mkdir -p -- /usr/src/tmp/yacas-buildroot/usr/share/yacas/scripts//multivar.rep
 /usr/libexec/rpm-build/install -p -m 644 multivar.rep/code.ys /usr/src/tmp/yacas-buildroot/usr/share/yacas/scripts//multivar.rep/code.ys
 /usr/libexec/rpm-build/install -p -m 644 multivar.rep/code.ys.def /usr/src/tmp/yacas-buildroot/usr/share/yacas/scripts//multivar.rep/code.ys.def
 /usr/libexec/rpm-build/install -p -m 644 multivar.rep/makemulti.ys /usr/src/tmp/yacas-buildroot/usr/share/yacas/scripts//multivar.rep/makemulti.ys
 /usr/libexec/rpm-build/install -p -m 644 multivar.rep/sparsetree.ys /usr/src/tmp/yacas-buildroot/usr/share/yacas/scripts//multivar.rep/sparsetree.ys
 /usr/libexec/rpm-build/install -p -m 644 multivar.rep/sparsetree.ys.def /usr/src/tmp/yacas-buildroot/usr/share/yacas/scripts//multivar.rep/sparsetree.ys.def
 /usr/libexec/rpm-build/install -p -m 644 multivar.rep/sparsenomial.ys /usr/src/tmp/yacas-buildroot/usr/share/yacas/scripts//multivar.rep/sparsenomial.ys
mkdir -p -- /usr/src/tmp/yacas-buildroot/usr/share/yacas/scripts//newly.rep
 /usr/libexec/rpm-build/install -p -m 644 newly.rep/code.ys /usr/src/tmp/yacas-buildroot/usr/share/yacas/scripts//newly.rep/code.ys
 /usr/libexec/rpm-build/install -p -m 644 newly.rep/code.ys.def /usr/src/tmp/yacas-buildroot/usr/share/yacas/scripts//newly.rep/code.ys.def
mkdir -p -- /usr/src/tmp/yacas-buildroot/usr/share/yacas/scripts//numbers.rep
 /usr/libexec/rpm-build/install -p -m 644 numbers.rep/code.ys /usr/src/tmp/yacas-buildroot/usr/share/yacas/scripts//numbers.rep/code.ys
 /usr/libexec/rpm-build/install -p -m 644 numbers.rep/code.ys.def /usr/src/tmp/yacas-buildroot/usr/share/yacas/scripts//numbers.rep/code.ys.def
 /usr/libexec/rpm-build/install -p -m 644 numbers.rep/om.ys /usr/src/tmp/yacas-buildroot/usr/share/yacas/scripts//numbers.rep/om.ys
 /usr/libexec/rpm-build/install -p -m 644 numbers.rep/nthroot.ys /usr/src/tmp/yacas-buildroot/usr/share/yacas/scripts//numbers.rep/nthroot.ys
 /usr/libexec/rpm-build/install -p -m 644 numbers.rep/nthroot.ys.def /usr/src/tmp/yacas-buildroot/usr/share/yacas/scripts//numbers.rep/nthroot.ys.def
mkdir -p -- /usr/src/tmp/yacas-buildroot/usr/share/yacas/scripts//odesolver.rep
 /usr/libexec/rpm-build/install -p -m 644 odesolver.rep/code.ys /usr/src/tmp/yacas-buildroot/usr/share/yacas/scripts//odesolver.rep/code.ys
 /usr/libexec/rpm-build/install -p -m 644 odesolver.rep/code.ys.def /usr/src/tmp/yacas-buildroot/usr/share/yacas/scripts//odesolver.rep/code.ys.def
mkdir -p -- /usr/src/tmp/yacas-buildroot/usr/share/yacas/scripts//openmath.rep
 /usr/libexec/rpm-build/install -p -m 644 openmath.rep/code.ys /usr/src/tmp/yacas-buildroot/usr/share/yacas/scripts//openmath.rep/code.ys
 /usr/libexec/rpm-build/install -p -m 644 openmath.rep/code.ys.def /usr/src/tmp/yacas-buildroot/usr/share/yacas/scripts//openmath.rep/code.ys.def
mkdir -p -- /usr/src/tmp/yacas-buildroot/usr/share/yacas/scripts//orthopoly.rep
 /usr/libexec/rpm-build/install -p -m 644 orthopoly.rep/code.ys /usr/src/tmp/yacas-buildroot/usr/share/yacas/scripts//orthopoly.rep/code.ys
 /usr/libexec/rpm-build/install -p -m 644 orthopoly.rep/code.ys.def /usr/src/tmp/yacas-buildroot/usr/share/yacas/scripts//orthopoly.rep/code.ys.def
mkdir -p -- /usr/src/tmp/yacas-buildroot/usr/share/yacas/scripts//padic.rep
 /usr/libexec/rpm-build/install -p -m 644 padic.rep/code.ys /usr/src/tmp/yacas-buildroot/usr/share/yacas/scripts//padic.rep/code.ys
 /usr/libexec/rpm-build/install -p -m 644 padic.rep/code.ys.def /usr/src/tmp/yacas-buildroot/usr/share/yacas/scripts//padic.rep/code.ys.def
mkdir -p -- /usr/src/tmp/yacas-buildroot/usr/share/yacas/scripts//patterns.rep
 /usr/libexec/rpm-build/install -p -m 644 patterns.rep/code.ys /usr/src/tmp/yacas-buildroot/usr/share/yacas/scripts//patterns.rep/code.ys
 /usr/libexec/rpm-build/install -p -m 644 patterns.rep/code.ys.def /usr/src/tmp/yacas-buildroot/usr/share/yacas/scripts//patterns.rep/code.ys.def
mkdir -p -- /usr/src/tmp/yacas-buildroot/usr/share/yacas/scripts//plots.rep
 /usr/libexec/rpm-build/install -p -m 644 plots.rep/code.ys /usr/src/tmp/yacas-buildroot/usr/share/yacas/scripts//plots.rep/code.ys
 /usr/libexec/rpm-build/install -p -m 644 plots.rep/code.ys.def /usr/src/tmp/yacas-buildroot/usr/share/yacas/scripts//plots.rep/code.ys.def
 /usr/libexec/rpm-build/install -p -m 644 plots.rep/backends-2d.ys /usr/src/tmp/yacas-buildroot/usr/share/yacas/scripts//plots.rep/backends-2d.ys
 /usr/libexec/rpm-build/install -p -m 644 plots.rep/backends-3d.ys /usr/src/tmp/yacas-buildroot/usr/share/yacas/scripts//plots.rep/backends-3d.ys
 /usr/libexec/rpm-build/install -p -m 644 plots.rep/plot2d.ys.def /usr/src/tmp/yacas-buildroot/usr/share/yacas/scripts//plots.rep/plot2d.ys.def
 /usr/libexec/rpm-build/install -p -m 644 plots.rep/plot3d.ys.def /usr/src/tmp/yacas-buildroot/usr/share/yacas/scripts//plots.rep/plot3d.ys.def
 /usr/libexec/rpm-build/install -p -m 644 plots.rep/plot2d.ys /usr/src/tmp/yacas-buildroot/usr/share/yacas/scripts//plots.rep/plot2d.ys
 /usr/libexec/rpm-build/install -p -m 644 plots.rep/plot3d.ys /usr/src/tmp/yacas-buildroot/usr/share/yacas/scripts//plots.rep/plot3d.ys
mkdir -p -- /usr/src/tmp/yacas-buildroot/usr/share/yacas/scripts//predicates.rep
 /usr/libexec/rpm-build/install -p -m 644 predicates.rep/code.ys /usr/src/tmp/yacas-buildroot/usr/share/yacas/scripts//predicates.rep/code.ys
 /usr/libexec/rpm-build/install -p -m 644 predicates.rep/code.ys.def /usr/src/tmp/yacas-buildroot/usr/share/yacas/scripts//predicates.rep/code.ys.def
mkdir -p -- /usr/src/tmp/yacas-buildroot/usr/share/yacas/scripts//pslq.rep
 /usr/libexec/rpm-build/install -p -m 644 pslq.rep/code.ys /usr/src/tmp/yacas-buildroot/usr/share/yacas/scripts//pslq.rep/code.ys
 /usr/libexec/rpm-build/install -p -m 644 pslq.rep/code.ys.def /usr/src/tmp/yacas-buildroot/usr/share/yacas/scripts//pslq.rep/code.ys.def
mkdir -p -- /usr/src/tmp/yacas-buildroot/usr/share/yacas/scripts//rabinmiller.rep
 /usr/libexec/rpm-build/install -p -m 644 rabinmiller.rep/code.ys /usr/src/tmp/yacas-buildroot/usr/share/yacas/scripts//rabinmiller.rep/code.ys
 /usr/libexec/rpm-build/install -p -m 644 rabinmiller.rep/code.ys.def /usr/src/tmp/yacas-buildroot/usr/share/yacas/scripts//rabinmiller.rep/code.ys.def
mkdir -p -- /usr/src/tmp/yacas-buildroot/usr/share/yacas/scripts//radsimp.rep
 /usr/libexec/rpm-build/install -p -m 644 radsimp.rep/code.ys /usr/src/tmp/yacas-buildroot/usr/share/yacas/scripts//radsimp.rep/code.ys
 /usr/libexec/rpm-build/install -p -m 644 radsimp.rep/code.ys.def /usr/src/tmp/yacas-buildroot/usr/share/yacas/scripts//radsimp.rep/code.ys.def
mkdir -p -- /usr/src/tmp/yacas-buildroot/usr/share/yacas/scripts//random.rep
 /usr/libexec/rpm-build/install -p -m 644 random.rep/code.ys /usr/src/tmp/yacas-buildroot/usr/share/yacas/scripts//random.rep/code.ys
 /usr/libexec/rpm-build/install -p -m 644 random.rep/code.ys.def /usr/src/tmp/yacas-buildroot/usr/share/yacas/scripts//random.rep/code.ys.def
mkdir -p -- /usr/src/tmp/yacas-buildroot/usr/share/yacas/scripts//rational.rep
 /usr/libexec/rpm-build/install -p -m 644 rational.rep/code.ys /usr/src/tmp/yacas-buildroot/usr/share/yacas/scripts//rational.rep/code.ys
 /usr/libexec/rpm-build/install -p -m 644 rational.rep/code.ys.def /usr/src/tmp/yacas-buildroot/usr/share/yacas/scripts//rational.rep/code.ys.def
mkdir -p -- /usr/src/tmp/yacas-buildroot/usr/share/yacas/scripts//simplify.rep
 /usr/libexec/rpm-build/install -p -m 644 simplify.rep/code.ys /usr/src/tmp/yacas-buildroot/usr/share/yacas/scripts//simplify.rep/code.ys
 /usr/libexec/rpm-build/install -p -m 644 simplify.rep/code.ys.def /usr/src/tmp/yacas-buildroot/usr/share/yacas/scripts//simplify.rep/code.ys.def
 /usr/libexec/rpm-build/install -p -m 644 simplify.rep/factorial.ys /usr/src/tmp/yacas-buildroot/usr/share/yacas/scripts//simplify.rep/factorial.ys
 /usr/libexec/rpm-build/install -p -m 644 simplify.rep/factorial.ys.def /usr/src/tmp/yacas-buildroot/usr/share/yacas/scripts//simplify.rep/factorial.ys.def
mkdir -p -- /usr/src/tmp/yacas-buildroot/usr/share/yacas/scripts//solve.rep
 /usr/libexec/rpm-build/install -p -m 644 solve.rep/code.ys /usr/src/tmp/yacas-buildroot/usr/share/yacas/scripts//solve.rep/code.ys
 /usr/libexec/rpm-build/install -p -m 644 solve.rep/code.ys.def /usr/src/tmp/yacas-buildroot/usr/share/yacas/scripts//solve.rep/code.ys.def
mkdir -p -- /usr/src/tmp/yacas-buildroot/usr/share/yacas/scripts//debug.rep
 /usr/libexec/rpm-build/install -p -m 644 debug.rep/code.ys /usr/src/tmp/yacas-buildroot/usr/share/yacas/scripts//debug.rep/code.ys
 /usr/libexec/rpm-build/install -p -m 644 debug.rep/code.ys.def /usr/src/tmp/yacas-buildroot/usr/share/yacas/scripts//debug.rep/code.ys.def
mkdir -p -- /usr/src/tmp/yacas-buildroot/usr/share/yacas/scripts//specfunc.rep
 /usr/libexec/rpm-build/install -p -m 644 specfunc.rep/bessel.ys /usr/src/tmp/yacas-buildroot/usr/share/yacas/scripts//specfunc.rep/bessel.ys
 /usr/libexec/rpm-build/install -p -m 644 specfunc.rep/bessel.ys.def /usr/src/tmp/yacas-buildroot/usr/share/yacas/scripts//specfunc.rep/bessel.ys.def
 /usr/libexec/rpm-build/install -p -m 644 specfunc.rep/bernou.ys /usr/src/tmp/yacas-buildroot/usr/share/yacas/scripts//specfunc.rep/bernou.ys
 /usr/libexec/rpm-build/install -p -m 644 specfunc.rep/bernou.ys.def /usr/src/tmp/yacas-buildroot/usr/share/yacas/scripts//specfunc.rep/bernou.ys.def
 /usr/libexec/rpm-build/install -p -m 644 specfunc.rep/code.ys /usr/src/tmp/yacas-buildroot/usr/share/yacas/scripts//specfunc.rep/code.ys
 /usr/libexec/rpm-build/install -p -m 644 specfunc.rep/code.ys.def /usr/src/tmp/yacas-buildroot/usr/share/yacas/scripts//specfunc.rep/code.ys.def
 /usr/libexec/rpm-build/install -p -m 644 specfunc.rep/gammaconst.ys /usr/src/tmp/yacas-buildroot/usr/share/yacas/scripts//specfunc.rep/gammaconst.ys
 /usr/libexec/rpm-build/install -p -m 644 specfunc.rep/gammaconst.ys.def /usr/src/tmp/yacas-buildroot/usr/share/yacas/scripts//specfunc.rep/gammaconst.ys.def
 /usr/libexec/rpm-build/install -p -m 644 specfunc.rep/gamma.ys /usr/src/tmp/yacas-buildroot/usr/share/yacas/scripts//specfunc.rep/gamma.ys
 /usr/libexec/rpm-build/install -p -m 644 specfunc.rep/gamma.ys.def /usr/src/tmp/yacas-buildroot/usr/share/yacas/scripts//specfunc.rep/gamma.ys.def
 /usr/libexec/rpm-build/install -p -m 644 specfunc.rep/zeta.ys /usr/src/tmp/yacas-buildroot/usr/share/yacas/scripts//specfunc.rep/zeta.ys
 /usr/libexec/rpm-build/install -p -m 644 specfunc.rep/zeta.ys.def /usr/src/tmp/yacas-buildroot/usr/share/yacas/scripts//specfunc.rep/zeta.ys.def
 /usr/libexec/rpm-build/install -p -m 644 specfunc.rep/om.ys /usr/src/tmp/yacas-buildroot/usr/share/yacas/scripts//specfunc.rep/om.ys
mkdir -p -- /usr/src/tmp/yacas-buildroot/usr/share/yacas/scripts//statistics.rep
 /usr/libexec/rpm-build/install -p -m 644 statistics.rep/hypothesystest.ys /usr/src/tmp/yacas-buildroot/usr/share/yacas/scripts//statistics.rep/hypothesystest.ys
 /usr/libexec/rpm-build/install -p -m 644 statistics.rep/incompletegamma.ys.def /usr/src/tmp/yacas-buildroot/usr/share/yacas/scripts//statistics.rep/incompletegamma.ys.def
 /usr/libexec/rpm-build/install -p -m 644 statistics.rep/regression.ys.def /usr/src/tmp/yacas-buildroot/usr/share/yacas/scripts//statistics.rep/regression.ys.def
 /usr/libexec/rpm-build/install -p -m 644 statistics.rep/hypothesystest.ys.def /usr/src/tmp/yacas-buildroot/usr/share/yacas/scripts//statistics.rep/hypothesystest.ys.def
 /usr/libexec/rpm-build/install -p -m 644 statistics.rep/randomtest.ys /usr/src/tmp/yacas-buildroot/usr/share/yacas/scripts//statistics.rep/randomtest.ys
 /usr/libexec/rpm-build/install -p -m 644 statistics.rep/statistics.ys /usr/src/tmp/yacas-buildroot/usr/share/yacas/scripts//statistics.rep/statistics.ys
 /usr/libexec/rpm-build/install -p -m 644 statistics.rep/incompletegamma.ys /usr/src/tmp/yacas-buildroot/usr/share/yacas/scripts//statistics.rep/incompletegamma.ys
 /usr/libexec/rpm-build/install -p -m 644 statistics.rep/regression.ys /usr/src/tmp/yacas-buildroot/usr/share/yacas/scripts//statistics.rep/regression.ys
 /usr/libexec/rpm-build/install -p -m 644 statistics.rep/statistics.ys.def /usr/src/tmp/yacas-buildroot/usr/share/yacas/scripts//statistics.rep/statistics.ys.def
 /usr/libexec/rpm-build/install -p -m 644 statistics.rep/distributions.ys /usr/src/tmp/yacas-buildroot/usr/share/yacas/scripts//statistics.rep/distributions.ys
 /usr/libexec/rpm-build/install -p -m 644 statistics.rep/distributions.ys.def /usr/src/tmp/yacas-buildroot/usr/share/yacas/scripts//statistics.rep/distributions.ys.def
mkdir -p -- /usr/src/tmp/yacas-buildroot/usr/share/yacas/scripts//stats.rep
 /usr/libexec/rpm-build/install -p -m 644 stats.rep/code.ys /usr/src/tmp/yacas-buildroot/usr/share/yacas/scripts//stats.rep/code.ys
 /usr/libexec/rpm-build/install -p -m 644 stats.rep/code.ys.def /usr/src/tmp/yacas-buildroot/usr/share/yacas/scripts//stats.rep/code.ys.def
mkdir -p -- /usr/src/tmp/yacas-buildroot/usr/share/yacas/scripts//stdfuncs.rep
 /usr/libexec/rpm-build/install -p -m 644 stdfuncs.rep/code.ys /usr/src/tmp/yacas-buildroot/usr/share/yacas/scripts//stdfuncs.rep/code.ys
 /usr/libexec/rpm-build/install -p -m 644 stdfuncs.rep/code.ys.def /usr/src/tmp/yacas-buildroot/usr/share/yacas/scripts//stdfuncs.rep/code.ys.def
 /usr/libexec/rpm-build/install -p -m 644 stdfuncs.rep/om.ys /usr/src/tmp/yacas-buildroot/usr/share/yacas/scripts//stdfuncs.rep/om.ys
 /usr/libexec/rpm-build/install -p -m 644 stdfuncs.rep/numerical.ys /usr/src/tmp/yacas-buildroot/usr/share/yacas/scripts//stdfuncs.rep/numerical.ys
 /usr/libexec/rpm-build/install -p -m 644 stdfuncs.rep/numerical.ys.def /usr/src/tmp/yacas-buildroot/usr/share/yacas/scripts//stdfuncs.rep/numerical.ys.def
 /usr/libexec/rpm-build/install -p -m 644 stdfuncs.rep/nummethods.ys /usr/src/tmp/yacas-buildroot/usr/share/yacas/scripts//stdfuncs.rep/nummethods.ys
 /usr/libexec/rpm-build/install -p -m 644 stdfuncs.rep/nummethods.ys.def /usr/src/tmp/yacas-buildroot/usr/share/yacas/scripts//stdfuncs.rep/nummethods.ys.def
mkdir -p -- /usr/src/tmp/yacas-buildroot/usr/share/yacas/scripts//stubs.rep
 /usr/libexec/rpm-build/install -p -m 644 stubs.rep/code.ys /usr/src/tmp/yacas-buildroot/usr/share/yacas/scripts//stubs.rep/code.ys
 /usr/libexec/rpm-build/install -p -m 644 stubs.rep/code.ys.def /usr/src/tmp/yacas-buildroot/usr/share/yacas/scripts//stubs.rep/code.ys.def
 /usr/libexec/rpm-build/install -p -m 644 stubs.rep/om.ys /usr/src/tmp/yacas-buildroot/usr/share/yacas/scripts//stubs.rep/om.ys
 /usr/libexec/rpm-build/install -p -m 644 stdfuncs.rep/elemfuncs.ys /usr/src/tmp/yacas-buildroot/usr/share/yacas/scripts//stdfuncs.rep/elemfuncs.ys
mkdir -p -- /usr/src/tmp/yacas-buildroot/usr/share/yacas/scripts//substitute.rep
 /usr/libexec/rpm-build/install -p -m 644 substitute.rep/code.ys /usr/src/tmp/yacas-buildroot/usr/share/yacas/scripts//substitute.rep/code.ys
 /usr/libexec/rpm-build/install -p -m 644 substitute.rep/code.ys.def /usr/src/tmp/yacas-buildroot/usr/share/yacas/scripts//substitute.rep/code.ys.def
 /usr/libexec/rpm-build/install -p -m 644 stdfuncs.rep/elemfuncs.ys.def /usr/src/tmp/yacas-buildroot/usr/share/yacas/scripts//stdfuncs.rep/elemfuncs.ys.def
mkdir -p -- /usr/src/tmp/yacas-buildroot/usr/share/yacas/scripts//sums.rep
 /usr/libexec/rpm-build/install -p -m 644 sums.rep/code.ys /usr/src/tmp/yacas-buildroot/usr/share/yacas/scripts//sums.rep/code.ys
 /usr/libexec/rpm-build/install -p -m 644 sums.rep/code.ys.def /usr/src/tmp/yacas-buildroot/usr/share/yacas/scripts//sums.rep/code.ys.def
 /usr/libexec/rpm-build/install -p -m 644 sums.rep/taylor.ys /usr/src/tmp/yacas-buildroot/usr/share/yacas/scripts//sums.rep/taylor.ys
 /usr/libexec/rpm-build/install -p -m 644 sums.rep/taylor.ys.def /usr/src/tmp/yacas-buildroot/usr/share/yacas/scripts//sums.rep/taylor.ys.def
 /usr/libexec/rpm-build/install -p -m 644 sums.rep/taylor3.ys /usr/src/tmp/yacas-buildroot/usr/share/yacas/scripts//sums.rep/taylor3.ys
 /usr/libexec/rpm-build/install -p -m 644 sums.rep/taylor3.ys.def /usr/src/tmp/yacas-buildroot/usr/share/yacas/scripts//sums.rep/taylor3.ys.def
 /usr/libexec/rpm-build/install -p -m 644 sums.rep/om.ys /usr/src/tmp/yacas-buildroot/usr/share/yacas/scripts//sums.rep/om.ys
mkdir -p -- /usr/src/tmp/yacas-buildroot/usr/share/yacas/scripts//tensor.rep
 /usr/libexec/rpm-build/install -p -m 644 tensor.rep/code.ys /usr/src/tmp/yacas-buildroot/usr/share/yacas/scripts//tensor.rep/code.ys
 /usr/libexec/rpm-build/install -p -m 644 tensor.rep/code.ys.def /usr/src/tmp/yacas-buildroot/usr/share/yacas/scripts//tensor.rep/code.ys.def
mkdir -p -- /usr/src/tmp/yacas-buildroot/usr/share/yacas/scripts//testers.rep
 /usr/libexec/rpm-build/install -p -m 644 testers.rep/code.ys /usr/src/tmp/yacas-buildroot/usr/share/yacas/scripts//testers.rep/code.ys
 /usr/libexec/rpm-build/install -p -m 644 testers.rep/code.ys.def /usr/src/tmp/yacas-buildroot/usr/share/yacas/scripts//testers.rep/code.ys.def
mkdir -p -- /usr/src/tmp/yacas-buildroot/usr/share/yacas/scripts//texform.rep
 /usr/libexec/rpm-build/install -p -m 644 texform.rep/code.ys /usr/src/tmp/yacas-buildroot/usr/share/yacas/scripts//texform.rep/code.ys
 /usr/libexec/rpm-build/install -p -m 644 texform.rep/code.ys.def /usr/src/tmp/yacas-buildroot/usr/share/yacas/scripts//texform.rep/code.ys.def
mkdir -p -- /usr/src/tmp/yacas-buildroot/usr/share/yacas/scripts//trigsimp.rep
 /usr/libexec/rpm-build/install -p -m 644 trigsimp.rep/code.ys /usr/src/tmp/yacas-buildroot/usr/share/yacas/scripts//trigsimp.rep/code.ys
 /usr/libexec/rpm-build/install -p -m 644 trigsimp.rep/code.ys.def /usr/src/tmp/yacas-buildroot/usr/share/yacas/scripts//trigsimp.rep/code.ys.def
mkdir -p -- /usr/src/tmp/yacas-buildroot/usr/share/yacas/scripts//univar.rep
 /usr/libexec/rpm-build/install -p -m 644 univar.rep/code.ys /usr/src/tmp/yacas-buildroot/usr/share/yacas/scripts//univar.rep/code.ys
 /usr/libexec/rpm-build/install -p -m 644 univar.rep/code.ys.def /usr/src/tmp/yacas-buildroot/usr/share/yacas/scripts//univar.rep/code.ys.def
 /usr/libexec/rpm-build/install -p -m 644 univar.rep/sturm.ys /usr/src/tmp/yacas-buildroot/usr/share/yacas/scripts//univar.rep/sturm.ys
 /usr/libexec/rpm-build/install -p -m 644 univar.rep/sturm.ys.def /usr/src/tmp/yacas-buildroot/usr/share/yacas/scripts//univar.rep/sturm.ys.def
 /usr/libexec/rpm-build/install -p -m 644 univar.rep/Cyclotomic.ys /usr/src/tmp/yacas-buildroot/usr/share/yacas/scripts//univar.rep/Cyclotomic.ys
 /usr/libexec/rpm-build/install -p -m 644 univar.rep/Cyclotomic.ys.def /usr/src/tmp/yacas-buildroot/usr/share/yacas/scripts//univar.rep/Cyclotomic.ys.def
 /usr/libexec/rpm-build/install -p -m 644 univar.rep/sparse.ys /usr/src/tmp/yacas-buildroot/usr/share/yacas/scripts//univar.rep/sparse.ys
 /usr/libexec/rpm-build/install -p -m 644 univar.rep/sparse.ys.def /usr/src/tmp/yacas-buildroot/usr/share/yacas/scripts//univar.rep/sparse.ys.def
mkdir -p -- /usr/src/tmp/yacas-buildroot/usr/share/yacas/scripts//probability.rep
 /usr/libexec/rpm-build/install -p -m 644 probability.rep/code.ys /usr/src/tmp/yacas-buildroot/usr/share/yacas/scripts//probability.rep/code.ys
 /usr/libexec/rpm-build/install -p -m 644 probability.rep/code.ys.def /usr/src/tmp/yacas-buildroot/usr/share/yacas/scripts//probability.rep/code.ys.def
 /usr/libexec/rpm-build/install -p -m 644 numbers.rep/NumberTheory.ys /usr/src/tmp/yacas-buildroot/usr/share/yacas/scripts//numbers.rep/NumberTheory.ys
 /usr/libexec/rpm-build/install -p -m 644 numbers.rep/NumberTheory.ys.def /usr/src/tmp/yacas-buildroot/usr/share/yacas/scripts//numbers.rep/NumberTheory.ys.def
 /usr/libexec/rpm-build/install -p -m 644 numbers.rep/GaussianIntegers.ys /usr/src/tmp/yacas-buildroot/usr/share/yacas/scripts//numbers.rep/GaussianIntegers.ys
 /usr/libexec/rpm-build/install -p -m 644 numbers.rep/GaussianIntegers.ys.def /usr/src/tmp/yacas-buildroot/usr/share/yacas/scripts//numbers.rep/GaussianIntegers.ys.def
mkdir -p -- /usr/src/tmp/yacas-buildroot/usr/share/yacas/scripts//transforms.rep
 /usr/libexec/rpm-build/install -p -m 644 transforms.rep/code.ys /usr/src/tmp/yacas-buildroot/usr/share/yacas/scripts//transforms.rep/code.ys
 /usr/libexec/rpm-build/install -p -m 644 transforms.rep/code.ys.def /usr/src/tmp/yacas-buildroot/usr/share/yacas/scripts//transforms.rep/code.ys.def
mkdir -p -- /usr/src/tmp/yacas-buildroot/usr/share/yacas/scripts//base.rep
 /usr/libexec/rpm-build/install -p -m 644 base.rep/math.ys /usr/src/tmp/yacas-buildroot/usr/share/yacas/scripts//base.rep/math.ys
 /usr/libexec/rpm-build/install -p -m 644 base.rep/math.ys.def /usr/src/tmp/yacas-buildroot/usr/share/yacas/scripts//base.rep/math.ys.def
 /usr/libexec/rpm-build/install -p -m 644 stdarith.ys /usr/src/tmp/yacas-buildroot/usr/share/yacas/scripts//stdarith.ys
 /usr/libexec/rpm-build/install -p -m 644 stdarith.ys.def /usr/src/tmp/yacas-buildroot/usr/share/yacas/scripts//stdarith.ys.def
mkdir -p -- /usr/src/tmp/yacas-buildroot/usr/share/yacas/scripts//calendar.rep
 /usr/libexec/rpm-build/install -p -m 644 calendar.rep/code.ys /usr/src/tmp/yacas-buildroot/usr/share/yacas/scripts//calendar.rep/code.ys
 /usr/libexec/rpm-build/install -p -m 644 calendar.rep/code.ys.def /usr/src/tmp/yacas-buildroot/usr/share/yacas/scripts//calendar.rep/code.ys.def
mkdir -p -- /usr/src/tmp/yacas-buildroot/usr/share/yacas/scripts//examples
 /usr/libexec/rpm-build/install -p -m 644 examples/ABIN.ys /usr/src/tmp/yacas-buildroot/usr/share/yacas/scripts//examples/ABIN.ys
 /usr/libexec/rpm-build/install -p -m 644 examples/pi.ys /usr/src/tmp/yacas-buildroot/usr/share/yacas/scripts//examples/pi.ys
 /usr/libexec/rpm-build/install -p -m 644 examples/findsum.ys /usr/src/tmp/yacas-buildroot/usr/share/yacas/scripts//examples/findsum.ys
 /usr/libexec/rpm-build/install -p -m 644 examples/wordproblems.ys /usr/src/tmp/yacas-buildroot/usr/share/yacas/scripts//examples/wordproblems.ys
 /usr/libexec/rpm-build/install -p -m 644 examples/queens.ys /usr/src/tmp/yacas-buildroot/usr/share/yacas/scripts//examples/queens.ys
 /usr/libexec/rpm-build/install -p -m 644 examples/benchmark.ys /usr/src/tmp/yacas-buildroot/usr/share/yacas/scripts//examples/benchmark.ys
 /usr/libexec/rpm-build/install -p -m 644 examples/MinimumSpanningTree.ys /usr/src/tmp/yacas-buildroot/usr/share/yacas/scripts//examples/MinimumSpanningTree.ys
 /usr/libexec/rpm-build/install -p -m 644 examples/benchmark2.ys /usr/src/tmp/yacas-buildroot/usr/share/yacas/scripts//examples/benchmark2.ys
 /usr/libexec/rpm-build/install -p -m 644 examples/benchbuild.ys /usr/src/tmp/yacas-buildroot/usr/share/yacas/scripts//examples/benchbuild.ys
 /usr/libexec/rpm-build/install -p -m 644 examples/goldbach.ys /usr/src/tmp/yacas-buildroot/usr/share/yacas/scripts//examples/goldbach.ys
 /usr/libexec/rpm-build/install -p -m 644 examples/series.ys /usr/src/tmp/yacas-buildroot/usr/share/yacas/scripts//examples/series.ys
make[2]: Leaving directory '/usr/src/RPM/BUILD/yacas-1.4.1/scripts'
make[1]: Leaving directory '/usr/src/RPM/BUILD/yacas-1.4.1/scripts'
Making install in manmake
make[1]: Entering directory '/usr/src/RPM/BUILD/yacas-1.4.1/manmake'
echo '[DefaultDirectory("./"); Use("styleplain"); Use("indexmaker"); GenerateIndex();];' | ../src/yacas --rootdir ../scripts/:../scripts/ -fpc
yacas: failed to stat /proc/self/exe, bailing out
make[1]: [Makefile:843: books.html] Error 1 (ignored)
yacas: failed to stat /proc/self/exe, bailing out
make[1]: [Makefile:846: intromanual.html] Error 1 (ignored)
yacas: failed to stat /proc/self/exe, bailing out
make[1]: [Makefile:849: codingmanual.html] Error 1 (ignored)
yacas: failed to stat /proc/self/exe, bailing out
make[1]: [Makefile:852: essaysmanual.html] Error 1 (ignored)
yacas: failed to stat /proc/self/exe, bailing out
make[1]: [Makefile:855: refmanual.html] Error 1 (ignored)
yacas: failed to stat /proc/self/exe, bailing out
make[1]: [Makefile:858: refprogmanual.html] Error 1 (ignored)
yacas: failed to stat /proc/self/exe, bailing out
make[1]: [Makefile:861: Algomanual.html] Error 1 (ignored)
make[2]: Entering directory '/usr/src/RPM/BUILD/yacas-1.4.1/manmake'
 /bin/mkdir -p '/usr/src/tmp/yacas-buildroot/usr/bin'
 /usr/libexec/rpm-build/install -p ytxt2tex '/usr/src/tmp/yacas-buildroot/usr/bin'
echo '[DefaultDirectory("./"); Use("styleplain"); Use("indexmaker"); GenerateIndex();];' | ../src/yacas --rootdir ../scripts/:../scripts/ -fpc
yacas: failed to stat /proc/self/exe, bailing out
make[2]: [Makefile:843: books.html] Error 1 (ignored)
/bin/sh ../mkinstalldirs /usr/src/tmp/yacas-buildroot/usr/share/yacas/documentation//
/usr/libexec/rpm-build/install -p -m 644 ../docs/yacaslogo.png /usr/src/tmp/yacas-buildroot/usr/share/yacas/documentation//
for file in *.html; do \
   /usr/libexec/rpm-build/install -p -m 644 $file /usr/src/tmp/yacas-buildroot/usr/share/yacas/documentation//$file; \
done
/bin/install: cannot stat '*.html': No such file or directory
make[2]: [Makefile:878: install-html] Error 1 (ignored)
/bin/sh ../mkinstalldirs /usr/src/tmp/yacas-buildroot/usr/share/yacas/manmake/
mkdir -p -- /usr/src/tmp/yacas-buildroot/usr/share/yacas/manmake/
for file in book2TeX.sh book2TeX.ys txt2yacasdoc.pl; do \
   /usr/libexec/rpm-build/install -p -m 644 ./$file /usr/src/tmp/yacas-buildroot/usr/share/yacas/manmake/$file; \
done
/bin/sh ../mkinstalldirs /usr/src/tmp/yacas-buildroot/usr/share/yacas/documentation
/usr/libexec/rpm-build/install -p -m 644 hints /usr/src/tmp/yacas-buildroot/usr/share/yacas/documentation/hints
make[2]: Leaving directory '/usr/src/RPM/BUILD/yacas-1.4.1/manmake'
make[1]: Leaving directory '/usr/src/RPM/BUILD/yacas-1.4.1/manmake'
Making install in tests
make[1]: Entering directory '/usr/src/RPM/BUILD/yacas-1.4.1/tests'
make[2]: Entering directory '/usr/src/RPM/BUILD/yacas-1.4.1/tests'
make[2]: Nothing to be done for 'install-exec-am'.
make[2]: Nothing to be done for 'install-data-am'.
make[2]: Leaving directory '/usr/src/RPM/BUILD/yacas-1.4.1/tests'
make[1]: Leaving directory '/usr/src/RPM/BUILD/yacas-1.4.1/tests'
Making install in JavaYacas
make[1]: Entering directory '/usr/src/RPM/BUILD/yacas-1.4.1/JavaYacas'
make[2]: Entering directory '/usr/src/RPM/BUILD/yacas-1.4.1/JavaYacas'
make[2]: Nothing to be done for 'install-exec-am'.
make[2]: Nothing to be done for 'install-data-am'.
make[2]: Leaving directory '/usr/src/RPM/BUILD/yacas-1.4.1/JavaYacas'
make[1]: Leaving directory '/usr/src/RPM/BUILD/yacas-1.4.1/JavaYacas'
make: Leaving directory '/usr/src/RPM/BUILD/yacas-1.4.1'
+ rm -rf /usr/src/tmp/yacas-buildroot/usr/share/yacas/include
+ /usr/lib/rpm/brp-alt
Cleaning files in /usr/src/tmp/yacas-buildroot (auto)
removed './usr/lib64/libyacas.la'
mode of './usr/lib64/libyacas.so.14.0.1' changed from 0755 (rwxr-xr-x) to 0644 (rw-r--r--)
Verifying and fixing files in /usr/src/tmp/yacas-buildroot (binconfig,pkgconfig,libtool,desktop,gnuconfig)
Checking contents of files in /usr/src/tmp/yacas-buildroot/ (default)
Compressing files in /usr/src/tmp/yacas-buildroot (auto)
Adjusting library links in /usr/src/tmp/yacas-buildroot
./usr/lib64: (from <cmdline>:0)
	libyacas.so.14 -> libyacas.so.14.0.1
Verifying ELF objects in /usr/src/tmp/yacas-buildroot (arch=normal,fhs=normal,lfs=relaxed,lint=relaxed,rpath=normal,stack=normal,textrel=normal,unresolved=normal)
Splitting links to aliased files under /{,s}bin in /usr/src/tmp/yacas-buildroot
Processing files: yacas-1.4.1-alt1
Executing(%doc): /bin/sh -e /usr/src/tmp/rpm-tmp.53498
+ umask 022
+ /bin/mkdir -p /usr/src/RPM/BUILD
+ cd /usr/src/RPM/BUILD
+ cd yacas-1.4.1
+ DOCDIR=/usr/src/tmp/yacas-buildroot/usr/share/doc/yacas-1.4.1
+ export DOCDIR
+ rm -rf /usr/src/tmp/yacas-buildroot/usr/share/doc/yacas-1.4.1
+ /bin/mkdir -p /usr/src/tmp/yacas-buildroot/usr/share/doc/yacas-1.4.1
+ cp -prL AUTHORS NEWS README TODO /usr/src/tmp/yacas-buildroot/usr/share/doc/yacas-1.4.1
+ chmod -R go-w /usr/src/tmp/yacas-buildroot/usr/share/doc/yacas-1.4.1
+ chmod -R a+rX /usr/src/tmp/yacas-buildroot/usr/share/doc/yacas-1.4.1
+ cp -prL docs/about.html docs/articles.html docs/basicindex.html docs/consoledescr.html docs/consoleedit.html docs/consoleview.html docs/credits.html docs/downloads.html docs/faq.html docs/gpl.html docs/homepage.html docs/journaldescr.html docs/links.html docs/newdesign.html docs/newtonconvergence.html docs/placeholder.html docs/plain.html docs/range_control.html docs/recent.html docs/recentindex.html docs/tutorials.html docs/tutorialtext1.html docs/yacas.html docs/back-dark.gif docs/back.gif docs/stop.gif /usr/src/tmp/yacas-buildroot/usr/share/doc/yacas-1.4.1
+ chmod -R go-w /usr/src/tmp/yacas-buildroot/usr/share/doc/yacas-1.4.1
+ chmod -R a+rX /usr/src/tmp/yacas-buildroot/usr/share/doc/yacas-1.4.1
+ exit 0
Finding Provides (using /usr/lib/rpm/find-provides)
Executing: /bin/sh -e /usr/src/tmp/rpm-tmp.6ZrsZe
find-provides: running scripts (alternatives,debuginfo,lib,pam,perl,pkgconfig,python,python3,shell)
Finding Requires (using /usr/lib/rpm/find-requires)
Executing: /bin/sh -e /usr/src/tmp/rpm-tmp.EFilfa
find-requires: running scripts (cpp,debuginfo,files,lib,pam,perl,pkgconfig,pkgconfiglib,python,python3,rpmlib,shebang,shell,static,symlinks,systemd-services)
/usr/src/tmp/yacas-buildroot/usr/share/yacas/manmake/txt2yacasdoc.pl syntax OK
shebang.req.files: executable script /usr/src/tmp/yacas-buildroot/usr/share/yacas/manmake/book2TeX.sh is not executable
shebang.req.files: executable script /usr/src/tmp/yacas-buildroot/usr/share/yacas/manmake/txt2yacasdoc.pl is not executable
find-requires: FINDPACKAGE-COMMANDS: mv perl rm
Requires: /bin/sh, /lib64/ld-linux-x86-64.so.2, coreutils, libc.so.6(GLIBC_2.14)(64bit), libc.so.6(GLIBC_2.2.5)(64bit), libc.so.6(GLIBC_2.33)(64bit), libc.so.6(GLIBC_2.34)(64bit), libc.so.6(GLIBC_2.38)(64bit), libc.so.6(GLIBC_2.4)(64bit), libgcc_s.so.1(GCC_3.0)(64bit), libgcc_s.so.1(GCC_3.3.1)(64bit), libstdc++.so.6(CXXABI_1.3)(64bit), libstdc++.so.6(GLIBCXX_3.4)(64bit), libstdc++.so.6(GLIBCXX_3.4.11)(64bit), libstdc++.so.6(GLIBCXX_3.4.21)(64bit), libstdc++.so.6(GLIBCXX_3.4.32)(64bit), libstdc++.so.6(GLIBCXX_3.4.9)(64bit), libyacas.so.14()(64bit) >= set:nixim21Mi1sL9vIJOe8y5FxSaM902JHDIW3ASz1wOHreDcos564cr9eVFab8Rojjh, perl-base, rtld(GNU_HASH)
Requires(rpmlib): rpmlib(SetVersions)
Finding debuginfo files (using /usr/lib/rpm/find-debuginfo-files)
Executing: /bin/sh -e /usr/src/tmp/rpm-tmp.LR0Aoj
Creating yacas-debuginfo package
Processing files: libyacas-1.4.1-alt1
Finding Provides (using /usr/lib/rpm/find-provides)
Executing: /bin/sh -e /usr/src/tmp/rpm-tmp.g13zaS
find-provides: running scripts (alternatives,debuginfo,lib,pam,perl,pkgconfig,python,python3,shell)
lib.prov: /usr/src/tmp/yacas-buildroot/usr/lib64/libyacas.so.14: 831 symbols, 20 bpp
Finding Requires (using /usr/lib/rpm/find-requires)
Executing: /bin/sh -e /usr/src/tmp/rpm-tmp.jCdrGc
find-requires: running scripts (cpp,debuginfo,files,lib,pam,perl,pkgconfig,pkgconfiglib,python,python3,rpmlib,shebang,shell,static,symlinks,systemd-services)
Provides: libyacas.so.14()(64bit) = set:nd1kVcEcwZpLGlZtEeZrDUj2p4Y1NJTuIakSdB7GO1pLVGmjupoxAYrPTw2NIsZ9WxZp7TQyLu3hKXalw0y5PCWG98yJkTqKK7E4TrDC2cH4FoSbklKtZlk8Kb51KXdz3TfqZiOCfy3l6x18sufyis41zP1Ef5edBwQaNI41MdNMbmArscScgb9NsP2nKHWsJjRj5Zo4qearbTugCYul1OaoIV7s5rOpWLPkW4Z8YpyTabcf6hiU8bHZelsxHQCaoLZuAYjGuVLZ9PQwogFTX4a0gztmXZfD8RGLJIrlP1ZAtV6FacJlL7xulWnZ9zsHfQHLU5PveNjJMHhM3pxjiwwyVb6Ycb12VtwadxonwZASnzAMoQgHHsCyF81Knh2Zcivvr5bzGU8AvisZGBPbaXFdYgYpNFaRc46VIcUM41imgOElSgXZbCGAiIkEJovAHohFxmcGFvge2l2oZ2IQnea4FwNMfqxlYxhjLUeuCyvpK253hcTdJxblw1cfi3dilercvKFeIYEFB30RxW8U8k3Y6zGuyd8bU8TZ3cqJBPRZF9WYrE3odotNpw5lUPDQ4wt1fZBfujppfA7QZpeBU3liqBiAxZlDFNRhhqMJ8SvIq45oBZAXYboX13a4p0ZeWg4XsyG1UoI7uHEDZ3iaUo6yuRPCS1ERBUldsg2XFpi2Y9vim5Zu625uOdCRhItDHDkqtra1NzsYVSBeMY9Wn6RL5LyvMaE0ADQpz1AEwd8Z98qiftRmpo4S3Szx9r1L8Zic6rbDkjJKadFwItgzJehjmkcEqzy2uyYKUUZ4aLPCjPENQcRf2lNbXSZlzc1kqdyQIK0S0JwoOtMw8YFijmjOUWbIFbpPKlqkR07PVo9ebDrGPKxlN7pXDtcO34oeycTUHlHaFe6iB5PlkK1ThyYF1VuVEQL2uzhRjvt9UPeXsHnPdI518C7aZnzkJn0OzA6MSFE9c8682UJ9Vw5iuPXgZ9brZbih8omUCWpuOhiUVAwAXBjv2krKU0NAQ1EeAFQdGgVa67BfTS8h51vIVC8XkPhnhltViNmIRudngtMjNCr6jLHZoKnEGBRwBoYy9tZ8zKqMrVVj7SycZnIZ2WOvQDRvZBb3BixEicQ6zd13wELPMklZIn07xQzoU2sDwEh5nGo4YqGuZvULuXQQZqrJibtabdVZC5o1jV1CKEKptfUk5EsKwq0VI5nSWFLChSPmi8kYONalNaiYnfXihKLvZbI9RuBuZoXzGHaBR3o9tdiZlTGEDJZ2QVHwiICuDe5GE0J8TFZjXKuR5T3H8eAkAO38f7cOaZzbQNEf8wrmRW04XgmV5MuwV9EW0JCZyelE4bRZArJFZI4XWKOCCl2G8zANh7VA4Z0p3MDg11D7ZBKtu78q8gcm0YjusiqYnQ7qsXpykxtUfw1Dv01qtVUkY1tNWl3IQUU908NWKBmtjxKR93ZzikknlumBcdjKSvCTNz2lVnhbHdCLxhbj0v7m5XzeyhAJsbIdZ0VIM3nsq7sxw1e8KpdSoT7K19H4EZG1IZE9d9czCsIHOGq841olTeOJBZwsuBvMkFlIpQCWnlyc3ebXHSREIryOmOu14lb2Wsrv4E6kMktgKgBpBlYbic1946J5cywj28aWFrLU5AEEY5pjB5GLTD5
Requires: libc.so.6(GLIBC_2.14)(64bit), libc.so.6(GLIBC_2.2.5)(64bit), libc.so.6(GLIBC_2.3.4)(64bit), libc.so.6(GLIBC_2.38)(64bit), libc.so.6(GLIBC_2.4)(64bit), libgcc_s.so.1(GCC_3.0)(64bit), libgcc_s.so.1(GCC_3.3.1)(64bit), libm.so.6(GLIBC_2.2.5)(64bit), libm.so.6(GLIBC_2.29)(64bit), libstdc++.so.6(CXXABI_1.3)(64bit), libstdc++.so.6(CXXABI_1.3.5)(64bit), libstdc++.so.6(CXXABI_1.3.8)(64bit), libstdc++.so.6(GLIBCXX_3.4)(64bit), libstdc++.so.6(GLIBCXX_3.4.11)(64bit), libstdc++.so.6(GLIBCXX_3.4.18)(64bit), libstdc++.so.6(GLIBCXX_3.4.20)(64bit), libstdc++.so.6(GLIBCXX_3.4.21)(64bit), libstdc++.so.6(GLIBCXX_3.4.26)(64bit), libstdc++.so.6(GLIBCXX_3.4.29)(64bit), libstdc++.so.6(GLIBCXX_3.4.32)(64bit), libstdc++.so.6(GLIBCXX_3.4.9)(64bit), rtld(GNU_HASH)
Finding debuginfo files (using /usr/lib/rpm/find-debuginfo-files)
Executing: /bin/sh -e /usr/src/tmp/rpm-tmp.HNuUw6
Creating libyacas-debuginfo package
Processing files: libyacas-devel-1.4.1-alt1
Finding Provides (using /usr/lib/rpm/find-provides)
Executing: /bin/sh -e /usr/src/tmp/rpm-tmp.VaLZ2T
find-provides: running scripts (alternatives,debuginfo,lib,pam,perl,pkgconfig,python,python3,shell)
Finding Requires (using /usr/lib/rpm/find-requires)
Executing: /bin/sh -e /usr/src/tmp/rpm-tmp.mbB9l2
find-requires: running scripts (cpp,debuginfo,files,lib,pam,perl,pkgconfig,pkgconfiglib,python,python3,rpmlib,shebang,shell,static,symlinks,systemd-services)
/usr/src/tmp/yacas-buildroot/usr/include/yacas/core.h:31:10: fatal error: iterator: No such file or directory
   31 | #include <iterator>
      |          ^~~~~~~~~~
compilation terminated.
cpp.req: /usr/src/tmp/yacas-buildroot/usr/include/yacas/core.h: cpp failed, trying c++ mode
/usr/src/tmp/yacas-buildroot/usr/include/yacas/utf8.h:31:10: fatal error: utf8/checked.h: No such file or directory
   31 | #include "utf8/checked.h"
      |          ^~~~~~~~~~~~~~~~
compilation terminated.
cpp.req: WARNING: /usr/src/tmp/yacas-buildroot/usr/include/yacas/utf8.h: cpp failed
In file included from /usr/src/tmp/yacas-buildroot/usr/include/yacas/stringio.h:9,
                 from /usr/src/tmp/yacas-buildroot/usr/include/yacas/yacas.h:9:
/usr/src/tmp/yacas-buildroot/usr/include/yacas/utf8.h:31:10: fatal error: utf8/checked.h: No such file or directory
   31 | #include "utf8/checked.h"
      |          ^~~~~~~~~~~~~~~~
compilation terminated.
cpp.req: WARNING: /usr/src/tmp/yacas-buildroot/usr/include/yacas/yacas.h: cpp failed
In file included from /usr/src/tmp/yacas-buildroot/usr/include/yacas/stringio.h:9,
                 from /usr/src/tmp/yacas-buildroot/usr/include/yacas/lispenvironment.h:16,
                 from /usr/src/tmp/yacas-buildroot/usr/include/yacas/numbers.h:4:
/usr/src/tmp/yacas-buildroot/usr/include/yacas/utf8.h:31:10: fatal error: utf8/checked.h: No such file or directory
   31 | #include "utf8/checked.h"
      |          ^~~~~~~~~~~~~~~~
compilation terminated.
cpp.req: WARNING: /usr/src/tmp/yacas-buildroot/usr/include/yacas/numbers.h: cpp failed
In file included from /usr/src/tmp/yacas-buildroot/usr/include/yacas/stringio.h:9,
                 from /usr/src/tmp/yacas-buildroot/usr/include/yacas/lispenvironment.h:16,
                 from /usr/src/tmp/yacas-buildroot/usr/include/yacas/numbers.h:4,
                 from /usr/src/tmp/yacas-buildroot/usr/include/yacas/lispatom.h:27:
/usr/src/tmp/yacas-buildroot/usr/include/yacas/utf8.h:31:10: fatal error: utf8/checked.h: No such file or directory
   31 | #include "utf8/checked.h"
      |          ^~~~~~~~~~~~~~~~
compilation terminated.
cpp.req: WARNING: /usr/src/tmp/yacas-buildroot/usr/include/yacas/lispatom.h: cpp failed
In file included from /usr/src/tmp/yacas-buildroot/usr/include/yacas/stringio.h:9,
                 from /usr/src/tmp/yacas-buildroot/usr/include/yacas/lispenvironment.h:16,
                 from /usr/src/tmp/yacas-buildroot/usr/include/yacas/lispeval.h:11:
/usr/src/tmp/yacas-buildroot/usr/include/yacas/utf8.h:31:10: fatal error: utf8/checked.h: No such file or directory
   31 | #include "utf8/checked.h"
      |          ^~~~~~~~~~~~~~~~
compilation terminated.
cpp.req: WARNING: /usr/src/tmp/yacas-buildroot/usr/include/yacas/lispeval.h: cpp failed
In file included from /usr/src/tmp/yacas-buildroot/usr/include/yacas/stringio.h:9,
                 from /usr/src/tmp/yacas-buildroot/usr/include/yacas/lispenvironment.h:16,
                 from /usr/src/tmp/yacas-buildroot/usr/include/yacas/patterns.h:19:
/usr/src/tmp/yacas-buildroot/usr/include/yacas/utf8.h:31:10: fatal error: utf8/checked.h: No such file or directory
   31 | #include "utf8/checked.h"
      |          ^~~~~~~~~~~~~~~~
compilation terminated.
cpp.req: WARNING: /usr/src/tmp/yacas-buildroot/usr/include/yacas/patterns.h: cpp failed
In file included from /usr/src/tmp/yacas-buildroot/usr/include/yacas/stringio.h:9,
                 from /usr/src/tmp/yacas-buildroot/usr/include/yacas/lispenvironment.h:16,
                 from /usr/src/tmp/yacas-buildroot/usr/include/yacas/standard.h:6:
/usr/src/tmp/yacas-buildroot/usr/include/yacas/utf8.h:31:10: fatal error: utf8/checked.h: No such file or directory
   31 | #include "utf8/checked.h"
      |          ^~~~~~~~~~~~~~~~
compilation terminated.
cpp.req: WARNING: /usr/src/tmp/yacas-buildroot/usr/include/yacas/standard.h: cpp failed
In file included from /usr/src/tmp/yacas-buildroot/usr/include/yacas/stringio.h:9:
/usr/src/tmp/yacas-buildroot/usr/include/yacas/utf8.h:31:10: fatal error: utf8/checked.h: No such file or directory
   31 | #include "utf8/checked.h"
      |          ^~~~~~~~~~~~~~~~
compilation terminated.
cpp.req: WARNING: /usr/src/tmp/yacas-buildroot/usr/include/yacas/stringio.h: cpp failed
In file included from /usr/src/tmp/yacas-buildroot/usr/include/yacas/stringio.h:9,
                 from /usr/src/tmp/yacas-buildroot/usr/include/yacas/lispenvironment.h:16,
                 from /usr/src/tmp/yacas-buildroot/usr/include/yacas/stdfileio.h:10:
/usr/src/tmp/yacas-buildroot/usr/include/yacas/utf8.h:31:10: fatal error: utf8/checked.h: No such file or directory
   31 | #include "utf8/checked.h"
      |          ^~~~~~~~~~~~~~~~
compilation terminated.
cpp.req: WARNING: /usr/src/tmp/yacas-buildroot/usr/include/yacas/stdfileio.h: cpp failed
In file included from /usr/src/tmp/yacas-buildroot/usr/include/yacas/stringio.h:9,
                 from /usr/src/tmp/yacas-buildroot/usr/include/yacas/lispenvironment.h:16,
                 from /usr/src/tmp/yacas-buildroot/usr/include/yacas/substitute.h:6:
/usr/src/tmp/yacas-buildroot/usr/include/yacas/utf8.h:31:10: fatal error: utf8/checked.h: No such file or directory
   31 | #include "utf8/checked.h"
      |          ^~~~~~~~~~~~~~~~
compilation terminated.
cpp.req: WARNING: /usr/src/tmp/yacas-buildroot/usr/include/yacas/substitute.h: cpp failed
In file included from /usr/src/tmp/yacas-buildroot/usr/include/yacas/commandline.h:23:
/usr/src/tmp/yacas-buildroot/usr/include/yacas/utf8.h:31:10: fatal error: utf8/checked.h: No such file or directory
   31 | #include "utf8/checked.h"
      |          ^~~~~~~~~~~~~~~~
compilation terminated.
cpp.req: WARNING: /usr/src/tmp/yacas-buildroot/usr/include/yacas/commandline.h: cpp failed
In file included from /usr/src/tmp/yacas-buildroot/usr/include/yacas/stringio.h:9,
                 from /usr/src/tmp/yacas-buildroot/usr/include/yacas/lispenvironment.h:16,
                 from /usr/src/tmp/yacas-buildroot/usr/include/yacas/mathcommands.h:5:
/usr/src/tmp/yacas-buildroot/usr/include/yacas/utf8.h:31:10: fatal error: utf8/checked.h: No such file or directory
   31 | #include "utf8/checked.h"
      |          ^~~~~~~~~~~~~~~~
compilation terminated.
cpp.req: WARNING: /usr/src/tmp/yacas-buildroot/usr/include/yacas/mathcommands.h: cpp failed
In file included from /usr/src/tmp/yacas-buildroot/usr/include/yacas/stringio.h:9,
                 from /usr/src/tmp/yacas-buildroot/usr/include/yacas/lispenvironment.h:16,
                 from /usr/src/tmp/yacas-buildroot/usr/include/yacas/patterns.h:19,
                 from /usr/src/tmp/yacas-buildroot/usr/include/yacas/patternclass.h:7,
                 from /usr/src/tmp/yacas-buildroot/usr/include/yacas/mathuserfunc.h:6:
/usr/src/tmp/yacas-buildroot/usr/include/yacas/utf8.h:31:10: fatal error: utf8/checked.h: No such file or directory
   31 | #include "utf8/checked.h"
      |          ^~~~~~~~~~~~~~~~
compilation terminated.
cpp.req: WARNING: /usr/src/tmp/yacas-buildroot/usr/include/yacas/mathuserfunc.h: cpp failed
In file included from /usr/src/tmp/yacas-buildroot/usr/include/yacas/stringio.h:9,
                 from /usr/src/tmp/yacas-buildroot/usr/include/yacas/lispenvironment.h:16,
                 from /usr/src/tmp/yacas-buildroot/usr/include/yacas/patterns.h:19,
                 from /usr/src/tmp/yacas-buildroot/usr/include/yacas/patternclass.h:7:
/usr/src/tmp/yacas-buildroot/usr/include/yacas/utf8.h:31:10: fatal error: utf8/checked.h: No such file or directory
   31 | #include "utf8/checked.h"
      |          ^~~~~~~~~~~~~~~~
compilation terminated.
cpp.req: WARNING: /usr/src/tmp/yacas-buildroot/usr/include/yacas/patternclass.h: cpp failed
In file included from /usr/src/tmp/yacas-buildroot/usr/include/yacas/commandline.h:23,
                 from /usr/src/tmp/yacas-buildroot/usr/include/yacas/stdcommandline.h:4:
/usr/src/tmp/yacas-buildroot/usr/include/yacas/utf8.h:31:10: fatal error: utf8/checked.h: No such file or directory
   31 | #include "utf8/checked.h"
      |          ^~~~~~~~~~~~~~~~
compilation terminated.
cpp.req: WARNING: /usr/src/tmp/yacas-buildroot/usr/include/yacas/stdcommandline.h: cpp failed
In file included from /usr/src/tmp/yacas-buildroot/usr/include/yacas/stringio.h:9,
                 from /usr/src/tmp/yacas-buildroot/usr/include/yacas/lispenvironment.h:16:
/usr/src/tmp/yacas-buildroot/usr/include/yacas/utf8.h:31:10: fatal error: utf8/checked.h: No such file or directory
   31 | #include "utf8/checked.h"
      |          ^~~~~~~~~~~~~~~~
compilation terminated.
cpp.req: WARNING: /usr/src/tmp/yacas-buildroot/usr/include/yacas/lispenvironment.h: cpp failed
In file included from /usr/src/tmp/yacas-buildroot/usr/include/yacas/commandline.h:23,
                 from /usr/src/tmp/yacas-buildroot/usr/include/yacas/unixcommandline.h:4:
/usr/src/tmp/yacas-buildroot/usr/include/yacas/utf8.h:31:10: fatal error: utf8/checked.h: No such file or directory
   31 | #include "utf8/checked.h"
      |          ^~~~~~~~~~~~~~~~
compilation terminated.
cpp.req: WARNING: /usr/src/tmp/yacas-buildroot/usr/include/yacas/unixcommandline.h: cpp failed
In file included from /usr/src/tmp/yacas-buildroot/usr/include/yacas/stringio.h:9,
                 from /usr/src/tmp/yacas-buildroot/usr/include/yacas/lispenvironment.h:16,
                 from /usr/src/tmp/yacas-buildroot/usr/include/yacas/standard.h:6,
                 from /usr/src/tmp/yacas-buildroot/usr/include/yacas/associationclass.h:30:
/usr/src/tmp/yacas-buildroot/usr/include/yacas/utf8.h:31:10: fatal error: utf8/checked.h: No such file or directory
   31 | #include "utf8/checked.h"
      |          ^~~~~~~~~~~~~~~~
compilation terminated.
cpp.req: WARNING: /usr/src/tmp/yacas-buildroot/usr/include/yacas/associationclass.h: cpp failed
Requires: /usr/lib64/libyacas.so.14.0.1
Finding debuginfo files (using /usr/lib/rpm/find-debuginfo-files)
Executing: /bin/sh -e /usr/src/tmp/rpm-tmp.cQqfiN
Processing files: yacas-docs-1.4.1-alt1
Finding Provides (using /usr/lib/rpm/find-provides)
Executing: /bin/sh -e /usr/src/tmp/rpm-tmp.D2XlEf
find-provides: running scripts (alternatives,debuginfo,lib,pam,perl,pkgconfig,python,python3,shell)
Finding Requires (using /usr/lib/rpm/find-requires)
Executing: /bin/sh -e /usr/src/tmp/rpm-tmp.5snoDI
find-requires: running scripts (cpp,debuginfo,files,lib,pam,perl,pkgconfig,pkgconfiglib,python,python3,rpmlib,shebang,shell,static,symlinks,systemd-services)
Processing files: yacas-debuginfo-1.4.1-alt1
Finding Provides (using /usr/lib/rpm/find-provides)
Executing: /bin/sh -e /usr/src/tmp/rpm-tmp.bcZe1G
find-provides: running scripts (debuginfo)
Finding Requires (using /usr/lib/rpm/find-requires)
Executing: /bin/sh -e /usr/src/tmp/rpm-tmp.5FE1fK
find-requires: running scripts (debuginfo)
Requires: yacas = 1.4.1-alt1, /usr/lib/debug/lib64/ld-linux-x86-64.so.2.debug, debug64(libc.so.6), debug64(libgcc_s.so.1), debug64(libstdc++.so.6), debug64(libyacas.so.14)
Processing files: libyacas-debuginfo-1.4.1-alt1
Finding Provides (using /usr/lib/rpm/find-provides)
Executing: /bin/sh -e /usr/src/tmp/rpm-tmp.EVrrFY
find-provides: running scripts (debuginfo)
Finding Requires (using /usr/lib/rpm/find-requires)
Executing: /bin/sh -e /usr/src/tmp/rpm-tmp.eDrbGW
find-requires: running scripts (debuginfo)
Provides: debug64(libyacas.so.14)
Requires: libyacas = 1.4.1-alt1, debug64(libc.so.6), debug64(libgcc_s.so.1), debug64(libm.so.6), debug64(libstdc++.so.6)
Adding to yacas a strict dependency on libyacas
Adding to libyacas-devel a strict dependency on libyacas
Adding to yacas-debuginfo a strict dependency on libyacas-debuginfo
Removing from yacas-debuginfo 29 sources provided by libyacas-debuginfo
also prunning dir /usr/src/debug/yacas-1.4.1/include/yacas/utf8
Removing 2 extra deps from yacas due to dependency on libyacas
Removing 1 extra deps from libyacas-devel due to dependency on libyacas
Removing 1 extra deps from yacas-debuginfo due to dependency on libyacas-debuginfo
Removing 13 extra deps from yacas due to repentancy on libyacas
Removing 3 extra deps from yacas-debuginfo due to repentancy on libyacas-debuginfo
Wrote: /usr/src/RPM/RPMS/x86_64/yacas-1.4.1-alt1.x86_64.rpm (w2.lzdio)
Wrote: /usr/src/RPM/RPMS/x86_64/libyacas-1.4.1-alt1.x86_64.rpm (w2.lzdio)
Wrote: /usr/src/RPM/RPMS/x86_64/libyacas-devel-1.4.1-alt1.x86_64.rpm (w2.lzdio)
Wrote: /usr/src/RPM/RPMS/noarch/yacas-docs-1.4.1-alt1.noarch.rpm (w2.lzdio)
Wrote: /usr/src/RPM/RPMS/x86_64/yacas-debuginfo-1.4.1-alt1.x86_64.rpm (w2.lzdio)
Wrote: /usr/src/RPM/RPMS/x86_64/libyacas-debuginfo-1.4.1-alt1.x86_64.rpm (w2.lzdio)
61.10user 13.03system 0:53.16elapsed 139%CPU (0avgtext+0avgdata 150500maxresident)k
0inputs+0outputs (0major+3440353minor)pagefaults 0swaps
/.out/yacas-docs-1.4.1-alt1.noarch.rpm: The use of such a license name is ambiguous: GPL
/.out/yacas-1.4.1-alt1.x86_64.rpm: The use of such a license name is ambiguous: GPL
/.out/libyacas-1.4.1-alt1.x86_64.rpm: The use of such a license name is ambiguous: GPL
/.out/libyacas-devel-1.4.1-alt1.x86_64.rpm: The use of such a license name is ambiguous: GPL
/.out/yacas-debuginfo-1.4.1-alt1.x86_64.rpm: The use of such a license name is ambiguous: GPL
/.out/libyacas-debuginfo-1.4.1-alt1.x86_64.rpm: The use of such a license name is ambiguous: GPL
8.60user 4.59system 1:56.30elapsed 11%CPU (0avgtext+0avgdata 130568maxresident)k
0inputs+0outputs (0major+282208minor)pagefaults 0swaps
--- libyacas-1.4.1-alt1.x86_64.rpm.repo	2016-03-06 19:30:35.000000000 +0000
+++ libyacas-1.4.1-alt1.x86_64.rpm.hasher	2024-04-15 04:25:23.128990144 +0000
@@ -5,5 +5,8 @@
 Requires: libc.so.6(GLIBC_2.3.4)(64bit)  
+Requires: libc.so.6(GLIBC_2.38)(64bit)  
 Requires: libc.so.6(GLIBC_2.4)(64bit)  
 Requires: libgcc_s.so.1(GCC_3.0)(64bit)  
+Requires: libgcc_s.so.1(GCC_3.3.1)(64bit)  
 Requires: libm.so.6(GLIBC_2.2.5)(64bit)  
+Requires: libm.so.6(GLIBC_2.29)(64bit)  
 Requires: libstdc++.so.6(CXXABI_1.3)(64bit)  
@@ -16,2 +19,5 @@
 Requires: libstdc++.so.6(GLIBCXX_3.4.21)(64bit)  
+Requires: libstdc++.so.6(GLIBCXX_3.4.26)(64bit)  
+Requires: libstdc++.so.6(GLIBCXX_3.4.29)(64bit)  
+Requires: libstdc++.so.6(GLIBCXX_3.4.32)(64bit)  
 Requires: libstdc++.so.6(GLIBCXX_3.4.9)(64bit)  
@@ -19,6 +25,6 @@
 Requires: rpmlib(PayloadIsLzma)  
-Provides: libyacas.so.14()(64bit) = set:odtltbEcw9v6oBbCKiZgi9C6cbo5zrpSrKqZcepoxZjdNTCLN7D1AWxdradJsRkGByKi58oRWwtOd11yTb3J0kyXJjjcdoLM2RgVKMKLp0u4IjVMVojn61G04ayDdKG920VPoxrSU0q996sa6QJjRj5Zo4UCB97zBkZhjUOXYhZsAs2m7npZgjK6DHw8GHrahL9qZjJEwUzXJX4x6bYsZ5FlRFHUKseRdCMDTjH6FJDRV8TiPVZINVz5uzD6E1fA5kXfFh6wZlaWtwatgyMDaBZ5zAoGm70e2WeN7mICUgwZ7JKJq4cIopMBN0D7pHYCoOJCE31W4I76qNEtS4Yws4XKok29G6J2xbbcqCFLCshYbPBeWcc4Nsfku3XL0QR4GlVINSPKz8C8L0ozm717xqw8VPxtz5cHfAVtj7RupIt2WofumlihAUKWkYFQepDXIZwqZADiY1lysc5kpCRpqcmn81gCnQzfaB4lLe4NeD8knuHAdppsK1OD9uMWDfVj2ScDO24VdnfunqQkCONQn3cvyZl41YaZhsGcTosWUzm6B7EVZ3DLEyE08HAgY9Rk3YWqyCD3uIGh1fhqNDT98V4RoqCW7xGUBtrZGhC0aQ3QQ8faqxxA11f4Z2c0X5UfkIcgJJH1eCKkonl5vAJvSN8f0O9YRGlBkQ5Pd07MBIHzskWD8xGDZqb1yaKR0YzxP2i3hgi37pOSM34CmIBLIpisJeV89Mz3Vq09zagR0pD5WefbBFQdUR2WO2JRWSfDKYxW2WAZ8b5W2PoYDYqqpdo9CGEJPy6aw55gMBZEEziYeUnCJNaNKjMyZ7XV9HZi8kJtlri4QeGPQBGUi5h7jTW5EarfjrToaS5vhv7l1wqcBjpzIBsbSdOz2xynemFGC18A3HukyRllSGf4jAPgZeR7fxsHwz2lkwmAkQiWrE0frfw7qZaAF9kAlcrH9Hb0TIG57j91oPiHAkaD8a8elchchVuhuUWaig6r8F4al0I7kgCOgk8f8Z2dQBZo50Mk98EfQUioxz9RPMQ4WTjnZgmSNLCZEt2cfVK8LDbV6VCiV6wjfwXGQkW1uh8h1HAW4fYJzb10Kgql4LYLcuaZeoJbgaqlElYCu4IGbRo2Y1jBb8COraDMTho4AlZFI0yG51wY0GhkFq06Z2HUnAo2iwKdUlZ83AEZB3CM5aFpV4lag7ZfXIN3IzZK9vxnyABDV2qHiB3Lc03B8YIsdisB6t3x1foupC05oGr0rZxjVWl2MZ8ovNY7tSMoU7dvVFa3sEO8c0xPXhYrOPKZ9kOVFPuMjX1TQaXvgZ4Ho73EM7KKi2pZ9ZAwwpeSilprVKYH0gZsHEOVTpa1y7veIfgyYXXrdV4fs54n2u4ZDZ5pa4VkpmRXV4yvETZDykHZmifQNTSCdEpH656pJZKnJqwgWhXgMHxS534ou1CDyvzaEKOZip49xyiVAxPwwu0mqcwd3kjxQcZrkkSjVUiUPivrBDq62wViSyG79AiHtdCpS6mIN496I5G4D20Y8tD63ZEmowh4xivWT20Al2cwVhq0ZaQ11tcqqV00wEjkRjAjTZ39ZmpunGwZnw6ASFdDR54JZ9kA2mMH7e6wrcJiLIJOdOFL8R0ZKkZbxUsp6Y1kzsfXnjxPLwtZjn8gDMU8RyIqPBZ5g9V7VtWpcrq7pc0Nzjloubt5yBFp8hIkQwZdd4aYMq8yxsptPZ6oJ0j95G20lwo0cov4c9EfZcx16ensrLBx9rxDrosapfcpn2pg2WQA2O9RVB00QF2G8Q8PHsUURSgZ9pUYatXRzH8BoEys6wXsDd1S2y9OCGQ38YxKZkLRCtHgZjZ1PdRpMtmNOS2zAzEZcwWxkp6Il0p1OZwQd053cd2idz518C7aZnzkdH3mjwaDiDoge9p51VCy1FT1ZJa6P27xUpc2IZ21xUVjwqP570g58nNNkSUr69G88ibOiC2f5Sy6k7xMXFMewDqZ1tL51gXZ1n0BeUOPDeueaQ5SugXDmaD7h5v84BPXhvD1oo93L0RThrqMivZCDCSn7Kkjps6ZgjV1YdkGls4VSq3eZftQr0VcNS45f2Js01DxKULu6uiZbZlSAkZfz7pw987GHh4fn8hsSSbQVHwuRqlg3cyvrXlnY2pZrHJ39yTnYxYgoIE1Ow1uHNesoof00c7wD0NKVrKmZxjMF9FChOZFX9O6Ia0YJYnI7mx8q0g8XN9F1CoZr5SlE0vFmIo2QdbiJwUjYCSq0LQMNH3EJavYD0SHDczoXEhhyyWqmcRlumB9ZFvO89nXfPXW6FIISoZmoQyU3BCeyhAnkbI5KTknMGV2Z62GAUJySkzlc9qPvUfG1n4cq87d4UQHP6UwfD5v9iC9HY87BtjkSM0UdQShw2SJrE1V25MRTmwr7rCYb8ayAxngyyOnAdlSYKkvm
+Provides: libyacas.so.14()(64bit) = set:nd1kVcEcwZpLGlZtEeZrDUj2p4Y1NJTuIakSdB7GO1pLVGmjupoxAYrPTw2NIsZ9WxZp7TQyLu3hKXalw0y5PCWG98yJkTqKK7E4TrDC2cH4FoSbklKtZlk8Kb51KXdz3TfqZiOCfy3l6x18sufyis41zP1Ef5edBwQaNI41MdNMbmArscScgb9NsP2nKHWsJjRj5Zo4qearbTugCYul1OaoIV7s5rOpWLPkW4Z8YpyTabcf6hiU8bHZelsxHQCaoLZuAYjGuVLZ9PQwogFTX4a0gztmXZfD8RGLJIrlP1ZAtV6FacJlL7xulWnZ9zsHfQHLU5PveNjJMHhM3pxjiwwyVb6Ycb12VtwadxonwZASnzAMoQgHHsCyF81Knh2Zcivvr5bzGU8AvisZGBPbaXFdYgYpNFaRc46VIcUM41imgOElSgXZbCGAiIkEJovAHohFxmcGFvge2l2oZ2IQnea4FwNMfqxlYxhjLUeuCyvpK253hcTdJxblw1cfi3dilercvKFeIYEFB30RxW8U8k3Y6zGuyd8bU8TZ3cqJBPRZF9WYrE3odotNpw5lUPDQ4wt1fZBfujppfA7QZpeBU3liqBiAxZlDFNRhhqMJ8SvIq45oBZAXYboX13a4p0ZeWg4XsyG1UoI7uHEDZ3iaUo6yuRPCS1ERBUldsg2XFpi2Y9vim5Zu625uOdCRhItDHDkqtra1NzsYVSBeMY9Wn6RL5LyvMaE0ADQpz1AEwd8Z98qiftRmpo4S3Szx9r1L8Zic6rbDkjJKadFwItgzJehjmkcEqzy2uyYKUUZ4aLPCjPENQcRf2lNbXSZlzc1kqdyQIK0S0JwoOtMw8YFijmjOUWbIFbpPKlqkR07PVo9ebDrGPKxlN7pXDtcO34oeycTUHlHaFe6iB5PlkK1ThyYF1VuVEQL2uzhRjvt9UPeXsHnPdI518C7aZnzkJn0OzA6MSFE9c8682UJ9Vw5iuPXgZ9brZbih8omUCWpuOhiUVAwAXBjv2krKU0NAQ1EeAFQdGgVa67BfTS8h51vIVC8XkPhnhltViNmIRudngtMjNCr6jLHZoKnEGBRwBoYy9tZ8zKqMrVVj7SycZnIZ2WOvQDRvZBb3BixEicQ6zd13wELPMklZIn07xQzoU2sDwEh5nGo4YqGuZvULuXQQZqrJibtabdVZC5o1jV1CKEKptfUk5EsKwq0VI5nSWFLChSPmi8kYONalNaiYnfXihKLvZbI9RuBuZoXzGHaBR3o9tdiZlTGEDJZ2QVHwiICuDe5GE0J8TFZjXKuR5T3H8eAkAO38f7cOaZzbQNEf8wrmRW04XgmV5MuwV9EW0JCZyelE4bRZArJFZI4XWKOCCl2G8zANh7VA4Z0p3MDg11D7ZBKtu78q8gcm0YjusiqYnQ7qsXpykxtUfw1Dv01qtVUkY1tNWl3IQUU908NWKBmtjxKR93ZzikknlumBcdjKSvCTNz2lVnhbHdCLxhbj0v7m5XzeyhAJsbIdZ0VIM3nsq7sxw1e8KpdSoT7K19H4EZG1IZE9d9czCsIHOGq841olTeOJBZwsuBvMkFlIpQCWnlyc3ebXHSREIryOmOu14lb2Wsrv4E6kMktgKgBpBlYbic1946J5cywj28aWFrLU5AEEY5pjB5GLTD5
 Provides: libyacas = 1.4.1-alt1
 File: /usr/lib64/libyacas.so.14	120777	root:root		libyacas.so.14.0.1
-File: /usr/lib64/libyacas.so.14.0.1	100644	root:root	21fb3b0b82017a7199fc5d072f4bea23	
-RPMIdentity: 08137b5d2ee4e98aef7daff6c0b0796d8c68dfb8b96a0802c3a02397d9945aec6bf201bb16cf8bb487bf4cd46a84249810821bb9b1342d6a8495f435e2a80f66
+File: /usr/lib64/libyacas.so.14.0.1	100644	root:root	db39ee6d87070d7fa6d8eeeea6693822	
+RPMIdentity: 1babc40092de07b13fb0bb59d0bed76de15e542a6712e5428429972187062fb28fc687b31775b01bbd8714425ffad4396395f862cd9bb36ea6c9b7ec1db514bd
--- libyacas-debuginfo-1.4.1-alt1.x86_64.rpm.repo	2016-03-06 19:30:35.000000000 +0000
+++ libyacas-debuginfo-1.4.1-alt1.x86_64.rpm.hasher	2024-04-15 04:25:23.256991461 +0000
@@ -1,4 +1,4 @@
-/usr/lib/debug/.build-id/dd	40755	root:root	
-/usr/lib/debug/.build-id/dd/f1f8aaf0f0c2f731da7150e63b4734b9248264	120777	root:root	../../../../lib64/libyacas.so.14.0.1
-/usr/lib/debug/.build-id/dd/f1f8aaf0f0c2f731da7150e63b4734b9248264.debug	120777	root:root	../../usr/lib64/libyacas.so.14.0.1.debug
+/usr/lib/debug/.build-id/6c	40755	root:root	
+/usr/lib/debug/.build-id/6c/384d8bbac68913cd475c469150c91394e15b65	120777	root:root	../../../../lib64/libyacas.so.14.0.1
+/usr/lib/debug/.build-id/6c/384d8bbac68913cd475c469150c91394e15b65.debug	120777	root:root	../../usr/lib64/libyacas.so.14.0.1.debug
 /usr/lib/debug/usr/lib64/libyacas.so.14.0.1.debug	100644	root:root	
@@ -61,2 +61,3 @@
 /usr/src/debug/yacas-1.4.1/src/commandline.cpp	100644	root:root	
+/usr/src/debug/yacas-1.4.1/src/debugmem.cpp	100644	root:root	
 /usr/src/debug/yacas-1.4.1/src/deffile.cpp	100644	root:root	
@@ -94,2 +95,3 @@
 /usr/src/debug/yacas-1.4.1/src/yacasapi.cpp	100644	root:root	
+/usr/src/debug/yacas-1.4.1/src/yacasbase.cpp	100644	root:root	
 /usr/src/debug/yacas-1.4.1/src/yacasnumbers.cpp	100644	root:root	
@@ -103,6 +105,6 @@
 Provides: libyacas-debuginfo = 1.4.1-alt1
-File: /usr/lib/debug/.build-id/dd	40755	root:root		
-File: /usr/lib/debug/.build-id/dd/f1f8aaf0f0c2f731da7150e63b4734b9248264	120777	root:root		../../../../lib64/libyacas.so.14.0.1
-File: /usr/lib/debug/.build-id/dd/f1f8aaf0f0c2f731da7150e63b4734b9248264.debug	120777	root:root		../../usr/lib64/libyacas.so.14.0.1.debug
-File: /usr/lib/debug/usr/lib64/libyacas.so.14.0.1.debug	100644	root:root	f9f95db7718a41eb5ab48b1847e08de3	
+File: /usr/lib/debug/.build-id/6c	40755	root:root		
+File: /usr/lib/debug/.build-id/6c/384d8bbac68913cd475c469150c91394e15b65	120777	root:root		../../../../lib64/libyacas.so.14.0.1
+File: /usr/lib/debug/.build-id/6c/384d8bbac68913cd475c469150c91394e15b65.debug	120777	root:root		../../usr/lib64/libyacas.so.14.0.1.debug
+File: /usr/lib/debug/usr/lib64/libyacas.so.14.0.1.debug	100644	root:root	97e29f32fd0755ff343d401219973fd7	
 File: /usr/lib/debug/usr/lib64/libyacas.so.14.debug	120777	root:root		libyacas.so.14.0.1.debug
@@ -164,2 +166,3 @@
 File: /usr/src/debug/yacas-1.4.1/src/commandline.cpp	100644	root:root	d65228f14967e3895833208457d68030	
+File: /usr/src/debug/yacas-1.4.1/src/debugmem.cpp	100644	root:root	01bb9e72f913fd30ca6cb10dd3bc798a	
 File: /usr/src/debug/yacas-1.4.1/src/deffile.cpp	100644	root:root	ab3f4a736d011eb2e1e9ed1ce367777e	
@@ -197,3 +200,4 @@
 File: /usr/src/debug/yacas-1.4.1/src/yacasapi.cpp	100644	root:root	2053fc227d2a851bfb7b183fb50b79bc	
+File: /usr/src/debug/yacas-1.4.1/src/yacasbase.cpp	100644	root:root	e9d872004eaa4884aca486a9a79bc027	
 File: /usr/src/debug/yacas-1.4.1/src/yacasnumbers.cpp	100644	root:root	6649221b4ac04da3ff6f4f901cfeac2d	
-RPMIdentity: 6613c283f19fd98e6ae225c1fe1a17c185e0b287c63485c68cb73828a0d5c673c994d346ebe7b43e053b08191d1a57e70dd796e024b15d59c7c041d080072da6
+RPMIdentity: d3ea2c20f574c05ba64f2c1d314e1d7b23d5b38f157287220c650cc82ac90f7e9ce727851533b2a7669df1c8d225fe34fa490ce5316cfbac7b24cc7a25e497be
--- libyacas-devel-1.4.1-alt1.x86_64.rpm.repo	2016-03-06 19:30:35.000000000 +0000
+++ libyacas-devel-1.4.1-alt1.x86_64.rpm.hasher	2024-04-15 04:25:23.401992953 +0000
@@ -127,2 +127,2 @@
 File: /usr/lib64/libyacas.so	120777	root:root		libyacas.so.14.0.1
-RPMIdentity: cc30fc0cdcfa482e55b633f82e82cf2b5404fe48a495ac378c6e7ac446aaf65ef866adf81d56c57c798d6cc3905aafb2c756143362405ac0a9c0d723ee89d21d
+RPMIdentity: bc4eb0c67d92928bd492183c0620b8c9b9eecc1f624beb81ede7e0df02e69cc75a0269b15a8dbef6acba83f200f170a354173ce3a8fda0d2aa495bdde0957aad
--- yacas-1.4.1-alt1.x86_64.rpm.repo	2016-03-06 19:30:35.000000000 +0000
+++ yacas-1.4.1-alt1.x86_64.rpm.hasher	2024-04-15 04:25:23.550994486 +0000
@@ -299,2 +299,4 @@
 Requires: coreutils  
+Requires: libc.so.6(GLIBC_2.33)(64bit)  
+Requires: libc.so.6(GLIBC_2.34)(64bit)  
 Requires: perl-base  
@@ -303,3 +305,3 @@
 Provides: yacas = 1.4.1-alt1
-File: /usr/bin/yacas	100755	root:root	42d78705518be3f0899c26f89e98fc51	
+File: /usr/bin/yacas	100755	root:root	7da3f0ab5a4ee4d89ddf83e148e9a535	
 File: /usr/bin/ytxt2tex	100755	root:root	f393ba3940f947d655bb2f9a032eebaa	
@@ -599,2 +601,2 @@
 File: /usr/share/yacas/scripts/yacasinit.ys	100644	root:root	c6e853e314dbeded03cb8a807c8028ec	
-RPMIdentity: 37fb5a879e8093f50afefc632e7f48212904af37ccb5d1d1ec40cff8a7a79b3cef7b42063c9587bdfc6feeb35e858687dc39978156c8d4877b9689440fc45cf2
+RPMIdentity: d2e81c6b600d130e29f88a7a29b83d542464612919ba66555a79f9a9e0c1dcb35e0f4780e74ec60ddb72b1b021145a6bf4c0010b529a59ac049b1b535bf9a83b
--- yacas-debuginfo-1.4.1-alt1.x86_64.rpm.repo	2016-03-06 19:30:35.000000000 +0000
+++ yacas-debuginfo-1.4.1-alt1.x86_64.rpm.hasher	2024-04-15 04:25:23.674995761 +0000
@@ -1,4 +1,4 @@
-/usr/lib/debug/.build-id/d5	40755	root:root	
-/usr/lib/debug/.build-id/d5/a2d5b1f35739851386b877b3e27f4afcd453a5	120777	root:root	../../../../bin/yacas
-/usr/lib/debug/.build-id/d5/a2d5b1f35739851386b877b3e27f4afcd453a5.debug	120777	root:root	../../usr/bin/yacas.debug
+/usr/lib/debug/.build-id/b9	40755	root:root	
+/usr/lib/debug/.build-id/b9/d17937e451da240b4a67051df06836f8b62b98	120777	root:root	../../../../bin/yacas
+/usr/lib/debug/.build-id/b9/d17937e451da240b4a67051df06836f8b62b98.debug	120777	root:root	../../usr/bin/yacas.debug
 /usr/lib/debug/usr/bin/yacas.debug	100644	root:root	
@@ -18,6 +18,6 @@
 Provides: yacas-debuginfo = 1.4.1-alt1
-File: /usr/lib/debug/.build-id/d5	40755	root:root		
-File: /usr/lib/debug/.build-id/d5/a2d5b1f35739851386b877b3e27f4afcd453a5	120777	root:root		../../../../bin/yacas
-File: /usr/lib/debug/.build-id/d5/a2d5b1f35739851386b877b3e27f4afcd453a5.debug	120777	root:root		../../usr/bin/yacas.debug
-File: /usr/lib/debug/usr/bin/yacas.debug	100644	root:root	ea604d2e979f8346d1b5541666a3cc6d	
+File: /usr/lib/debug/.build-id/b9	40755	root:root		
+File: /usr/lib/debug/.build-id/b9/d17937e451da240b4a67051df06836f8b62b98	120777	root:root		../../../../bin/yacas
+File: /usr/lib/debug/.build-id/b9/d17937e451da240b4a67051df06836f8b62b98.debug	120777	root:root		../../usr/bin/yacas.debug
+File: /usr/lib/debug/usr/bin/yacas.debug	100644	root:root	d7d2110a7934a82c2fc3de997692b889	
 File: /usr/src/debug/yacas-1.4.1	40755	root:root		
@@ -31,2 +31,2 @@
 File: /usr/src/debug/yacas-1.4.1/src/yacasmain.cpp	100644	root:root	38bd9c2ba576363b96d945e12f5027fe	
-RPMIdentity: a196de26fda732925cfbd42602aeed8d51fee1aaa6e2d49c60cfa42ddb2fc610096e969b161a82f6814ef5f5322ef61c559f600f930d13e0aa2d0288a73916b6
+RPMIdentity: 0af1fc4c84c7834345f5e5e1be65f87f3438a5f6924f6c123768cd15fa05d32fc04a4748b33725b2190f246cbc94aa591cec5dc7e71d32b36bcc63f716ab1939
--- yacas-docs-1.4.1-alt1.noarch.rpm.repo	2016-03-06 19:30:44.000000000 +0000
+++ yacas-docs-1.4.1-alt1.noarch.rpm.hasher	2024-04-15 04:25:23.832997387 +0000
@@ -10,2 +10,2 @@
 File: /usr/share/yacas/documentation/yacaslogo.png	100644	root:root	5a0705c6c47dd87ea029ee56f5a1e749	
-RPMIdentity: a9ff10b32f0c5197b5c69f101178d22c77d4d2fcd478cd488459ea0a80daff999ff3a7df6a5f245ca94ef202dec4290aa64d147b41865779143a97b068339a63
+RPMIdentity: d09d0ce21b416b5c201c0d68b9e8eb6bb975633473aaa89bed60c4d1c7337bf705ded38410343f6bf66c613820a64964dbfb6c49b493c9254a1dd5b5f0a0e15c