<86>Mar 30 04:14:45 userdel[125297]: delete user 'rooter'
<86>Mar 30 04:14:45 userdel[125297]: removed group 'rooter' owned by 'rooter'
<86>Mar 30 04:14:45 userdel[125297]: removed shadow group 'rooter' owned by 'rooter'
<86>Mar 30 04:14:45 groupadd[125320]: group added to /etc/group: name=rooter, GID=1853
<86>Mar 30 04:14:45 groupadd[125320]: group added to /etc/gshadow: name=rooter
<86>Mar 30 04:14:45 groupadd[125320]: new group: name=rooter, GID=1853
<86>Mar 30 04:14:45 useradd[125353]: new user: name=rooter, UID=1853, GID=1853, home=/root, shell=/bin/bash, from=none
<86>Mar 30 04:14:45 userdel[125380]: delete user 'builder'
<86>Mar 30 04:14:45 userdel[125380]: removed group 'builder' owned by 'builder'
<86>Mar 30 04:14:45 userdel[125380]: removed shadow group 'builder' owned by 'builder'
<86>Mar 30 04:14:45 groupadd[125405]: group added to /etc/group: name=builder, GID=1854
<86>Mar 30 04:14:45 groupadd[125405]: group added to /etc/gshadow: name=builder
<86>Mar 30 04:14:45 groupadd[125405]: new group: name=builder, GID=1854
<86>Mar 30 04:14:45 useradd[125421]: new user: name=builder, UID=1854, GID=1854, home=/usr/src, shell=/bin/bash, from=none
warning: Macro %subst_enable_tests not found
<13>Mar 30 04:14:50 rpmi: libjpeg-2:3.0.2-alt2.1 sisyphus+340135.100.1.1 1707449145 installed
<13>Mar 30 04:14:50 rpmi: libpng16-1.6.42-alt2 sisyphus+339555.100.1.1 1706781682 installed
<13>Mar 30 04:14:50 rpmi: libusb-1.0.26-alt3 sisyphus+340691.100.3.1 1708466435 installed
<13>Mar 30 04:14:50 rpmi: libogg-1.3.5-alt1 sisyphus+278100.3400.1.1 1626058929 installed
<13>Mar 30 04:14:50 rpmi: libidn2-2.3.7-alt1 sisyphus+339505.100.1.2 1706718968 installed
<13>Mar 30 04:14:50 rpmi: libnettle8-3.9.1-alt1 sisyphus+322548.100.1.2 1686176879 installed
<13>Mar 30 04:14:50 rpmi: libexpat-2.5.0-alt1 sisyphus+309227.100.1.1 1667075764 installed
<13>Mar 30 04:14:50 rpmi: llvm-common-17.0.0-alt2 sisyphus+331010.100.1.1 1696503105 installed
<13>Mar 30 04:14:50 rpmi: libv4l-1.26.1-alt1 sisyphus+336403.100.1.1 1702467946 installed
<13>Mar 30 04:14:50 rpmi: vulkan-filesystem-1.3.277-alt1 sisyphus+342474.300.2.1 1710160423 installed
<13>Mar 30 04:14:50 rpmi: libvulkan1-1.3.277-alt1 sisyphus+342474.300.2.1 1710160423 installed
<13>Mar 30 04:14:50 rpmi: libwebp7-1.3.2-alt1 sisyphus+329541.100.1.1 1694676223 installed
<13>Mar 30 04:14:50 rpmi: desktop-file-utils-0.26-alt6 sisyphus+331944.100.1.3 1697550026 installed
<13>Mar 30 04:14:50 rpmi: libICE-1.1.1-alt1 sisyphus+311428.500.1.1 1670577555 installed
<13>Mar 30 04:14:50 rpmi: llvm17.0-filesystem-17.0.6-alt4 sisyphus+343670.1200.12.1 1711728023 installed
<13>Mar 30 04:14:50 rpmi: libp11-kit-1:0.25.3-alt2 sisyphus+336533.100.1.1 1702645560 installed
<13>Mar 30 04:14:50 rpmi: libtasn1-4.19.0-alt3 sisyphus+327816.100.1.1 1692802615 installed
<13>Mar 30 04:14:50 rpmi: clang17.0-support-17.0.6-alt4 sisyphus+343670.1200.12.1 1711728023 installed
<13>Mar 30 04:14:50 rpmi: llvm17.0-polly-17.0.6-alt4 sisyphus+343670.1200.12.1 1711728023 installed
<13>Mar 30 04:14:50 rpmi: libSM-1.2.4-alt1 sisyphus+312057.200.1.1 1671526916 installed
<13>Mar 30 04:14:50 rpmi: libhogweed6-3.9.1-alt1 sisyphus+322548.100.1.2 1686176879 installed
<13>Mar 30 04:14:50 rpmi: libgnutls30-3.8.4-alt1 sisyphus+343729.100.2.1 1711571288 installed
<13>Mar 30 04:14:50 rpmi: libngtcp2.16-1.4.0-alt1 sisyphus+343912.100.1.1 1711714683 installed
<13>Mar 30 04:14:50 rpmi: libngtcp2_crypto_gnutls8-1.4.0-alt1 sisyphus+343912.100.1.1 1711714683 installed
<13>Mar 30 04:14:50 rpmi: libflac12-1.4.3-alt2 sisyphus+343354.100.1.1 1711118098 installed
<13>Mar 30 04:14:50 rpmi: libvorbis-1.3.7-alt1 sisyphus+275738.100.1.1 1624751601 installed
<13>Mar 30 04:14:50 rpmi: wine-common-1:9.0.9-alt1 sisyphus+341758.100.1.1 1709300007 installed
<13>Mar 30 04:14:50 rpmi: ocl-icd-2.3.2-alt1 sisyphus+335648.100.1.1 1701640049 installed
<13>Mar 30 04:14:51 rpmi: vulkan-headers-1.3.277-alt1 sisyphus+342281.100.1.1 1709847574 installed
<13>Mar 30 04:14:51 rpmi: libunwind-1.7.0-alt2 sisyphus+335269.100.1.1 1701110934 installed
<13>Mar 30 04:14:51 rpmi: libspirv-tools0-1:2023.6-alt0.2.g0b027ba sisyphus+342474.100.2.1 1710160164 installed
<13>Mar 30 04:14:51 rpmi: libpcsclite-2.0.3-alt1 sisyphus+342053.100.1.1 1709635573 installed
<13>Mar 30 04:14:51 rpmi: libopus-1.5.1-alt1 sisyphus+342127.200.2.2 1709717988 installed
<13>Mar 30 04:14:51 rpmi: libmpg123-1:1.32.5-alt1 sisyphus+341064.100.1.1 1708350195 installed
<13>Mar 30 04:14:51 rpmi: libmpdec3-2.5.1-alt3 sisyphus+314490.500.5.1 1675432004 installed
<13>Mar 30 04:14:51 rpmi: liblame-3.100-alt1 sisyphus+276241.100.1.2 1624925657 installed
<13>Mar 30 04:14:51 rpmi: libieee1284-0.2.11-alt3 sisyphus+277204.100.1.1 1625414483 installed
<13>Mar 30 04:14:51 rpmi: libgsm-1.0.17-alt1 sisyphus+275359.100.2.1 1624907612 installed
<13>Mar 30 04:14:51 rpmi: libsndfile-1.1.0-alt1 sisyphus+339776.7300.6.2 1707350065 installed
<13>Mar 30 04:14:51 rpmi: libltdl7-2.4.7-alt5 sisyphus+341963.200.3.1 1711659208 installed
<13>Mar 30 04:14:51 rpmi: liblockdev-1.0.3-alt3.2 sisyphus+335067.10100.2.2 1701153968 installed
<13>Mar 30 04:14:51 rpmi: libgphoto2_port-12-2.5.31-alt1 sisyphus+328593.100.1.1 1693665711 installed
<13>Mar 30 04:14:51 rpmi: libgdbm-1.8.3-alt10 sisyphus+278100.1600.1.1 1626058413 installed
<13>Mar 30 04:14:51 rpmi: libnuma-2.0.14-alt2 sisyphus+278485.100.1.1 1626104244 installed
<13>Mar 30 04:14:51 rpmi: libx265-199-3.5-alt1.1 sisyphus+277560.100.1.1 1625697230 installed
<13>Mar 30 04:14:51 rpmi: shared-mime-info-2.4-alt1 sisyphus+334259.100.1.1 1699787316 installed
<13>Mar 30 04:14:51 rpmi: libgdk-pixbuf-locales-2.42.10-alt1 sisyphus+308991.100.1.1 1666721198 installed
<13>Mar 30 04:14:51 rpmi: libgraphite2-1.3.14-alt2.1 sisyphus+279571.100.1.2 1626605111 installed
<13>Mar 30 04:14:51 rpmi: libexif-0.6.24-alt1 sisyphus+294799.100.1.1 1644087329 installed
<13>Mar 30 04:14:51 rpmi: libdeflate-1.20-alt1 sisyphus+343488.100.1.1 1711323991 installed
<13>Mar 30 04:14:51 rpmi: libtiff5-4.4.0-alt4 sisyphus+322581.100.1.2 1686180089 installed
<13>Mar 30 04:14:51 rpmi: libde265-1.0.15-alt1 sisyphus+337190.100.1.1 1703502096 installed
<13>Mar 30 04:14:51 rpmi: publicsuffix-list-dafsa-20240130-alt1 sisyphus+339506.100.1.1 1706719111 installed
<13>Mar 30 04:14:51 rpmi: libpsl-0.21.5-alt1 sisyphus+338474.100.1.1 1705684769 installed
<13>Mar 30 04:14:51 rpmi: libnghttp3.9-1.2.0-alt1 sisyphus+343912.200.1.1 1711714725 installed
<13>Mar 30 04:14:51 rpmi: libnghttp2-1.60.0-alt1 sisyphus+343907.100.1.1 1711710687 installed
<13>Mar 30 04:14:51 rpmi: openldap-common-2.6.7-alt1 sisyphus+343335.200.1.1 1711113916 installed
<13>Mar 30 04:14:51 rpmi: libntlm-1.5-alt1 sisyphus+278100.3300.1.1 1626058899 installed
<13>Mar 30 04:14:51 rpmi: libidn-1.37-alt2 sisyphus+300849.100.1.1 1653769687 installed
<13>Mar 30 04:14:51 rpmi: libverto-0.3.2-alt1_1 sisyphus+321176.2200.10.2 1684803947 installed
<13>Mar 30 04:14:51 rpmi: liblmdb-0.9.32-alt1 sisyphus+342426.100.1.1 1710124288 installed
<13>Mar 30 04:14:51 rpmi: libkeyutils-1.6.3-alt1 sisyphus+266061.100.1.1 1612919566 installed
<13>Mar 30 04:14:51 rpmi: libcom_err-1.46.4.0.5.4cda-alt1 sisyphus+283826.100.1.1 1629975345 installed
<13>Mar 30 04:14:51 rpmi: libbrotlicommon-1.1.0-alt1 sisyphus+328501.100.1.1 1693598419 installed
<13>Mar 30 04:14:51 rpmi: libbrotlidec-1.1.0-alt1 sisyphus+328501.100.1.1 1693598419 installed
<13>Mar 30 04:14:51 rpmi: libharfbuzz-8.3.1-alt1 sisyphus+342941.100.1.1 1710698679 installed
<13>Mar 30 04:14:51 rpmi: libfreetype-2.13.2-alt1 sisyphus+328677.100.1.1 1693834345 installed
<13>Mar 30 04:14:51 rpmi: libfontconfig1-2.14.2-alt8 sisyphus+328444.100.1.1 1693553402 installed
<13>Mar 30 04:14:51 rpmi: libb2-0.98.1-alt1_1 sisyphus+291614.100.1.1 1638962877 installed
<13>Mar 30 04:14:51 rpmi: liblz4-1:1.9.4-alt1 sisyphus+309416.100.1.1 1667412981 installed
<13>Mar 30 04:14:51 rpmi: libsystemd-1:254.10-alt1 sisyphus+343748.100.3.1 1711611773 installed
<13>Mar 30 04:14:51 rpmi: libdbus-1.14.10-alt1 sisyphus+327286.5700.14.1 1711487401 installed
<13>Mar 30 04:14:51 rpmi: libavahi-0.8-alt3 sisyphus+342997.200.2.2 1710863062 installed
<13>Mar 30 04:14:51 rpmi: libpcap0.8-2:1.10.4-alt1 sisyphus+322910.100.5.1 1687282815 installed
<13>Mar 30 04:14:51 rpmi: libasyncns-0.8-alt2.qa1 sisyphus+275091.100.1.1 1624402241 installed
<13>Mar 30 04:14:51 rpmi: libaom3-3.5.0-alt2 sisyphus+335780.100.1.1 1701761281 installed
<13>Mar 30 04:14:51 rpmi: libSDL2-2.30.1-alt1 sisyphus+342186.100.1.2 1709739783 installed
<13>Mar 30 04:14:51 rpmi: libglvnd-7:1.7.0-alt1 sisyphus+330949.100.1.1 1696424893 installed
<13>Mar 30 04:14:51 rpmi: libxshmfence-1.3.2-alt1 sisyphus+311428.400.1.1 1670577525 installed
<13>Mar 30 04:14:51 rpmi: libpciaccess-1:0.18.1-alt1 sisyphus+343583.300.1.1 1711440789 installed
<13>Mar 30 04:14:51 rpmi: libdrm-1:2.4.120-alt1 sisyphus+338137.100.1.2 1705653179 installed
<13>Mar 30 04:14:51 rpmi: libX11-locales-3:1.8.8-alt1 sisyphus+343583.100.1.1 1711440719 installed
<13>Mar 30 04:14:51 rpmi: libXdmcp-1.1.5-alt1 sisyphus+343583.700.1.1 1711441061 installed
<13>Mar 30 04:14:51 rpmi: libXau-1.0.11-alt1 sisyphus+311428.100.1.1 1670577439 installed
<13>Mar 30 04:14:51 rpmi: libxcb-1.16.1-alt1 sisyphus+343583.500.1.1 1711440979 installed
<13>Mar 30 04:14:51 rpmi: libX11-3:1.8.8-alt1 sisyphus+343583.100.1.1 1711440719 installed
<13>Mar 30 04:14:51 rpmi: libXext-1.3.6-alt1 sisyphus+343583.1000.1.1 1711441101 installed
<13>Mar 30 04:14:51 rpmi: libXfixes-6.0.1-alt1 sisyphus+331490.300.1.1 1697023233 installed
<13>Mar 30 04:14:51 rpmi: libXrender-0.9.11-alt1 sisyphus+308841.100.1.1 1666436130 installed
<13>Mar 30 04:14:51 rpmi: libXxf86vm-1.1.5-alt1 sisyphus+308663.1400.1.1 1666168523 installed
<13>Mar 30 04:14:52 rpmi: libGLX-mesa-4:24.0.4-alt1 sisyphus+343891.100.1.1 1711699833 installed
<13>Mar 30 04:14:52 rpmi: libGLX-7:1.7.0-alt1 sisyphus+330949.100.1.1 1696424893 installed
<13>Mar 30 04:14:52 rpmi: libGL-7:1.7.0-alt1 sisyphus+330949.100.1.1 1696424893 installed
<13>Mar 30 04:14:52 rpmi: libXcursor-1.2.2-alt1 sisyphus+343583.600.1.1 1711441025 installed
<13>Mar 30 04:14:52 rpmi: libXrandr-1.5.4-alt1 sisyphus+330992.100.1.1 1696485400 installed
<13>Mar 30 04:14:52 rpmi: libXi-1.8-alt1 sisyphus+285490.200.1.1 1632124174 installed
<13>Mar 30 04:14:52 rpmi: libXinerama-1.1.5-alt1 sisyphus+309287.100.1.1 1667213208 installed
<13>Mar 30 04:14:52 rpmi: libXcomposite-0.4.6-alt1 sisyphus+311188.200.1.1 1670233682 installed
<13>Mar 30 04:14:52 rpmi: libXt-1.3.0-alt1 sisyphus+331490.500.1.1 1697023310 installed
<13>Mar 30 04:14:52 rpmi: libXpm-3.5.17-alt1 sisyphus+330921.100.1.1 1696400257 installed
<13>Mar 30 04:14:52 rpmi: libpulseaudio-17.0-alt2 sisyphus+339257.100.1.1 1706519226 installed
<13>Mar 30 04:14:52 rpmi: gsettings-desktop-schemas-data-46.0-alt1 sisyphus+343025.100.4.2 1710847127 installed
<13>Mar 30 04:14:52 rpmi: libgio-2.80.0-alt2.1 sisyphus+343856.100.1.1 1711642821 installed
<13>Mar 30 04:14:52 rpmi: gsettings-desktop-schemas-46.0-alt1 sisyphus+343025.100.4.2 1710847127 installed
<13>Mar 30 04:14:52 rpmi: libgdk-pixbuf-2.42.10-alt1 sisyphus+308991.100.1.1 1666721198 installed
<13>Mar 30 04:14:52 rpmi: libheif-1.17.6-alt1 sisyphus+337190.200.1.1 1703502141 installed
<13>Mar 30 04:14:52 rpmi: libgd3-2.3.3-alt2 sisyphus+335387.100.1.1 1701278641 installed
<13>Mar 30 04:14:52 rpmi: gcc-c++-common-1.4.27-alt1 sisyphus+278099.1300.1.1 1626028636 installed
<13>Mar 30 04:14:52 rpmi: libstdc++13-devel-13.2.1-alt3 sisyphus+339335.100.1.1 1706563486 installed
<13>Mar 30 04:14:53 rpmi: gcc13-c++-13.2.1-alt3 sisyphus+339335.100.1.1 1706563486 installed
<13>Mar 30 04:14:53 rpmi: gcc-c++-13-alt1 sisyphus+323337.300.1.1 1687267966 installed
<13>Mar 30 04:14:53 rpmi: libstdc++-devel-13-alt1 sisyphus+323337.300.1.1 1687267966 installed
<13>Mar 30 04:14:53 rpmi: libdevmapper-1.02.196-alt1 sisyphus+328928.400.3.1 1694103931 installed
<13>Mar 30 04:14:53 rpmi: mount-2.39.2-alt1 sisyphus+327286.4500.14.1 1711486324 installed
<13>Mar 30 04:14:53 rpmi: losetup-2.39.2-alt1 sisyphus+327286.4500.14.1 1711486324 installed
<13>Mar 30 04:14:53 rpmi: lsblk-2.39.2-alt1 sisyphus+327286.4500.14.1 1711486324 installed
<13>Mar 30 04:14:53 rpmi: libedit3-3.1.20230828-alt1 sisyphus+330914.200.3.1 1696922743 installed
<13>Mar 30 04:14:53 rpmi: llvm17.0-gold-17.0.6-alt4 sisyphus+343670.1200.12.1 1711728023 installed
<13>Mar 30 04:14:54 rpmi: llvm17.0-libs-17.0.6-alt4 sisyphus+343670.1200.12.1 1711728023 installed
<13>Mar 30 04:14:55 rpmi: libclang-cpp17-17.0.6-alt4 sisyphus+343670.1200.12.1 1711728023 installed
<13>Mar 30 04:14:55 rpmi: clang17.0-17.0.6-alt4 sisyphus+343670.1200.12.1 1711728023 installed
<13>Mar 30 04:14:55 rpmi: clang-17.0.0-alt2 sisyphus+331010.100.1.1 1696503105 installed
<13>Mar 30 04:14:55 rpmi: libOSMesa-4:24.0.4-alt1 sisyphus+343891.100.1.1 1711699833 installed
<13>Mar 30 04:14:55 rpmi: lld17.0-17.0.6-alt4 sisyphus+343670.1200.12.1 1711728023 installed
<13>Mar 30 04:14:55 rpmi: lld-17.0.0-alt2 sisyphus+331010.100.1.1 1696503105 installed
<13>Mar 30 04:14:55 rpmi: rpm-macros-alternatives-0.5.2-alt2 sisyphus+315270.200.2.1 1676457367 installed
<13>Mar 30 04:14:55 rpmi: alternatives-0.5.2-alt2 sisyphus+315270.200.2.1 1676457367 installed
<13>Mar 30 04:14:55 rpmi: ca-certificates-2024.02.24-alt1 sisyphus+341362.100.1.1 1708791001 installed
<13>Mar 30 04:14:55 rpmi: ca-trust-0.1.5-alt1 sisyphus+340049.100.1.1 1707326464 installed
<13>Mar 30 04:14:55 rpmi: p11-kit-trust-1:0.25.3-alt2 sisyphus+336533.100.1.1 1702645560 installed
<13>Mar 30 04:14:55 rpmi: libcrypto3-3.1.5-alt1 sisyphus+339669.100.1.1 1706908440 installed
<13>Mar 30 04:14:55 rpmi: libssl3-3.1.5-alt1 sisyphus+339669.100.1.1 1706908440 installed
<13>Mar 30 04:14:55 rpmi: python3-3.12.2-alt1 sisyphus+341702.200.1.1 1709232871 installed
<13>Mar 30 04:14:56 rpmi: python3-base-3.12.2-alt1 sisyphus+341702.200.1.1 1709232871 installed
<86>Mar 30 04:14:56 groupadd[146737]: group added to /etc/group: name=_keytab, GID=999
<86>Mar 30 04:14:56 groupadd[146737]: group added to /etc/gshadow: name=_keytab
<86>Mar 30 04:14:56 groupadd[146737]: new group: name=_keytab, GID=999
<13>Mar 30 04:14:56 rpmi: libkrb5-1.21.2-alt2 sisyphus+338902.100.2.1 1706700934 installed
<13>Mar 30 04:14:56 rpmi: libkmod-31-alt1 sisyphus+330699.100.1.1 1696072422 installed
<13>Mar 30 04:14:56 rpmi: kmod-31-alt1 sisyphus+330699.100.1.1 1696072422 installed
<13>Mar 30 04:14:56 rpmi: dmsetup-1.02.196-alt1 sisyphus+328928.400.3.1 1694103931 installed
<86>Mar 30 04:14:56 groupadd[146816]: group added to /etc/group: name=tape, GID=998
<86>Mar 30 04:14:56 groupadd[146816]: group added to /etc/gshadow: name=tape
<86>Mar 30 04:14:56 groupadd[146816]: new group: name=tape, GID=998
<86>Mar 30 04:14:56 groupadd[146826]: group added to /etc/group: name=dialout, GID=997
<86>Mar 30 04:14:56 groupadd[146826]: group added to /etc/gshadow: name=dialout
<86>Mar 30 04:14:56 groupadd[146826]: new group: name=dialout, GID=997
<86>Mar 30 04:14:56 groupadd[146843]: group added to /etc/group: name=input, GID=996
<86>Mar 30 04:14:56 groupadd[146843]: group added to /etc/gshadow: name=input
<86>Mar 30 04:14:56 groupadd[146843]: new group: name=input, GID=996
<86>Mar 30 04:14:56 groupadd[146864]: group added to /etc/group: name=video, GID=995
<86>Mar 30 04:14:56 groupadd[146864]: group added to /etc/gshadow: name=video
<86>Mar 30 04:14:56 groupadd[146864]: new group: name=video, GID=995
<86>Mar 30 04:14:56 groupadd[146880]: group added to /etc/group: name=render, GID=994
<86>Mar 30 04:14:56 groupadd[146880]: group added to /etc/gshadow: name=render
<86>Mar 30 04:14:56 groupadd[146880]: new group: name=render, GID=994
<86>Mar 30 04:14:56 groupadd[146897]: group added to /etc/group: name=sgx, GID=993
<86>Mar 30 04:14:56 groupadd[146897]: group added to /etc/gshadow: name=sgx
<86>Mar 30 04:14:56 groupadd[146897]: new group: name=sgx, GID=993
<13>Mar 30 04:14:56 rpmi: udev-1:254.10-alt1 sisyphus+343748.100.3.1 1711611773 installed
<13>Mar 30 04:14:56 rpmi: libcups-2.4.7-alt2 sisyphus+333092.100.1.1 1698654160 installed
<13>Mar 30 04:14:56 rpmi: libgsasl-2.2.0-alt1 sisyphus+333173.100.1.1 1698696954 installed
<86>Mar 30 04:14:56 groupadd[147151]: group added to /etc/group: name=sasl, GID=992
<86>Mar 30 04:14:56 groupadd[147151]: group added to /etc/gshadow: name=sasl
<86>Mar 30 04:14:56 groupadd[147151]: new group: name=sasl, GID=992
<13>Mar 30 04:14:56 rpmi: libsasl2-3-2.1.28-alt2 sisyphus+343335.100.1.1 1711112544 installed
<13>Mar 30 04:14:56 rpmi: libldap2-2.6.7-alt1 sisyphus+343335.200.1.1 1711113916 installed
<13>Mar 30 04:14:56 rpmi: python3-module-markupsafe-1:2.1.5-alt1 sisyphus+339663.100.1.1 1706899589 installed
<13>Mar 30 04:14:56 rpmi: python3-module-jinja2-3.1.3-alt1 sisyphus+338371.3500.8.1 1706006785 installed
<13>Mar 30 04:14:56 rpmi: python3-module-railroad-diagrams-1.1.1-alt1 sisyphus+294587.100.1.1 1643813088 installed
<13>Mar 30 04:14:56 rpmi: python3-module-pyparsing-3.1.2-alt1 sisyphus+342155.100.2.1 1709806916 installed
<13>Mar 30 04:14:56 rpmi: vulkan-registry-1.3.277-alt1 sisyphus+342281.100.1.1 1709847574 installed
<13>Mar 30 04:14:58 rpmi: llvm17.0-17.0.6-alt4 sisyphus+343670.1200.12.1 1711728023 installed
<13>Mar 30 04:14:58 rpmi: llvm-17.0.0-alt2 sisyphus+331010.100.1.1 1696503105 installed
<13>Mar 30 04:14:58 rpmi: libnet-snmp40-5.9.4-alt1 sisyphus+333513.4600.71.1 1704536569 installed
<86>Mar 30 04:14:58 groupadd[149263]: group added to /etc/group: name=scanner, GID=991
<86>Mar 30 04:14:58 groupadd[149263]: group added to /etc/gshadow: name=scanner
<86>Mar 30 04:14:58 groupadd[149263]: new group: name=scanner, GID=991
<13>Mar 30 04:14:58 rpmi: libsane-1.2.1-alt2 sisyphus+330359.40.2.1 1695717290 installed
<13>Mar 30 04:14:58 rpmi: libssh2-1.11.0-alt2 sisyphus+339356.100.1.1 1706593137 installed
<13>Mar 30 04:14:58 rpmi: libcurl-8.7.1-alt1 sisyphus+343696.100.2.2 1711555843 installed
<86>Mar 30 04:14:58 groupadd[149431]: group added to /etc/group: name=camera, GID=990
<86>Mar 30 04:14:58 groupadd[149431]: group added to /etc/gshadow: name=camera
<86>Mar 30 04:14:58 groupadd[149431]: new group: name=camera, GID=990
<13>Mar 30 04:14:58 rpmi: libgphoto2-6-2.5.31-alt1 sisyphus+328593.100.1.1 1693665711 installed
<13>Mar 30 04:14:58 rpmi: alsa-ucm-conf-1.2.10-alt2 sisyphus+337619.100.1.1 1704220124 installed
<13>Mar 30 04:14:58 rpmi: alsa-topology-conf-1.2.5.1-alt1 sisyphus+274777.100.1.1 1624089141 installed
<13>Mar 30 04:14:58 rpmi: libalsa-1:1.2.10-alt2 sisyphus+337619.200.1.1 1704220185 installed
<13>Mar 30 04:15:00 rpmi: wine-1:9.0.9-alt1 sisyphus+341758.100.1.1 1709300007 installed
<13>Mar 30 04:15:01 rpmi: wine-devel-1:9.0.9-alt1 sisyphus+341758.100.1.1 1709300007 installed
<13>Mar 30 04:15:01 rpmi: wine-devel-tools-1:9.0.9-alt1 sisyphus+341758.100.1.1 1709300007 installed
<13>Mar 30 04:15:01 rpmi: libvulkan-devel-1.3.277-alt1 sisyphus+342474.300.2.1 1710160423 installed
<13>Mar 30 04:15:01 rpmi: libspirv-tools-devel-1:2023.6-alt0.2.g0b027ba sisyphus+342474.100.2.1 1710160164 installed
<13>Mar 30 04:15:01 rpmi: spirv-headers-2:1.5.5-alt12.gb73e168 sisyphus+342376.300.3.1 1709982982 installed
<13>Mar 30 04:15:01 rpmi: flex-2.6.4.0.88.9801-alt2 sisyphus+283727.100.1.1 1629851973 installed
warning: Macro %subst_enable_tests not found
Building target platforms: x86_64
Building for target x86_64
Wrote: /usr/src/in/nosrpm/vkd3d-1.11-alt1.nosrc.rpm (w1.gzdio)
warning: Macro %subst_enable_tests not found
Installing vkd3d-1.11-alt1.src.rpm
Building target platforms: x86_64
Building for target x86_64
Executing(%prep): /bin/sh -e /usr/src/tmp/rpm-tmp.19116
+ umask 022
+ /bin/mkdir -p /usr/src/RPM/BUILD
+ cd /usr/src/RPM/BUILD
+ cd /usr/src/RPM/BUILD
+ rm -rf vkd3d-1.11
+ echo 'Source #0 (vkd3d-1.11.tar):'
Source #0 (vkd3d-1.11.tar):
+ /bin/tar -xf /usr/src/RPM/SOURCES/vkd3d-1.11.tar
+ cd vkd3d-1.11
+ /bin/chmod -c -Rf u+rwX,go-w .
+ echo 'Patch #0 (vkd3d-1.11-alt1.patch):'
Patch #0 (vkd3d-1.11-alt1.patch):
+ /usr/bin/patch -p1
patching file .gear/rules
patching file .gear/tags/07ba86d6c324833334952a0770b88c9293c64f85
patching file .gear/tags/28c40f8e7f7433e3df157a389f8f50aeb19ea1f6
patching file .gear/tags/8f40fd9e22fe38f2cf37609a1a4b3da8f2ca2f57
patching file .gear/tags/b30a44682e8842845fc112578789679ee5a7422d
patching file .gear/tags/list
patching file .gear/vkd3d.spec
+ autoreconf -fisv
autoreconf-default: export WARNINGS=
autoreconf-default: Entering directory '.'
autoreconf-default: configure.ac: not using Gettext
autoreconf-default: running: aclocal --force -I m4
autoreconf-default: configure.ac: tracing
autoreconf-default: running: libtoolize --force --install
libtoolize-default: putting auxiliary files in AC_CONFIG_AUX_DIR, 'bin'.
libtoolize-default: linking file 'bin/config.guess'
libtoolize-default: linking file 'bin/config.sub'
libtoolize-default: linking file 'bin/install-sh'
libtoolize-default: linking file 'bin/ltmain.sh'
libtoolize-default: putting macros in AC_CONFIG_MACRO_DIRS, 'm4'.
libtoolize-default: linking file 'm4/libtool.m4'
libtoolize-default: linking file 'm4/ltoptions.m4'
libtoolize-default: linking file 'm4/ltsugar.m4'
libtoolize-default: linking file 'm4/ltversion.m4'
libtoolize-default: linking file 'm4/lt~obsolete.m4'
autoreconf-default: configure.ac: not using Intltool
autoreconf-default: configure.ac: not using Gtkdoc
autoreconf-default: running: aclocal --force -I m4
autoreconf-default: running: /usr/bin/autoconf-2.71 --force
autoreconf-default: running: /usr/bin/autoheader-2.71 --force
autoreconf-default: running: automake --add-missing --force-missing
configure.ac:26: installing 'bin/ar-lib'
configure.ac:23: installing 'bin/compile'
configure.ac:46: installing 'bin/missing'
Makefile.am: installing 'bin/depcomp'
parallel-tests: installing 'bin/test-driver'
autoreconf-default: Leaving directory '.'
+ CFLAGS='-pipe -frecord-gcc-switches -Wall -g -O2 -flto=auto'
+ export CFLAGS
+ CXXFLAGS='-pipe -frecord-gcc-switches -Wall -g -O2 -flto=auto'
+ export CXXFLAGS
+ FFLAGS='-pipe -frecord-gcc-switches -Wall -g -O2 -flto=auto'
+ export FFLAGS
+ FCFLAGS='-pipe -frecord-gcc-switches -Wall -g -O2 -flto=auto'
+ export FCFLAGS
+ '[' -n '' ']'
++ printf %s '-pipe -frecord-gcc-switches -Wall -g -O2 -flto=auto'
++ sed -r 's/(^|[[:space:]]+)-[^m][^[:space:]]*//g'
+ ASFLAGS=
+ export ASFLAGS
+ export lt_cv_deplibs_check_method=pass_all
+ lt_cv_deplibs_check_method=pass_all
+ readlink -e -- ./configure
+ xargs -ri dirname -- '{}'
+ xargs -ri find '{}' -type f '(' -name config.sub -or -name config.guess ')' -printf '%h/\n'
+ sort -u
+ xargs -rn1 install -pm755 -- /usr/share/gnu-config/config.sub /usr/share/gnu-config/config.guess
+ configure_runstatedir_flags=
+ grep -qF runstatedir=DIR ./configure
+ configure_runstatedir_flags=--runstatedir=/var/run
+ ./configure --build=x86_64-alt-linux --host=x86_64-alt-linux --prefix=/usr --exec-prefix=/usr --bindir=/usr/bin --sbindir=/usr/sbin --sysconfdir=/etc --datadir=/usr/share --includedir=/usr/include --libdir=/usr/lib64 --libexecdir=/usr/lib --localstatedir=/var/lib --sharedstatedir=/var/lib --mandir=/usr/share/man --infodir=/usr/share/info --disable-dependency-tracking --disable-silent-rules --runstatedir=/var/run --without-included-gettext --disable-demos '%{subst_enable_tests}' --with-spirv-tools
configure: WARNING: you should use --build, --host, --target
configure: WARNING: invalid host type: %{subst_enable_tests}
configure: WARNING: unrecognized options: --without-included-gettext
checking for x86_64-alt-linux-gcc... x86_64-alt-linux-gcc
checking whether the C compiler works... yes
checking for C compiler default output file name... a.out
checking for suffix of executables... 
checking whether we are cross compiling... no
checking for suffix of object files... o
checking whether the compiler supports GNU C... yes
checking whether x86_64-alt-linux-gcc accepts -g... yes
checking for x86_64-alt-linux-gcc option to enable C11 features... none needed
checking whether x86_64-alt-linux-gcc understands -c and -o together... yes
checking for stdio.h... yes
checking for stdlib.h... yes
checking for string.h... yes
checking for inttypes.h... yes
checking for stdint.h... yes
checking for strings.h... yes
checking for sys/stat.h... yes
checking for sys/types.h... yes
checking for unistd.h... yes
checking for wchar.h... yes
checking for minix/config.h... no
checking whether it is safe to define __EXTENSIONS__... yes
checking whether _XOPEN_SOURCE should be defined... no
checking for x86_64-alt-linux-ar... no
checking for x86_64-alt-linux-lib... no
checking for x86_64-alt-linux-link... no
checking for ar... ar
checking the archiver (ar) interface... ar
checking for x86_64-alt-linux-gcc... (cached) x86_64-alt-linux-gcc
checking whether the compiler supports GNU C... (cached) yes
checking whether x86_64-alt-linux-gcc accepts -g... (cached) yes
checking for x86_64-alt-linux-gcc option to enable C11 features... (cached) none needed
checking whether x86_64-alt-linux-gcc understands -c and -o together... (cached) yes
checking for a sed that does not truncate output... /bin/sed
checking for a race-free mkdir -p... /bin/mkdir -p
checking for gawk... gawk
checking for widl... widl
checking checking whether widl version >= 3.21... yes (9.0)
checking for flex... flex
checking for bison... bison
checking for x86_64-alt-linux-doxygen... no
checking for doxygen... no
configure: WARNING: doxygen not found - will not generate any doxygen documentation
checking for x86_64-alt-linux-perl... no
checking for perl... /usr/bin/perl
checking for a BSD-compatible install... /bin/install -c
checking whether build environment is sane... yes
checking whether make sets $(MAKE)... yes
checking whether make supports the include directive... yes (GNU style)
checking whether make supports nested variables... yes
checking dependency style of x86_64-alt-linux-gcc... none
checking whether to enable maintainer-specific portions of Makefiles... yes
checking whether make supports nested variables... (cached) yes
checking build system type... x86_64-alt-linux-gnu
checking host system type... x86_64-alt-linux-gnu
checking how to print strings... printf
checking for a sed that does not truncate output... (cached) /bin/sed
checking for grep that handles long lines and -e... /bin/grep
checking for egrep... /bin/grep -E
checking for fgrep... /bin/grep -F
checking for ld used by x86_64-alt-linux-gcc... /usr/bin/ld
checking if the linker (/usr/bin/ld) is GNU ld... yes
checking for BSD- or MS-compatible name lister (nm)... /usr/bin/nm -B
checking the name lister (/usr/bin/nm -B) interface... BSD nm
checking whether ln -s works... yes
checking the maximum length of command line arguments... 1572864
checking how to convert x86_64-alt-linux-gnu file names to x86_64-alt-linux-gnu format... func_convert_file_noop
checking how to convert x86_64-alt-linux-gnu file names to toolchain format... func_convert_file_noop
checking for /usr/bin/ld option to reload object files... -r
checking for x86_64-alt-linux-file... no
checking for file... file
checking for x86_64-alt-linux-objdump... no
checking for objdump... objdump
checking how to recognize dependent libraries... (cached) pass_all
checking for x86_64-alt-linux-dlltool... no
checking for dlltool... no
checking how to associate runtime and link libraries... printf %s\n
checking for x86_64-alt-linux-ar... ar
checking for archiver @FILE support... @
checking for x86_64-alt-linux-strip... no
checking for strip... strip
checking for x86_64-alt-linux-ranlib... no
checking for ranlib... ranlib
checking command to parse /usr/bin/nm -B output from x86_64-alt-linux-gcc object... ok
checking for sysroot... no
checking for a working dd... /bin/dd
checking how to truncate binary pipes... /bin/dd bs=4096 count=1
checking for x86_64-alt-linux-mt... no
checking for mt... no
checking if : is a manifest tool... no
checking for dlfcn.h... yes
checking for objdir... .libs
checking if x86_64-alt-linux-gcc supports -fno-rtti -fno-exceptions... no
checking for x86_64-alt-linux-gcc option to produce PIC... -fPIC -DPIC
checking if x86_64-alt-linux-gcc PIC flag -fPIC -DPIC works... yes
checking if x86_64-alt-linux-gcc static flag -static works... no
checking if x86_64-alt-linux-gcc supports -c -o file.o... yes
checking if x86_64-alt-linux-gcc supports -c -o file.o... (cached) yes
checking whether the x86_64-alt-linux-gcc linker (/usr/bin/ld -m elf_x86_64) supports shared libraries... yes
checking whether -lc should be explicitly linked in... no
checking dynamic linker characteristics... GNU/Linux ld.so
checking how to hardcode library paths into programs... immediate
checking whether stripping libraries is possible... yes
checking if libtool supports shared libraries... yes
checking whether to build shared libraries... yes
checking whether to build static libraries... yes
checking if LD -Wl,--version-script works... yes
checking whether the compiler supports -std=c99... yes
checking whether the compiler supports -fvisibility=hidden... yes
checking whether the compiler supports -Wdeclaration-after-statement... yes
checking whether the compiler supports -Wempty-body... yes
checking whether the compiler supports -Wenum-conversion... yes
checking whether the compiler supports -Wimplicit-fallthrough... yes
checking whether the compiler supports -Winit-self... yes
checking whether the compiler supports -Wmissing-prototypes... yes
checking whether the compiler supports -Wpointer-arith... yes
checking whether the compiler supports -Wshadow... yes
checking whether the compiler supports -Wshift-overflow=2... yes
checking whether the compiler supports -Wtype-limits... yes
checking whether the compiler supports -Wunused-but-set-parameter... yes
checking whether the compiler supports -Wvla... yes
checking whether the compiler supports -Wwrite-strings... yes
checking whether the compiler supports -Wl,--no-undefined... yes
checking for i686-w64-mingw32-gcc... no
checking for i586-w64-mingw32-gcc... no
checking for i486-w64-mingw32-gcc... no
checking for i386-w64-mingw32-gcc... no
checking for x86_64-w64-mingw32-gcc... no
checking for amd64-w64-mingw32-gcc... no
checking for dlfcn.h... (cached) yes
checking for vulkan/vulkan.h... yes
checking for vulkan/spirv.h... no
checking for vulkan/GLSL.std.450.h... no
checking for spirv/unified1/spirv.h... yes
checking for spirv/unified1/GLSL.std.450.h... yes
checking whether VK_HEADER_VERSION >= 228... yes
checking for x86_64-alt-linux-gcc options needed to detect all undeclared functions... none needed
checking whether SpvCapabilityDemoteToHelperInvocationEXT is declared... yes
checking whether program_invocation_name is declared... yes
checking for x86_64-alt-linux-pkg-config... no
checking for pkg-config... /usr/bin/pkg-config
checking pkg-config is at least version 0.9.0... yes
checking for ceilf in -lm... yes
checking for dlopen in -ldl... yes
checking for pthread.h... yes
checking checking for pthread_create in -pthread... yes
checking for pthread_setname_np... yes
checking how many arguments pthread_set_np() takes... two
checking for ldd... /usr/bin/ldd
checking for x86_64-alt-linux-otool... no
checking for otool... no
checking for x86_64-alt-linux-readelf... no
checking for readelf... readelf
checking for -lvulkan... libvulkan.so.1
checking for -ldxcompiler... not found
checking for ncurses... no
checking for egl opengl... no
checking for SPIRV-Tools-shared... yes
checking for xcb xcb-event xcb-icccm xcb-keysyms... no
checking for __builtin_clz... yes
checking for __builtin_popcount... yes
checking for __builtin_add_overflow... yes
checking for __sync_add_and_fetch... yes
checking for __sync_bool_compare_and_swap... yes
checking for __atomic_exchange_n... yes
checking for gettid... yes
checking that generated files are newer than configure... done
configure: creating ./config.status
config.status: creating Doxyfile
config.status: creating Makefile
config.status: creating include/config.h
config.status: executing depfiles commands
config.status: executing libtool commands
configure: WARNING: unrecognized options: --without-included-gettext

  Configuration summary for vkd3d 1.11

  widl: widl

  Have ncurses: no
  Have OpenGL: no
  Have SPIRV-Tools: yes
  Have xcb: no
  Have dxcompiler: no

  Building demos: no
  Building tests: yes
  Building documentation: no

  Cross-compiling tests: no

+ exit 0
Executing(%build): /bin/sh -e /usr/src/tmp/rpm-tmp.33103
+ umask 022
+ /bin/mkdir -p /usr/src/RPM/BUILD
+ cd /usr/src/RPM/BUILD
+ cd vkd3d-1.11
+ make -j16
make: Entering directory '/usr/src/RPM/BUILD/vkd3d-1.11'
widl -I./include -h -o include/vkd3d_d3d12shader.h include/vkd3d_d3d12shader.idl
make: Leaving directory '/usr/src/RPM/BUILD/vkd3d-1.11'
make: Entering directory '/usr/src/RPM/BUILD/vkd3d-1.11'
widl -I./include -h -o include/vkd3d_d3dcommon.h include/vkd3d_d3dcommon.idl
make: Leaving directory '/usr/src/RPM/BUILD/vkd3d-1.11'
make: Entering directory '/usr/src/RPM/BUILD/vkd3d-1.11'
widl -I./include -h -o include/vkd3d_d3dx9shader.h include/vkd3d_d3dx9shader.idl
make: Leaving directory '/usr/src/RPM/BUILD/vkd3d-1.11'
make: Entering directory '/usr/src/RPM/BUILD/vkd3d-1.11'
widl -I./include -h -o include/vkd3d_dxgi.h include/vkd3d_dxgi.idl
make: Leaving directory '/usr/src/RPM/BUILD/vkd3d-1.11'
make: Entering directory '/usr/src/RPM/BUILD/vkd3d-1.11'
widl -I./include -h -o include/vkd3d_dxgibase.h include/vkd3d_dxgibase.idl
make: Leaving directory '/usr/src/RPM/BUILD/vkd3d-1.11'
make: Entering directory '/usr/src/RPM/BUILD/vkd3d-1.11'
widl -I./include -h -o include/vkd3d_dxgiformat.h include/vkd3d_dxgiformat.idl
make: Leaving directory '/usr/src/RPM/BUILD/vkd3d-1.11'
make: Entering directory '/usr/src/RPM/BUILD/vkd3d-1.11'
widl -I./include -h -o include/vkd3d_dxgi1_2.h include/vkd3d_dxgi1_2.idl
make: Leaving directory '/usr/src/RPM/BUILD/vkd3d-1.11'
make: Entering directory '/usr/src/RPM/BUILD/vkd3d-1.11'
widl -I./include -h -o include/vkd3d_dxgi1_3.h include/vkd3d_dxgi1_3.idl
make: Leaving directory '/usr/src/RPM/BUILD/vkd3d-1.11'
make: Entering directory '/usr/src/RPM/BUILD/vkd3d-1.11'
widl -I./include -h -o include/vkd3d_dxgitype.h include/vkd3d_dxgitype.idl
make: Leaving directory '/usr/src/RPM/BUILD/vkd3d-1.11'
make: Entering directory '/usr/src/RPM/BUILD/vkd3d-1.11'
widl -I./include -h -o include/vkd3d_dxgi1_4.h include/vkd3d_dxgi1_4.idl
make: Leaving directory '/usr/src/RPM/BUILD/vkd3d-1.11'
make: Entering directory '/usr/src/RPM/BUILD/vkd3d-1.11'
widl -I./include -h -o tests/dxcompiler.h tests/dxcompiler.idl
make: Leaving directory '/usr/src/RPM/BUILD/vkd3d-1.11'
make: Entering directory '/usr/src/RPM/BUILD/vkd3d-1.11'
widl -I./include -h -o include/vkd3d_d3d12sdklayers.h include/vkd3d_d3d12sdklayers.idl
make: Leaving directory '/usr/src/RPM/BUILD/vkd3d-1.11'
make: Entering directory '/usr/src/RPM/BUILD/vkd3d-1.11'
widl -I./include -h -o include/vkd3d_d3d12.h include/vkd3d_d3d12.idl
make: Leaving directory '/usr/src/RPM/BUILD/vkd3d-1.11'
make: Entering directory '/usr/src/RPM/BUILD/vkd3d-1.11'
bison  -d -o libs/vkd3d-shader/preproc.tab.c libs/vkd3d-shader/preproc.y
make: Leaving directory '/usr/src/RPM/BUILD/vkd3d-1.11'
make: Entering directory '/usr/src/RPM/BUILD/vkd3d-1.11'
bison  -d -o libs/vkd3d-shader/hlsl.tab.c libs/vkd3d-shader/hlsl.y
make: Leaving directory '/usr/src/RPM/BUILD/vkd3d-1.11'
make  all-am
make[1]: Entering directory '/usr/src/RPM/BUILD/vkd3d-1.11'
flex  -o libs/vkd3d-shader/hlsl.yy.c libs/vkd3d-shader/hlsl.l
make[1]: Leaving directory '/usr/src/RPM/BUILD/vkd3d-1.11'
make[1]: Entering directory '/usr/src/RPM/BUILD/vkd3d-1.11'
flex  -o libs/vkd3d-shader/preproc.yy.c libs/vkd3d-shader/preproc.l
make[1]: Leaving directory '/usr/src/RPM/BUILD/vkd3d-1.11'
make[1]: Entering directory '/usr/src/RPM/BUILD/vkd3d-1.11'
/bin/sed -e 's![@]prefix[@]!/usr!g' \
	-e 's![@]exec_prefix[@]!/usr!g' \
	-e 's![@]includedir[@]!/usr/include!g' \
	-e 's![@]libdir[@]!/usr/lib64!g' \
	-e 's![@]PACKAGE_VERSION[@]!1.11!g' \
	libs/vkd3d/libvkd3d.pc.in > libvkd3d.pc
make[1]: Leaving directory '/usr/src/RPM/BUILD/vkd3d-1.11'
make[1]: Entering directory '/usr/src/RPM/BUILD/vkd3d-1.11'
/bin/sed -e 's![@]prefix[@]!/usr!g' \
	-e 's![@]exec_prefix[@]!/usr!g' \
	-e 's![@]includedir[@]!/usr/include!g' \
	-e 's![@]libdir[@]!/usr/lib64!g' \
	-e 's![@]PACKAGE_VERSION[@]!1.11!g' \
	libs/vkd3d-shader/libvkd3d-shader.pc.in > libvkd3d-shader.pc
make[1]: Leaving directory '/usr/src/RPM/BUILD/vkd3d-1.11'
make[1]: Entering directory '/usr/src/RPM/BUILD/vkd3d-1.11'
/bin/sed -e 's![@]prefix[@]!/usr!g' \
	-e 's![@]exec_prefix[@]!/usr!g' \
	-e 's![@]includedir[@]!/usr/include!g' \
	-e 's![@]libdir[@]!/usr/lib64!g' \
	-e 's![@]PACKAGE_VERSION[@]!1.11!g' \
	libs/vkd3d-utils/libvkd3d-utils.pc.in > libvkd3d-utils.pc
make[1]: Leaving directory '/usr/src/RPM/BUILD/vkd3d-1.11'
make[1]: Entering directory '/usr/src/RPM/BUILD/vkd3d-1.11'
x86_64-alt-linux-gcc -DHAVE_CONFIG_H -I. -I./include  -I./include -I./include/private -I./include/private  -Wall -pipe -std=c99 -fvisibility=hidden -Wdeclaration-after-statement -Wempty-body -Wenum-conversion -Wimplicit-fallthrough -Winit-self -Wmissing-prototypes -Wpointer-arith -Wshadow -Wshift-overflow=2 -Wtype-limits -Wunused-but-set-parameter -Wvla -Wwrite-strings -Wl,--no-undefined  -pipe -frecord-gcc-switches -Wall -g -O2 -flto=auto -c -o programs/vkd3d-compiler/vkd3d_compiler-main.o `test -f 'programs/vkd3d-compiler/main.c' || echo './'`programs/vkd3d-compiler/main.c
make[1]: Leaving directory '/usr/src/RPM/BUILD/vkd3d-1.11'
make[1]: Entering directory '/usr/src/RPM/BUILD/vkd3d-1.11'
/bin/sh ./libtool  --tag=CC   --mode=compile x86_64-alt-linux-gcc -DHAVE_CONFIG_H -I. -I./include  -I./include -I./include/private -I./include/private  -Wall -pipe -std=c99 -fvisibility=hidden -Wdeclaration-after-statement -Wempty-body -Wenum-conversion -Wimplicit-fallthrough -Winit-self -Wmissing-prototypes -Wpointer-arith -Wshadow -Wshift-overflow=2 -Wtype-limits -Wunused-but-set-parameter -Wvla -Wwrite-strings -Wl,--no-undefined -DLIBVKD3D_SHADER_SOURCE -I./libs/vkd3d-shader  -pipe -frecord-gcc-switches -Wall -g -O2 -flto=auto -c -o libs/vkd3d-shader/libvkd3d_shader_la-checksum.lo `test -f 'libs/vkd3d-shader/checksum.c' || echo './'`libs/vkd3d-shader/checksum.c
libtool: compile:  x86_64-alt-linux-gcc -DHAVE_CONFIG_H -I. -I./include -I./include -I./include/private -I./include/private -Wall -pipe -std=c99 -fvisibility=hidden -Wdeclaration-after-statement -Wempty-body -Wenum-conversion -Wimplicit-fallthrough -Winit-self -Wmissing-prototypes -Wpointer-arith -Wshadow -Wshift-overflow=2 -Wtype-limits -Wunused-but-set-parameter -Wvla -Wwrite-strings -Wl,--no-undefined -DLIBVKD3D_SHADER_SOURCE -I./libs/vkd3d-shader -pipe -frecord-gcc-switches -Wall -g -O2 -flto=auto -c libs/vkd3d-shader/checksum.c  -fPIC -DPIC -o libs/vkd3d-shader/.libs/libvkd3d_shader_la-checksum.o
libtool: compile:  x86_64-alt-linux-gcc -DHAVE_CONFIG_H -I. -I./include -I./include -I./include/private -I./include/private -Wall -pipe -std=c99 -fvisibility=hidden -Wdeclaration-after-statement -Wempty-body -Wenum-conversion -Wimplicit-fallthrough -Winit-self -Wmissing-prototypes -Wpointer-arith -Wshadow -Wshift-overflow=2 -Wtype-limits -Wunused-but-set-parameter -Wvla -Wwrite-strings -Wl,--no-undefined -DLIBVKD3D_SHADER_SOURCE -I./libs/vkd3d-shader -pipe -frecord-gcc-switches -Wall -g -O2 -flto=auto -c libs/vkd3d-shader/checksum.c -o libs/vkd3d-shader/libvkd3d_shader_la-checksum.o >/dev/null 2>&1
make[1]: Leaving directory '/usr/src/RPM/BUILD/vkd3d-1.11'
make[1]: Entering directory '/usr/src/RPM/BUILD/vkd3d-1.11'
/bin/sh ./libtool  --tag=CC   --mode=compile x86_64-alt-linux-gcc -DHAVE_CONFIG_H -I. -I./include  -I./include -I./include/private -I./include/private  -Wall -pipe -std=c99 -fvisibility=hidden -Wdeclaration-after-statement -Wempty-body -Wenum-conversion -Wimplicit-fallthrough -Winit-self -Wmissing-prototypes -Wpointer-arith -Wshadow -Wshift-overflow=2 -Wtype-limits -Wunused-but-set-parameter -Wvla -Wwrite-strings -Wl,--no-undefined -DLIBVKD3D_SHADER_SOURCE -I./libs/vkd3d-shader  -pipe -frecord-gcc-switches -Wall -g -O2 -flto=auto -c -o libs/vkd3d-shader/libvkd3d_shader_la-glsl.lo `test -f 'libs/vkd3d-shader/glsl.c' || echo './'`libs/vkd3d-shader/glsl.c
libtool: compile:  x86_64-alt-linux-gcc -DHAVE_CONFIG_H -I. -I./include -I./include -I./include/private -I./include/private -Wall -pipe -std=c99 -fvisibility=hidden -Wdeclaration-after-statement -Wempty-body -Wenum-conversion -Wimplicit-fallthrough -Winit-self -Wmissing-prototypes -Wpointer-arith -Wshadow -Wshift-overflow=2 -Wtype-limits -Wunused-but-set-parameter -Wvla -Wwrite-strings -Wl,--no-undefined -DLIBVKD3D_SHADER_SOURCE -I./libs/vkd3d-shader -pipe -frecord-gcc-switches -Wall -g -O2 -flto=auto -c libs/vkd3d-shader/glsl.c  -fPIC -DPIC -o libs/vkd3d-shader/.libs/libvkd3d_shader_la-glsl.o
libtool: compile:  x86_64-alt-linux-gcc -DHAVE_CONFIG_H -I. -I./include -I./include -I./include/private -I./include/private -Wall -pipe -std=c99 -fvisibility=hidden -Wdeclaration-after-statement -Wempty-body -Wenum-conversion -Wimplicit-fallthrough -Winit-self -Wmissing-prototypes -Wpointer-arith -Wshadow -Wshift-overflow=2 -Wtype-limits -Wunused-but-set-parameter -Wvla -Wwrite-strings -Wl,--no-undefined -DLIBVKD3D_SHADER_SOURCE -I./libs/vkd3d-shader -pipe -frecord-gcc-switches -Wall -g -O2 -flto=auto -c libs/vkd3d-shader/glsl.c -o libs/vkd3d-shader/libvkd3d_shader_la-glsl.o >/dev/null 2>&1
make[1]: Leaving directory '/usr/src/RPM/BUILD/vkd3d-1.11'
make[1]: Entering directory '/usr/src/RPM/BUILD/vkd3d-1.11'
/bin/sh ./libtool  --tag=CC   --mode=compile x86_64-alt-linux-gcc -DHAVE_CONFIG_H -I. -I./include  -I./include -I./include/private -I./include/private  -Wall -pipe -std=c99 -fvisibility=hidden -Wdeclaration-after-statement -Wempty-body -Wenum-conversion -Wimplicit-fallthrough -Winit-self -Wmissing-prototypes -Wpointer-arith -Wshadow -Wshift-overflow=2 -Wtype-limits -Wunused-but-set-parameter -Wvla -Wwrite-strings -Wl,--no-undefined -DLIBVKD3D_SHADER_SOURCE -I./libs/vkd3d-shader  -pipe -frecord-gcc-switches -Wall -g -O2 -flto=auto -c -o libs/vkd3d-shader/libvkd3d_shader_la-fx.lo `test -f 'libs/vkd3d-shader/fx.c' || echo './'`libs/vkd3d-shader/fx.c
libtool: compile:  x86_64-alt-linux-gcc -DHAVE_CONFIG_H -I. -I./include -I./include -I./include/private -I./include/private -Wall -pipe -std=c99 -fvisibility=hidden -Wdeclaration-after-statement -Wempty-body -Wenum-conversion -Wimplicit-fallthrough -Winit-self -Wmissing-prototypes -Wpointer-arith -Wshadow -Wshift-overflow=2 -Wtype-limits -Wunused-but-set-parameter -Wvla -Wwrite-strings -Wl,--no-undefined -DLIBVKD3D_SHADER_SOURCE -I./libs/vkd3d-shader -pipe -frecord-gcc-switches -Wall -g -O2 -flto=auto -c libs/vkd3d-shader/fx.c  -fPIC -DPIC -o libs/vkd3d-shader/.libs/libvkd3d_shader_la-fx.o
libtool: compile:  x86_64-alt-linux-gcc -DHAVE_CONFIG_H -I. -I./include -I./include -I./include/private -I./include/private -Wall -pipe -std=c99 -fvisibility=hidden -Wdeclaration-after-statement -Wempty-body -Wenum-conversion -Wimplicit-fallthrough -Winit-self -Wmissing-prototypes -Wpointer-arith -Wshadow -Wshift-overflow=2 -Wtype-limits -Wunused-but-set-parameter -Wvla -Wwrite-strings -Wl,--no-undefined -DLIBVKD3D_SHADER_SOURCE -I./libs/vkd3d-shader -pipe -frecord-gcc-switches -Wall -g -O2 -flto=auto -c libs/vkd3d-shader/fx.c -o libs/vkd3d-shader/libvkd3d_shader_la-fx.o >/dev/null 2>&1
make[1]: Leaving directory '/usr/src/RPM/BUILD/vkd3d-1.11'
make[1]: Entering directory '/usr/src/RPM/BUILD/vkd3d-1.11'
/bin/sh ./libtool  --tag=CC   --mode=compile x86_64-alt-linux-gcc -DHAVE_CONFIG_H -I. -I./include  -I./include -I./include/private -I./include/private  -Wall -pipe -std=c99 -fvisibility=hidden -Wdeclaration-after-statement -Wempty-body -Wenum-conversion -Wimplicit-fallthrough -Winit-self -Wmissing-prototypes -Wpointer-arith -Wshadow -Wshift-overflow=2 -Wtype-limits -Wunused-but-set-parameter -Wvla -Wwrite-strings -Wl,--no-undefined -DLIBVKD3D_SHADER_SOURCE -I./libs/vkd3d-shader  -pipe -frecord-gcc-switches -Wall -g -O2 -flto=auto -c -o libs/vkd3d-shader/libvkd3d_shader_la-hlsl_constant_ops.lo `test -f 'libs/vkd3d-shader/hlsl_constant_ops.c' || echo './'`libs/vkd3d-shader/hlsl_constant_ops.c
libtool: compile:  x86_64-alt-linux-gcc -DHAVE_CONFIG_H -I. -I./include -I./include -I./include/private -I./include/private -Wall -pipe -std=c99 -fvisibility=hidden -Wdeclaration-after-statement -Wempty-body -Wenum-conversion -Wimplicit-fallthrough -Winit-self -Wmissing-prototypes -Wpointer-arith -Wshadow -Wshift-overflow=2 -Wtype-limits -Wunused-but-set-parameter -Wvla -Wwrite-strings -Wl,--no-undefined -DLIBVKD3D_SHADER_SOURCE -I./libs/vkd3d-shader -pipe -frecord-gcc-switches -Wall -g -O2 -flto=auto -c libs/vkd3d-shader/hlsl_constant_ops.c  -fPIC -DPIC -o libs/vkd3d-shader/.libs/libvkd3d_shader_la-hlsl_constant_ops.o
libtool: compile:  x86_64-alt-linux-gcc -DHAVE_CONFIG_H -I. -I./include -I./include -I./include/private -I./include/private -Wall -pipe -std=c99 -fvisibility=hidden -Wdeclaration-after-statement -Wempty-body -Wenum-conversion -Wimplicit-fallthrough -Winit-self -Wmissing-prototypes -Wpointer-arith -Wshadow -Wshift-overflow=2 -Wtype-limits -Wunused-but-set-parameter -Wvla -Wwrite-strings -Wl,--no-undefined -DLIBVKD3D_SHADER_SOURCE -I./libs/vkd3d-shader -pipe -frecord-gcc-switches -Wall -g -O2 -flto=auto -c libs/vkd3d-shader/hlsl_constant_ops.c -o libs/vkd3d-shader/libvkd3d_shader_la-hlsl_constant_ops.o >/dev/null 2>&1
make[1]: Leaving directory '/usr/src/RPM/BUILD/vkd3d-1.11'
make[1]: Entering directory '/usr/src/RPM/BUILD/vkd3d-1.11'
/bin/sh ./libtool  --tag=CC   --mode=compile x86_64-alt-linux-gcc -DHAVE_CONFIG_H -I. -I./include  -I./include -I./include/private -I./include/private  -Wall -pipe -std=c99 -fvisibility=hidden -Wdeclaration-after-statement -Wempty-body -Wenum-conversion -Wimplicit-fallthrough -Winit-self -Wmissing-prototypes -Wpointer-arith -Wshadow -Wshift-overflow=2 -Wtype-limits -Wunused-but-set-parameter -Wvla -Wwrite-strings -Wl,--no-undefined -DLIBVKD3D_SHADER_SOURCE -I./libs/vkd3d-shader  -pipe -frecord-gcc-switches -Wall -g -O2 -flto=auto -c -o libs/vkd3d-shader/libvkd3d_shader_la-dxbc.lo `test -f 'libs/vkd3d-shader/dxbc.c' || echo './'`libs/vkd3d-shader/dxbc.c
libtool: compile:  x86_64-alt-linux-gcc -DHAVE_CONFIG_H -I. -I./include -I./include -I./include/private -I./include/private -Wall -pipe -std=c99 -fvisibility=hidden -Wdeclaration-after-statement -Wempty-body -Wenum-conversion -Wimplicit-fallthrough -Winit-self -Wmissing-prototypes -Wpointer-arith -Wshadow -Wshift-overflow=2 -Wtype-limits -Wunused-but-set-parameter -Wvla -Wwrite-strings -Wl,--no-undefined -DLIBVKD3D_SHADER_SOURCE -I./libs/vkd3d-shader -pipe -frecord-gcc-switches -Wall -g -O2 -flto=auto -c libs/vkd3d-shader/dxbc.c  -fPIC -DPIC -o libs/vkd3d-shader/.libs/libvkd3d_shader_la-dxbc.o
libtool: compile:  x86_64-alt-linux-gcc -DHAVE_CONFIG_H -I. -I./include -I./include -I./include/private -I./include/private -Wall -pipe -std=c99 -fvisibility=hidden -Wdeclaration-after-statement -Wempty-body -Wenum-conversion -Wimplicit-fallthrough -Winit-self -Wmissing-prototypes -Wpointer-arith -Wshadow -Wshift-overflow=2 -Wtype-limits -Wunused-but-set-parameter -Wvla -Wwrite-strings -Wl,--no-undefined -DLIBVKD3D_SHADER_SOURCE -I./libs/vkd3d-shader -pipe -frecord-gcc-switches -Wall -g -O2 -flto=auto -c libs/vkd3d-shader/dxbc.c -o libs/vkd3d-shader/libvkd3d_shader_la-dxbc.o >/dev/null 2>&1
make[1]: Leaving directory '/usr/src/RPM/BUILD/vkd3d-1.11'
make[1]: Entering directory '/usr/src/RPM/BUILD/vkd3d-1.11'
/bin/sh ./libtool  --tag=CC   --mode=compile x86_64-alt-linux-gcc -DHAVE_CONFIG_H -I. -I./include  -I./include -I./include/private -I./include/private  -Wall -pipe -std=c99 -fvisibility=hidden -Wdeclaration-after-statement -Wempty-body -Wenum-conversion -Wimplicit-fallthrough -Winit-self -Wmissing-prototypes -Wpointer-arith -Wshadow -Wshift-overflow=2 -Wtype-limits -Wunused-but-set-parameter -Wvla -Wwrite-strings -Wl,--no-undefined -DLIBVKD3D_SHADER_SOURCE -I./libs/vkd3d-shader  -pipe -frecord-gcc-switches -Wall -g -O2 -flto=auto -c -o libs/vkd3d-shader/libvkd3d_shader_la-d3d_asm.lo `test -f 'libs/vkd3d-shader/d3d_asm.c' || echo './'`libs/vkd3d-shader/d3d_asm.c
libtool: compile:  x86_64-alt-linux-gcc -DHAVE_CONFIG_H -I. -I./include -I./include -I./include/private -I./include/private -Wall -pipe -std=c99 -fvisibility=hidden -Wdeclaration-after-statement -Wempty-body -Wenum-conversion -Wimplicit-fallthrough -Winit-self -Wmissing-prototypes -Wpointer-arith -Wshadow -Wshift-overflow=2 -Wtype-limits -Wunused-but-set-parameter -Wvla -Wwrite-strings -Wl,--no-undefined -DLIBVKD3D_SHADER_SOURCE -I./libs/vkd3d-shader -pipe -frecord-gcc-switches -Wall -g -O2 -flto=auto -c libs/vkd3d-shader/d3d_asm.c  -fPIC -DPIC -o libs/vkd3d-shader/.libs/libvkd3d_shader_la-d3d_asm.o
libtool: compile:  x86_64-alt-linux-gcc -DHAVE_CONFIG_H -I. -I./include -I./include -I./include/private -I./include/private -Wall -pipe -std=c99 -fvisibility=hidden -Wdeclaration-after-statement -Wempty-body -Wenum-conversion -Wimplicit-fallthrough -Winit-self -Wmissing-prototypes -Wpointer-arith -Wshadow -Wshift-overflow=2 -Wtype-limits -Wunused-but-set-parameter -Wvla -Wwrite-strings -Wl,--no-undefined -DLIBVKD3D_SHADER_SOURCE -I./libs/vkd3d-shader -pipe -frecord-gcc-switches -Wall -g -O2 -flto=auto -c libs/vkd3d-shader/d3d_asm.c -o libs/vkd3d-shader/libvkd3d_shader_la-d3d_asm.o >/dev/null 2>&1
make[1]: Leaving directory '/usr/src/RPM/BUILD/vkd3d-1.11'
make[1]: Entering directory '/usr/src/RPM/BUILD/vkd3d-1.11'
/bin/sh ./libtool  --tag=CC   --mode=compile x86_64-alt-linux-gcc -DHAVE_CONFIG_H -I. -I./include  -I./include -I./include/private -I./include/private  -Wall -pipe -std=c99 -fvisibility=hidden -Wdeclaration-after-statement -Wempty-body -Wenum-conversion -Wimplicit-fallthrough -Winit-self -Wmissing-prototypes -Wpointer-arith -Wshadow -Wshift-overflow=2 -Wtype-limits -Wunused-but-set-parameter -Wvla -Wwrite-strings -Wl,--no-undefined -DLIBVKD3D_SHADER_SOURCE -I./libs/vkd3d-shader  -pipe -frecord-gcc-switches -Wall -g -O2 -flto=auto -c -o libs/vkd3d-shader/libvkd3d_shader_la-d3dbc.lo `test -f 'libs/vkd3d-shader/d3dbc.c' || echo './'`libs/vkd3d-shader/d3dbc.c
libtool: compile:  x86_64-alt-linux-gcc -DHAVE_CONFIG_H -I. -I./include -I./include -I./include/private -I./include/private -Wall -pipe -std=c99 -fvisibility=hidden -Wdeclaration-after-statement -Wempty-body -Wenum-conversion -Wimplicit-fallthrough -Winit-self -Wmissing-prototypes -Wpointer-arith -Wshadow -Wshift-overflow=2 -Wtype-limits -Wunused-but-set-parameter -Wvla -Wwrite-strings -Wl,--no-undefined -DLIBVKD3D_SHADER_SOURCE -I./libs/vkd3d-shader -pipe -frecord-gcc-switches -Wall -g -O2 -flto=auto -c libs/vkd3d-shader/d3dbc.c  -fPIC -DPIC -o libs/vkd3d-shader/.libs/libvkd3d_shader_la-d3dbc.o
libtool: compile:  x86_64-alt-linux-gcc -DHAVE_CONFIG_H -I. -I./include -I./include -I./include/private -I./include/private -Wall -pipe -std=c99 -fvisibility=hidden -Wdeclaration-after-statement -Wempty-body -Wenum-conversion -Wimplicit-fallthrough -Winit-self -Wmissing-prototypes -Wpointer-arith -Wshadow -Wshift-overflow=2 -Wtype-limits -Wunused-but-set-parameter -Wvla -Wwrite-strings -Wl,--no-undefined -DLIBVKD3D_SHADER_SOURCE -I./libs/vkd3d-shader -pipe -frecord-gcc-switches -Wall -g -O2 -flto=auto -c libs/vkd3d-shader/d3dbc.c -o libs/vkd3d-shader/libvkd3d_shader_la-d3dbc.o >/dev/null 2>&1
make[1]: Leaving directory '/usr/src/RPM/BUILD/vkd3d-1.11'
make[1]: Entering directory '/usr/src/RPM/BUILD/vkd3d-1.11'
/bin/sh ./libtool  --tag=CC   --mode=compile x86_64-alt-linux-gcc -DHAVE_CONFIG_H -I. -I./include  -I./include -I./include/private -I./include/private  -Wall -pipe -std=c99 -fvisibility=hidden -Wdeclaration-after-statement -Wempty-body -Wenum-conversion -Wimplicit-fallthrough -Winit-self -Wmissing-prototypes -Wpointer-arith -Wshadow -Wshift-overflow=2 -Wtype-limits -Wunused-but-set-parameter -Wvla -Wwrite-strings -Wl,--no-undefined -DLIBVKD3D_SHADER_SOURCE -I./libs/vkd3d-shader  -pipe -frecord-gcc-switches -Wall -g -O2 -flto=auto -c -o libs/vkd3d-shader/libvkd3d_shader_la-vkd3d_shader_main.lo `test -f 'libs/vkd3d-shader/vkd3d_shader_main.c' || echo './'`libs/vkd3d-shader/vkd3d_shader_main.c
libtool: compile:  x86_64-alt-linux-gcc -DHAVE_CONFIG_H -I. -I./include -I./include -I./include/private -I./include/private -Wall -pipe -std=c99 -fvisibility=hidden -Wdeclaration-after-statement -Wempty-body -Wenum-conversion -Wimplicit-fallthrough -Winit-self -Wmissing-prototypes -Wpointer-arith -Wshadow -Wshift-overflow=2 -Wtype-limits -Wunused-but-set-parameter -Wvla -Wwrite-strings -Wl,--no-undefined -DLIBVKD3D_SHADER_SOURCE -I./libs/vkd3d-shader -pipe -frecord-gcc-switches -Wall -g -O2 -flto=auto -c libs/vkd3d-shader/vkd3d_shader_main.c  -fPIC -DPIC -o libs/vkd3d-shader/.libs/libvkd3d_shader_la-vkd3d_shader_main.o
libtool: compile:  x86_64-alt-linux-gcc -DHAVE_CONFIG_H -I. -I./include -I./include -I./include/private -I./include/private -Wall -pipe -std=c99 -fvisibility=hidden -Wdeclaration-after-statement -Wempty-body -Wenum-conversion -Wimplicit-fallthrough -Winit-self -Wmissing-prototypes -Wpointer-arith -Wshadow -Wshift-overflow=2 -Wtype-limits -Wunused-but-set-parameter -Wvla -Wwrite-strings -Wl,--no-undefined -DLIBVKD3D_SHADER_SOURCE -I./libs/vkd3d-shader -pipe -frecord-gcc-switches -Wall -g -O2 -flto=auto -c libs/vkd3d-shader/vkd3d_shader_main.c -o libs/vkd3d-shader/libvkd3d_shader_la-vkd3d_shader_main.o >/dev/null 2>&1
make[1]: Leaving directory '/usr/src/RPM/BUILD/vkd3d-1.11'
make[1]: Entering directory '/usr/src/RPM/BUILD/vkd3d-1.11'
/bin/sh ./libtool  --tag=CC   --mode=compile x86_64-alt-linux-gcc -DHAVE_CONFIG_H -I. -I./include  -I./include -I./include/private -I./include/private  -Wall -pipe -std=c99 -fvisibility=hidden -Wdeclaration-after-statement -Wempty-body -Wenum-conversion -Wimplicit-fallthrough -Winit-self -Wmissing-prototypes -Wpointer-arith -Wshadow -Wshift-overflow=2 -Wtype-limits -Wunused-but-set-parameter -Wvla -Wwrite-strings -Wl,--no-undefined -DLIBVKD3D_SHADER_SOURCE -I./libs/vkd3d-shader  -pipe -frecord-gcc-switches -Wall -g -O2 -flto=auto -c -o libs/vkd3d-shader/libvkd3d_shader_la-preproc.tab.lo `test -f 'libs/vkd3d-shader/preproc.tab.c' || echo './'`libs/vkd3d-shader/preproc.tab.c
libtool: compile:  x86_64-alt-linux-gcc -DHAVE_CONFIG_H -I. -I./include -I./include -I./include/private -I./include/private -Wall -pipe -std=c99 -fvisibility=hidden -Wdeclaration-after-statement -Wempty-body -Wenum-conversion -Wimplicit-fallthrough -Winit-self -Wmissing-prototypes -Wpointer-arith -Wshadow -Wshift-overflow=2 -Wtype-limits -Wunused-but-set-parameter -Wvla -Wwrite-strings -Wl,--no-undefined -DLIBVKD3D_SHADER_SOURCE -I./libs/vkd3d-shader -pipe -frecord-gcc-switches -Wall -g -O2 -flto=auto -c libs/vkd3d-shader/preproc.tab.c  -fPIC -DPIC -o libs/vkd3d-shader/.libs/libvkd3d_shader_la-preproc.tab.o
libtool: compile:  x86_64-alt-linux-gcc -DHAVE_CONFIG_H -I. -I./include -I./include -I./include/private -I./include/private -Wall -pipe -std=c99 -fvisibility=hidden -Wdeclaration-after-statement -Wempty-body -Wenum-conversion -Wimplicit-fallthrough -Winit-self -Wmissing-prototypes -Wpointer-arith -Wshadow -Wshift-overflow=2 -Wtype-limits -Wunused-but-set-parameter -Wvla -Wwrite-strings -Wl,--no-undefined -DLIBVKD3D_SHADER_SOURCE -I./libs/vkd3d-shader -pipe -frecord-gcc-switches -Wall -g -O2 -flto=auto -c libs/vkd3d-shader/preproc.tab.c -o libs/vkd3d-shader/libvkd3d_shader_la-preproc.tab.o >/dev/null 2>&1
make[1]: Leaving directory '/usr/src/RPM/BUILD/vkd3d-1.11'
make[1]: Entering directory '/usr/src/RPM/BUILD/vkd3d-1.11'
/bin/sh ./libtool  --tag=CC   --mode=compile x86_64-alt-linux-gcc -DHAVE_CONFIG_H -I. -I./include  -I./include -I./include/private -I./include/private  -Wall -pipe -std=c99 -fvisibility=hidden -Wdeclaration-after-statement -Wempty-body -Wenum-conversion -Wimplicit-fallthrough -Winit-self -Wmissing-prototypes -Wpointer-arith -Wshadow -Wshift-overflow=2 -Wtype-limits -Wunused-but-set-parameter -Wvla -Wwrite-strings -Wl,--no-undefined -pipe -frecord-gcc-switches -Wall -g -O2 -flto=auto -c -o libs/vkd3d-common/error.lo libs/vkd3d-common/error.c
libtool: compile:  x86_64-alt-linux-gcc -DHAVE_CONFIG_H -I. -I./include -I./include -I./include/private -I./include/private -Wall -pipe -std=c99 -fvisibility=hidden -Wdeclaration-after-statement -Wempty-body -Wenum-conversion -Wimplicit-fallthrough -Winit-self -Wmissing-prototypes -Wpointer-arith -Wshadow -Wshift-overflow=2 -Wtype-limits -Wunused-but-set-parameter -Wvla -Wwrite-strings -Wl,--no-undefined -pipe -frecord-gcc-switches -Wall -g -O2 -flto=auto -c libs/vkd3d-common/error.c  -fPIC -DPIC -o libs/vkd3d-common/.libs/error.o
libtool: compile:  x86_64-alt-linux-gcc -DHAVE_CONFIG_H -I. -I./include -I./include -I./include/private -I./include/private -Wall -pipe -std=c99 -fvisibility=hidden -Wdeclaration-after-statement -Wempty-body -Wenum-conversion -Wimplicit-fallthrough -Winit-self -Wmissing-prototypes -Wpointer-arith -Wshadow -Wshift-overflow=2 -Wtype-limits -Wunused-but-set-parameter -Wvla -Wwrite-strings -Wl,--no-undefined -pipe -frecord-gcc-switches -Wall -g -O2 -flto=auto -c libs/vkd3d-common/error.c -o libs/vkd3d-common/error.o >/dev/null 2>&1
make[1]: Leaving directory '/usr/src/RPM/BUILD/vkd3d-1.11'
make[1]: Entering directory '/usr/src/RPM/BUILD/vkd3d-1.11'
/bin/sh ./libtool  --tag=CC   --mode=compile x86_64-alt-linux-gcc -DHAVE_CONFIG_H -I. -I./include  -I./include -I./include/private -I./include/private  -Wall -pipe -std=c99 -fvisibility=hidden -Wdeclaration-after-statement -Wempty-body -Wenum-conversion -Wimplicit-fallthrough -Winit-self -Wmissing-prototypes -Wpointer-arith -Wshadow -Wshift-overflow=2 -Wtype-limits -Wunused-but-set-parameter -Wvla -Wwrite-strings -Wl,--no-undefined -pipe -frecord-gcc-switches -Wall -g -O2 -flto=auto -c -o libs/vkd3d-common/utf8.lo libs/vkd3d-common/utf8.c
libtool: compile:  x86_64-alt-linux-gcc -DHAVE_CONFIG_H -I. -I./include -I./include -I./include/private -I./include/private -Wall -pipe -std=c99 -fvisibility=hidden -Wdeclaration-after-statement -Wempty-body -Wenum-conversion -Wimplicit-fallthrough -Winit-self -Wmissing-prototypes -Wpointer-arith -Wshadow -Wshift-overflow=2 -Wtype-limits -Wunused-but-set-parameter -Wvla -Wwrite-strings -Wl,--no-undefined -pipe -frecord-gcc-switches -Wall -g -O2 -flto=auto -c libs/vkd3d-common/utf8.c  -fPIC -DPIC -o libs/vkd3d-common/.libs/utf8.o
libtool: compile:  x86_64-alt-linux-gcc -DHAVE_CONFIG_H -I. -I./include -I./include -I./include/private -I./include/private -Wall -pipe -std=c99 -fvisibility=hidden -Wdeclaration-after-statement -Wempty-body -Wenum-conversion -Wimplicit-fallthrough -Winit-self -Wmissing-prototypes -Wpointer-arith -Wshadow -Wshift-overflow=2 -Wtype-limits -Wunused-but-set-parameter -Wvla -Wwrite-strings -Wl,--no-undefined -pipe -frecord-gcc-switches -Wall -g -O2 -flto=auto -c libs/vkd3d-common/utf8.c -o libs/vkd3d-common/utf8.o >/dev/null 2>&1
make[1]: Leaving directory '/usr/src/RPM/BUILD/vkd3d-1.11'
make[1]: Entering directory '/usr/src/RPM/BUILD/vkd3d-1.11'
/bin/sh ./libtool  --tag=CC   --mode=compile x86_64-alt-linux-gcc -DHAVE_CONFIG_H -I. -I./include  -I./include -I./include/private -I./include/private  -Wall -pipe -std=c99 -fvisibility=hidden -Wdeclaration-after-statement -Wempty-body -Wenum-conversion -Wimplicit-fallthrough -Winit-self -Wmissing-prototypes -Wpointer-arith -Wshadow -Wshift-overflow=2 -Wtype-limits -Wunused-but-set-parameter -Wvla -Wwrite-strings -Wl,--no-undefined -pipe -frecord-gcc-switches -Wall -g -O2 -flto=auto -c -o libs/vkd3d-common/memory.lo libs/vkd3d-common/memory.c
libtool: compile:  x86_64-alt-linux-gcc -DHAVE_CONFIG_H -I. -I./include -I./include -I./include/private -I./include/private -Wall -pipe -std=c99 -fvisibility=hidden -Wdeclaration-after-statement -Wempty-body -Wenum-conversion -Wimplicit-fallthrough -Winit-self -Wmissing-prototypes -Wpointer-arith -Wshadow -Wshift-overflow=2 -Wtype-limits -Wunused-but-set-parameter -Wvla -Wwrite-strings -Wl,--no-undefined -pipe -frecord-gcc-switches -Wall -g -O2 -flto=auto -c libs/vkd3d-common/memory.c  -fPIC -DPIC -o libs/vkd3d-common/.libs/memory.o
libtool: compile:  x86_64-alt-linux-gcc -DHAVE_CONFIG_H -I. -I./include -I./include -I./include/private -I./include/private -Wall -pipe -std=c99 -fvisibility=hidden -Wdeclaration-after-statement -Wempty-body -Wenum-conversion -Wimplicit-fallthrough -Winit-self -Wmissing-prototypes -Wpointer-arith -Wshadow -Wshift-overflow=2 -Wtype-limits -Wunused-but-set-parameter -Wvla -Wwrite-strings -Wl,--no-undefined -pipe -frecord-gcc-switches -Wall -g -O2 -flto=auto -c libs/vkd3d-common/memory.c -o libs/vkd3d-common/memory.o >/dev/null 2>&1
make[1]: Leaving directory '/usr/src/RPM/BUILD/vkd3d-1.11'
make[1]: Entering directory '/usr/src/RPM/BUILD/vkd3d-1.11'
/bin/sh ./libtool  --tag=CC   --mode=compile x86_64-alt-linux-gcc -DHAVE_CONFIG_H -I. -I./include  -I./include -I./include/private -I./include/private  -Wall -pipe -std=c99 -fvisibility=hidden -Wdeclaration-after-statement -Wempty-body -Wenum-conversion -Wimplicit-fallthrough -Winit-self -Wmissing-prototypes -Wpointer-arith -Wshadow -Wshift-overflow=2 -Wtype-limits -Wunused-but-set-parameter -Wvla -Wwrite-strings -Wl,--no-undefined -pipe -frecord-gcc-switches -Wall -g -O2 -flto=auto -c -o libs/vkd3d-common/debug.lo libs/vkd3d-common/debug.c
libtool: compile:  x86_64-alt-linux-gcc -DHAVE_CONFIG_H -I. -I./include -I./include -I./include/private -I./include/private -Wall -pipe -std=c99 -fvisibility=hidden -Wdeclaration-after-statement -Wempty-body -Wenum-conversion -Wimplicit-fallthrough -Winit-self -Wmissing-prototypes -Wpointer-arith -Wshadow -Wshift-overflow=2 -Wtype-limits -Wunused-but-set-parameter -Wvla -Wwrite-strings -Wl,--no-undefined -pipe -frecord-gcc-switches -Wall -g -O2 -flto=auto -c libs/vkd3d-common/debug.c  -fPIC -DPIC -o libs/vkd3d-common/.libs/debug.o
libtool: compile:  x86_64-alt-linux-gcc -DHAVE_CONFIG_H -I. -I./include -I./include -I./include/private -I./include/private -Wall -pipe -std=c99 -fvisibility=hidden -Wdeclaration-after-statement -Wempty-body -Wenum-conversion -Wimplicit-fallthrough -Winit-self -Wmissing-prototypes -Wpointer-arith -Wshadow -Wshift-overflow=2 -Wtype-limits -Wunused-but-set-parameter -Wvla -Wwrite-strings -Wl,--no-undefined -pipe -frecord-gcc-switches -Wall -g -O2 -flto=auto -c libs/vkd3d-common/debug.c -o libs/vkd3d-common/debug.o >/dev/null 2>&1
make[1]: Leaving directory '/usr/src/RPM/BUILD/vkd3d-1.11'
make[1]: Entering directory '/usr/src/RPM/BUILD/vkd3d-1.11'
x86_64-alt-linux-gcc -DHAVE_CONFIG_H -I. -I./include  -I./include -I./include/private -I./include/private  -Wall -pipe -std=c99 -fvisibility=hidden -Wdeclaration-after-statement -Wempty-body -Wenum-conversion -Wimplicit-fallthrough -Winit-self -Wmissing-prototypes -Wpointer-arith -Wshadow -Wshift-overflow=2 -Wtype-limits -Wunused-but-set-parameter -Wvla -Wwrite-strings -Wl,--no-undefined  -pipe -frecord-gcc-switches -Wall -g -O2 -flto=auto -c -o programs/vkd3d-dxbc/vkd3d_dxbc-main.o `test -f 'programs/vkd3d-dxbc/main.c' || echo './'`programs/vkd3d-dxbc/main.c
make[1]: Leaving directory '/usr/src/RPM/BUILD/vkd3d-1.11'
make[1]: Entering directory '/usr/src/RPM/BUILD/vkd3d-1.11'
/bin/sh ./libtool  --tag=CC   --mode=compile x86_64-alt-linux-gcc -DHAVE_CONFIG_H -I. -I./include  -I./include -I./include/private -I./include/private  -Wall -pipe -std=c99 -fvisibility=hidden -Wdeclaration-after-statement -Wempty-body -Wenum-conversion -Wimplicit-fallthrough -Winit-self -Wmissing-prototypes -Wpointer-arith -Wshadow -Wshift-overflow=2 -Wtype-limits -Wunused-but-set-parameter -Wvla -Wwrite-strings -Wl,--no-undefined -DLIBVKD3D_SHADER_SOURCE -I./libs/vkd3d-shader  -pipe -frecord-gcc-switches -Wall -g -O2 -flto=auto -c -o libs/vkd3d-shader/libvkd3d_shader_la-preproc.yy.lo `test -f 'libs/vkd3d-shader/preproc.yy.c' || echo './'`libs/vkd3d-shader/preproc.yy.c
libtool: compile:  x86_64-alt-linux-gcc -DHAVE_CONFIG_H -I. -I./include -I./include -I./include/private -I./include/private -Wall -pipe -std=c99 -fvisibility=hidden -Wdeclaration-after-statement -Wempty-body -Wenum-conversion -Wimplicit-fallthrough -Winit-self -Wmissing-prototypes -Wpointer-arith -Wshadow -Wshift-overflow=2 -Wtype-limits -Wunused-but-set-parameter -Wvla -Wwrite-strings -Wl,--no-undefined -DLIBVKD3D_SHADER_SOURCE -I./libs/vkd3d-shader -pipe -frecord-gcc-switches -Wall -g -O2 -flto=auto -c libs/vkd3d-shader/preproc.yy.c  -fPIC -DPIC -o libs/vkd3d-shader/.libs/libvkd3d_shader_la-preproc.yy.o
libtool: compile:  x86_64-alt-linux-gcc -DHAVE_CONFIG_H -I. -I./include -I./include -I./include/private -I./include/private -Wall -pipe -std=c99 -fvisibility=hidden -Wdeclaration-after-statement -Wempty-body -Wenum-conversion -Wimplicit-fallthrough -Winit-self -Wmissing-prototypes -Wpointer-arith -Wshadow -Wshift-overflow=2 -Wtype-limits -Wunused-but-set-parameter -Wvla -Wwrite-strings -Wl,--no-undefined -DLIBVKD3D_SHADER_SOURCE -I./libs/vkd3d-shader -pipe -frecord-gcc-switches -Wall -g -O2 -flto=auto -c libs/vkd3d-shader/preproc.yy.c -o libs/vkd3d-shader/libvkd3d_shader_la-preproc.yy.o >/dev/null 2>&1
make[1]: Leaving directory '/usr/src/RPM/BUILD/vkd3d-1.11'
make[1]: Entering directory '/usr/src/RPM/BUILD/vkd3d-1.11'
/bin/sh ./libtool  --tag=CC   --mode=compile x86_64-alt-linux-gcc -DHAVE_CONFIG_H -I. -I./include  -I./include -I./include/private -I./include/private  -Wall -pipe -std=c99 -fvisibility=hidden -Wdeclaration-after-statement -Wempty-body -Wenum-conversion -Wimplicit-fallthrough -Winit-self -Wmissing-prototypes -Wpointer-arith -Wshadow -Wshift-overflow=2 -Wtype-limits -Wunused-but-set-parameter -Wvla -Wwrite-strings -Wl,--no-undefined -DLIBVKD3D_SHADER_SOURCE -I./libs/vkd3d-shader  -pipe -frecord-gcc-switches -Wall -g -O2 -flto=auto -c -o libs/vkd3d-shader/libvkd3d_shader_la-hlsl.yy.lo `test -f 'libs/vkd3d-shader/hlsl.yy.c' || echo './'`libs/vkd3d-shader/hlsl.yy.c
libtool: compile:  x86_64-alt-linux-gcc -DHAVE_CONFIG_H -I. -I./include -I./include -I./include/private -I./include/private -Wall -pipe -std=c99 -fvisibility=hidden -Wdeclaration-after-statement -Wempty-body -Wenum-conversion -Wimplicit-fallthrough -Winit-self -Wmissing-prototypes -Wpointer-arith -Wshadow -Wshift-overflow=2 -Wtype-limits -Wunused-but-set-parameter -Wvla -Wwrite-strings -Wl,--no-undefined -DLIBVKD3D_SHADER_SOURCE -I./libs/vkd3d-shader -pipe -frecord-gcc-switches -Wall -g -O2 -flto=auto -c libs/vkd3d-shader/hlsl.yy.c  -fPIC -DPIC -o libs/vkd3d-shader/.libs/libvkd3d_shader_la-hlsl.yy.o
libtool: compile:  x86_64-alt-linux-gcc -DHAVE_CONFIG_H -I. -I./include -I./include -I./include/private -I./include/private -Wall -pipe -std=c99 -fvisibility=hidden -Wdeclaration-after-statement -Wempty-body -Wenum-conversion -Wimplicit-fallthrough -Winit-self -Wmissing-prototypes -Wpointer-arith -Wshadow -Wshift-overflow=2 -Wtype-limits -Wunused-but-set-parameter -Wvla -Wwrite-strings -Wl,--no-undefined -DLIBVKD3D_SHADER_SOURCE -I./libs/vkd3d-shader -pipe -frecord-gcc-switches -Wall -g -O2 -flto=auto -c libs/vkd3d-shader/hlsl.yy.c -o libs/vkd3d-shader/libvkd3d_shader_la-hlsl.yy.o >/dev/null 2>&1
make[1]: Leaving directory '/usr/src/RPM/BUILD/vkd3d-1.11'
make[1]: Entering directory '/usr/src/RPM/BUILD/vkd3d-1.11'
/bin/sh ./libtool  --tag=CC   --mode=compile x86_64-alt-linux-gcc -DHAVE_CONFIG_H -I. -I./include  -I./include -I./include/private -I./include/private  -Wall -pipe -std=c99 -fvisibility=hidden -Wdeclaration-after-statement -Wempty-body -Wenum-conversion -Wimplicit-fallthrough -Winit-self -Wmissing-prototypes -Wpointer-arith -Wshadow -Wshift-overflow=2 -Wtype-limits -Wunused-but-set-parameter -Wvla -Wwrite-strings -Wl,--no-undefined -DLIBVKD3D_SHADER_SOURCE -I./libs/vkd3d-shader  -pipe -frecord-gcc-switches -Wall -g -O2 -flto=auto -c -o libs/vkd3d-shader/libvkd3d_shader_la-hlsl.lo `test -f 'libs/vkd3d-shader/hlsl.c' || echo './'`libs/vkd3d-shader/hlsl.c
libtool: compile:  x86_64-alt-linux-gcc -DHAVE_CONFIG_H -I. -I./include -I./include -I./include/private -I./include/private -Wall -pipe -std=c99 -fvisibility=hidden -Wdeclaration-after-statement -Wempty-body -Wenum-conversion -Wimplicit-fallthrough -Winit-self -Wmissing-prototypes -Wpointer-arith -Wshadow -Wshift-overflow=2 -Wtype-limits -Wunused-but-set-parameter -Wvla -Wwrite-strings -Wl,--no-undefined -DLIBVKD3D_SHADER_SOURCE -I./libs/vkd3d-shader -pipe -frecord-gcc-switches -Wall -g -O2 -flto=auto -c libs/vkd3d-shader/hlsl.c  -fPIC -DPIC -o libs/vkd3d-shader/.libs/libvkd3d_shader_la-hlsl.o
libtool: compile:  x86_64-alt-linux-gcc -DHAVE_CONFIG_H -I. -I./include -I./include -I./include/private -I./include/private -Wall -pipe -std=c99 -fvisibility=hidden -Wdeclaration-after-statement -Wempty-body -Wenum-conversion -Wimplicit-fallthrough -Winit-self -Wmissing-prototypes -Wpointer-arith -Wshadow -Wshift-overflow=2 -Wtype-limits -Wunused-but-set-parameter -Wvla -Wwrite-strings -Wl,--no-undefined -DLIBVKD3D_SHADER_SOURCE -I./libs/vkd3d-shader -pipe -frecord-gcc-switches -Wall -g -O2 -flto=auto -c libs/vkd3d-shader/hlsl.c -o libs/vkd3d-shader/libvkd3d_shader_la-hlsl.o >/dev/null 2>&1
make[1]: Leaving directory '/usr/src/RPM/BUILD/vkd3d-1.11'
make[1]: Entering directory '/usr/src/RPM/BUILD/vkd3d-1.11'
/bin/sh ./libtool  --tag=CC   --mode=compile x86_64-alt-linux-gcc -DHAVE_CONFIG_H -I. -I./include  -I./include -I./include/private -I./include/private  -Wall -pipe -std=c99 -fvisibility=hidden -Wdeclaration-after-statement -Wempty-body -Wenum-conversion -Wimplicit-fallthrough -Winit-self -Wmissing-prototypes -Wpointer-arith -Wshadow -Wshift-overflow=2 -Wtype-limits -Wunused-but-set-parameter -Wvla -Wwrite-strings -Wl,--no-undefined -DLIBVKD3D_SHADER_SOURCE -I./libs/vkd3d-shader  -pipe -frecord-gcc-switches -Wall -g -O2 -flto=auto -c -o libs/vkd3d-shader/libvkd3d_shader_la-tpf.lo `test -f 'libs/vkd3d-shader/tpf.c' || echo './'`libs/vkd3d-shader/tpf.c
libtool: compile:  x86_64-alt-linux-gcc -DHAVE_CONFIG_H -I. -I./include -I./include -I./include/private -I./include/private -Wall -pipe -std=c99 -fvisibility=hidden -Wdeclaration-after-statement -Wempty-body -Wenum-conversion -Wimplicit-fallthrough -Winit-self -Wmissing-prototypes -Wpointer-arith -Wshadow -Wshift-overflow=2 -Wtype-limits -Wunused-but-set-parameter -Wvla -Wwrite-strings -Wl,--no-undefined -DLIBVKD3D_SHADER_SOURCE -I./libs/vkd3d-shader -pipe -frecord-gcc-switches -Wall -g -O2 -flto=auto -c libs/vkd3d-shader/tpf.c  -fPIC -DPIC -o libs/vkd3d-shader/.libs/libvkd3d_shader_la-tpf.o
libtool: compile:  x86_64-alt-linux-gcc -DHAVE_CONFIG_H -I. -I./include -I./include -I./include/private -I./include/private -Wall -pipe -std=c99 -fvisibility=hidden -Wdeclaration-after-statement -Wempty-body -Wenum-conversion -Wimplicit-fallthrough -Winit-self -Wmissing-prototypes -Wpointer-arith -Wshadow -Wshift-overflow=2 -Wtype-limits -Wunused-but-set-parameter -Wvla -Wwrite-strings -Wl,--no-undefined -DLIBVKD3D_SHADER_SOURCE -I./libs/vkd3d-shader -pipe -frecord-gcc-switches -Wall -g -O2 -flto=auto -c libs/vkd3d-shader/tpf.c -o libs/vkd3d-shader/libvkd3d_shader_la-tpf.o >/dev/null 2>&1
make[1]: Leaving directory '/usr/src/RPM/BUILD/vkd3d-1.11'
make[1]: Entering directory '/usr/src/RPM/BUILD/vkd3d-1.11'
/bin/sh ./libtool  --tag=CC   --mode=compile x86_64-alt-linux-gcc -DHAVE_CONFIG_H -I. -I./include  -I./include -I./include/private -I./include/private  -Wall -pipe -std=c99 -fvisibility=hidden -Wdeclaration-after-statement -Wempty-body -Wenum-conversion -Wimplicit-fallthrough -Winit-self -Wmissing-prototypes -Wpointer-arith -Wshadow -Wshift-overflow=2 -Wtype-limits -Wunused-but-set-parameter -Wvla -Wwrite-strings -Wl,--no-undefined -DLIBVKD3D_SHADER_SOURCE -I./libs/vkd3d-shader  -pipe -frecord-gcc-switches -Wall -g -O2 -flto=auto -c -o libs/vkd3d-shader/libvkd3d_shader_la-ir.lo `test -f 'libs/vkd3d-shader/ir.c' || echo './'`libs/vkd3d-shader/ir.c
libtool: compile:  x86_64-alt-linux-gcc -DHAVE_CONFIG_H -I. -I./include -I./include -I./include/private -I./include/private -Wall -pipe -std=c99 -fvisibility=hidden -Wdeclaration-after-statement -Wempty-body -Wenum-conversion -Wimplicit-fallthrough -Winit-self -Wmissing-prototypes -Wpointer-arith -Wshadow -Wshift-overflow=2 -Wtype-limits -Wunused-but-set-parameter -Wvla -Wwrite-strings -Wl,--no-undefined -DLIBVKD3D_SHADER_SOURCE -I./libs/vkd3d-shader -pipe -frecord-gcc-switches -Wall -g -O2 -flto=auto -c libs/vkd3d-shader/ir.c  -fPIC -DPIC -o libs/vkd3d-shader/.libs/libvkd3d_shader_la-ir.o
libtool: compile:  x86_64-alt-linux-gcc -DHAVE_CONFIG_H -I. -I./include -I./include -I./include/private -I./include/private -Wall -pipe -std=c99 -fvisibility=hidden -Wdeclaration-after-statement -Wempty-body -Wenum-conversion -Wimplicit-fallthrough -Winit-self -Wmissing-prototypes -Wpointer-arith -Wshadow -Wshift-overflow=2 -Wtype-limits -Wunused-but-set-parameter -Wvla -Wwrite-strings -Wl,--no-undefined -DLIBVKD3D_SHADER_SOURCE -I./libs/vkd3d-shader -pipe -frecord-gcc-switches -Wall -g -O2 -flto=auto -c libs/vkd3d-shader/ir.c -o libs/vkd3d-shader/libvkd3d_shader_la-ir.o >/dev/null 2>&1
make[1]: Leaving directory '/usr/src/RPM/BUILD/vkd3d-1.11'
make[1]: Entering directory '/usr/src/RPM/BUILD/vkd3d-1.11'
/bin/sh ./libtool  --tag=CC   --mode=compile x86_64-alt-linux-gcc -DHAVE_CONFIG_H -I. -I./include  -I./include -I./include/private -I./include/private  -Wall -pipe -std=c99 -fvisibility=hidden -Wdeclaration-after-statement -Wempty-body -Wenum-conversion -Wimplicit-fallthrough -Winit-self -Wmissing-prototypes -Wpointer-arith -Wshadow -Wshift-overflow=2 -Wtype-limits -Wunused-but-set-parameter -Wvla -Wwrite-strings -Wl,--no-undefined -pipe -frecord-gcc-switches -Wall -g -O2 -flto=auto -c -o libs/vkd3d-common/blob.lo libs/vkd3d-common/blob.c
libtool: compile:  x86_64-alt-linux-gcc -DHAVE_CONFIG_H -I. -I./include -I./include -I./include/private -I./include/private -Wall -pipe -std=c99 -fvisibility=hidden -Wdeclaration-after-statement -Wempty-body -Wenum-conversion -Wimplicit-fallthrough -Winit-self -Wmissing-prototypes -Wpointer-arith -Wshadow -Wshift-overflow=2 -Wtype-limits -Wunused-but-set-parameter -Wvla -Wwrite-strings -Wl,--no-undefined -pipe -frecord-gcc-switches -Wall -g -O2 -flto=auto -c libs/vkd3d-common/blob.c  -fPIC -DPIC -o libs/vkd3d-common/.libs/blob.o
libtool: compile:  x86_64-alt-linux-gcc -DHAVE_CONFIG_H -I. -I./include -I./include -I./include/private -I./include/private -Wall -pipe -std=c99 -fvisibility=hidden -Wdeclaration-after-statement -Wempty-body -Wenum-conversion -Wimplicit-fallthrough -Winit-self -Wmissing-prototypes -Wpointer-arith -Wshadow -Wshift-overflow=2 -Wtype-limits -Wunused-but-set-parameter -Wvla -Wwrite-strings -Wl,--no-undefined -pipe -frecord-gcc-switches -Wall -g -O2 -flto=auto -c libs/vkd3d-common/blob.c -o libs/vkd3d-common/blob.o >/dev/null 2>&1
make[1]: Leaving directory '/usr/src/RPM/BUILD/vkd3d-1.11'
make[1]: Entering directory '/usr/src/RPM/BUILD/vkd3d-1.11'
/bin/sh ./libtool  --tag=CC   --mode=link x86_64-alt-linux-gcc -Wall -pipe -std=c99 -fvisibility=hidden -Wdeclaration-after-statement -Wempty-body -Wenum-conversion -Wimplicit-fallthrough -Winit-self -Wmissing-prototypes -Wpointer-arith -Wshadow -Wshift-overflow=2 -Wtype-limits -Wunused-but-set-parameter -Wvla -Wwrite-strings -Wl,--no-undefined -pipe -frecord-gcc-switches -Wall -g -O2 -flto=auto -no-undefined  -o libvkd3d-common.la  libs/vkd3d-common/blob.lo libs/vkd3d-common/debug.lo libs/vkd3d-common/error.lo libs/vkd3d-common/memory.lo libs/vkd3d-common/utf8.lo -pthread -lm 
libtool: link: ar cr .libs/libvkd3d-common.a libs/vkd3d-common/.libs/blob.o libs/vkd3d-common/.libs/debug.o libs/vkd3d-common/.libs/error.o libs/vkd3d-common/.libs/memory.o libs/vkd3d-common/.libs/utf8.o 
libtool: link: ranlib .libs/libvkd3d-common.a
libtool: link: ( cd ".libs" && rm -f "libvkd3d-common.la" && ln -s "../libvkd3d-common.la" "libvkd3d-common.la" )
make[1]: Leaving directory '/usr/src/RPM/BUILD/vkd3d-1.11'
make[1]: Entering directory '/usr/src/RPM/BUILD/vkd3d-1.11'
/bin/sh ./libtool  --tag=CC   --mode=compile x86_64-alt-linux-gcc -DHAVE_CONFIG_H -I. -I./include  -I./include -I./include/private -I./include/private  -Wall -pipe -std=c99 -fvisibility=hidden -Wdeclaration-after-statement -Wempty-body -Wenum-conversion -Wimplicit-fallthrough -Winit-self -Wmissing-prototypes -Wpointer-arith -Wshadow -Wshift-overflow=2 -Wtype-limits -Wunused-but-set-parameter -Wvla -Wwrite-strings -Wl,--no-undefined -DLIBVKD3D_SHADER_SOURCE -I./libs/vkd3d-shader  -pipe -frecord-gcc-switches -Wall -g -O2 -flto=auto -c -o libs/vkd3d-shader/libvkd3d_shader_la-hlsl_codegen.lo `test -f 'libs/vkd3d-shader/hlsl_codegen.c' || echo './'`libs/vkd3d-shader/hlsl_codegen.c
libtool: compile:  x86_64-alt-linux-gcc -DHAVE_CONFIG_H -I. -I./include -I./include -I./include/private -I./include/private -Wall -pipe -std=c99 -fvisibility=hidden -Wdeclaration-after-statement -Wempty-body -Wenum-conversion -Wimplicit-fallthrough -Winit-self -Wmissing-prototypes -Wpointer-arith -Wshadow -Wshift-overflow=2 -Wtype-limits -Wunused-but-set-parameter -Wvla -Wwrite-strings -Wl,--no-undefined -DLIBVKD3D_SHADER_SOURCE -I./libs/vkd3d-shader -pipe -frecord-gcc-switches -Wall -g -O2 -flto=auto -c libs/vkd3d-shader/hlsl_codegen.c  -fPIC -DPIC -o libs/vkd3d-shader/.libs/libvkd3d_shader_la-hlsl_codegen.o
libtool: compile:  x86_64-alt-linux-gcc -DHAVE_CONFIG_H -I. -I./include -I./include -I./include/private -I./include/private -Wall -pipe -std=c99 -fvisibility=hidden -Wdeclaration-after-statement -Wempty-body -Wenum-conversion -Wimplicit-fallthrough -Winit-self -Wmissing-prototypes -Wpointer-arith -Wshadow -Wshift-overflow=2 -Wtype-limits -Wunused-but-set-parameter -Wvla -Wwrite-strings -Wl,--no-undefined -DLIBVKD3D_SHADER_SOURCE -I./libs/vkd3d-shader -pipe -frecord-gcc-switches -Wall -g -O2 -flto=auto -c libs/vkd3d-shader/hlsl_codegen.c -o libs/vkd3d-shader/libvkd3d_shader_la-hlsl_codegen.o >/dev/null 2>&1
make[1]: Leaving directory '/usr/src/RPM/BUILD/vkd3d-1.11'
make[1]: Entering directory '/usr/src/RPM/BUILD/vkd3d-1.11'
/bin/sh ./libtool  --tag=CC   --mode=compile x86_64-alt-linux-gcc -DHAVE_CONFIG_H -I. -I./include  -I./include -I./include/private -I./include/private  -Wall -pipe -std=c99 -fvisibility=hidden -Wdeclaration-after-statement -Wempty-body -Wenum-conversion -Wimplicit-fallthrough -Winit-self -Wmissing-prototypes -Wpointer-arith -Wshadow -Wshift-overflow=2 -Wtype-limits -Wunused-but-set-parameter -Wvla -Wwrite-strings -Wl,--no-undefined -DLIBVKD3D_SHADER_SOURCE -I./libs/vkd3d-shader  -pipe -frecord-gcc-switches -Wall -g -O2 -flto=auto -c -o libs/vkd3d-shader/libvkd3d_shader_la-hlsl.tab.lo `test -f 'libs/vkd3d-shader/hlsl.tab.c' || echo './'`libs/vkd3d-shader/hlsl.tab.c
libtool: compile:  x86_64-alt-linux-gcc -DHAVE_CONFIG_H -I. -I./include -I./include -I./include/private -I./include/private -Wall -pipe -std=c99 -fvisibility=hidden -Wdeclaration-after-statement -Wempty-body -Wenum-conversion -Wimplicit-fallthrough -Winit-self -Wmissing-prototypes -Wpointer-arith -Wshadow -Wshift-overflow=2 -Wtype-limits -Wunused-but-set-parameter -Wvla -Wwrite-strings -Wl,--no-undefined -DLIBVKD3D_SHADER_SOURCE -I./libs/vkd3d-shader -pipe -frecord-gcc-switches -Wall -g -O2 -flto=auto -c libs/vkd3d-shader/hlsl.tab.c  -fPIC -DPIC -o libs/vkd3d-shader/.libs/libvkd3d_shader_la-hlsl.tab.o
libtool: compile:  x86_64-alt-linux-gcc -DHAVE_CONFIG_H -I. -I./include -I./include -I./include/private -I./include/private -Wall -pipe -std=c99 -fvisibility=hidden -Wdeclaration-after-statement -Wempty-body -Wenum-conversion -Wimplicit-fallthrough -Winit-self -Wmissing-prototypes -Wpointer-arith -Wshadow -Wshift-overflow=2 -Wtype-limits -Wunused-but-set-parameter -Wvla -Wwrite-strings -Wl,--no-undefined -DLIBVKD3D_SHADER_SOURCE -I./libs/vkd3d-shader -pipe -frecord-gcc-switches -Wall -g -O2 -flto=auto -c libs/vkd3d-shader/hlsl.tab.c -o libs/vkd3d-shader/libvkd3d_shader_la-hlsl.tab.o >/dev/null 2>&1
make[1]: Leaving directory '/usr/src/RPM/BUILD/vkd3d-1.11'
make[1]: Entering directory '/usr/src/RPM/BUILD/vkd3d-1.11'
/bin/sh ./libtool  --tag=CC   --mode=compile x86_64-alt-linux-gcc -DHAVE_CONFIG_H -I. -I./include  -I./include -I./include/private -I./include/private  -Wall -pipe -std=c99 -fvisibility=hidden -Wdeclaration-after-statement -Wempty-body -Wenum-conversion -Wimplicit-fallthrough -Winit-self -Wmissing-prototypes -Wpointer-arith -Wshadow -Wshift-overflow=2 -Wtype-limits -Wunused-but-set-parameter -Wvla -Wwrite-strings -Wl,--no-undefined -DLIBVKD3D_SHADER_SOURCE -I./libs/vkd3d-shader  -pipe -frecord-gcc-switches -Wall -g -O2 -flto=auto -c -o libs/vkd3d-shader/libvkd3d_shader_la-dxil.lo `test -f 'libs/vkd3d-shader/dxil.c' || echo './'`libs/vkd3d-shader/dxil.c
libtool: compile:  x86_64-alt-linux-gcc -DHAVE_CONFIG_H -I. -I./include -I./include -I./include/private -I./include/private -Wall -pipe -std=c99 -fvisibility=hidden -Wdeclaration-after-statement -Wempty-body -Wenum-conversion -Wimplicit-fallthrough -Winit-self -Wmissing-prototypes -Wpointer-arith -Wshadow -Wshift-overflow=2 -Wtype-limits -Wunused-but-set-parameter -Wvla -Wwrite-strings -Wl,--no-undefined -DLIBVKD3D_SHADER_SOURCE -I./libs/vkd3d-shader -pipe -frecord-gcc-switches -Wall -g -O2 -flto=auto -c libs/vkd3d-shader/dxil.c  -fPIC -DPIC -o libs/vkd3d-shader/.libs/libvkd3d_shader_la-dxil.o
libtool: compile:  x86_64-alt-linux-gcc -DHAVE_CONFIG_H -I. -I./include -I./include -I./include/private -I./include/private -Wall -pipe -std=c99 -fvisibility=hidden -Wdeclaration-after-statement -Wempty-body -Wenum-conversion -Wimplicit-fallthrough -Winit-self -Wmissing-prototypes -Wpointer-arith -Wshadow -Wshift-overflow=2 -Wtype-limits -Wunused-but-set-parameter -Wvla -Wwrite-strings -Wl,--no-undefined -DLIBVKD3D_SHADER_SOURCE -I./libs/vkd3d-shader -pipe -frecord-gcc-switches -Wall -g -O2 -flto=auto -c libs/vkd3d-shader/dxil.c -o libs/vkd3d-shader/libvkd3d_shader_la-dxil.o >/dev/null 2>&1
make[1]: Leaving directory '/usr/src/RPM/BUILD/vkd3d-1.11'
make[1]: Entering directory '/usr/src/RPM/BUILD/vkd3d-1.11'
/bin/sh ./libtool  --tag=CC   --mode=compile x86_64-alt-linux-gcc -DHAVE_CONFIG_H -I. -I./include  -I./include -I./include/private -I./include/private  -Wall -pipe -std=c99 -fvisibility=hidden -Wdeclaration-after-statement -Wempty-body -Wenum-conversion -Wimplicit-fallthrough -Winit-self -Wmissing-prototypes -Wpointer-arith -Wshadow -Wshift-overflow=2 -Wtype-limits -Wunused-but-set-parameter -Wvla -Wwrite-strings -Wl,--no-undefined -DLIBVKD3D_UTILS_SOURCE -pipe -frecord-gcc-switches -Wall -g -O2 -flto=auto -c -o libs/vkd3d-utils/libvkd3d_utils_la-reflection.lo `test -f 'libs/vkd3d-utils/reflection.c' || echo './'`libs/vkd3d-utils/reflection.c
libtool: compile:  x86_64-alt-linux-gcc -DHAVE_CONFIG_H -I. -I./include -I./include -I./include/private -I./include/private -Wall -pipe -std=c99 -fvisibility=hidden -Wdeclaration-after-statement -Wempty-body -Wenum-conversion -Wimplicit-fallthrough -Winit-self -Wmissing-prototypes -Wpointer-arith -Wshadow -Wshift-overflow=2 -Wtype-limits -Wunused-but-set-parameter -Wvla -Wwrite-strings -Wl,--no-undefined -DLIBVKD3D_UTILS_SOURCE -pipe -frecord-gcc-switches -Wall -g -O2 -flto=auto -c libs/vkd3d-utils/reflection.c  -fPIC -DPIC -o libs/vkd3d-utils/.libs/libvkd3d_utils_la-reflection.o
libtool: compile:  x86_64-alt-linux-gcc -DHAVE_CONFIG_H -I. -I./include -I./include -I./include/private -I./include/private -Wall -pipe -std=c99 -fvisibility=hidden -Wdeclaration-after-statement -Wempty-body -Wenum-conversion -Wimplicit-fallthrough -Winit-self -Wmissing-prototypes -Wpointer-arith -Wshadow -Wshift-overflow=2 -Wtype-limits -Wunused-but-set-parameter -Wvla -Wwrite-strings -Wl,--no-undefined -DLIBVKD3D_UTILS_SOURCE -pipe -frecord-gcc-switches -Wall -g -O2 -flto=auto -c libs/vkd3d-utils/reflection.c -o libs/vkd3d-utils/libvkd3d_utils_la-reflection.o >/dev/null 2>&1
make[1]: Leaving directory '/usr/src/RPM/BUILD/vkd3d-1.11'
make[1]: Entering directory '/usr/src/RPM/BUILD/vkd3d-1.11'
/bin/sh ./libtool  --tag=CC   --mode=compile x86_64-alt-linux-gcc -DHAVE_CONFIG_H -I. -I./include  -I./include -I./include/private -I./include/private  -Wall -pipe -std=c99 -fvisibility=hidden -Wdeclaration-after-statement -Wempty-body -Wenum-conversion -Wimplicit-fallthrough -Winit-self -Wmissing-prototypes -Wpointer-arith -Wshadow -Wshift-overflow=2 -Wtype-limits -Wunused-but-set-parameter -Wvla -Wwrite-strings -Wl,--no-undefined -DLIBVKD3D_SOURCE -pipe -frecord-gcc-switches -Wall -g -O2 -flto=auto -c -o libs/vkd3d/libvkd3d_la-utils.lo `test -f 'libs/vkd3d/utils.c' || echo './'`libs/vkd3d/utils.c
libtool: compile:  x86_64-alt-linux-gcc -DHAVE_CONFIG_H -I. -I./include -I./include -I./include/private -I./include/private -Wall -pipe -std=c99 -fvisibility=hidden -Wdeclaration-after-statement -Wempty-body -Wenum-conversion -Wimplicit-fallthrough -Winit-self -Wmissing-prototypes -Wpointer-arith -Wshadow -Wshift-overflow=2 -Wtype-limits -Wunused-but-set-parameter -Wvla -Wwrite-strings -Wl,--no-undefined -DLIBVKD3D_SOURCE -pipe -frecord-gcc-switches -Wall -g -O2 -flto=auto -c libs/vkd3d/utils.c  -fPIC -DPIC -o libs/vkd3d/.libs/libvkd3d_la-utils.o
libtool: compile:  x86_64-alt-linux-gcc -DHAVE_CONFIG_H -I. -I./include -I./include -I./include/private -I./include/private -Wall -pipe -std=c99 -fvisibility=hidden -Wdeclaration-after-statement -Wempty-body -Wenum-conversion -Wimplicit-fallthrough -Winit-self -Wmissing-prototypes -Wpointer-arith -Wshadow -Wshift-overflow=2 -Wtype-limits -Wunused-but-set-parameter -Wvla -Wwrite-strings -Wl,--no-undefined -DLIBVKD3D_SOURCE -pipe -frecord-gcc-switches -Wall -g -O2 -flto=auto -c libs/vkd3d/utils.c -o libs/vkd3d/libvkd3d_la-utils.o >/dev/null 2>&1
make[1]: Leaving directory '/usr/src/RPM/BUILD/vkd3d-1.11'
make[1]: Entering directory '/usr/src/RPM/BUILD/vkd3d-1.11'
/bin/sh ./libtool  --tag=CC   --mode=compile x86_64-alt-linux-gcc -DHAVE_CONFIG_H -I. -I./include  -I./include -I./include/private -I./include/private  -Wall -pipe -std=c99 -fvisibility=hidden -Wdeclaration-after-statement -Wempty-body -Wenum-conversion -Wimplicit-fallthrough -Winit-self -Wmissing-prototypes -Wpointer-arith -Wshadow -Wshift-overflow=2 -Wtype-limits -Wunused-but-set-parameter -Wvla -Wwrite-strings -Wl,--no-undefined -DLIBVKD3D_UTILS_SOURCE -pipe -frecord-gcc-switches -Wall -g -O2 -flto=auto -c -o libs/vkd3d-utils/libvkd3d_utils_la-vkd3d_utils_main.lo `test -f 'libs/vkd3d-utils/vkd3d_utils_main.c' || echo './'`libs/vkd3d-utils/vkd3d_utils_main.c
libtool: compile:  x86_64-alt-linux-gcc -DHAVE_CONFIG_H -I. -I./include -I./include -I./include/private -I./include/private -Wall -pipe -std=c99 -fvisibility=hidden -Wdeclaration-after-statement -Wempty-body -Wenum-conversion -Wimplicit-fallthrough -Winit-self -Wmissing-prototypes -Wpointer-arith -Wshadow -Wshift-overflow=2 -Wtype-limits -Wunused-but-set-parameter -Wvla -Wwrite-strings -Wl,--no-undefined -DLIBVKD3D_UTILS_SOURCE -pipe -frecord-gcc-switches -Wall -g -O2 -flto=auto -c libs/vkd3d-utils/vkd3d_utils_main.c  -fPIC -DPIC -o libs/vkd3d-utils/.libs/libvkd3d_utils_la-vkd3d_utils_main.o
libtool: compile:  x86_64-alt-linux-gcc -DHAVE_CONFIG_H -I. -I./include -I./include -I./include/private -I./include/private -Wall -pipe -std=c99 -fvisibility=hidden -Wdeclaration-after-statement -Wempty-body -Wenum-conversion -Wimplicit-fallthrough -Winit-self -Wmissing-prototypes -Wpointer-arith -Wshadow -Wshift-overflow=2 -Wtype-limits -Wunused-but-set-parameter -Wvla -Wwrite-strings -Wl,--no-undefined -DLIBVKD3D_UTILS_SOURCE -pipe -frecord-gcc-switches -Wall -g -O2 -flto=auto -c libs/vkd3d-utils/vkd3d_utils_main.c -o libs/vkd3d-utils/libvkd3d_utils_la-vkd3d_utils_main.o >/dev/null 2>&1
make[1]: Leaving directory '/usr/src/RPM/BUILD/vkd3d-1.11'
make[1]: Entering directory '/usr/src/RPM/BUILD/vkd3d-1.11'
/bin/sh ./libtool  --tag=CC   --mode=compile x86_64-alt-linux-gcc -DHAVE_CONFIG_H -I. -I./include  -I./include -I./include/private -I./include/private  -Wall -pipe -std=c99 -fvisibility=hidden -Wdeclaration-after-statement -Wempty-body -Wenum-conversion -Wimplicit-fallthrough -Winit-self -Wmissing-prototypes -Wpointer-arith -Wshadow -Wshift-overflow=2 -Wtype-limits -Wunused-but-set-parameter -Wvla -Wwrite-strings -Wl,--no-undefined -DLIBVKD3D_SOURCE -pipe -frecord-gcc-switches -Wall -g -O2 -flto=auto -c -o libs/vkd3d/libvkd3d_la-vkd3d_main.lo `test -f 'libs/vkd3d/vkd3d_main.c' || echo './'`libs/vkd3d/vkd3d_main.c
libtool: compile:  x86_64-alt-linux-gcc -DHAVE_CONFIG_H -I. -I./include -I./include -I./include/private -I./include/private -Wall -pipe -std=c99 -fvisibility=hidden -Wdeclaration-after-statement -Wempty-body -Wenum-conversion -Wimplicit-fallthrough -Winit-self -Wmissing-prototypes -Wpointer-arith -Wshadow -Wshift-overflow=2 -Wtype-limits -Wunused-but-set-parameter -Wvla -Wwrite-strings -Wl,--no-undefined -DLIBVKD3D_SOURCE -pipe -frecord-gcc-switches -Wall -g -O2 -flto=auto -c libs/vkd3d/vkd3d_main.c  -fPIC -DPIC -o libs/vkd3d/.libs/libvkd3d_la-vkd3d_main.o
libtool: compile:  x86_64-alt-linux-gcc -DHAVE_CONFIG_H -I. -I./include -I./include -I./include/private -I./include/private -Wall -pipe -std=c99 -fvisibility=hidden -Wdeclaration-after-statement -Wempty-body -Wenum-conversion -Wimplicit-fallthrough -Winit-self -Wmissing-prototypes -Wpointer-arith -Wshadow -Wshift-overflow=2 -Wtype-limits -Wunused-but-set-parameter -Wvla -Wwrite-strings -Wl,--no-undefined -DLIBVKD3D_SOURCE -pipe -frecord-gcc-switches -Wall -g -O2 -flto=auto -c libs/vkd3d/vkd3d_main.c -o libs/vkd3d/libvkd3d_la-vkd3d_main.o >/dev/null 2>&1
make[1]: Leaving directory '/usr/src/RPM/BUILD/vkd3d-1.11'
make[1]: Entering directory '/usr/src/RPM/BUILD/vkd3d-1.11'
/bin/sh ./libtool  --tag=CC   --mode=compile x86_64-alt-linux-gcc -DHAVE_CONFIG_H -I. -I./include  -I./include -I./include/private -I./include/private  -Wall -pipe -std=c99 -fvisibility=hidden -Wdeclaration-after-statement -Wempty-body -Wenum-conversion -Wimplicit-fallthrough -Winit-self -Wmissing-prototypes -Wpointer-arith -Wshadow -Wshift-overflow=2 -Wtype-limits -Wunused-but-set-parameter -Wvla -Wwrite-strings -Wl,--no-undefined -DLIBVKD3D_SOURCE -pipe -frecord-gcc-switches -Wall -g -O2 -flto=auto -c -o libs/vkd3d/libvkd3d_la-state.lo `test -f 'libs/vkd3d/state.c' || echo './'`libs/vkd3d/state.c
libtool: compile:  x86_64-alt-linux-gcc -DHAVE_CONFIG_H -I. -I./include -I./include -I./include/private -I./include/private -Wall -pipe -std=c99 -fvisibility=hidden -Wdeclaration-after-statement -Wempty-body -Wenum-conversion -Wimplicit-fallthrough -Winit-self -Wmissing-prototypes -Wpointer-arith -Wshadow -Wshift-overflow=2 -Wtype-limits -Wunused-but-set-parameter -Wvla -Wwrite-strings -Wl,--no-undefined -DLIBVKD3D_SOURCE -pipe -frecord-gcc-switches -Wall -g -O2 -flto=auto -c libs/vkd3d/state.c  -fPIC -DPIC -o libs/vkd3d/.libs/libvkd3d_la-state.o
libtool: compile:  x86_64-alt-linux-gcc -DHAVE_CONFIG_H -I. -I./include -I./include -I./include/private -I./include/private -Wall -pipe -std=c99 -fvisibility=hidden -Wdeclaration-after-statement -Wempty-body -Wenum-conversion -Wimplicit-fallthrough -Winit-self -Wmissing-prototypes -Wpointer-arith -Wshadow -Wshift-overflow=2 -Wtype-limits -Wunused-but-set-parameter -Wvla -Wwrite-strings -Wl,--no-undefined -DLIBVKD3D_SOURCE -pipe -frecord-gcc-switches -Wall -g -O2 -flto=auto -c libs/vkd3d/state.c -o libs/vkd3d/libvkd3d_la-state.o >/dev/null 2>&1
make[1]: Leaving directory '/usr/src/RPM/BUILD/vkd3d-1.11'
make[1]: Entering directory '/usr/src/RPM/BUILD/vkd3d-1.11'
/bin/sh ./libtool  --tag=CC   --mode=compile x86_64-alt-linux-gcc -DHAVE_CONFIG_H -I. -I./include  -I./include -I./include/private -I./include/private  -Wall -pipe -std=c99 -fvisibility=hidden -Wdeclaration-after-statement -Wempty-body -Wenum-conversion -Wimplicit-fallthrough -Winit-self -Wmissing-prototypes -Wpointer-arith -Wshadow -Wshift-overflow=2 -Wtype-limits -Wunused-but-set-parameter -Wvla -Wwrite-strings -Wl,--no-undefined -DLIBVKD3D_SHADER_SOURCE -I./libs/vkd3d-shader  -pipe -frecord-gcc-switches -Wall -g -O2 -flto=auto -c -o libs/vkd3d-shader/libvkd3d_shader_la-spirv.lo `test -f 'libs/vkd3d-shader/spirv.c' || echo './'`libs/vkd3d-shader/spirv.c
libtool: compile:  x86_64-alt-linux-gcc -DHAVE_CONFIG_H -I. -I./include -I./include -I./include/private -I./include/private -Wall -pipe -std=c99 -fvisibility=hidden -Wdeclaration-after-statement -Wempty-body -Wenum-conversion -Wimplicit-fallthrough -Winit-self -Wmissing-prototypes -Wpointer-arith -Wshadow -Wshift-overflow=2 -Wtype-limits -Wunused-but-set-parameter -Wvla -Wwrite-strings -Wl,--no-undefined -DLIBVKD3D_SHADER_SOURCE -I./libs/vkd3d-shader -pipe -frecord-gcc-switches -Wall -g -O2 -flto=auto -c libs/vkd3d-shader/spirv.c  -fPIC -DPIC -o libs/vkd3d-shader/.libs/libvkd3d_shader_la-spirv.o
libtool: compile:  x86_64-alt-linux-gcc -DHAVE_CONFIG_H -I. -I./include -I./include -I./include/private -I./include/private -Wall -pipe -std=c99 -fvisibility=hidden -Wdeclaration-after-statement -Wempty-body -Wenum-conversion -Wimplicit-fallthrough -Winit-self -Wmissing-prototypes -Wpointer-arith -Wshadow -Wshift-overflow=2 -Wtype-limits -Wunused-but-set-parameter -Wvla -Wwrite-strings -Wl,--no-undefined -DLIBVKD3D_SHADER_SOURCE -I./libs/vkd3d-shader -pipe -frecord-gcc-switches -Wall -g -O2 -flto=auto -c libs/vkd3d-shader/spirv.c -o libs/vkd3d-shader/libvkd3d_shader_la-spirv.o >/dev/null 2>&1
make[1]: Leaving directory '/usr/src/RPM/BUILD/vkd3d-1.11'
make[1]: Entering directory '/usr/src/RPM/BUILD/vkd3d-1.11'
/bin/sh ./libtool  --tag=CC   --mode=compile x86_64-alt-linux-gcc -DHAVE_CONFIG_H -I. -I./include  -I./include -I./include/private -I./include/private  -Wall -pipe -std=c99 -fvisibility=hidden -Wdeclaration-after-statement -Wempty-body -Wenum-conversion -Wimplicit-fallthrough -Winit-self -Wmissing-prototypes -Wpointer-arith -Wshadow -Wshift-overflow=2 -Wtype-limits -Wunused-but-set-parameter -Wvla -Wwrite-strings -Wl,--no-undefined -DLIBVKD3D_SOURCE -pipe -frecord-gcc-switches -Wall -g -O2 -flto=auto -c -o libs/vkd3d/libvkd3d_la-device.lo `test -f 'libs/vkd3d/device.c' || echo './'`libs/vkd3d/device.c
libtool: compile:  x86_64-alt-linux-gcc -DHAVE_CONFIG_H -I. -I./include -I./include -I./include/private -I./include/private -Wall -pipe -std=c99 -fvisibility=hidden -Wdeclaration-after-statement -Wempty-body -Wenum-conversion -Wimplicit-fallthrough -Winit-self -Wmissing-prototypes -Wpointer-arith -Wshadow -Wshift-overflow=2 -Wtype-limits -Wunused-but-set-parameter -Wvla -Wwrite-strings -Wl,--no-undefined -DLIBVKD3D_SOURCE -pipe -frecord-gcc-switches -Wall -g -O2 -flto=auto -c libs/vkd3d/device.c  -fPIC -DPIC -o libs/vkd3d/.libs/libvkd3d_la-device.o
libtool: compile:  x86_64-alt-linux-gcc -DHAVE_CONFIG_H -I. -I./include -I./include -I./include/private -I./include/private -Wall -pipe -std=c99 -fvisibility=hidden -Wdeclaration-after-statement -Wempty-body -Wenum-conversion -Wimplicit-fallthrough -Winit-self -Wmissing-prototypes -Wpointer-arith -Wshadow -Wshift-overflow=2 -Wtype-limits -Wunused-but-set-parameter -Wvla -Wwrite-strings -Wl,--no-undefined -DLIBVKD3D_SOURCE -pipe -frecord-gcc-switches -Wall -g -O2 -flto=auto -c libs/vkd3d/device.c -o libs/vkd3d/libvkd3d_la-device.o >/dev/null 2>&1
make[1]: Leaving directory '/usr/src/RPM/BUILD/vkd3d-1.11'
make[1]: Entering directory '/usr/src/RPM/BUILD/vkd3d-1.11'
/bin/sh ./libtool  --tag=CC   --mode=compile x86_64-alt-linux-gcc -DHAVE_CONFIG_H -I. -I./include  -I./include -I./include/private -I./include/private  -Wall -pipe -std=c99 -fvisibility=hidden -Wdeclaration-after-statement -Wempty-body -Wenum-conversion -Wimplicit-fallthrough -Winit-self -Wmissing-prototypes -Wpointer-arith -Wshadow -Wshift-overflow=2 -Wtype-limits -Wunused-but-set-parameter -Wvla -Wwrite-strings -Wl,--no-undefined -DLIBVKD3D_SOURCE -pipe -frecord-gcc-switches -Wall -g -O2 -flto=auto -c -o libs/vkd3d/libvkd3d_la-resource.lo `test -f 'libs/vkd3d/resource.c' || echo './'`libs/vkd3d/resource.c
libtool: compile:  x86_64-alt-linux-gcc -DHAVE_CONFIG_H -I. -I./include -I./include -I./include/private -I./include/private -Wall -pipe -std=c99 -fvisibility=hidden -Wdeclaration-after-statement -Wempty-body -Wenum-conversion -Wimplicit-fallthrough -Winit-self -Wmissing-prototypes -Wpointer-arith -Wshadow -Wshift-overflow=2 -Wtype-limits -Wunused-but-set-parameter -Wvla -Wwrite-strings -Wl,--no-undefined -DLIBVKD3D_SOURCE -pipe -frecord-gcc-switches -Wall -g -O2 -flto=auto -c libs/vkd3d/resource.c  -fPIC -DPIC -o libs/vkd3d/.libs/libvkd3d_la-resource.o
libtool: compile:  x86_64-alt-linux-gcc -DHAVE_CONFIG_H -I. -I./include -I./include -I./include/private -I./include/private -Wall -pipe -std=c99 -fvisibility=hidden -Wdeclaration-after-statement -Wempty-body -Wenum-conversion -Wimplicit-fallthrough -Winit-self -Wmissing-prototypes -Wpointer-arith -Wshadow -Wshift-overflow=2 -Wtype-limits -Wunused-but-set-parameter -Wvla -Wwrite-strings -Wl,--no-undefined -DLIBVKD3D_SOURCE -pipe -frecord-gcc-switches -Wall -g -O2 -flto=auto -c libs/vkd3d/resource.c -o libs/vkd3d/libvkd3d_la-resource.o >/dev/null 2>&1
make[1]: Leaving directory '/usr/src/RPM/BUILD/vkd3d-1.11'
make[1]: Entering directory '/usr/src/RPM/BUILD/vkd3d-1.11'
/bin/sh ./libtool  --tag=CC   --mode=compile x86_64-alt-linux-gcc -DHAVE_CONFIG_H -I. -I./include  -I./include -I./include/private -I./include/private  -Wall -pipe -std=c99 -fvisibility=hidden -Wdeclaration-after-statement -Wempty-body -Wenum-conversion -Wimplicit-fallthrough -Winit-self -Wmissing-prototypes -Wpointer-arith -Wshadow -Wshift-overflow=2 -Wtype-limits -Wunused-but-set-parameter -Wvla -Wwrite-strings -Wl,--no-undefined -DLIBVKD3D_SOURCE -pipe -frecord-gcc-switches -Wall -g -O2 -flto=auto -c -o libs/vkd3d/libvkd3d_la-command.lo `test -f 'libs/vkd3d/command.c' || echo './'`libs/vkd3d/command.c
libtool: compile:  x86_64-alt-linux-gcc -DHAVE_CONFIG_H -I. -I./include -I./include -I./include/private -I./include/private -Wall -pipe -std=c99 -fvisibility=hidden -Wdeclaration-after-statement -Wempty-body -Wenum-conversion -Wimplicit-fallthrough -Winit-self -Wmissing-prototypes -Wpointer-arith -Wshadow -Wshift-overflow=2 -Wtype-limits -Wunused-but-set-parameter -Wvla -Wwrite-strings -Wl,--no-undefined -DLIBVKD3D_SOURCE -pipe -frecord-gcc-switches -Wall -g -O2 -flto=auto -c libs/vkd3d/command.c  -fPIC -DPIC -o libs/vkd3d/.libs/libvkd3d_la-command.o
libtool: compile:  x86_64-alt-linux-gcc -DHAVE_CONFIG_H -I. -I./include -I./include -I./include/private -I./include/private -Wall -pipe -std=c99 -fvisibility=hidden -Wdeclaration-after-statement -Wempty-body -Wenum-conversion -Wimplicit-fallthrough -Winit-self -Wmissing-prototypes -Wpointer-arith -Wshadow -Wshift-overflow=2 -Wtype-limits -Wunused-but-set-parameter -Wvla -Wwrite-strings -Wl,--no-undefined -DLIBVKD3D_SOURCE -pipe -frecord-gcc-switches -Wall -g -O2 -flto=auto -c libs/vkd3d/command.c -o libs/vkd3d/libvkd3d_la-command.o >/dev/null 2>&1
make[1]: Leaving directory '/usr/src/RPM/BUILD/vkd3d-1.11'
make[1]: Entering directory '/usr/src/RPM/BUILD/vkd3d-1.11'
/bin/sh ./libtool  --tag=CC   --mode=link x86_64-alt-linux-gcc -Wall -pipe -std=c99 -fvisibility=hidden -Wdeclaration-after-statement -Wempty-body -Wenum-conversion -Wimplicit-fallthrough -Winit-self -Wmissing-prototypes -Wpointer-arith -Wshadow -Wshift-overflow=2 -Wtype-limits -Wunused-but-set-parameter -Wvla -Wwrite-strings -Wl,--no-undefined -DLIBVKD3D_SHADER_SOURCE -I./libs/vkd3d-shader  -pipe -frecord-gcc-switches -Wall -g -O2 -flto=auto -no-undefined -version-info 10:0:9 -Wl,--version-script=./libs/vkd3d-shader/vkd3d_shader.map  -o libvkd3d-shader.la -rpath /usr/lib64 libs/vkd3d-shader/libvkd3d_shader_la-checksum.lo libs/vkd3d-shader/libvkd3d_shader_la-d3d_asm.lo libs/vkd3d-shader/libvkd3d_shader_la-d3dbc.lo libs/vkd3d-shader/libvkd3d_shader_la-dxbc.lo libs/vkd3d-shader/libvkd3d_shader_la-dxil.lo libs/vkd3d-shader/libvkd3d_shader_la-fx.lo libs/vkd3d-shader/libvkd3d_shader_la-glsl.lo libs/vkd3d-shader/libvkd3d_shader_la-hlsl.lo libs/vkd3d-shader/libvkd3d_shader_la-hlsl_codegen.lo libs/vkd3d-shader/libvkd3d_shader_la-hlsl_constant_ops.lo libs/vkd3d-shader/libvkd3d_shader_la-ir.lo libs/vkd3d-shader/libvkd3d_shader_la-spirv.lo libs/vkd3d-shader/libvkd3d_shader_la-tpf.lo libs/vkd3d-shader/libvkd3d_shader_la-vkd3d_shader_main.lo libs/vkd3d-shader/libvkd3d_shader_la-hlsl.tab.lo libs/vkd3d-shader/libvkd3d_shader_la-hlsl.yy.lo libs/vkd3d-shader/libvkd3d_shader_la-preproc.tab.lo libs/vkd3d-shader/libvkd3d_shader_la-preproc.yy.lo libvkd3d-common.la -lSPIRV-Tools-shared -lm -lm 
libtool: link: x86_64-alt-linux-gcc -shared  -fPIC -DPIC  libs/vkd3d-shader/.libs/libvkd3d_shader_la-checksum.o libs/vkd3d-shader/.libs/libvkd3d_shader_la-d3d_asm.o libs/vkd3d-shader/.libs/libvkd3d_shader_la-d3dbc.o libs/vkd3d-shader/.libs/libvkd3d_shader_la-dxbc.o libs/vkd3d-shader/.libs/libvkd3d_shader_la-dxil.o libs/vkd3d-shader/.libs/libvkd3d_shader_la-fx.o libs/vkd3d-shader/.libs/libvkd3d_shader_la-glsl.o libs/vkd3d-shader/.libs/libvkd3d_shader_la-hlsl.o libs/vkd3d-shader/.libs/libvkd3d_shader_la-hlsl_codegen.o libs/vkd3d-shader/.libs/libvkd3d_shader_la-hlsl_constant_ops.o libs/vkd3d-shader/.libs/libvkd3d_shader_la-ir.o libs/vkd3d-shader/.libs/libvkd3d_shader_la-spirv.o libs/vkd3d-shader/.libs/libvkd3d_shader_la-tpf.o libs/vkd3d-shader/.libs/libvkd3d_shader_la-vkd3d_shader_main.o libs/vkd3d-shader/.libs/libvkd3d_shader_la-hlsl.tab.o libs/vkd3d-shader/.libs/libvkd3d_shader_la-hlsl.yy.o libs/vkd3d-shader/.libs/libvkd3d_shader_la-preproc.tab.o libs/vkd3d-shader/.libs/libvkd3d_shader_la-preproc.yy.o  -Wl,--whole-archive ./.libs/libvkd3d-common.a -Wl,--no-whole-archive  -lSPIRV-Tools-shared -lm  -Wl,--no-undefined -g -O2 -flto=auto -Wl,--version-script=./libs/vkd3d-shader/vkd3d_shader.map   -pthread -Wl,-soname -Wl,libvkd3d-shader.so.1 -o .libs/libvkd3d-shader.so.1.9.0
libtool: link: (cd ".libs" && rm -f "libvkd3d-shader.so.1" && ln -s "libvkd3d-shader.so.1.9.0" "libvkd3d-shader.so.1")
libtool: link: (cd ".libs" && rm -f "libvkd3d-shader.so" && ln -s "libvkd3d-shader.so.1.9.0" "libvkd3d-shader.so")
libtool: link: (cd .libs/libvkd3d-shader.lax/libvkd3d-common.a && ar x "/usr/src/RPM/BUILD/vkd3d-1.11/./.libs/libvkd3d-common.a")
libtool: link: ar cr .libs/libvkd3d-shader.a  libs/vkd3d-shader/libvkd3d_shader_la-checksum.o libs/vkd3d-shader/libvkd3d_shader_la-d3d_asm.o libs/vkd3d-shader/libvkd3d_shader_la-d3dbc.o libs/vkd3d-shader/libvkd3d_shader_la-dxbc.o libs/vkd3d-shader/libvkd3d_shader_la-dxil.o libs/vkd3d-shader/libvkd3d_shader_la-fx.o libs/vkd3d-shader/libvkd3d_shader_la-glsl.o libs/vkd3d-shader/libvkd3d_shader_la-hlsl.o libs/vkd3d-shader/libvkd3d_shader_la-hlsl_codegen.o libs/vkd3d-shader/libvkd3d_shader_la-hlsl_constant_ops.o libs/vkd3d-shader/libvkd3d_shader_la-ir.o libs/vkd3d-shader/libvkd3d_shader_la-spirv.o libs/vkd3d-shader/libvkd3d_shader_la-tpf.o libs/vkd3d-shader/libvkd3d_shader_la-vkd3d_shader_main.o libs/vkd3d-shader/libvkd3d_shader_la-hlsl.tab.o libs/vkd3d-shader/libvkd3d_shader_la-hlsl.yy.o libs/vkd3d-shader/libvkd3d_shader_la-preproc.tab.o libs/vkd3d-shader/libvkd3d_shader_la-preproc.yy.o  .libs/libvkd3d-shader.lax/libvkd3d-common.a/blob.o .libs/libvkd3d-shader.lax/libvkd3d-common.a/debug.o .libs/libvkd3d-shader.lax/libvkd3d-common.a/error.o .libs/libvkd3d-shader.lax/libvkd3d-common.a/memory.o .libs/libvkd3d-shader.lax/libvkd3d-common.a/utf8.o 
libtool: link: ranlib .libs/libvkd3d-shader.a
libtool: link: rm -fr .libs/libvkd3d-shader.lax
libtool: link: ( cd ".libs" && rm -f "libvkd3d-shader.la" && ln -s "../libvkd3d-shader.la" "libvkd3d-shader.la" )
make[1]: Leaving directory '/usr/src/RPM/BUILD/vkd3d-1.11'
make[1]: Entering directory '/usr/src/RPM/BUILD/vkd3d-1.11'
/bin/sh ./libtool  --tag=CC   --mode=link x86_64-alt-linux-gcc -Wall -pipe -std=c99 -fvisibility=hidden -Wdeclaration-after-statement -Wempty-body -Wenum-conversion -Wimplicit-fallthrough -Winit-self -Wmissing-prototypes -Wpointer-arith -Wshadow -Wshift-overflow=2 -Wtype-limits -Wunused-but-set-parameter -Wvla -Wwrite-strings -Wl,--no-undefined  -pipe -frecord-gcc-switches -Wall -g -O2 -flto=auto -no-undefined  -o vkd3d-dxbc programs/vkd3d-dxbc/vkd3d_dxbc-main.o libvkd3d-shader.la  -lm 
libtool: link: x86_64-alt-linux-gcc -Wall -pipe -std=c99 -fvisibility=hidden -Wdeclaration-after-statement -Wempty-body -Wenum-conversion -Wimplicit-fallthrough -Winit-self -Wmissing-prototypes -Wpointer-arith -Wshadow -Wshift-overflow=2 -Wtype-limits -Wunused-but-set-parameter -Wvla -Wwrite-strings -Wl,--no-undefined -pipe -frecord-gcc-switches -Wall -g -O2 -flto=auto -o .libs/vkd3d-dxbc programs/vkd3d-dxbc/vkd3d_dxbc-main.o  ./.libs/libvkd3d-shader.so -lm -pthread
make[1]: Leaving directory '/usr/src/RPM/BUILD/vkd3d-1.11'
make[1]: Entering directory '/usr/src/RPM/BUILD/vkd3d-1.11'
/bin/sh ./libtool  --tag=CC   --mode=link x86_64-alt-linux-gcc -Wall -pipe -std=c99 -fvisibility=hidden -Wdeclaration-after-statement -Wempty-body -Wenum-conversion -Wimplicit-fallthrough -Winit-self -Wmissing-prototypes -Wpointer-arith -Wshadow -Wshift-overflow=2 -Wtype-limits -Wunused-but-set-parameter -Wvla -Wwrite-strings -Wl,--no-undefined  -pipe -frecord-gcc-switches -Wall -g -O2 -flto=auto -no-undefined  -o vkd3d-compiler programs/vkd3d-compiler/vkd3d_compiler-main.o libvkd3d-shader.la  -lm 
libtool: link: x86_64-alt-linux-gcc -Wall -pipe -std=c99 -fvisibility=hidden -Wdeclaration-after-statement -Wempty-body -Wenum-conversion -Wimplicit-fallthrough -Winit-self -Wmissing-prototypes -Wpointer-arith -Wshadow -Wshift-overflow=2 -Wtype-limits -Wunused-but-set-parameter -Wvla -Wwrite-strings -Wl,--no-undefined -pipe -frecord-gcc-switches -Wall -g -O2 -flto=auto -o .libs/vkd3d-compiler programs/vkd3d-compiler/vkd3d_compiler-main.o  ./.libs/libvkd3d-shader.so -lm -pthread
make[1]: Leaving directory '/usr/src/RPM/BUILD/vkd3d-1.11'
make[1]: Entering directory '/usr/src/RPM/BUILD/vkd3d-1.11'
/bin/sh ./libtool  --tag=CC   --mode=link x86_64-alt-linux-gcc -Wall -pipe -std=c99 -fvisibility=hidden -Wdeclaration-after-statement -Wempty-body -Wenum-conversion -Wimplicit-fallthrough -Winit-self -Wmissing-prototypes -Wpointer-arith -Wshadow -Wshift-overflow=2 -Wtype-limits -Wunused-but-set-parameter -Wvla -Wwrite-strings -Wl,--no-undefined -DLIBVKD3D_SOURCE -pipe -frecord-gcc-switches -Wall -g -O2 -flto=auto -no-undefined -version-info 12:0:11 -Wl,--version-script=./libs/vkd3d/vkd3d.map  -o libvkd3d.la -rpath /usr/lib64 libs/vkd3d/libvkd3d_la-command.lo libs/vkd3d/libvkd3d_la-device.lo libs/vkd3d/libvkd3d_la-resource.lo libs/vkd3d/libvkd3d_la-state.lo libs/vkd3d/libvkd3d_la-utils.lo libs/vkd3d/libvkd3d_la-vkd3d_main.lo libvkd3d-common.la libvkd3d-shader.la -ldl -pthread -lm 
libtool: link: x86_64-alt-linux-gcc -shared  -fPIC -DPIC  libs/vkd3d/.libs/libvkd3d_la-command.o libs/vkd3d/.libs/libvkd3d_la-device.o libs/vkd3d/.libs/libvkd3d_la-resource.o libs/vkd3d/.libs/libvkd3d_la-state.o libs/vkd3d/.libs/libvkd3d_la-utils.o libs/vkd3d/.libs/libvkd3d_la-vkd3d_main.o  -Wl,--whole-archive ./.libs/libvkd3d-common.a -Wl,--no-whole-archive  -Wl,-rpath -Wl,/usr/src/RPM/BUILD/vkd3d-1.11/.libs ./.libs/libvkd3d-shader.so -ldl -lm  -Wl,--no-undefined -g -O2 -flto=auto -Wl,--version-script=./libs/vkd3d/vkd3d.map   -pthread -Wl,-soname -Wl,libvkd3d.so.1 -o .libs/libvkd3d.so.1.11.0
libtool: link: (cd ".libs" && rm -f "libvkd3d.so.1" && ln -s "libvkd3d.so.1.11.0" "libvkd3d.so.1")
libtool: link: (cd ".libs" && rm -f "libvkd3d.so" && ln -s "libvkd3d.so.1.11.0" "libvkd3d.so")
libtool: link: (cd .libs/libvkd3d.lax/libvkd3d-common.a && ar x "/usr/src/RPM/BUILD/vkd3d-1.11/./.libs/libvkd3d-common.a")
libtool: link: ar cr .libs/libvkd3d.a  libs/vkd3d/libvkd3d_la-command.o libs/vkd3d/libvkd3d_la-device.o libs/vkd3d/libvkd3d_la-resource.o libs/vkd3d/libvkd3d_la-state.o libs/vkd3d/libvkd3d_la-utils.o libs/vkd3d/libvkd3d_la-vkd3d_main.o  .libs/libvkd3d.lax/libvkd3d-common.a/blob.o .libs/libvkd3d.lax/libvkd3d-common.a/debug.o .libs/libvkd3d.lax/libvkd3d-common.a/error.o .libs/libvkd3d.lax/libvkd3d-common.a/memory.o .libs/libvkd3d.lax/libvkd3d-common.a/utf8.o 
libtool: link: ranlib .libs/libvkd3d.a
libtool: link: rm -fr .libs/libvkd3d.lax
libtool: link: ( cd ".libs" && rm -f "libvkd3d.la" && ln -s "../libvkd3d.la" "libvkd3d.la" )
make[1]: Leaving directory '/usr/src/RPM/BUILD/vkd3d-1.11'
make[1]: Entering directory '/usr/src/RPM/BUILD/vkd3d-1.11'
/bin/sh ./libtool  --tag=CC   --mode=link x86_64-alt-linux-gcc -Wall -pipe -std=c99 -fvisibility=hidden -Wdeclaration-after-statement -Wempty-body -Wenum-conversion -Wimplicit-fallthrough -Winit-self -Wmissing-prototypes -Wpointer-arith -Wshadow -Wshift-overflow=2 -Wtype-limits -Wunused-but-set-parameter -Wvla -Wwrite-strings -Wl,--no-undefined -DLIBVKD3D_UTILS_SOURCE -pipe -frecord-gcc-switches -Wall -g -O2 -flto=auto -no-undefined -version-info 6:0:5 -Wl,--version-script=./libs/vkd3d-utils/vkd3d_utils.map  -o libvkd3d-utils.la -rpath /usr/lib64 libs/vkd3d-utils/libvkd3d_utils_la-reflection.lo libs/vkd3d-utils/libvkd3d_utils_la-vkd3d_utils_main.lo libvkd3d-common.la libvkd3d-shader.la libvkd3d.la -pthread -lm 
libtool: link: x86_64-alt-linux-gcc -shared  -fPIC -DPIC  libs/vkd3d-utils/.libs/libvkd3d_utils_la-reflection.o libs/vkd3d-utils/.libs/libvkd3d_utils_la-vkd3d_utils_main.o  -Wl,--whole-archive ./.libs/libvkd3d-common.a -Wl,--no-whole-archive  -Wl,-rpath -Wl,/usr/src/RPM/BUILD/vkd3d-1.11/.libs ./.libs/libvkd3d-shader.so ./.libs/libvkd3d.so -lm  -Wl,--no-undefined -g -O2 -flto=auto -Wl,--version-script=./libs/vkd3d-utils/vkd3d_utils.map   -pthread -Wl,-soname -Wl,libvkd3d-utils.so.1 -o .libs/libvkd3d-utils.so.1.5.0
libtool: link: (cd ".libs" && rm -f "libvkd3d-utils.so.1" && ln -s "libvkd3d-utils.so.1.5.0" "libvkd3d-utils.so.1")
libtool: link: (cd ".libs" && rm -f "libvkd3d-utils.so" && ln -s "libvkd3d-utils.so.1.5.0" "libvkd3d-utils.so")
libtool: link: (cd .libs/libvkd3d-utils.lax/libvkd3d-common.a && ar x "/usr/src/RPM/BUILD/vkd3d-1.11/./.libs/libvkd3d-common.a")
libtool: link: ar cr .libs/libvkd3d-utils.a  libs/vkd3d-utils/libvkd3d_utils_la-reflection.o libs/vkd3d-utils/libvkd3d_utils_la-vkd3d_utils_main.o  .libs/libvkd3d-utils.lax/libvkd3d-common.a/blob.o .libs/libvkd3d-utils.lax/libvkd3d-common.a/debug.o .libs/libvkd3d-utils.lax/libvkd3d-common.a/error.o .libs/libvkd3d-utils.lax/libvkd3d-common.a/memory.o .libs/libvkd3d-utils.lax/libvkd3d-common.a/utf8.o 
libtool: link: ranlib .libs/libvkd3d-utils.a
libtool: link: rm -fr .libs/libvkd3d-utils.lax
libtool: link: ( cd ".libs" && rm -f "libvkd3d-utils.la" && ln -s "../libvkd3d-utils.la" "libvkd3d-utils.la" )
make[1]: Leaving directory '/usr/src/RPM/BUILD/vkd3d-1.11'
+ exit 0
Executing(%install): /bin/sh -e /usr/src/tmp/rpm-tmp.19150
+ umask 022
+ /bin/mkdir -p /usr/src/RPM/BUILD
+ cd /usr/src/RPM/BUILD
+ /bin/chmod -Rf u+rwX -- /usr/src/tmp/vkd3d-buildroot
+ :
+ /bin/rm -rf -- /usr/src/tmp/vkd3d-buildroot
+ PATH=/usr/libexec/rpm-build:/usr/src/bin:/bin:/usr/bin:/usr/X11R6/bin:/usr/games
+ cd vkd3d-1.11
+ /usr/bin/make 'INSTALL=/usr/libexec/rpm-build/install -p' prefix=/usr/src/tmp/vkd3d-buildroot/usr exec_prefix=/usr/src/tmp/vkd3d-buildroot/usr bindir=/usr/src/tmp/vkd3d-buildroot/usr/bin sbindir=/usr/src/tmp/vkd3d-buildroot/usr/sbin sysconfdir=/usr/src/tmp/vkd3d-buildroot/etc datadir=/usr/src/tmp/vkd3d-buildroot/usr/share includedir=/usr/src/tmp/vkd3d-buildroot/usr/include libdir=/usr/src/tmp/vkd3d-buildroot/usr/lib64 libexecdir=/usr/src/tmp/vkd3d-buildroot/usr/lib localstatedir=/usr/src/tmp/vkd3d-buildroot/var/lib runstatedir=/usr/src/tmp/vkd3d-buildroot/var/run sharedstatedir=/usr/src/tmp/vkd3d-buildroot/var/lib mandir=/usr/src/tmp/vkd3d-buildroot/usr/share/man infodir=/usr/src/tmp/vkd3d-buildroot/usr/share/info install
make: Entering directory '/usr/src/RPM/BUILD/vkd3d-1.11'
/usr/bin/make  install-am
make[1]: Entering directory '/usr/src/RPM/BUILD/vkd3d-1.11'
make[2]: Entering directory '/usr/src/RPM/BUILD/vkd3d-1.11'
 /bin/mkdir -p '/usr/src/tmp/vkd3d-buildroot/usr/lib64'
 /bin/sh ./libtool   --mode=install /usr/libexec/rpm-build/install -p   libvkd3d-shader.la libvkd3d.la libvkd3d-utils.la '/usr/src/tmp/vkd3d-buildroot/usr/lib64'
libtool: install: /usr/libexec/rpm-build/install -p .libs/libvkd3d-shader.so.1.9.0 /usr/src/tmp/vkd3d-buildroot/usr/lib64/libvkd3d-shader.so.1.9.0
libtool: install: (cd /usr/src/tmp/vkd3d-buildroot/usr/lib64 && { ln -s -f libvkd3d-shader.so.1.9.0 libvkd3d-shader.so.1 || { rm -f libvkd3d-shader.so.1 && ln -s libvkd3d-shader.so.1.9.0 libvkd3d-shader.so.1; }; })
libtool: install: (cd /usr/src/tmp/vkd3d-buildroot/usr/lib64 && { ln -s -f libvkd3d-shader.so.1.9.0 libvkd3d-shader.so || { rm -f libvkd3d-shader.so && ln -s libvkd3d-shader.so.1.9.0 libvkd3d-shader.so; }; })
libtool: install: /usr/libexec/rpm-build/install -p .libs/libvkd3d-shader.lai /usr/src/tmp/vkd3d-buildroot/usr/lib64/libvkd3d-shader.la
libtool: warning: relinking 'libvkd3d.la'
libtool: install: (cd /usr/src/RPM/BUILD/vkd3d-1.11; /bin/sh "/usr/src/RPM/BUILD/vkd3d-1.11/libtool"  --tag CC --mode=relink x86_64-alt-linux-gcc -Wall -pipe -std=c99 -fvisibility=hidden -Wdeclaration-after-statement -Wempty-body -Wenum-conversion -Wimplicit-fallthrough -Winit-self -Wmissing-prototypes -Wpointer-arith -Wshadow -Wshift-overflow=2 -Wtype-limits -Wunused-but-set-parameter -Wvla -Wwrite-strings -Wl,--no-undefined -DLIBVKD3D_SOURCE -pipe -frecord-gcc-switches -Wall -g -O2 -flto=auto -no-undefined -version-info 12:0:11 -Wl,--version-script=./libs/vkd3d/vkd3d.map -o libvkd3d.la -rpath /usr/lib64 libs/vkd3d/libvkd3d_la-command.lo libs/vkd3d/libvkd3d_la-device.lo libs/vkd3d/libvkd3d_la-resource.lo libs/vkd3d/libvkd3d_la-state.lo libs/vkd3d/libvkd3d_la-utils.lo libs/vkd3d/libvkd3d_la-vkd3d_main.lo libvkd3d-common.la libvkd3d-shader.la -ldl -pthread -lm -inst-prefix-dir /usr/src/tmp/vkd3d-buildroot)
libtool: relink: x86_64-alt-linux-gcc -shared  -fPIC -DPIC  libs/vkd3d/.libs/libvkd3d_la-command.o libs/vkd3d/.libs/libvkd3d_la-device.o libs/vkd3d/.libs/libvkd3d_la-resource.o libs/vkd3d/.libs/libvkd3d_la-state.o libs/vkd3d/.libs/libvkd3d_la-utils.o libs/vkd3d/.libs/libvkd3d_la-vkd3d_main.o  -Wl,--whole-archive ./.libs/libvkd3d-common.a -Wl,--no-whole-archive  -L/usr/src/tmp/vkd3d-buildroot/usr/lib64 -L/usr/lib64 -lvkd3d-shader -ldl -lm  -Wl,--no-undefined -g -O2 -flto=auto -Wl,--version-script=./libs/vkd3d/vkd3d.map   -pthread -Wl,-soname -Wl,libvkd3d.so.1 -o .libs/libvkd3d.so.1.11.0
libtool: install: /usr/libexec/rpm-build/install -p .libs/libvkd3d.so.1.11.0T /usr/src/tmp/vkd3d-buildroot/usr/lib64/libvkd3d.so.1.11.0
libtool: install: (cd /usr/src/tmp/vkd3d-buildroot/usr/lib64 && { ln -s -f libvkd3d.so.1.11.0 libvkd3d.so.1 || { rm -f libvkd3d.so.1 && ln -s libvkd3d.so.1.11.0 libvkd3d.so.1; }; })
libtool: install: (cd /usr/src/tmp/vkd3d-buildroot/usr/lib64 && { ln -s -f libvkd3d.so.1.11.0 libvkd3d.so || { rm -f libvkd3d.so && ln -s libvkd3d.so.1.11.0 libvkd3d.so; }; })
libtool: install: /usr/libexec/rpm-build/install -p .libs/libvkd3d.lai /usr/src/tmp/vkd3d-buildroot/usr/lib64/libvkd3d.la
libtool: warning: relinking 'libvkd3d-utils.la'
libtool: install: (cd /usr/src/RPM/BUILD/vkd3d-1.11; /bin/sh "/usr/src/RPM/BUILD/vkd3d-1.11/libtool"  --tag CC --mode=relink x86_64-alt-linux-gcc -Wall -pipe -std=c99 -fvisibility=hidden -Wdeclaration-after-statement -Wempty-body -Wenum-conversion -Wimplicit-fallthrough -Winit-self -Wmissing-prototypes -Wpointer-arith -Wshadow -Wshift-overflow=2 -Wtype-limits -Wunused-but-set-parameter -Wvla -Wwrite-strings -Wl,--no-undefined -DLIBVKD3D_UTILS_SOURCE -pipe -frecord-gcc-switches -Wall -g -O2 -flto=auto -no-undefined -version-info 6:0:5 -Wl,--version-script=./libs/vkd3d-utils/vkd3d_utils.map -o libvkd3d-utils.la -rpath /usr/lib64 libs/vkd3d-utils/libvkd3d_utils_la-reflection.lo libs/vkd3d-utils/libvkd3d_utils_la-vkd3d_utils_main.lo libvkd3d-common.la libvkd3d-shader.la libvkd3d.la -pthread -lm -inst-prefix-dir /usr/src/tmp/vkd3d-buildroot)
libtool: relink: x86_64-alt-linux-gcc -shared  -fPIC -DPIC  libs/vkd3d-utils/.libs/libvkd3d_utils_la-reflection.o libs/vkd3d-utils/.libs/libvkd3d_utils_la-vkd3d_utils_main.o  -Wl,--whole-archive ./.libs/libvkd3d-common.a -Wl,--no-whole-archive  -L/usr/src/tmp/vkd3d-buildroot/usr/lib64 -L/usr/lib64 -lvkd3d-shader -lvkd3d -lm  -Wl,--no-undefined -g -O2 -flto=auto -Wl,--version-script=./libs/vkd3d-utils/vkd3d_utils.map   -pthread -Wl,-soname -Wl,libvkd3d-utils.so.1 -o .libs/libvkd3d-utils.so.1.5.0
libtool: install: /usr/libexec/rpm-build/install -p .libs/libvkd3d-utils.so.1.5.0T /usr/src/tmp/vkd3d-buildroot/usr/lib64/libvkd3d-utils.so.1.5.0
libtool: install: (cd /usr/src/tmp/vkd3d-buildroot/usr/lib64 && { ln -s -f libvkd3d-utils.so.1.5.0 libvkd3d-utils.so.1 || { rm -f libvkd3d-utils.so.1 && ln -s libvkd3d-utils.so.1.5.0 libvkd3d-utils.so.1; }; })
libtool: install: (cd /usr/src/tmp/vkd3d-buildroot/usr/lib64 && { ln -s -f libvkd3d-utils.so.1.5.0 libvkd3d-utils.so || { rm -f libvkd3d-utils.so && ln -s libvkd3d-utils.so.1.5.0 libvkd3d-utils.so; }; })
libtool: install: /usr/libexec/rpm-build/install -p .libs/libvkd3d-utils.lai /usr/src/tmp/vkd3d-buildroot/usr/lib64/libvkd3d-utils.la
libtool: install: /usr/libexec/rpm-build/install -p .libs/libvkd3d-shader.a /usr/src/tmp/vkd3d-buildroot/usr/lib64/libvkd3d-shader.a
libtool: install: chmod 644 /usr/src/tmp/vkd3d-buildroot/usr/lib64/libvkd3d-shader.a
libtool: install: ranlib /usr/src/tmp/vkd3d-buildroot/usr/lib64/libvkd3d-shader.a
libtool: install: /usr/libexec/rpm-build/install -p .libs/libvkd3d.a /usr/src/tmp/vkd3d-buildroot/usr/lib64/libvkd3d.a
libtool: install: chmod 644 /usr/src/tmp/vkd3d-buildroot/usr/lib64/libvkd3d.a
libtool: install: ranlib /usr/src/tmp/vkd3d-buildroot/usr/lib64/libvkd3d.a
libtool: install: /usr/libexec/rpm-build/install -p .libs/libvkd3d-utils.a /usr/src/tmp/vkd3d-buildroot/usr/lib64/libvkd3d-utils.a
libtool: install: chmod 644 /usr/src/tmp/vkd3d-buildroot/usr/lib64/libvkd3d-utils.a
libtool: install: ranlib /usr/src/tmp/vkd3d-buildroot/usr/lib64/libvkd3d-utils.a
libtool: warning: remember to run 'libtool --finish /usr/lib64'
 /bin/mkdir -p '/usr/src/tmp/vkd3d-buildroot/usr/bin'
  /bin/sh ./libtool   --mode=install /usr/libexec/rpm-build/install -p vkd3d-compiler vkd3d-dxbc '/usr/src/tmp/vkd3d-buildroot/usr/bin'
libtool: warning: 'libvkd3d-shader.la' has not been installed in '/usr/lib64'
libtool: install: /usr/libexec/rpm-build/install -p .libs/vkd3d-compiler /usr/src/tmp/vkd3d-buildroot/usr/bin/vkd3d-compiler
libtool: warning: 'libvkd3d-shader.la' has not been installed in '/usr/lib64'
libtool: install: /usr/libexec/rpm-build/install -p .libs/vkd3d-dxbc /usr/src/tmp/vkd3d-buildroot/usr/bin/vkd3d-dxbc
 /bin/mkdir -p '/usr/src/tmp/vkd3d-buildroot/usr/lib64/pkgconfig'
 /usr/libexec/rpm-build/install -p -m 644 libvkd3d.pc libvkd3d-shader.pc libvkd3d-utils.pc '/usr/src/tmp/vkd3d-buildroot/usr/lib64/pkgconfig'
 /bin/mkdir -p '/usr/src/tmp/vkd3d-buildroot/usr/include/vkd3d'
 /usr/libexec/rpm-build/install -p -m 644 include/vkd3d.h include/vkd3d_d3d12.h include/vkd3d_d3d12sdklayers.h include/vkd3d_d3d12shader.h include/vkd3d_d3d9types.h include/vkd3d_d3dcommon.h include/vkd3d_d3dcompiler.h include/vkd3d_d3dcompiler_types.h include/vkd3d_d3dx9shader.h include/vkd3d_dxgibase.h include/vkd3d_dxgiformat.h include/vkd3d_shader.h include/vkd3d_types.h include/vkd3d_utils.h include/vkd3d_windows.h '/usr/src/tmp/vkd3d-buildroot/usr/include/vkd3d'
make[2]: Leaving directory '/usr/src/RPM/BUILD/vkd3d-1.11'
make[1]: Leaving directory '/usr/src/RPM/BUILD/vkd3d-1.11'
make: Leaving directory '/usr/src/RPM/BUILD/vkd3d-1.11'
+ rm -f /usr/src/tmp/vkd3d-buildroot/usr/lib64/libvkd3d-shader.a /usr/src/tmp/vkd3d-buildroot/usr/lib64/libvkd3d-utils.a /usr/src/tmp/vkd3d-buildroot/usr/lib64/libvkd3d.a
+ /usr/lib/rpm/brp-alt
Cleaning files in /usr/src/tmp/vkd3d-buildroot (auto)
removed './usr/lib64/libvkd3d-utils.la'
removed './usr/lib64/libvkd3d.la'
removed './usr/lib64/libvkd3d-shader.la'
mode of './usr/lib64/libvkd3d-utils.so.1.5.0' changed from 0755 (rwxr-xr-x) to 0644 (rw-r--r--)
mode of './usr/lib64/libvkd3d.so.1.11.0' changed from 0755 (rwxr-xr-x) to 0644 (rw-r--r--)
mode of './usr/lib64/libvkd3d-shader.so.1.9.0' changed from 0755 (rwxr-xr-x) to 0644 (rw-r--r--)
Verifying and fixing files in /usr/src/tmp/vkd3d-buildroot (binconfig,pkgconfig,libtool,desktop,gnuconfig)
/usr/lib64/pkgconfig/libvkd3d-utils.pc: Libs: '-L${libdir} -lvkd3d-utils' --> '-lvkd3d-utils'
/usr/lib64/pkgconfig/libvkd3d-shader.pc: Libs: '-L${libdir} -lvkd3d-shader' --> '-lvkd3d-shader'
/usr/lib64/pkgconfig/libvkd3d.pc: Libs: '-L${libdir} -lvkd3d' --> '-lvkd3d'
Checking contents of files in /usr/src/tmp/vkd3d-buildroot/ (default)
Compressing files in /usr/src/tmp/vkd3d-buildroot (auto)
Adjusting library links in /usr/src/tmp/vkd3d-buildroot
./usr/lib64: (from <cmdline>:0)
	libvkd3d-shader.so.1 -> libvkd3d-shader.so.1.9.0
	libvkd3d.so.1 -> libvkd3d.so.1.11.0
	libvkd3d-utils.so.1 -> libvkd3d-utils.so.1.5.0
Verifying ELF objects in /usr/src/tmp/vkd3d-buildroot (arch=normal,fhs=normal,lfs=relaxed,lint=relaxed,rpath=normal,stack=normal,textrel=normal,unresolved=normal)
Splitting links to aliased files under /{,s}bin in /usr/src/tmp/vkd3d-buildroot
Processing files: libvkd3d1-1.11-alt1
Finding Provides (using /usr/lib/rpm/find-provides)
Executing: /bin/sh -e /usr/src/tmp/rpm-tmp.gkOIjB
find-provides: running scripts (alternatives,debuginfo,lib,pam,perl,pkgconfig,python,python3,shell)
lib.prov: /usr/src/tmp/vkd3d-buildroot/usr/lib64/libvkd3d-shader.so.1: 23 symbols, 15 bpp
lib.prov: /usr/src/tmp/vkd3d-buildroot/usr/lib64/libvkd3d-utils.so.1: 24 symbols, 15 bpp
lib.prov: /usr/src/tmp/vkd3d-buildroot/usr/lib64/libvkd3d.so.1: 22 symbols, 15 bpp
Finding Requires (using /usr/lib/rpm/find-requires)
Executing: /bin/sh -e /usr/src/tmp/rpm-tmp.xCnvY6
find-requires: running scripts (cpp,debuginfo,files,lib,pam,perl,pkgconfig,pkgconfiglib,python,python3,rpmlib,shebang,shell,static,symlinks,systemd-services)
Provides: libvkd3d-shader.so.1()(64bit) = set:idvQK8WrwExpw8JC2tbn9REZmy0NNVBLtzk5mGint6omq7ZE1, libvkd3d-shader.so.1(VKD3D_1_0)(64bit), libvkd3d-utils.so.1()(64bit) = set:idNGxOd2tO12jcCgRl9zG1TML6pSsS8my33LZ61fxNj2VVjrH4, libvkd3d-utils.so.1(VKD3D_1_0)(64bit), libvkd3d.so.1()(64bit) = set:id0n7ZcuvRivVFnZyoYHTkAamZolIaCUxmm6a63i08wfrS4, libvkd3d.so.1(VKD3D_1_0)(64bit)
Requires: libSPIRV-Tools-shared.so.0()(64bit) >= set:khmyhUky11GZmNZ1evb, libc.so.6(GLIBC_2.14)(64bit), libc.so.6(GLIBC_2.2.5)(64bit), libc.so.6(GLIBC_2.3)(64bit), libc.so.6(GLIBC_2.3.2)(64bit), libc.so.6(GLIBC_2.3.4)(64bit), libc.so.6(GLIBC_2.30)(64bit), libc.so.6(GLIBC_2.33)(64bit), libc.so.6(GLIBC_2.34)(64bit), libc.so.6(GLIBC_2.38)(64bit), libc.so.6(GLIBC_2.4)(64bit), libc.so.6(GLIBC_2.7)(64bit), libm.so.6(GLIBC_2.2.5)(64bit), libm.so.6(GLIBC_2.27)(64bit), libm.so.6(GLIBC_2.29)(64bit), rtld(GNU_HASH)
Requires(rpmlib): rpmlib(SetVersions)
Finding debuginfo files (using /usr/lib/rpm/find-debuginfo-files)
Executing: /bin/sh -e /usr/src/tmp/rpm-tmp.SKMVTb
Creating libvkd3d1-debuginfo package
Processing files: vkd3d-devel-1.11-alt1
Finding Provides (using /usr/lib/rpm/find-provides)
Executing: /bin/sh -e /usr/src/tmp/rpm-tmp.Swq1zZ
find-provides: running scripts (alternatives,debuginfo,lib,pam,perl,pkgconfig,python,python3,shell)
Finding Requires (using /usr/lib/rpm/find-requires)
Executing: /bin/sh -e /usr/src/tmp/rpm-tmp.m7ySnQ
find-requires: running scripts (cpp,debuginfo,files,lib,pam,perl,pkgconfig,pkgconfiglib,python,python3,rpmlib,shebang,shell,static,symlinks,systemd-services)
/usr/src/tmp/vkd3d-buildroot/usr/include/vkd3d/vkd3d_d3d12shader.h:12:10: fatal error: windows.h: No such file or directory
   12 | #include <windows.h>
      |          ^~~~~~~~~~~
compilation terminated.
cpp.req: /usr/src/tmp/vkd3d-buildroot/usr/include/vkd3d/vkd3d_d3d12shader.h: cpp failed, trying c++ mode
/usr/src/tmp/vkd3d-buildroot/usr/include/vkd3d/vkd3d_d3d12shader.h:12:10: fatal error: windows.h: No such file or directory
   12 | #include <windows.h>
      |          ^~~~~~~~~~~
compilation terminated.
cpp.req: WARNING: /usr/src/tmp/vkd3d-buildroot/usr/include/vkd3d/vkd3d_d3d12shader.h: cpp failed
/usr/src/tmp/vkd3d-buildroot/usr/include/vkd3d/vkd3d_d3dx9shader.h:12:10: fatal error: windows.h: No such file or directory
   12 | #include <windows.h>
      |          ^~~~~~~~~~~
compilation terminated.
cpp.req: /usr/src/tmp/vkd3d-buildroot/usr/include/vkd3d/vkd3d_d3dx9shader.h: cpp failed, trying c++ mode
/usr/src/tmp/vkd3d-buildroot/usr/include/vkd3d/vkd3d_d3dx9shader.h:12:10: fatal error: windows.h: No such file or directory
   12 | #include <windows.h>
      |          ^~~~~~~~~~~
compilation terminated.
cpp.req: WARNING: /usr/src/tmp/vkd3d-buildroot/usr/include/vkd3d/vkd3d_d3dx9shader.h: cpp failed
Provides: pkgconfig(libvkd3d) = 1.11, pkgconfig(libvkd3d-shader) = 1.11, pkgconfig(libvkd3d-utils) = 1.11
Requires: libvkd3d1 = 1.11-alt1, vkd3d-utils = 1.11-alt1, /usr/lib64/libvkd3d-shader.so.1.9.0, /usr/lib64/libvkd3d-utils.so.1.5.0, /usr/lib64/libvkd3d.so.1.11.0, /usr/lib64/pkgconfig, vulkan-headers
Finding debuginfo files (using /usr/lib/rpm/find-debuginfo-files)
Executing: /bin/sh -e /usr/src/tmp/rpm-tmp.0LQJkd
Processing files: vkd3d-utils-1.11-alt1
Finding Provides (using /usr/lib/rpm/find-provides)
Executing: /bin/sh -e /usr/src/tmp/rpm-tmp.UMYS5i
find-provides: running scripts (alternatives,debuginfo,lib,pam,perl,pkgconfig,python,python3,shell)
Finding Requires (using /usr/lib/rpm/find-requires)
Executing: /bin/sh -e /usr/src/tmp/rpm-tmp.BKgE7t
find-requires: running scripts (cpp,debuginfo,files,lib,pam,perl,pkgconfig,pkgconfiglib,python,python3,rpmlib,shebang,shell,static,symlinks,systemd-services)
Requires: libvkd3d1 = 1.11-alt1, /lib64/ld-linux-x86-64.so.2, libc.so.6(GLIBC_2.2.5)(64bit), libc.so.6(GLIBC_2.3)(64bit), libc.so.6(GLIBC_2.3.4)(64bit), libc.so.6(GLIBC_2.33)(64bit), libc.so.6(GLIBC_2.34)(64bit), libc.so.6(GLIBC_2.4)(64bit), libc.so.6(GLIBC_2.7)(64bit), libvkd3d-shader.so.1()(64bit) >= set:ievkwJx8Z6apsBKBas5wZo5, libvkd3d-shader.so.1(VKD3D_1_0)(64bit), rtld(GNU_HASH)
Requires(rpmlib): rpmlib(SetVersions)
Finding debuginfo files (using /usr/lib/rpm/find-debuginfo-files)
Executing: /bin/sh -e /usr/src/tmp/rpm-tmp.XBR7LK
Creating vkd3d-utils-debuginfo package
Processing files: libvkd3d1-debuginfo-1.11-alt1
Finding Provides (using /usr/lib/rpm/find-provides)
Executing: /bin/sh -e /usr/src/tmp/rpm-tmp.KwP2eN
find-provides: running scripts (debuginfo)
Finding Requires (using /usr/lib/rpm/find-requires)
Executing: /bin/sh -e /usr/src/tmp/rpm-tmp.hn2mfa
find-requires: running scripts (debuginfo)
Provides: debug64(libvkd3d-shader.so.1), debug64(libvkd3d-utils.so.1), debug64(libvkd3d.so.1)
Requires: libvkd3d1 = 1.11-alt1, debug64(libSPIRV-Tools-shared.so.0), debug64(libc.so.6), debug64(libm.so.6)
Processing files: vkd3d-utils-debuginfo-1.11-alt1
Finding Provides (using /usr/lib/rpm/find-provides)
Executing: /bin/sh -e /usr/src/tmp/rpm-tmp.dcOmtm
find-provides: running scripts (debuginfo)
Finding Requires (using /usr/lib/rpm/find-requires)
Executing: /bin/sh -e /usr/src/tmp/rpm-tmp.DAnpyO
find-requires: running scripts (debuginfo)
Requires: vkd3d-utils = 1.11-alt1, /usr/lib/debug/lib64/ld-linux-x86-64.so.2.debug, debug64(libc.so.6), debug64(libvkd3d-shader.so.1)
Adding to vkd3d-devel a strict dependency on libvkd3d1
Adding to vkd3d-utils a strict dependency on libvkd3d1
Adding to libvkd3d1-debuginfo a strict dependency on libvkd3d1
Adding to vkd3d-devel a strict dependency on vkd3d-utils
Adding to vkd3d-utils-debuginfo a strict dependency on vkd3d-utils
Adding to vkd3d-utils-debuginfo a strict dependency on libvkd3d1-debuginfo
Removing from vkd3d-utils-debuginfo 3 sources provided by libvkd3d1-debuginfo
also prunning dir /usr/src/debug/vkd3d-1.11/include/private
also prunning dir /usr/src/debug/vkd3d-1.11/include
Removing 3 extra deps from vkd3d-devel due to dependency on libvkd3d1
Removing 3 extra deps from vkd3d-utils due to dependency on libvkd3d1
Removing 1 extra deps from vkd3d-utils-debuginfo due to dependency on libvkd3d1-debuginfo
Removing 8 extra deps from vkd3d-utils due to repentancy on libvkd3d1
Removing 1 extra deps from vkd3d-devel due to repentancy on vkd3d-utils
Removing 1 extra deps from vkd3d-utils-debuginfo due to repentancy on libvkd3d1-debuginfo
Wrote: /usr/src/RPM/RPMS/x86_64/libvkd3d1-1.11-alt1.x86_64.rpm (w2.lzdio)
Wrote: /usr/src/RPM/RPMS/x86_64/vkd3d-devel-1.11-alt1.x86_64.rpm (w2.lzdio)
Wrote: /usr/src/RPM/RPMS/x86_64/vkd3d-utils-1.11-alt1.x86_64.rpm (w2.lzdio)
Wrote: /usr/src/RPM/RPMS/x86_64/libvkd3d1-debuginfo-1.11-alt1.x86_64.rpm (w2T16.xzdio)
Wrote: /usr/src/RPM/RPMS/x86_64/vkd3d-utils-debuginfo-1.11-alt1.x86_64.rpm (w2.lzdio)
54.22user 17.17system 0:34.17elapsed 208%CPU (0avgtext+0avgdata 77264maxresident)k
0inputs+0outputs (0major+3123713minor)pagefaults 0swaps
3.69user 3.20system 0:57.79elapsed 11%CPU (0avgtext+0avgdata 130984maxresident)k
86392inputs+0outputs (0major+271390minor)pagefaults 0swaps