<86>Jan 12 03:16:35 userdel[3337161]: delete user 'rooter'
<86>Jan 12 03:16:35 userdel[3337161]: removed group 'rooter' owned by 'rooter'
<86>Jan 12 03:16:35 userdel[3337161]: removed shadow group 'rooter' owned by 'rooter'
<86>Jan 12 03:16:35 groupadd[3337192]: group added to /etc/group: name=rooter, GID=1790
<86>Jan 12 03:16:35 groupadd[3337192]: group added to /etc/gshadow: name=rooter
<86>Jan 12 03:16:35 groupadd[3337192]: new group: name=rooter, GID=1790
<86>Jan 12 03:16:35 useradd[3337219]: new user: name=rooter, UID=1790, GID=1790, home=/root, shell=/bin/bash, from=none
<86>Jan 12 03:16:35 userdel[3337255]: delete user 'builder'
<86>Jan 12 03:16:35 userdel[3337255]: removed group 'builder' owned by 'builder'
<86>Jan 12 03:16:35 userdel[3337255]: removed shadow group 'builder' owned by 'builder'
<86>Jan 12 03:16:35 groupadd[3337284]: group added to /etc/group: name=builder, GID=1791
<86>Jan 12 03:16:35 groupadd[3337284]: group added to /etc/gshadow: name=builder
<86>Jan 12 03:16:35 groupadd[3337284]: new group: name=builder, GID=1791
<86>Jan 12 03:16:35 useradd[3337308]: new user: name=builder, UID=1791, GID=1791, home=/usr/src, shell=/bin/bash, from=none
<13>Jan 12 03:16:40 rpmi: libidn2-2.3.4-alt1 sisyphus+309023.100.1.1 1666791084 installed
<13>Jan 12 03:16:40 rpmi: libnettle8-3.9.1-alt1 sisyphus+322548.100.1.2 1686176879 installed
<13>Jan 12 03:16:40 rpmi: libp11-kit-1:0.25.3-alt2 sisyphus+336533.100.1.1 1702645560 installed
<13>Jan 12 03:16:40 rpmi: libtasn1-4.19.0-alt3 sisyphus+327816.100.1.1 1692802615 installed
<13>Jan 12 03:16:40 rpmi: libhogweed6-3.9.1-alt1 sisyphus+322548.100.1.2 1686176879 installed
<13>Jan 12 03:16:40 rpmi: libgnutls30-3.8.2-alt1 sisyphus+334989.100.1.1 1700757173 installed
<13>Jan 12 03:16:40 rpmi: libngtcp2.16-1.0.1-alt1 sisyphus+332583.200.2.1 1698669153 installed
<13>Jan 12 03:16:40 rpmi: libngtcp2_crypto_gnutls8-1.0.1-alt1 sisyphus+332583.200.2.1 1698669153 installed
<13>Jan 12 03:16:40 rpmi: rpm-macros-ninja-build-1.11.1-alt2 sisyphus+327335.100.1.1 1692285423 installed
<13>Jan 12 03:16:40 rpmi: ninja-build-1.11.1-alt2 sisyphus+327335.100.1.1 1692285423 installed
<13>Jan 12 03:16:40 rpmi: rpm-macros-cmake-3.27.7-alt1 sisyphus+331245.40.2.1 1697877617 installed
<13>Jan 12 03:16:41 rpmi: cmake-modules-3.27.7-alt1 sisyphus+331245.40.2.1 1697877617 installed
<13>Jan 12 03:16:41 rpmi: libuv-1.47.0-alt1 sisyphus+337159.100.2.1 1703930510 installed
<13>Jan 12 03:16:41 rpmi: librhash-1.3.5-alt3 sisyphus+286141.40.2.1 1632982456 installed
<13>Jan 12 03:16:41 rpmi: libjsoncpp24-1.9.4-alt2 sisyphus+286441.100.1.1 1633444232 installed
<13>Jan 12 03:16:41 rpmi: libexpat-2.5.0-alt1 sisyphus+309227.100.1.1 1667075764 installed
<13>Jan 12 03:16:41 rpmi: publicsuffix-list-dafsa-20231026-alt1 sisyphus+332908.100.1.1 1698419299 installed
<13>Jan 12 03:16:41 rpmi: libpsl-0.21.2-alt1 sisyphus+312536.100.1.1 1672131178 installed
<13>Jan 12 03:16:41 rpmi: libnghttp3.9-1.0.0-alt1 sisyphus+332583.100.2.1 1698669103 installed
<13>Jan 12 03:16:41 rpmi: libnghttp2-1.57.0-alt1 sisyphus+331457.200.2.1 1697011702 installed
<13>Jan 12 03:16:41 rpmi: openldap-common-2.6.6-alt1 sisyphus+330946.100.2.1 1696432854 installed
<13>Jan 12 03:16:41 rpmi: libntlm-1.5-alt1 sisyphus+278100.3300.1.1 1626058899 installed
<13>Jan 12 03:16:41 rpmi: libidn-1.37-alt2 sisyphus+300849.100.1.1 1653769687 installed
<13>Jan 12 03:16:41 rpmi: libverto-0.3.2-alt1_1 sisyphus+321176.2200.10.2 1684803947 installed
<13>Jan 12 03:16:41 rpmi: liblmdb-0.9.31-alt1 sisyphus+330946.40.2.1 1696431544 installed
<13>Jan 12 03:16:41 rpmi: libkeyutils-1.6.3-alt1 sisyphus+266061.100.1.1 1612919566 installed
<13>Jan 12 03:16:41 rpmi: libcom_err-1.46.4.0.5.4cda-alt1 sisyphus+283826.100.1.1 1629975345 installed
<13>Jan 12 03:16:41 rpmi: libbrotlicommon-1.1.0-alt1 sisyphus+328501.100.1.1 1693598419 installed
<13>Jan 12 03:16:41 rpmi: libbrotlidec-1.1.0-alt1 sisyphus+328501.100.1.1 1693598419 installed
<13>Jan 12 03:16:41 rpmi: rpm-macros-alternatives-0.5.2-alt2 sisyphus+315270.200.2.1 1676457367 installed
<13>Jan 12 03:16:41 rpmi: alternatives-0.5.2-alt2 sisyphus+315270.200.2.1 1676457367 installed
<13>Jan 12 03:16:41 rpmi: ca-certificates-2023.12.20-alt1 sisyphus+336902.300.1.1 1703105726 installed
<13>Jan 12 03:16:41 rpmi: ca-trust-0.1.4-alt1 sisyphus+308690.100.1.1 1666182992 installed
<13>Jan 12 03:16:41 rpmi: p11-kit-trust-1:0.25.3-alt2 sisyphus+336533.100.1.1 1702645560 installed
<13>Jan 12 03:16:41 rpmi: libcrypto3-3.1.4-alt1 sisyphus+332632.100.2.1 1698241041 installed
<13>Jan 12 03:16:41 rpmi: libssl3-3.1.4-alt1 sisyphus+332632.100.2.1 1698241041 installed
<86>Jan 12 03:16:41 groupadd[3350569]: group added to /etc/group: name=_keytab, GID=999
<86>Jan 12 03:16:41 groupadd[3350569]: group added to /etc/gshadow: name=_keytab
<86>Jan 12 03:16:41 groupadd[3350569]: new group: name=_keytab, GID=999
<13>Jan 12 03:16:41 rpmi: libkrb5-1.21.2-alt1 sisyphus+327265.100.1.1 1692185462 installed
<13>Jan 12 03:16:41 rpmi: libgsasl-2.2.0-alt1 sisyphus+333173.100.1.1 1698696954 installed
<86>Jan 12 03:16:41 groupadd[3350753]: group added to /etc/group: name=sasl, GID=998
<86>Jan 12 03:16:41 groupadd[3350753]: group added to /etc/gshadow: name=sasl
<86>Jan 12 03:16:41 groupadd[3350753]: new group: name=sasl, GID=998
<13>Jan 12 03:16:41 rpmi: libsasl2-3-2.1.27-alt2.2 sisyphus+324359.6000.12.1 1689392001 installed
<13>Jan 12 03:16:41 rpmi: libldap2-2.6.6-alt1 sisyphus+330946.100.2.1 1696432854 installed
<13>Jan 12 03:16:41 rpmi: libarchive13-3.6.1-alt2 sisyphus+324359.1300.6.1 1689326379 installed
<13>Jan 12 03:16:41 rpmi: libssh2-1.11.0-alt1 sisyphus+327652.100.1.1 1692636577 installed
<13>Jan 12 03:16:41 rpmi: libcurl-8.5.0-alt1 sisyphus+335914.200.3.1 1701860990 installed
<13>Jan 12 03:16:41 rpmi: cmake-3.27.7-alt1 sisyphus+331245.40.2.1 1697877617 installed
<13>Jan 12 03:16:41 rpmi: rpm-build-ninja-1.11.1-alt2 sisyphus+327335.100.1.1 1692285423 installed
<13>Jan 12 03:16:43 rpmi: libpng16-1.6.40-alt1 sisyphus+323732.100.1.1 1687771851 installed
<13>Jan 12 03:16:43 rpmi: libjpeg-2:2.1.5.1-alt2 sisyphus+334304.100.1.1 1699893670 installed
<13>Jan 12 03:16:43 rpmi: libsqlite3-3.44.2-alt1 sisyphus+335409.100.3.3 1701347810 installed
<13>Jan 12 03:16:43 rpmi: liblz4-1:1.9.4-alt1 sisyphus+309416.100.1.1 1667412981 installed
<13>Jan 12 03:16:43 rpmi: libopenjpeg2.0-2.5.0-alt1 sisyphus+299926.300.3.1 1652478843 installed
<13>Jan 12 03:16:43 rpmi: libnuma-2.0.14-alt2 sisyphus+278485.100.1.1 1626104244 installed
<13>Jan 12 03:16:44 rpmi: libhdf5-103-1.10.6-alt2 sisyphus+271925.100.1.1 1621108446 installed
<13>Jan 12 03:16:44 rpmi: libwebp7-1.3.2-alt1 sisyphus+329541.100.1.1 1694676223 installed
<13>Jan 12 03:16:44 rpmi: libgeos-3.12.1-alt1 sisyphus+334260.100.1.1 1699789550 installed
<13>Jan 12 03:16:44 rpmi: libnl3-3.7.0-alt1 sisyphus+307975.100.1.1 1665071443 installed
<13>Jan 12 03:16:44 rpmi: libibverbs-48.0-alt1 sisyphus+331326.100.2.2 1697008990 installed
<13>Jan 12 03:16:44 rpmi: librdmacm-48.0-alt1 sisyphus+331326.100.2.2 1697008990 installed
<13>Jan 12 03:16:44 rpmi: libnspr-1:4.35-alt1 sisyphus+308164.100.1.1 1665397040 installed
<13>Jan 12 03:16:44 rpmi: libgif-4.1.6-alt3 sisyphus+276911.100.1.3 1625273979 installed
<13>Jan 12 03:16:44 rpmi: zlib-devel-1.2.13-alt1 sisyphus+309409.200.2.1 1667402043 installed
<13>Jan 12 03:16:44 rpmi: libquadmath0-13.2.1-alt2 sisyphus+327572.100.1.1 1692472816 installed
<13>Jan 12 03:16:44 rpmi: libgfortran5-13.2.1-alt2 sisyphus+327572.100.1.1 1692472816 installed
<13>Jan 12 03:16:44 rpmi: libminizip-1.2.13-alt1 sisyphus+309409.200.2.1 1667402043 installed
<13>Jan 12 03:16:44 rpmi: freexl-2.0.0-alt1 sisyphus+331219.100.1.1 1696656233 installed
<13>Jan 12 03:16:44 rpmi: libkmod-31-alt1 sisyphus+330699.100.1.1 1696072422 installed
<13>Jan 12 03:16:44 rpmi: kmod-31-alt1 sisyphus+330699.100.1.1 1696072422 installed
<13>Jan 12 03:16:44 rpmi: libquadmath13-devel-13.2.1-alt2 sisyphus+327572.100.1.1 1692472816 installed
<13>Jan 12 03:16:44 rpmi: libnss-3.96.1-alt1 sisyphus+336902.200.1.1 1703105698 installed
<13>Jan 12 03:16:44 rpmi: librttopo-1.1.0-alt1 sisyphus+288384.100.1.1 1635558056 installed
<13>Jan 12 03:16:44 rpmi: libhdf5-hl-100-1.10.6-alt2 sisyphus+271925.100.1.1 1621108446 installed
<13>Jan 12 03:16:44 rpmi: libnetcdf19-4.8.0-alt1 sisyphus+279368.100.1.2 1626522047 installed
<13>Jan 12 03:16:44 rpmi: libx265-199-3.5-alt1.1 sisyphus+277560.100.1.1 1625697230 installed
<13>Jan 12 03:16:44 rpmi: libnuma-devel-2.0.14-alt2 sisyphus+278485.100.1.1 1626104244 installed
<13>Jan 12 03:16:44 rpmi: libsystemd-1:254.7-alt1 sisyphus+336047.100.1.1 1701962782 installed
<13>Jan 12 03:16:44 rpmi: libunwind-1.7.0-alt2 sisyphus+335269.100.1.1 1701110934 installed
<13>Jan 12 03:16:44 rpmi: rpm-macros-mpi-selector-1.0.3-alt4 sisyphus+299671.100.1.1 1651928220 installed
<13>Jan 12 03:16:44 rpmi: tcsh-6.20.00-alt4 sisyphus+328733.200.1.1 1693865584 installed
<13>Jan 12 03:16:44 rpmi: mpi-selector-1.0.3-alt4 sisyphus+299671.100.1.1 1651928220 installed
<13>Jan 12 03:16:44 rpmi: openmpi-2.0.1-alt9 sisyphus+328620.200.2.1 1693816139 installed
<13>Jan 12 03:16:44 rpmi: libpnetcdf-1.8.1-alt3 sisyphus+284349.100.1.1 1630507685 installed
<13>Jan 12 03:16:44 rpmi: libncurses6-6.3.20220618-alt4 sisyphus+328055.40.2.1 1693212977 installed
<13>Jan 12 03:16:44 rpmi: libtinfo-devel-6.3.20220618-alt4 sisyphus+328055.40.2.1 1693212977 installed
<13>Jan 12 03:16:44 rpmi: libncurses-devel-6.3.20220618-alt4 sisyphus+328055.40.2.1 1693212977 installed
<13>Jan 12 03:16:44 rpmi: libmpdec3-2.5.1-alt3 sisyphus+314490.500.5.1 1675432004 installed
<13>Jan 12 03:16:44 rpmi: libibumad-48.0-alt1 sisyphus+331326.100.2.2 1697008990 installed
<13>Jan 12 03:16:44 rpmi: libibmad-48.0-alt1 sisyphus+331326.100.2.2 1697008990 installed
<13>Jan 12 03:16:44 rpmi: libibnetdisc-48.0-alt1 sisyphus+331326.100.2.2 1697008990 installed
<13>Jan 12 03:16:44 rpmi: libgdbm-1.8.3-alt10 sisyphus+278100.1600.1.1 1626058413 installed
<13>Jan 12 03:16:44 rpmi: libxerces-c-3.2.5-alt1 sisyphus+337156.100.1.1 1703464407 installed
<13>Jan 12 03:16:44 rpmi: libqhull-2020.2-alt1 sisyphus+279488.100.1.2 1626573478 installed
<13>Jan 12 03:16:44 rpmi: libpq5-16.1-alt2 sisyphus+335067.4500.2.2 1701150978 installed
<13>Jan 12 03:16:44 rpmi: liblcms2-2.16-alt1 sisyphus+335676.100.1.1 1701682597 installed
<13>Jan 12 03:16:44 rpmi: poppler-data-0.4.12-alt1 sisyphus+322151.100.1.1 1685438511 installed
<13>Jan 12 03:16:44 rpmi: libltdl7-2.4.7-alt4 sisyphus+336930.1700.1.1 1703106841 installed
<13>Jan 12 03:16:44 rpmi: libunixODBC2-2.3.11-alt1 sisyphus+325970.100.1.1 1690647363 installed
<13>Jan 12 03:16:44 rpmi: libunixODBC-devel-compat-2.3.11-alt1 sisyphus+325970.100.1.1 1690647363 installed
<13>Jan 12 03:16:44 rpmi: libunixODBC-devel-2.3.11-alt1 sisyphus+325970.100.1.1 1690647363 installed
<13>Jan 12 03:16:45 rpmi: libmysqlclient21-8.0.35-alt1.1 sisyphus+334725.100.1.1 1700475420 installed
<13>Jan 12 03:16:45 rpmi: desktop-file-utils-0.26-alt6 sisyphus+331944.100.1.3 1697550026 installed
<13>Jan 12 03:16:45 rpmi: shared-mime-info-2.4-alt1 sisyphus+334259.100.1.1 1699787316 installed
<13>Jan 12 03:16:45 rpmi: libgdk-pixbuf-locales-2.42.10-alt1 sisyphus+308991.100.1.1 1666721198 installed
<13>Jan 12 03:16:45 rpmi: ocl-icd-2.3.2-alt1 sisyphus+335648.100.1.1 1701640049 installed
<13>Jan 12 03:16:45 rpmi: libdeflate-1.19-alt1 sisyphus+329822.100.2.2 1695269327 installed
<13>Jan 12 03:16:45 rpmi: libtiff5-4.4.0-alt4 sisyphus+322581.100.1.2 1686180089 installed
<13>Jan 12 03:16:45 rpmi: libproj-9.3.1-alt1 sisyphus+336697.100.1.1 1702918957 installed
<13>Jan 12 03:16:45 rpmi: libgeotiff5-1.6.0-alt2 sisyphus+308658.1020.16.1 1666988306 installed
<13>Jan 12 03:16:45 rpmi: libspatialite-5.0.1-alt1 sisyphus+308658.1040.16.1 1666988358 installed
<13>Jan 12 03:16:45 rpmi: libtiff-devel-4.4.0-alt4 sisyphus+322581.100.1.2 1686180089 installed
<13>Jan 12 03:16:45 rpmi: libde265-1.0.15-alt1 sisyphus+337190.100.1.1 1703502096 installed
<13>Jan 12 03:16:45 rpmi: libcryptopp-8.9.0-alt1 sisyphus+337150.100.1.1 1703463627 installed
<13>Jan 12 03:16:45 rpmi: libpixman-3:0.42.2-alt1 sisyphus+309549.100.1.1 1667649219 installed
<13>Jan 12 03:16:45 rpmi: libgraphite2-1.3.14-alt2.1 sisyphus+279571.100.1.2 1626605111 installed
<13>Jan 12 03:16:45 rpmi: libharfbuzz-8.3.0-alt1 sisyphus+334471.200.2.1 1700075951 installed
<13>Jan 12 03:16:45 rpmi: libfreetype-2.13.2-alt1 sisyphus+328677.100.1.1 1693834345 installed
<13>Jan 12 03:16:45 rpmi: libfontconfig1-2.14.2-alt8 sisyphus+328444.100.1.1 1693553402 installed
<13>Jan 12 03:16:45 rpmi: libpoppler126-23.02.0-alt1 sisyphus+325701.100.1.1 1690470643 installed
<13>Jan 12 03:16:45 rpmi: libb2-0.98.1-alt1_1 sisyphus+291614.100.1.1 1638962877 installed
<13>Jan 12 03:16:45 rpmi: python3-3.11.6-alt1 sisyphus+331220.100.1.1 1696667994 installed
<13>Jan 12 03:16:46 rpmi: python3-base-3.11.6-alt1 sisyphus+331220.100.1.1 1696667994 installed
<13>Jan 12 03:16:46 rpmi: libpython3-3.11.6-alt1 sisyphus+331220.100.1.1 1696667994 installed
<13>Jan 12 03:16:46 rpmi: python3-module-py3dephell-0.1.0-alt2 sisyphus+328191.600.5.1 1693609196 installed
<13>Jan 12 03:16:46 rpmi: tests-for-installed-python3-pkgs-0.1.24-alt2 sisyphus+331059.100.4.1 1696870033 installed
<13>Jan 12 03:16:46 rpmi: rpm-build-python3-0.1.24-alt2 sisyphus+331059.100.4.1 1696870033 installed
<13>Jan 12 03:16:46 rpmi: libaom3-3.5.0-alt2 sisyphus+335780.100.1.1 1701761281 installed
<13>Jan 12 03:16:46 rpmi: libXdmcp-1.1.4-alt1 sisyphus+311188.1000.1.1 1670233857 installed
<13>Jan 12 03:16:46 rpmi: libXau-1.0.11-alt1 sisyphus+311428.100.1.1 1670577439 installed
<13>Jan 12 03:16:46 rpmi: libxcb-1.16-alt1 sisyphus+327325.200.1.1 1692276261 installed
<13>Jan 12 03:16:46 rpmi: libX11-locales-3:1.8.7-alt1 sisyphus+330921.200.1.1 1696400315 installed
<13>Jan 12 03:16:46 rpmi: libX11-3:1.8.7-alt1 sisyphus+330921.200.1.1 1696400315 installed
<13>Jan 12 03:16:46 rpmi: libXext-1.3.5-alt1 sisyphus+309285.100.1.1 1667212412 installed
<13>Jan 12 03:16:46 rpmi: libXrender-0.9.11-alt1 sisyphus+308841.100.1.1 1666436130 installed
<13>Jan 12 03:16:46 rpmi: libcairo-1:1.18.0-alt1 sisyphus+330227.100.1.1 1695539090 installed
<13>Jan 12 03:16:46 rpmi: librasterlite2-1.1.0-alt1.1 sisyphus+315672.100.1.1 1677138123 installed
<13>Jan 12 03:16:46 rpmi: libtirpc-1.3.4-alt1 sisyphus+331275.100.1.1 1696842481 installed
<13>Jan 12 03:16:46 rpmi: hdf-4.2.15-alt2 sisyphus+285206.100.2.1 1631717633 installed
<13>Jan 12 03:16:46 rpmi: gsettings-desktop-schemas-data-45.0-alt1 sisyphus+325066.400.6.2 1695203930 installed
<13>Jan 12 03:16:47 rpmi: libgio-2.78.3-alt1 sisyphus+335997.100.1.1 1701932747 installed
<13>Jan 12 03:16:47 rpmi: gsettings-desktop-schemas-45.0-alt1 sisyphus+325066.400.6.2 1695203930 installed
<13>Jan 12 03:16:47 rpmi: libgdk-pixbuf-2.42.10-alt1 sisyphus+308991.100.1.1 1666721198 installed
<13>Jan 12 03:16:47 rpmi: libheif-1.17.6-alt1 sisyphus+337190.200.1.1 1703502141 installed
<13>Jan 12 03:16:47 rpmi: libgdal-3.8.2-alt1 sisyphus+337097.100.1.1 1703336695 installed
<13>Jan 12 03:16:47 rpmi: gcc-fortran-common-1.4.27-alt1 sisyphus+278099.1300.1.1 1626028636 installed
<13>Jan 12 03:16:47 rpmi: libgfortran13-devel-13.2.1-alt2 sisyphus+327572.100.1.1 1692472816 installed
<13>Jan 12 03:16:48 rpmi: gcc13-fortran-13.2.1-alt2 sisyphus+327572.100.1.1 1692472816 installed
<13>Jan 12 03:16:48 rpmi: gcc-fortran-13-alt1 sisyphus+323337.300.1.1 1687267966 installed
<13>Jan 12 03:16:48 rpmi: gcc-c++-common-1.4.27-alt1 sisyphus+278099.1300.1.1 1626028636 installed
<13>Jan 12 03:16:48 rpmi: libstdc++13-devel-13.2.1-alt2 sisyphus+327572.100.1.1 1692472816 installed
<13>Jan 12 03:16:48 rpmi: gcc13-c++-13.2.1-alt2 sisyphus+327572.100.1.1 1692472816 installed
<13>Jan 12 03:16:48 rpmi: gcc-c++-13-alt1 sisyphus+323337.300.1.1 1687267966 installed
<13>Jan 12 03:16:48 rpmi: libdevmapper-1.02.196-alt1 sisyphus+328928.400.3.1 1694103931 installed
<13>Jan 12 03:16:48 rpmi: mount-2.39.2-alt1 sisyphus+329530.100.1.1 1694630186 installed
<13>Jan 12 03:16:48 rpmi: losetup-2.39.2-alt1 sisyphus+329530.100.1.1 1694630186 installed
<13>Jan 12 03:16:48 rpmi: lsblk-2.39.2-alt1 sisyphus+329530.100.1.1 1694630186 installed
<86>Jan 12 03:16:48 groupadd[3369752]: group added to /etc/group: name=tape, GID=997
<86>Jan 12 03:16:48 groupadd[3369752]: group added to /etc/gshadow: name=tape
<86>Jan 12 03:16:48 groupadd[3369752]: new group: name=tape, GID=997
<86>Jan 12 03:16:48 groupadd[3369794]: group added to /etc/group: name=dialout, GID=996
<86>Jan 12 03:16:48 groupadd[3369794]: group added to /etc/gshadow: name=dialout
<86>Jan 12 03:16:48 groupadd[3369794]: new group: name=dialout, GID=996
<86>Jan 12 03:16:48 groupadd[3369830]: group added to /etc/group: name=input, GID=995
<86>Jan 12 03:16:48 groupadd[3369830]: group added to /etc/gshadow: name=input
<86>Jan 12 03:16:48 groupadd[3369830]: new group: name=input, GID=995
<86>Jan 12 03:16:48 groupadd[3369863]: group added to /etc/group: name=video, GID=994
<86>Jan 12 03:16:48 groupadd[3369863]: group added to /etc/gshadow: name=video
<86>Jan 12 03:16:48 groupadd[3369863]: new group: name=video, GID=994
<86>Jan 12 03:16:48 groupadd[3369890]: group added to /etc/group: name=render, GID=993
<86>Jan 12 03:16:48 groupadd[3369890]: group added to /etc/gshadow: name=render
<86>Jan 12 03:16:48 groupadd[3369890]: new group: name=render, GID=993
<86>Jan 12 03:16:48 groupadd[3369914]: group added to /etc/group: name=sgx, GID=992
<86>Jan 12 03:16:48 groupadd[3369914]: group added to /etc/gshadow: name=sgx
<86>Jan 12 03:16:48 groupadd[3369914]: new group: name=sgx, GID=992
<13>Jan 12 03:16:49 rpmi: udev-1:254.7-alt1 sisyphus+336047.100.1.1 1701962782 installed
<13>Jan 12 03:16:49 rpmi: dmsetup-1.02.196-alt1 sisyphus+328928.400.3.1 1694103931 installed
<13>Jan 12 03:16:49 rpmi: rdma-core-48.0-alt1 sisyphus+331326.100.2.2 1697008990 installed
<13>Jan 12 03:16:49 rpmi: rdma-core-devel-48.0-alt1 sisyphus+331326.100.2.2 1697008990 installed
<13>Jan 12 03:16:49 rpmi: openmpi-devel-2.0.1-alt9 sisyphus+328620.200.2.1 1693816139 installed
<13>Jan 12 03:16:49 rpmi: libreadline7-7.0.3-alt5 sisyphus+328858.200.1.1 1694010737 installed
<13>Jan 12 03:16:49 rpmi: bc-1:1.07.1-alt1 sisyphus+278100.400.1.1 1626056612 installed
<13>Jan 12 03:16:49 rpmi: libcurl-devel-8.5.0-alt1 sisyphus+335914.200.3.1 1701860990 installed
<13>Jan 12 03:16:49 rpmi: libproj-devel-9.3.1-alt1 sisyphus+336697.100.1.1 1702918957 installed
<13>Jan 12 03:16:49 rpmi: libgeotiff-devel-1.6.0-alt2 sisyphus+308658.1020.16.1 1666988306 installed
<13>Jan 12 03:16:49 rpmi: libpnetcdf-devel-1.8.1-alt3 sisyphus+284349.100.1.1 1630507685 installed
<13>Jan 12 03:16:49 rpmi: libgdal-devel-3.8.2-alt1 sisyphus+337097.100.1.1 1703336695 installed
<13>Jan 12 03:16:49 rpmi: hdf-devel-4.2.15-alt2 sisyphus+285206.100.2.1 1631717633 installed
<13>Jan 12 03:16:50 rpmi: python3-dev-3.11.6-alt1 sisyphus+331220.100.1.1 1696667994 installed
<13>Jan 12 03:16:50 rpmi: libcryptopp-devel-8.9.0-alt1 sisyphus+337150.100.1.1 1703463627 installed
<13>Jan 12 03:16:50 rpmi: libunwind-devel-1.7.0-alt2 sisyphus+335269.100.1.1 1701110934 installed
<13>Jan 12 03:16:50 rpmi: liblz4-devel-1:1.9.4-alt1 sisyphus+309416.100.1.1 1667412981 installed
<13>Jan 12 03:16:50 rpmi: libzstd-devel-1.5.5-alt2 sisyphus+327847.100.1.1 1692867219 installed
<13>Jan 12 03:16:50 rpmi: libxml2-devel-1:2.12.3-alt1 sisyphus+336543.100.1.1 1702649479 installed
<13>Jan 12 03:16:50 rpmi: libssl-devel-3.1.4-alt1 sisyphus+332632.100.2.1 1698241041 installed
<13>Jan 12 03:16:50 rpmi: bash-completion-1:2.11-alt3.git.157.g59d2322e sisyphus+314768.100.1.1 1675690562 installed
Building target platforms: x86_64
Building for target x86_64
Wrote: /usr/src/in/nosrpm/pdal-2.6.2-alt1.nosrc.rpm (w1.gzdio)
Installing pdal-2.6.2-alt1.src.rpm
Building target platforms: x86_64
Building for target x86_64
Executing(%prep): /bin/sh -e /usr/src/tmp/rpm-tmp.7061
+ umask 022
+ /bin/mkdir -p /usr/src/RPM/BUILD
+ cd /usr/src/RPM/BUILD
+ cd /usr/src/RPM/BUILD
+ rm -rf PDAL-2.6.2
+ echo 'Source #0 (PDAL-2.6.2.tar):'
Source #0 (PDAL-2.6.2.tar):
+ /bin/tar -xf /usr/src/RPM/SOURCES/PDAL-2.6.2.tar
+ cd PDAL-2.6.2
+ /bin/chmod -c -Rf u+rwX,go-w .
+ sed -i '/{CMAKE_DL_LIBS}/a unwind' CMakeLists.txt
+ exit 0
Executing(%build): /bin/sh -e /usr/src/tmp/rpm-tmp.7061
+ umask 022
+ /bin/mkdir -p /usr/src/RPM/BUILD
+ cd /usr/src/RPM/BUILD
+ cd PDAL-2.6.2
+ mkdir -p x86_64-alt-linux
+ cmake -DCMAKE_SKIP_INSTALL_RPATH:BOOL=yes '-DCMAKE_C_FLAGS:STRING=-pipe -frecord-gcc-switches -Wall -g -O2 -flto=auto' '-DCMAKE_CXX_FLAGS:STRING=-pipe -frecord-gcc-switches -Wall -g -O2 -flto=auto' '-DCMAKE_Fortran_FLAGS:STRING=-pipe -frecord-gcc-switches -Wall -g -O2 -flto=auto' -DCMAKE_INSTALL_PREFIX=/usr -DINCLUDE_INSTALL_DIR:PATH=/usr/include -DLIB_INSTALL_DIR:PATH=/usr/lib64 -DSYSCONF_INSTALL_DIR:PATH=/etc -DSHARE_INSTALL_PREFIX:PATH=/usr/share -DLIB_DESTINATION=lib64 -DLIB_SUFFIX=64 -S . -B x86_64-alt-linux -GNinja -Wno-dev -DPDAL_LIB_INSTALL_DIR=/usr/lib64 -DWITH_TESTS=false
-- The CXX compiler identification is GNU 13.2.1
-- The C compiler identification is GNU 13.2.1
-- Detecting CXX compiler ABI info
-- Detecting CXX compiler ABI info - done
-- Check for working CXX compiler: /usr/bin/c++ - skipped
-- Detecting CXX compile features
-- Detecting CXX compile features - done
-- Detecting C compiler ABI info
-- Detecting C compiler ABI info - done
-- Check for working C compiler: /usr/bin/cc - skipped
-- Detecting C compile features
-- Detecting C compile features - done
-- Could NOT find LIBEXECINFO (missing: LIBEXECINFO_LIBRARY) 
-- Found LIBUNWIND: /usr/lib64/libunwind.so  
-- Found Proj: /usr/lib64/libproj.so version 9 (9.3.1)
-- Found GDAL: /usr/lib64/libgdal.so (found suitable version "3.8.2", minimum required is "3.4") 
-- Found GeoTIFF: /usr/lib64/libgeotiff.so  
-- Performing Test CMAKE_HAVE_LIBC_PTHREAD
-- Performing Test CMAKE_HAVE_LIBC_PTHREAD - Success
-- Found Threads: TRUE  
-- Found ZLIB: /usr/lib64/libz.so (found version "1.2.13")  
Package liblzma was not found in the pkg-config search path.
Perhaps you should add the directory containing `liblzma.pc'
to the PKG_CONFIG_PATH environment variable
Package 'liblzma', required by 'libxml-2.0', not found
Package liblzma was not found in the pkg-config search path.
Perhaps you should add the directory containing `liblzma.pc'
to the PKG_CONFIG_PATH environment variable
Package 'liblzma', required by 'libxml-2.0', not found
Package liblzma was not found in the pkg-config search path.
Perhaps you should add the directory containing `liblzma.pc'
to the PKG_CONFIG_PATH environment variable
Package 'liblzma', required by 'libxml-2.0', not found
Package liblzma was not found in the pkg-config search path.
Perhaps you should add the directory containing `liblzma.pc'
to the PKG_CONFIG_PATH environment variable
Package 'liblzma', required by 'libxml-2.0', not found
-- Found LibXml2: /usr/lib64/libxml2.so (found version "2.12.3") 
-- Found CURL: /usr/lib64/libcurl.so (found version "8.5.0")  
-- Found OpenSSL: /usr/lib64/libcrypto.so (found suitable version "3.1.4", minimum required is "1.1")  
-- The following features have been enabled:

 * Backtrace, build with backtrace (Libunwind/Libexecinfo) support

-- The following OPTIONAL packages have been found:

 * Libunwind
 * ZSTD
   General compression support
 * LibXml2
 * PkgConfig
 * OpenSSL (required version >= 1.1)

-- The following REQUIRED packages have been found:

 * GDAL (required version >= 3.4)
   Provides general purpose raster, vector, and reference system support
 * GeoTIFF
 * ZLIB
   Compression support in BPF
 * CURL
 * Threads, The thread library of the system

-- The following features have been disabled:

 * Bash completion, completion for PDAL command line
 * CPD plugin, Coherent Point Drift (CPD) computes rigid or nonrigid transformations between point sets
 * Draco plugin, Read data in the draco format
 * Icebridge plugin, read data in the Icebridge format
 * HDF plugin, read data in the HDF format
 * Matlab plugin, write data to a .mat file
 * NITF plugin, read/write LAS data wrapped in NITF
 * OpenSceneGraph plugin, read/write OpenSceneGraph objects
 * PostgreSQL PointCloud plugin, read/write PostgreSQL PointCloud objects
 * RiVLib plugin, read data in the RXP format
 * rdblib plugin, read data in the RDB format
 * MBIO plugin, add features that depend on MBIO
 * FBX plugin, add features that depend on FBX
 * TEASER++ plugin, TEASER++ computes transformations between point sets
 * TileDB plugin, read/write data from TileDB
 * Trajectory plugin, Compute trajectory from LAS input
 * E57 plugin, read/write data to and from e57 format
 * Unit tests, PDAL unit tests
 * Abseil debugging support , unit tests

-- The following OPTIONAL packages have not been found:

 * PostgreSQL
 * Libexecinfo

-- Configuring done (0.6s)
-- Generating done (0.0s)
CMake Warning:
  Manually-specified variables were not used by the project:

    CMAKE_Fortran_FLAGS
    LIB_DESTINATION
    LIB_SUFFIX
    SHARE_INSTALL_PREFIX
    SYSCONF_INSTALL_DIR


-- Build files have been written to: /usr/src/RPM/BUILD/PDAL-2.6.2/x86_64-alt-linux
+ /usr/bin/ninja -j16 -C x86_64-alt-linux
ninja: Entering directory `x86_64-alt-linux'
[1/312] Building CXX object vendor/kazhdan/CMakeFiles/pdal_kazhdan.dir/Factor.cpp.o
[2/312] Building CXX object vendor/kazhdan/CMakeFiles/pdal_kazhdan.dir/Geometry.cpp.o
[3/312] Building CXX object vendor/lazperf/CMakeFiles/pdal_lazperf.dir/charbuf.cpp.o
[4/312] Building CXX object vendor/kazhdan/CMakeFiles/pdal_kazhdan.dir/MarchingCubes.cpp.o
[5/312] Linking CXX static library usr/lib64/libpdal_kazhdan.a
[6/312] Building CXX object vendor/lazperf/CMakeFiles/pdal_lazperf.dir/detail/field_byte10.cpp.o
[7/312] Building CXX object vendor/lazperf/CMakeFiles/pdal_lazperf.dir/detail/field_nir14.cpp.o
[8/312] Building CXX object vendor/lazperf/CMakeFiles/pdal_lazperf.dir/detail/field_byte14.cpp.o
[9/312] Building CXX object vendor/lazperf/CMakeFiles/pdal_lazperf.dir/detail/field_gpstime10.cpp.o
[10/312] Building CXX object vendor/lazperf/CMakeFiles/pdal_lazperf.dir/detail/field_rgb10.cpp.o
[11/312] Building CXX object vendor/lazperf/CMakeFiles/pdal_lazperf.dir/detail/field_point10.cpp.o
[12/312] Building CXX object dimbuilder/CMakeFiles/dimbuilder.dir/__/pdal/util/Utils.cpp.o
[13/312] Building CXX object vendor/lazperf/CMakeFiles/pdal_lazperf.dir/detail/field_rgb14.cpp.o
[14/312] Building CXX object vendor/lazperf/CMakeFiles/pdal_lazperf.dir/header.cpp.o
[15/312] Building CXX object vendor/lepcc/CMakeFiles/pdal_lepcc.dir/src/BitMask.cpp.o
[16/312] Building CXX object vendor/lepcc/CMakeFiles/pdal_lepcc.dir/src/Common.cpp.o
[17/312] Building CXX object vendor/lazperf/CMakeFiles/pdal_lazperf.dir/detail/field_point14.cpp.o
[18/312] Building CXX object vendor/lepcc/CMakeFiles/pdal_lepcc.dir/src/BitStuffer2.cpp.o
[19/312] Building CXX object vendor/lazperf/CMakeFiles/pdal_lazperf.dir/filestream.cpp.o
[20/312] Building CXX object vendor/lepcc/CMakeFiles/pdal_lepcc.dir/src/FlagBytes.cpp.o
In file included from /usr/include/c++/13/cassert:44,
                 from /usr/src/RPM/BUILD/PDAL-2.6.2/vendor/lepcc/src/utl_const_array.h:25,
                 from /usr/src/RPM/BUILD/PDAL-2.6.2/vendor/lepcc/src/FlagBytes.cpp:29:
/usr/src/RPM/BUILD/PDAL-2.6.2/vendor/lepcc/src/utl_const_array.h: In instantiation of 'const T& lepcc::const_array<T>::operator[](size_t) const [with T = unsigned char; size_t = long unsigned int]':
/usr/src/RPM/BUILD/PDAL-2.6.2/vendor/lepcc/src/FlagBytes.cpp:116:35:   required from here
/usr/src/RPM/BUILD/PDAL-2.6.2/vendor/lepcc/src/utl_const_array.h:43:67: warning: comparison of unsigned expression in '>= 0' is always true [-Wtype-limits]
   43 |     const T& operator[](size_t i) const _NOEXCEPT{ LEPCC_ASSERT(i >= 0 && i < m_size); return m_data[i]; }
      |                                                                 ~~^~~~
/usr/src/RPM/BUILD/PDAL-2.6.2/vendor/lepcc/src/utl_const_array.h:43:52: note: in expansion of macro 'LEPCC_ASSERT'
   43 |     const T& operator[](size_t i) const _NOEXCEPT{ LEPCC_ASSERT(i >= 0 && i < m_size); return m_data[i]; }
      |                                                    ^~~~~~~~~~~~
[21/312] Building CXX object vendor/lepcc/CMakeFiles/pdal_lepcc.dir/src/Intensity.cpp.o
In file included from /usr/include/c++/13/cassert:44,
                 from /usr/src/RPM/BUILD/PDAL-2.6.2/vendor/lepcc/src/utl_const_array.h:25,
                 from /usr/src/RPM/BUILD/PDAL-2.6.2/vendor/lepcc/src/Intensity.cpp:30:
/usr/src/RPM/BUILD/PDAL-2.6.2/vendor/lepcc/src/utl_const_array.h: In instantiation of 'const T& lepcc::const_array<T>::operator[](size_t) const [with T = short unsigned int; size_t = long unsigned int]':
/usr/src/RPM/BUILD/PDAL-2.6.2/vendor/lepcc/src/Intensity.cpp:112:36:   required from here
/usr/src/RPM/BUILD/PDAL-2.6.2/vendor/lepcc/src/utl_const_array.h:43:67: warning: comparison of unsigned expression in '>= 0' is always true [-Wtype-limits]
   43 |     const T& operator[](size_t i) const _NOEXCEPT{ LEPCC_ASSERT(i >= 0 && i < m_size); return m_data[i]; }
      |                                                                 ~~^~~~
/usr/src/RPM/BUILD/PDAL-2.6.2/vendor/lepcc/src/utl_const_array.h:43:52: note: in expansion of macro 'LEPCC_ASSERT'
   43 |     const T& operator[](size_t i) const _NOEXCEPT{ LEPCC_ASSERT(i >= 0 && i < m_size); return m_data[i]; }
      |                                                    ^~~~~~~~~~~~
[22/312] Building CXX object vendor/lazperf/CMakeFiles/pdal_lazperf.dir/vlr.cpp.o
[23/312] Building CXX object vendor/schema-validator/CMakeFiles/pdal_json_schema.dir/json-uri.cpp.o
[24/312] Building CXX object vendor/lepcc/CMakeFiles/pdal_lepcc.dir/src/Huffman.cpp.o
[25/312] Building CXX object vendor/lepcc/CMakeFiles/pdal_lepcc.dir/src/ClusterRGB.cpp.o
In file included from /usr/include/c++/13/cassert:44,
                 from /usr/src/RPM/BUILD/PDAL-2.6.2/vendor/lepcc/src/utl_const_array.h:25,
                 from /usr/src/RPM/BUILD/PDAL-2.6.2/vendor/lepcc/src/ClusterRGB.cpp:28:
/usr/src/RPM/BUILD/PDAL-2.6.2/vendor/lepcc/src/utl_const_array.h: In instantiation of 'const T& lepcc::const_array<T>::operator[](size_t) const [with T = lepcc::RGB_t; size_t = long unsigned int]':
/usr/src/RPM/BUILD/PDAL-2.6.2/vendor/lepcc/src/ClusterRGB.cpp:67:24:   required from here
/usr/src/RPM/BUILD/PDAL-2.6.2/vendor/lepcc/src/utl_const_array.h:43:67: warning: comparison of unsigned expression in '>= 0' is always true [-Wtype-limits]
   43 |     const T& operator[](size_t i) const _NOEXCEPT{ LEPCC_ASSERT(i >= 0 && i < m_size); return m_data[i]; }
      |                                                                 ~~^~~~
/usr/src/RPM/BUILD/PDAL-2.6.2/vendor/lepcc/src/utl_const_array.h:43:52: note: in expansion of macro 'LEPCC_ASSERT'
   43 |     const T& operator[](size_t i) const _NOEXCEPT{ LEPCC_ASSERT(i >= 0 && i < m_size); return m_data[i]; }
      |                                                    ^~~~~~~~~~~~
[26/312] Building CXX object vendor/lazperf/CMakeFiles/pdal_lazperf.dir/lazperf.cpp.o
[27/312] Building CXX object vendor/schema-validator/CMakeFiles/pdal_json_schema.dir/json-schema-draft7.json.cpp.o
[28/312] Building CXX object vendor/lazperf/CMakeFiles/pdal_lazperf.dir/writers.cpp.o
[29/312] Building CXX object vendor/lepcc/CMakeFiles/pdal_lepcc.dir/src/LEPCC.cpp.o
In file included from /usr/include/c++/13/cassert:44,
                 from /usr/src/RPM/BUILD/PDAL-2.6.2/vendor/lepcc/src/utl_const_array.h:25,
                 from /usr/src/RPM/BUILD/PDAL-2.6.2/vendor/lepcc/src/LEPCC.cpp:29:
/usr/src/RPM/BUILD/PDAL-2.6.2/vendor/lepcc/src/utl_const_array.h: In instantiation of 'const T& lepcc::const_array<T>::operator[](size_t) const [with T = lepcc::Point3D; size_t = long unsigned int]':
/usr/src/RPM/BUILD/PDAL-2.6.2/vendor/lepcc/src/LEPCC.cpp:323:46:   required from here
/usr/src/RPM/BUILD/PDAL-2.6.2/vendor/lepcc/src/utl_const_array.h:43:67: warning: comparison of unsigned expression in '>= 0' is always true [-Wtype-limits]
   43 |     const T& operator[](size_t i) const _NOEXCEPT{ LEPCC_ASSERT(i >= 0 && i < m_size); return m_data[i]; }
      |                                                                 ~~^~~~
/usr/src/RPM/BUILD/PDAL-2.6.2/vendor/lepcc/src/utl_const_array.h:43:52: note: in expansion of macro 'LEPCC_ASSERT'
   43 |     const T& operator[](size_t i) const _NOEXCEPT{ LEPCC_ASSERT(i >= 0 && i < m_size); return m_data[i]; }
      |                                                    ^~~~~~~~~~~~
[30/312] Building CXX object vendor/lazperf/CMakeFiles/pdal_lazperf.dir/readers.cpp.o
[31/312] Building CXX object vendor/lepcc/CMakeFiles/pdal_lepcc.dir/src/lepcc_c_api_impl.cpp.o
[32/312] Linking CXX static library usr/lib64/libpdal_lazperf.a
[33/312] Linking CXX static library usr/lib64/libpdal_lepcc.a
[34/312] Building CXX object vendor/schema-validator/CMakeFiles/pdal_json_schema.dir/json-patch.cpp.o
[35/312] Building CXX object tools/lasdump/CMakeFiles/lasdump.dir/Header.cpp.o
[36/312] Building CXX object tools/lasdump/CMakeFiles/lasdump.dir/Dumper.cpp.o
[37/312] Building CXX object vendor/schema-validator/CMakeFiles/pdal_json_schema.dir/string-format-check.cpp.o
[38/312] Building CXX object tools/lasdump/CMakeFiles/lasdump.dir/__/__/pdal/util/Utils.cpp.o
[39/312] Building CXX object tools/lasdump/CMakeFiles/lasdump.dir/__/__/pdal/util/FileUtils.cpp.o
[40/312] Building CXX object dimbuilder/CMakeFiles/dimbuilder.dir/DimBuilder.cpp.o
[41/312] Building CXX object tools/lasdump/CMakeFiles/lasdump.dir/__/__/pdal/util/Bounds.cpp.o
[42/312] Building CXX object vendor/arbiter/CMakeFiles/pdal_arbiter.dir/arbiter.cpp.o
[43/312] Linking CXX static library usr/lib64/libpdal_arbiter.a
[44/312] Building CXX object vendor/schema-validator/CMakeFiles/pdal_json_schema.dir/json-validator.cpp.o
[45/312] Linking CXX static library usr/lib64/libpdal_json_schema.a
[46/312] Linking CXX executable bin/dimbuilder
[47/312] Generating include/pdal/Dimension.hpp
[48/312] Linking CXX executable bin/lasdump
[49/312] Building CXX object CMakeFiles/pdalcpp.dir/filters/ChipperFilter.cpp.o
[50/312] Building CXX object CMakeFiles/pdalcpp.dir/filters/DelaunayFilter.cpp.o
[51/312] Building CXX object CMakeFiles/pdalcpp.dir/filters/CSFilter.cpp.o
[52/312] Building CXX object CMakeFiles/pdalcpp.dir/filters/AssignFilter.cpp.o
[53/312] Building CXX object CMakeFiles/pdalcpp.dir/filters/ELMFilter.cpp.o
[54/312] Building CXX object CMakeFiles/pdalcpp.dir/filters/ColorizationFilter.cpp.o
[55/312] Building CXX object CMakeFiles/pdalcpp.dir/filters/DividerFilter.cpp.o
[56/312] Building CXX object CMakeFiles/pdalcpp.dir/filters/ClusterFilter.cpp.o
[57/312] Building CXX object CMakeFiles/pdalcpp.dir/filters/DecimationFilter.cpp.o
[58/312] Building CXX object CMakeFiles/pdalcpp.dir/filters/DEMFilter.cpp.o
[59/312] Building CXX object CMakeFiles/pdalcpp.dir/filters/DBSCANFilter.cpp.o
[60/312] Building CXX object CMakeFiles/pdalcpp.dir/filters/ColorinterpFilter.cpp.o
[61/312] Building CXX object CMakeFiles/pdalcpp.dir/filters/CropFilter.cpp.o
[62/312] Building CXX object CMakeFiles/pdalcpp.dir/filters/ApproximateCoplanarFilter.cpp.o
[63/312] Building CXX object CMakeFiles/pdalcpp.dir/filters/ExpressionFilter.cpp.o
[64/312] Building CXX object CMakeFiles/pdalcpp.dir/filters/FerryFilter.cpp.o
[65/312] Building CXX object CMakeFiles/pdalcpp.dir/filters/CovarianceFeaturesFilter.cpp.o
[66/312] Building CXX object CMakeFiles/pdalcpp.dir/filters/EstimateRankFilter.cpp.o
[67/312] Building CXX object CMakeFiles/pdalcpp.dir/filters/FarthestPointSamplingFilter.cpp.o
[68/312] Building CXX object CMakeFiles/pdalcpp.dir/filters/GroupByFilter.cpp.o
[69/312] Building CXX object CMakeFiles/pdalcpp.dir/filters/GpsTimeConvert.cpp.o
[70/312] Building CXX object CMakeFiles/pdalcpp.dir/filters/EigenvaluesFilter.cpp.o
[71/312] Building CXX object CMakeFiles/pdalcpp.dir/filters/GeomDistanceFilter.cpp.o
[72/312] Building CXX object CMakeFiles/pdalcpp.dir/filters/FaceRasterFilter.cpp.o
[73/312] Building CXX object CMakeFiles/pdalcpp.dir/filters/HagDelaunayFilter.cpp.o
[74/312] Building CXX object CMakeFiles/pdalcpp.dir/filters/HagDemFilter.cpp.o
[75/312] Building CXX object CMakeFiles/pdalcpp.dir/filters/HeadFilter.cpp.o
[76/312] Building CXX object CMakeFiles/pdalcpp.dir/filters/HagNnFilter.cpp.o
[77/312] Building CXX object CMakeFiles/pdalcpp.dir/filters/IQRFilter.cpp.o
[78/312] Building CXX object CMakeFiles/pdalcpp.dir/filters/GreedyProjection.cpp.o
[79/312] Building CXX object CMakeFiles/pdalcpp.dir/filters/MergeFilter.cpp.o
[80/312] Building CXX object CMakeFiles/pdalcpp.dir/filters/InfoFilter.cpp.o
[81/312] Building CXX object CMakeFiles/pdalcpp.dir/filters/LOFFilter.cpp.o
[82/312] Building CXX object CMakeFiles/pdalcpp.dir/filters/LocateFilter.cpp.o
[83/312] Building CXX object CMakeFiles/pdalcpp.dir/filters/LiTreeFilter.cpp.o
[84/312] Building CXX object CMakeFiles/pdalcpp.dir/filters/LloydKMeansFilter.cpp.o
[85/312] Building CXX object CMakeFiles/pdalcpp.dir/filters/HexBinFilter.cpp.o
[86/312] Building CXX object CMakeFiles/pdalcpp.dir/filters/MADFilter.cpp.o
[87/312] Building CXX object CMakeFiles/pdalcpp.dir/filters/MiniballFilter.cpp.o
[88/312] Building CXX object CMakeFiles/pdalcpp.dir/filters/GeoreferenceFilter.cpp.o
[89/312] Building CXX object CMakeFiles/pdalcpp.dir/filters/NNDistanceFilter.cpp.o
[90/312] Building CXX object CMakeFiles/pdalcpp.dir/filters/MortonOrderFilter.cpp.o
[91/312] Building CXX object CMakeFiles/pdalcpp.dir/filters/OutlierFilter.cpp.o
[92/312] Building CXX object CMakeFiles/pdalcpp.dir/filters/NeighborClassifierFilter.cpp.o
[93/312] Building CXX object CMakeFiles/pdalcpp.dir/filters/RadialDensityFilter.cpp.o
[94/312] Building CXX object CMakeFiles/pdalcpp.dir/filters/OverlayFilter.cpp.o
[95/312] Building CXX object CMakeFiles/pdalcpp.dir/filters/ProjPipelineFilter.cpp.o
[96/312] Building CXX object CMakeFiles/pdalcpp.dir/filters/MongoExpressionFilter.cpp.o
[97/312] Building CXX object CMakeFiles/pdalcpp.dir/filters/RandomizeFilter.cpp.o
[98/312] Building CXX object CMakeFiles/pdalcpp.dir/filters/PMFFilter.cpp.o
[99/312] Building CXX object CMakeFiles/pdalcpp.dir/filters/OptimalNeighborhoodFilter.cpp.o
[100/312] Building CXX object CMakeFiles/pdalcpp.dir/filters/RangeFilter.cpp.o
[101/312] Building CXX object CMakeFiles/pdalcpp.dir/filters/PlaneFitFilter.cpp.o
[102/312] Building CXX object CMakeFiles/pdalcpp.dir/filters/ReciprocityFilter.cpp.o
[103/312] Building CXX object CMakeFiles/pdalcpp.dir/filters/NormalFilter.cpp.o
[104/312] Building CXX object CMakeFiles/pdalcpp.dir/filters/ReturnsFilter.cpp.o
[105/312] Building CXX object CMakeFiles/pdalcpp.dir/filters/ReprojectionFilter.cpp.o
[106/312] Building CXX object CMakeFiles/pdalcpp.dir/filters/RelaxationDartThrowing.cpp.o
[107/312] Building CXX object CMakeFiles/pdalcpp.dir/filters/SeparateScanLineFilter.cpp.o
[108/312] Building CXX object CMakeFiles/pdalcpp.dir/filters/SampleFilter.cpp.o
[109/312] Building CXX object CMakeFiles/pdalcpp.dir/filters/SkewnessBalancingFilter.cpp.o
[110/312] Building CXX object CMakeFiles/pdalcpp.dir/filters/ShellFilter.cpp.o
[111/312] Building CXX object CMakeFiles/pdalcpp.dir/io/BpfCompressor.cpp.o
[112/312] Building CXX object CMakeFiles/pdalcpp.dir/filters/StreamCallbackFilter.cpp.o
[113/312] Building CXX object CMakeFiles/pdalcpp.dir/filters/SortFilter.cpp.o
[114/312] Building CXX object CMakeFiles/pdalcpp.dir/filters/SplitterFilter.cpp.o
[115/312] Building CXX object CMakeFiles/pdalcpp.dir/filters/TailFilter.cpp.o
[116/312] Building CXX object CMakeFiles/pdalcpp.dir/filters/PoissonFilter.cpp.o
[117/312] Building CXX object CMakeFiles/pdalcpp.dir/filters/StatsFilter.cpp.o
[118/312] Building CXX object CMakeFiles/pdalcpp.dir/io/BpfHeader.cpp.o
[119/312] Building CXX object CMakeFiles/pdalcpp.dir/filters/VoxelCenterNearestNeighborFilter.cpp.o
[120/312] Building CXX object CMakeFiles/pdalcpp.dir/filters/SMRFilter.cpp.o
[121/312] Building CXX object CMakeFiles/pdalcpp.dir/filters/ZsmoothFilter.cpp.o
[122/312] Building CXX object CMakeFiles/pdalcpp.dir/filters/VoxelDownsizeFilter.cpp.o
[123/312] Building CXX object CMakeFiles/pdalcpp.dir/filters/StraightenFilter.cpp.o
[124/312] Building CXX object CMakeFiles/pdalcpp.dir/io/FbiHeader.cpp.o
[125/312] Building CXX object CMakeFiles/pdalcpp.dir/filters/VoxelCentroidNearestNeighborFilter.cpp.o
[126/312] Building CXX object CMakeFiles/pdalcpp.dir/filters/TransformationFilter.cpp.o
[127/312] Building CXX object CMakeFiles/pdalcpp.dir/io/FbiReader.cpp.o
[128/312] Building CXX object CMakeFiles/pdalcpp.dir/io/FauxReader.cpp.o
[129/312] Building CXX object CMakeFiles/pdalcpp.dir/io/BpfWriter.cpp.o
[130/312] Building CXX object CMakeFiles/pdalcpp.dir/io/Ilvis2MetadataReader.cpp.o
[131/312] Building CXX object CMakeFiles/pdalcpp.dir/io/GDALReader.cpp.o
[132/312] Building CXX object CMakeFiles/pdalcpp.dir/io/FbiWriter.cpp.o
[133/312] Building CXX object CMakeFiles/pdalcpp.dir/io/BpfReader.cpp.o
[134/312] Building CXX object CMakeFiles/pdalcpp.dir/io/GDALWriter.cpp.o
[135/312] Building CXX object CMakeFiles/pdalcpp.dir/io/CopcWriter.cpp.o
[136/312] Building CXX object CMakeFiles/pdalcpp.dir/io/LasHeader.cpp.o
[137/312] Building CXX object CMakeFiles/pdalcpp.dir/io/Ilvis2Reader.cpp.o
[138/312] Building CXX object CMakeFiles/pdalcpp.dir/io/LasVLR.cpp.o
[139/312] Building CXX object CMakeFiles/pdalcpp.dir/io/I3SReader.cpp.o
[140/312] Building CXX object CMakeFiles/pdalcpp.dir/io/CopcReader.cpp.o
[141/312] Building CXX object CMakeFiles/pdalcpp.dir/io/NullWriter.cpp.o
[142/312] Building CXX object CMakeFiles/pdalcpp.dir/io/EptAddonWriter.cpp.o
[143/312] Building CXX object CMakeFiles/pdalcpp.dir/io/GltfWriter.cpp.o
[144/312] Building CXX object CMakeFiles/pdalcpp.dir/io/MemoryViewReader.cpp.o
[145/312] Building CXX object CMakeFiles/pdalcpp.dir/filters/IterativeClosestPoint.cpp.o
[146/312] Building CXX object CMakeFiles/pdalcpp.dir/io/LasReader.cpp.o
[147/312] Building CXX object CMakeFiles/pdalcpp.dir/io/EptReader.cpp.o
[148/312] Building CXX object CMakeFiles/pdalcpp.dir/io/EsriReader.cpp.o
[149/312] Building CXX object CMakeFiles/pdalcpp.dir/io/PcdHeader.cpp.o
[150/312] Building CXX object CMakeFiles/pdalcpp.dir/io/ObjReader.cpp.o
[151/312] Building CXX object CMakeFiles/pdalcpp.dir/io/OptechReader.cpp.o
[152/312] Building CXX object CMakeFiles/pdalcpp.dir/io/LasWriter.cpp.o
[153/312] Building CXX object CMakeFiles/pdalcpp.dir/io/OGRWriter.cpp.o
[154/312] Building CXX object CMakeFiles/pdalcpp.dir/io/PtsReader.cpp.o
[155/312] Building CXX object CMakeFiles/pdalcpp.dir/io/PlyReader.cpp.o
[156/312] Building CXX object CMakeFiles/pdalcpp.dir/io/PtxReader.cpp.o
[157/312] Building CXX object CMakeFiles/pdalcpp.dir/io/QfitReader.cpp.o
[158/312] Building CXX object CMakeFiles/pdalcpp.dir/io/PcdReader.cpp.o
[159/312] Building CXX object CMakeFiles/pdalcpp.dir/io/PlyWriter.cpp.o
[160/312] Building CXX object CMakeFiles/pdalcpp.dir/io/SbetSmrmsgReader.cpp.o
[161/312] Building CXX object CMakeFiles/pdalcpp.dir/io/SbetReader.cpp.o
[162/312] Building CXX object CMakeFiles/pdalcpp.dir/io/PcdWriter.cpp.o
[163/312] Building CXX object CMakeFiles/pdalcpp.dir/io/SbetWriter.cpp.o
[164/312] Building CXX object CMakeFiles/pdalcpp.dir/io/RasterWriter.cpp.o
[165/312] Building CXX object CMakeFiles/pdalcpp.dir/io/TerrasolidReader.cpp.o
[166/312] Building CXX object CMakeFiles/pdalcpp.dir/io/TextReader.cpp.o
[167/312] Building CXX object CMakeFiles/pdalcpp.dir/io/TextWriter.cpp.o
[168/312] Building CXX object CMakeFiles/pdalcpp.dir/kernels/ChamferKernel.cpp.o
[169/312] Building CXX object CMakeFiles/pdalcpp.dir/io/SlpkReader.cpp.o
[170/312] Building CXX object CMakeFiles/pdalcpp.dir/kernels/DensityKernel.cpp.o
[171/312] Building CXX object CMakeFiles/pdalcpp.dir/kernels/DeltaKernel.cpp.o
[172/312] Building CXX object CMakeFiles/pdalcpp.dir/kernels/GroundKernel.cpp.o
[173/312] Building CXX object CMakeFiles/pdalcpp.dir/kernels/HausdorffKernel.cpp.o
[174/312] Building CXX object CMakeFiles/pdalcpp.dir/kernels/MergeKernel.cpp.o
[175/312] Building CXX object CMakeFiles/pdalcpp.dir/io/TIndexReader.cpp.o
[176/312] Building CXX object CMakeFiles/pdalcpp.dir/kernels/RandomKernel.cpp.o
[177/312] Building CXX object CMakeFiles/pdalcpp.dir/kernels/SortKernel.cpp.o
[178/312] Building CXX object CMakeFiles/pdalcpp.dir/pdal/DynamicLibrary.cpp.o
[179/312] Building CXX object CMakeFiles/pdalcpp.dir/pdal/ColumnPointTable.cpp.o
[180/312] Building CXX object CMakeFiles/pdalcpp.dir/io/StacReader.cpp.o
[181/312] Building CXX object CMakeFiles/pdalcpp.dir/kernels/SplitKernel.cpp.o
[182/312] Building CXX object CMakeFiles/pdalcpp.dir/kernels/PipelineKernel.cpp.o
[183/312] Building CXX object CMakeFiles/pdalcpp.dir/kernels/EvalKernel.cpp.o
[184/312] Building CXX object CMakeFiles/pdalcpp.dir/kernels/InfoKernel.cpp.o
[185/312] Building CXX object CMakeFiles/pdalcpp.dir/kernels/TranslateKernel.cpp.o
[186/312] Building CXX object CMakeFiles/pdalcpp.dir/pdal/Geometry.cpp.o
[187/312] Building CXX object CMakeFiles/pdalcpp.dir/pdal/DbReader.cpp.o
[188/312] Building CXX object CMakeFiles/pdalcpp.dir/kernels/TIndexKernel.cpp.o
[189/312] Building CXX object CMakeFiles/pdalcpp.dir/pdal/DbWriter.cpp.o
[190/312] Building CXX object CMakeFiles/pdalcpp.dir/pdal/Log.cpp.o
[191/312] Building CXX object CMakeFiles/pdalcpp.dir/pdal/Metadata.cpp.o
[192/312] Building CXX object CMakeFiles/pdalcpp.dir/pdal/Filter.cpp.o
[193/312] Building CXX object CMakeFiles/pdalcpp.dir/kernels/TileKernel.cpp.o
[194/312] Building CXX object CMakeFiles/pdalcpp.dir/pdal/KDIndex.cpp.o
[195/312] Building CXX object CMakeFiles/pdalcpp.dir/pdal/PipelineExecutor.cpp.o
[196/312] Building CXX object CMakeFiles/pdalcpp.dir/pdal/Kernel.cpp.o
[197/312] Building CXX object CMakeFiles/pdalcpp.dir/pdal/PipelineWriter.cpp.o
[198/312] Building CXX object CMakeFiles/pdalcpp.dir/pdal/PipelineManager.cpp.o
[199/312] Building CXX object CMakeFiles/pdalcpp.dir/pdal/PluginDirectory.cpp.o
[200/312] Building CXX object CMakeFiles/pdalcpp.dir/pdal/PointTable.cpp.o
[201/312] Building CXX object CMakeFiles/pdalcpp.dir/pdal/PointLayout.cpp.o
[202/312] Building CXX object CMakeFiles/pdalcpp.dir/pdal/QuadIndex.cpp.o
[203/312] Building CXX object CMakeFiles/pdalcpp.dir/pdal/Options.cpp.o
[204/312] Building CXX object CMakeFiles/pdalcpp.dir/pdal/SrsBounds.cpp.o
[205/312] Building CXX object CMakeFiles/pdalcpp.dir/pdal/PluginManager.cpp.o
[206/312] Building CXX object CMakeFiles/pdalcpp.dir/pdal/PointView.cpp.o
[207/312] Building CXX object CMakeFiles/pdalcpp.dir/pdal/PDALUtils.cpp.o
[208/312] Building CXX object CMakeFiles/pdalcpp.dir/pdal/Polygon.cpp.o
[209/312] Building CXX object CMakeFiles/pdalcpp.dir/pdal/SpatialReference.cpp.o
[210/312] Building CXX object CMakeFiles/pdalcpp.dir/pdal/Scaling.cpp.o
[211/312] Building CXX object CMakeFiles/pdalcpp.dir/pdal/Reader.cpp.o
[212/312] Building CXX object CMakeFiles/pdalcpp.dir/pdal/StageExtensions.cpp.o
[213/312] Building CXX object CMakeFiles/pdalcpp.dir/pdal/util/Charbuf.cpp.o
[214/312] Building CXX object CMakeFiles/pdalcpp.dir/pdal/util/Georeference.cpp.o
[215/312] Building CXX object CMakeFiles/pdalcpp.dir/pdal/util/Backtrace.cpp.o
[216/312] Building CXX object CMakeFiles/pdalcpp.dir/pdal/compression/DeflateCompression.cpp.o
[217/312] Building CXX object CMakeFiles/pdalcpp.dir/pdal/util/Random.cpp.o
[218/312] Building CXX object CMakeFiles/pdalcpp.dir/pdal/compression/ZstdCompression.cpp.o
[219/312] Building CXX object CMakeFiles/pdalcpp.dir/pdal/PipelineReaderJSON.cpp.o
[220/312] Building CXX object CMakeFiles/pdalcpp.dir/pdal/StageFactory.cpp.o
[221/312] Building CXX object CMakeFiles/pdalcpp.dir/pdal/pdal_config.cpp.o
[222/312] Building CXX object CMakeFiles/pdalcpp.dir/pdal/compression/LazPerfVlrCompression.cpp.o
[223/312] Building CXX object CMakeFiles/pdalcpp.dir/pdal/XMLSchema.cpp.o
[224/312] Building CXX object CMakeFiles/pdalcpp.dir/pdal/Streamable.cpp.o
[225/312] Building CXX object CMakeFiles/pdalcpp.dir/pdal/util/FileUtils.cpp.o
[226/312] Building CXX object CMakeFiles/pdalcpp.dir/filters/private/csf/Constraint.cpp.o
[227/312] Building CXX object CMakeFiles/pdalcpp.dir/pdal/SubcommandKernel.cpp.o
[228/312] Building CXX object CMakeFiles/pdalcpp.dir/pdal/Writer.cpp.o
[229/312] Building CXX object CMakeFiles/pdalcpp.dir/pdal/util/Utils.cpp.o
[230/312] Building CXX object CMakeFiles/pdalcpp.dir/filters/private/csf/point_cloud.cpp.o
[231/312] Building CXX object CMakeFiles/pdalcpp.dir/filters/private/csf/Particle.cpp.o
[232/312] Building CXX object CMakeFiles/pdalcpp.dir/pdal/util/ThreadPool.cpp.o
[233/312] Building CXX object CMakeFiles/pdalcpp.dir/filters/private/csf/XYZReader.cpp.o
[234/312] Building CXX object CMakeFiles/pdalcpp.dir/filters/private/csf/Rasterization.cpp.o
[235/312] Building CXX object CMakeFiles/pdalcpp.dir/filters/private/csf/Cloth.cpp.o
[236/312] Building CXX object CMakeFiles/pdalcpp.dir/filters/private/csf/c2cdist.cpp.o
[237/312] Building CXX object CMakeFiles/pdalcpp.dir/filters/private/delaunator.cpp.o
[238/312] Building CXX object CMakeFiles/pdalcpp.dir/pdal/Stage.cpp.o
[239/312] Building CXX object CMakeFiles/pdalcpp.dir/filters/private/csf/CSF.cpp.o
[240/312] Building CXX object CMakeFiles/pdalcpp.dir/filters/private/DimRange.cpp.o
[241/312] Building CXX object CMakeFiles/pdalcpp.dir/filters/private/Point.cpp.o
[242/312] Building CXX object CMakeFiles/pdalcpp.dir/filters/private/hexer/Hexagon.cpp.o
[243/312] Building CXX object CMakeFiles/pdalcpp.dir/pdal/util/Bounds.cpp.o
[244/312] Building CXX object CMakeFiles/pdalcpp.dir/filters/private/expr/Lexer.cpp.o
[245/312] Building CXX object CMakeFiles/pdalcpp.dir/filters/private/hexer/Path.cpp.o
[246/312] Building CXX object CMakeFiles/pdalcpp.dir/filters/private/expr/AssignParser.cpp.o
[247/312] Building CXX object CMakeFiles/pdalcpp.dir/filters/private/expr/BaseParser.cpp.o
[248/312] Building CXX object CMakeFiles/pdalcpp.dir/filters/private/expr/AssignStatement.cpp.o
[249/312] Building CXX object CMakeFiles/pdalcpp.dir/filters/private/hexer/Processor.cpp.o
[250/312] Building CXX object CMakeFiles/pdalcpp.dir/filters/private/Segmentation.cpp.o
[251/312] Building CXX object CMakeFiles/pdalcpp.dir/filters/private/expr/ConditionalExpression.cpp.o
[252/312] Building CXX object CMakeFiles/pdalcpp.dir/filters/private/expr/IdentExpression.cpp.o
[253/312] Building CXX object CMakeFiles/pdalcpp.dir/filters/private/expr/ConditionalParser.cpp.o
[254/312] Building CXX object CMakeFiles/pdalcpp.dir/filters/private/hexer/Segment.cpp.o
[255/312] Building CXX object CMakeFiles/pdalcpp.dir/filters/private/expr/MathExpression.cpp.o
[256/312] Building CXX object CMakeFiles/pdalcpp.dir/filters/private/expr/MathParser.cpp.o
[257/312] Building CXX object CMakeFiles/pdalcpp.dir/filters/private/hexer/HexGrid.cpp.o
[258/312] Building CXX object CMakeFiles/pdalcpp.dir/filters/private/georeference/LocalCartesian.cpp.o
[259/312] Building CXX object CMakeFiles/pdalcpp.dir/filters/private/expr/Expression.cpp.o
[260/312] Building CXX object CMakeFiles/pdalcpp.dir/filters/private/straighten/Utils.cpp.o
[261/312] Building CXX object CMakeFiles/pdalcpp.dir/io/private/copc/Entry.cpp.o
[262/312] Building CXX object CMakeFiles/pdalcpp.dir/filters/private/mongoexpression/LogicGate.cpp.o
[263/312] Building CXX object CMakeFiles/pdalcpp.dir/io/private/GDALGrid.cpp.o
[264/312] Building CXX object CMakeFiles/pdalcpp.dir/io/private/copcwriter/Grid.cpp.o
[265/312] Building CXX object CMakeFiles/pdalcpp.dir/filters/private/mongoexpression/Expression.cpp.o
[266/312] Building CXX object CMakeFiles/pdalcpp.dir/filters/private/straighten/Polyline.cpp.o
/usr/src/RPM/BUILD/PDAL-2.6.2/filters/private/straighten/Polyline.cpp: In member function 'double pdal::straighten::Polyline::closestSegment(const pdal::PointRef&, double&, double&, double&, double&, double&, double&)':
/usr/src/RPM/BUILD/PDAL-2.6.2/filters/private/straighten/Polyline.cpp:283:23: warning: comparison of integer expressions of different signedness: 'int' and 'pdal::point_count_t' {aka 'long unsigned int'} [-Wsign-compare]
  283 |     for (int i = 1; i < size; ++i)
      |                     ~~^~~~~~
[267/312] Building CXX object CMakeFiles/pdalcpp.dir/io/private/copcwriter/Output.cpp.o
[268/312] Building CXX object CMakeFiles/pdalcpp.dir/io/private/copcwriter/BuPyramid.cpp.o
[269/312] Building CXX object CMakeFiles/pdalcpp.dir/io/private/copcwriter/Reprocessor.cpp.o
[270/312] Building CXX object CMakeFiles/pdalcpp.dir/io/private/ept/FixedPointLayout.cpp.o
[271/312] Building CXX object CMakeFiles/pdalcpp.dir/filters/private/mongoexpression/Comparison.cpp.o
[272/312] Building CXX object CMakeFiles/pdalcpp.dir/io/private/copc/Tile.cpp.o
[273/312] Building CXX object CMakeFiles/pdalcpp.dir/io/private/connector/Connector.cpp.o
[274/312] Building CXX object CMakeFiles/pdalcpp.dir/io/private/copcwriter/Processor.cpp.o
[275/312] Building CXX object CMakeFiles/pdalcpp.dir/io/private/copcwriter/PyramidManager.cpp.o
[276/312] Building CXX object CMakeFiles/pdalcpp.dir/filters/private/georeference/Trajectory.cpp.o
[277/312] Building CXX object CMakeFiles/pdalcpp.dir/io/private/las/Header.cpp.o
[278/312] Building CXX object CMakeFiles/pdalcpp.dir/io/private/las/Summary.cpp.o
[279/312] Building CXX object CMakeFiles/pdalcpp.dir/io/private/las/Geotiff.cpp.o
In file included from /usr/include/libgeotiff/geo_tiffp.h:38,
                 from /usr/src/RPM/BUILD/PDAL-2.6.2/io/private/las/Geotiff.cpp:41:
/usr/include/libgeotiff/cpl_serv.h:132:25: warning: redundant redeclaration of 'void _GTIFFree(void*)' in same scope [-Wredundant-decls]
  132 | #define VSIFree         _GTIFFree
      |                         ^~~~~~~~~
/usr/src/RPM/BUILD/PDAL-2.6.2/io/private/las/Geotiff.cpp:78:6: note: in expansion of macro 'VSIFree'
   78 | void VSIFree(void *data);
      |      ^~~~~~~
/usr/include/libgeotiff/geo_tiffp.h:105:22: note: previous declaration of 'void _GTIFFree(gdata_t)'
  105 | extern void GTIF_DLL _GTIFFree(gdata_t data);
      |                      ^~~~~~~~~
[280/312] Building CXX object CMakeFiles/pdalcpp.dir/io/private/esri/EsriUtil.cpp.o
[281/312] Building CXX object CMakeFiles/pdalcpp.dir/io/private/ept/Addon.cpp.o
[282/312] Building CXX object CMakeFiles/pdalcpp.dir/io/private/las/Srs.cpp.o
[283/312] Building CXX object CMakeFiles/pdalcpp.dir/io/private/esri/PageManager.cpp.o
[284/312] Building CXX object CMakeFiles/pdalcpp.dir/io/private/ept/EptInfo.cpp.o
[285/312] Building CXX object CMakeFiles/pdalcpp.dir/io/private/ept/TileContents.cpp.o
[286/312] Building CXX object CMakeFiles/pdalcpp.dir/io/private/las/Utils.cpp.o
[287/312] Building CXX object CMakeFiles/pdalcpp.dir/pdal/private/SrsTransform.cpp.o
[288/312] Building CXX object CMakeFiles/pdalcpp.dir/kernels/private/density/OGR.cpp.o
[289/312] Building CXX object CMakeFiles/pdalcpp.dir/pdal/private/Raster.cpp.o
[290/312] Building CXX object CMakeFiles/pdalcpp.dir/pdal/util/private/BacktraceUnwind.cpp.o
/usr/src/RPM/BUILD/PDAL-2.6.2/pdal/util/private/BacktraceUnwind.cpp: In function 'pdal::Utils::BacktraceEntries pdal::Utils::backtraceImpl()':
/usr/src/RPM/BUILD/PDAL-2.6.2/pdal/util/private/BacktraceUnwind.cpp:64:11: warning: dereferencing type-punned pointer will break strict-aliasing rules [-Wstrict-aliasing]
   64 |         *(reinterpret_cast<unw_word_t *>(&entry.addr)) = val;
      |          ~^~~~~~~~~~~~~~~~~~~~~~~~~~~~~~~~~~~~~~~~~~~~
[291/312] Building CXX object CMakeFiles/pdalcpp.dir/pdal/private/gdal/ErrorHandler.cpp.o
[292/312] Building CXX object CMakeFiles/pdalcpp.dir/pdal/private/gdal/SpatialRef.cpp.o
[293/312] Building CXX object CMakeFiles/pdalcpp.dir/pdal/private/gdal/BaseBand.cpp.o
[294/312] Building CXX object CMakeFiles/pdalcpp.dir/io/private/stac/Utils.cpp.o
[295/312] Building CXX object CMakeFiles/pdalcpp.dir/pdal/private/StageRunner.cpp.o
[296/312] Building CXX object CMakeFiles/pdalcpp.dir/io/private/stac/Collection.cpp.o
[297/312] Building CXX object CMakeFiles/pdalcpp.dir/kernels/private/PointlessLas.cpp.o
[298/312] Building CXX object CMakeFiles/pdalcpp.dir/io/private/las/Vlr.cpp.o
[299/312] Building CXX object CMakeFiles/pdalcpp.dir/io/private/esri/Obb.cpp.o
[300/312] Building CXX object CMakeFiles/pdalcpp.dir/io/private/stac/ItemCollection.cpp.o
[301/312] Building CXX object CMakeFiles/pdalcpp.dir/pdal/private/gdal/Raster.cpp.o
[302/312] Building CXX object CMakeFiles/pdalcpp.dir/io/private/stac/Catalog.cpp.o
[303/312] Building CXX object plugins/faux/CMakeFiles/pdal_plugin_kernel_fauxplugin.dir/kernel/FauxPluginKernel.cpp.o
[304/312] Building CXX object CMakeFiles/pdalcpp.dir/io/private/stac/Item.cpp.o
[305/312] Building CXX object CMakeFiles/pdalcpp.dir/pdal/private/gdal/GDALUtils.cpp.o
[306/312] Building CXX object CMakeFiles/pdalcpp.dir/pdal/private/MathUtils.cpp.o
[307/312] Building CXX object apps/CMakeFiles/pdal.dir/pdal.cpp.o
[308/312] Linking CXX shared library usr/lib64/libpdalcpp.so.16.2.0
[309/312] Creating library symlink usr/lib64/libpdalcpp.so.16 usr/lib64/libpdalcpp.so
[310/312] Linking CXX shared library usr/lib64/libpdal_plugin_kernel_fauxplugin.so.16.2.0
[311/312] Creating library symlink usr/lib64/libpdal_plugin_kernel_fauxplugin.so.16 usr/lib64/libpdal_plugin_kernel_fauxplugin.so
[312/312] Linking CXX executable bin/pdal
+ exit 0
Executing(%install): /bin/sh -e /usr/src/tmp/rpm-tmp.83523
+ umask 022
+ /bin/mkdir -p /usr/src/RPM/BUILD
+ cd /usr/src/RPM/BUILD
+ /bin/chmod -Rf u+rwX -- /usr/src/tmp/pdal-buildroot
+ :
+ /bin/rm -rf -- /usr/src/tmp/pdal-buildroot
+ PATH=/usr/libexec/rpm-build:/usr/src/bin:/bin:/usr/bin:/usr/X11R6/bin:/usr/games
+ cd PDAL-2.6.2
+ DESTDIR=/usr/src/tmp/pdal-buildroot
+ /usr/bin/ninja -j16 install -C x86_64-alt-linux
ninja: Entering directory `x86_64-alt-linux'
[0/1] Install the project...
-- Install configuration: ""
-- Installing: /usr/src/tmp/pdal-buildroot/usr/lib64/libpdalcpp.so.16.2.0
-- Installing: /usr/src/tmp/pdal-buildroot/usr/lib64/libpdalcpp.so.16
-- Installing: /usr/src/tmp/pdal-buildroot/usr/lib64/libpdalcpp.so
-- Installing: /usr/src/tmp/pdal-buildroot/usr/include/pdal
-- Installing: /usr/src/tmp/pdal-buildroot/usr/include/pdal/util
-- Installing: /usr/src/tmp/pdal-buildroot/usr/include/pdal/util/private
-- Installing: /usr/src/tmp/pdal-buildroot/usr/include/pdal/util/private/BacktraceImpl.hpp
-- Installing: /usr/src/tmp/pdal-buildroot/usr/include/pdal/util/portable_endian.hpp
-- Installing: /usr/src/tmp/pdal-buildroot/usr/include/pdal/util/pdal_util_internal.hpp
-- Installing: /usr/src/tmp/pdal-buildroot/usr/include/pdal/util/pdal_util_export.hpp
-- Installing: /usr/src/tmp/pdal-buildroot/usr/include/pdal/util/Uuid.hpp
-- Installing: /usr/src/tmp/pdal-buildroot/usr/include/pdal/util/Utils.hpp
-- Installing: /usr/src/tmp/pdal-buildroot/usr/include/pdal/util/ThreadPool.hpp
-- Installing: /usr/src/tmp/pdal-buildroot/usr/include/pdal/util/Random.hpp
-- Installing: /usr/src/tmp/pdal-buildroot/usr/include/pdal/util/ProgramArgs.hpp
-- Installing: /usr/src/tmp/pdal-buildroot/usr/include/pdal/util/OStream.hpp
-- Installing: /usr/src/tmp/pdal-buildroot/usr/include/pdal/util/NullOStream.hpp
-- Installing: /usr/src/tmp/pdal-buildroot/usr/include/pdal/util/Inserter.hpp
-- Installing: /usr/src/tmp/pdal-buildroot/usr/include/pdal/util/IStream.hpp
-- Installing: /usr/src/tmp/pdal-buildroot/usr/include/pdal/util/Georeference.hpp
-- Installing: /usr/src/tmp/pdal-buildroot/usr/include/pdal/util/FileUtils.hpp
-- Installing: /usr/src/tmp/pdal-buildroot/usr/include/pdal/util/Extractor.hpp
-- Installing: /usr/src/tmp/pdal-buildroot/usr/include/pdal/util/Charbuf.hpp
-- Installing: /usr/src/tmp/pdal-buildroot/usr/include/pdal/util/Bounds.hpp
-- Installing: /usr/src/tmp/pdal-buildroot/usr/include/pdal/util/Backtrace.hpp
-- Installing: /usr/src/tmp/pdal-buildroot/usr/include/pdal/util/Algorithm.hpp
-- Installing: /usr/src/tmp/pdal-buildroot/usr/include/pdal/private
-- Installing: /usr/src/tmp/pdal-buildroot/usr/include/pdal/private/gdal
-- Installing: /usr/src/tmp/pdal-buildroot/usr/include/pdal/private/gdal/SpatialRef.hpp
-- Installing: /usr/src/tmp/pdal-buildroot/usr/include/pdal/private/gdal/Raster.hpp
-- Installing: /usr/src/tmp/pdal-buildroot/usr/include/pdal/private/gdal/GDALUtils.hpp
-- Installing: /usr/src/tmp/pdal-buildroot/usr/include/pdal/private/gdal/GDALError.hpp
-- Installing: /usr/src/tmp/pdal-buildroot/usr/include/pdal/private/gdal/ErrorHandler.hpp
-- Installing: /usr/src/tmp/pdal-buildroot/usr/include/pdal/private/StageRunner.hpp
-- Installing: /usr/src/tmp/pdal-buildroot/usr/include/pdal/private/SrsTransform.hpp
-- Installing: /usr/src/tmp/pdal-buildroot/usr/include/pdal/private/Raster.hpp
-- Installing: /usr/src/tmp/pdal-buildroot/usr/include/pdal/private/MathUtils.hpp
-- Installing: /usr/src/tmp/pdal-buildroot/usr/include/pdal/private/KDImpl.hpp
-- Installing: /usr/src/tmp/pdal-buildroot/usr/include/pdal/private/DynamicLibrary.hpp
-- Installing: /usr/src/tmp/pdal-buildroot/usr/include/pdal/pdal_types.hpp
-- Installing: /usr/src/tmp/pdal-buildroot/usr/include/pdal/pdal_test_main.hpp
-- Installing: /usr/src/tmp/pdal-buildroot/usr/include/pdal/pdal_internal.hpp
-- Installing: /usr/src/tmp/pdal-buildroot/usr/include/pdal/pdal_export.hpp
-- Installing: /usr/src/tmp/pdal-buildroot/usr/include/pdal/pdal_config.hpp
-- Installing: /usr/src/tmp/pdal-buildroot/usr/include/pdal/pdal.hpp
-- Installing: /usr/src/tmp/pdal-buildroot/usr/include/pdal/compression
-- Installing: /usr/src/tmp/pdal-buildroot/usr/include/pdal/compression/ZstdCompression.hpp
-- Installing: /usr/src/tmp/pdal-buildroot/usr/include/pdal/compression/LzmaCompression.hpp
-- Installing: /usr/src/tmp/pdal-buildroot/usr/include/pdal/compression/LazPerfVlrCompression.hpp
-- Installing: /usr/src/tmp/pdal-buildroot/usr/include/pdal/compression/GzipCompression.hpp
-- Installing: /usr/src/tmp/pdal-buildroot/usr/include/pdal/compression/DeflateCompression.hpp
-- Installing: /usr/src/tmp/pdal-buildroot/usr/include/pdal/compression/Compression.hpp
-- Installing: /usr/src/tmp/pdal-buildroot/usr/include/pdal/XMLSchema.hpp
-- Installing: /usr/src/tmp/pdal-buildroot/usr/include/pdal/Writer.hpp
-- Installing: /usr/src/tmp/pdal-buildroot/usr/include/pdal/SubcommandKernel.hpp
-- Installing: /usr/src/tmp/pdal-buildroot/usr/include/pdal/Streamable.hpp
-- Installing: /usr/src/tmp/pdal-buildroot/usr/include/pdal/StageWrapper.hpp
-- Installing: /usr/src/tmp/pdal-buildroot/usr/include/pdal/StageFactory.hpp
-- Installing: /usr/src/tmp/pdal-buildroot/usr/include/pdal/StageExtensions.hpp
-- Installing: /usr/src/tmp/pdal-buildroot/usr/include/pdal/Stage.hpp
-- Installing: /usr/src/tmp/pdal-buildroot/usr/include/pdal/SrsBounds.hpp
-- Installing: /usr/src/tmp/pdal-buildroot/usr/include/pdal/SpatialReference.hpp
-- Installing: /usr/src/tmp/pdal-buildroot/usr/include/pdal/Scaling.hpp
-- Installing: /usr/src/tmp/pdal-buildroot/usr/include/pdal/Reader.hpp
-- Installing: /usr/src/tmp/pdal-buildroot/usr/include/pdal/QuickInfo.hpp
-- Installing: /usr/src/tmp/pdal-buildroot/usr/include/pdal/QuadIndex.hpp
-- Installing: /usr/src/tmp/pdal-buildroot/usr/include/pdal/Polygon.hpp
-- Installing: /usr/src/tmp/pdal-buildroot/usr/include/pdal/PointView.hpp
-- Installing: /usr/src/tmp/pdal-buildroot/usr/include/pdal/PointTable.hpp
-- Installing: /usr/src/tmp/pdal-buildroot/usr/include/pdal/PointRef.hpp
-- Installing: /usr/src/tmp/pdal-buildroot/usr/include/pdal/PointLayout.hpp
-- Installing: /usr/src/tmp/pdal-buildroot/usr/include/pdal/PointContainer.hpp
-- Installing: /usr/src/tmp/pdal-buildroot/usr/include/pdal/PluginManager.hpp
-- Installing: /usr/src/tmp/pdal-buildroot/usr/include/pdal/PluginInfo.hpp
-- Installing: /usr/src/tmp/pdal-buildroot/usr/include/pdal/PluginHelper.hpp
-- Installing: /usr/src/tmp/pdal-buildroot/usr/include/pdal/PluginDirectory.hpp
-- Installing: /usr/src/tmp/pdal-buildroot/usr/include/pdal/PipelineWriter.hpp
-- Installing: /usr/src/tmp/pdal-buildroot/usr/include/pdal/PipelineReaderJSON.hpp
-- Installing: /usr/src/tmp/pdal-buildroot/usr/include/pdal/PipelineManager.hpp
-- Installing: /usr/src/tmp/pdal-buildroot/usr/include/pdal/PipelineExecutor.hpp
-- Installing: /usr/src/tmp/pdal-buildroot/usr/include/pdal/PDALUtils.hpp
-- Installing: /usr/src/tmp/pdal-buildroot/usr/include/pdal/Options.hpp
-- Installing: /usr/src/tmp/pdal-buildroot/usr/include/pdal/Metadata.hpp
-- Installing: /usr/src/tmp/pdal-buildroot/usr/include/pdal/Mesh.hpp
-- Installing: /usr/src/tmp/pdal-buildroot/usr/include/pdal/Log.hpp
-- Installing: /usr/src/tmp/pdal-buildroot/usr/include/pdal/Kernel.hpp
-- Installing: /usr/src/tmp/pdal-buildroot/usr/include/pdal/KDIndex.hpp
-- Installing: /usr/src/tmp/pdal-buildroot/usr/include/pdal/JsonFwd.hpp
-- Installing: /usr/src/tmp/pdal-buildroot/usr/include/pdal/Geometry.hpp
-- Installing: /usr/src/tmp/pdal-buildroot/usr/include/pdal/FlexWriter.hpp
-- Installing: /usr/src/tmp/pdal-buildroot/usr/include/pdal/Filter.hpp
-- Installing: /usr/src/tmp/pdal-buildroot/usr/include/pdal/DimUtil.hpp
-- Installing: /usr/src/tmp/pdal-buildroot/usr/include/pdal/DimType.hpp
-- Installing: /usr/src/tmp/pdal-buildroot/usr/include/pdal/DimDetail.hpp
-- Installing: /usr/src/tmp/pdal-buildroot/usr/include/pdal/DbWriter.hpp
-- Installing: /usr/src/tmp/pdal-buildroot/usr/include/pdal/DbReader.hpp
-- Installing: /usr/src/tmp/pdal-buildroot/usr/include/pdal/ArtifactManager.hpp
-- Installing: /usr/src/tmp/pdal-buildroot/usr/include/pdal/Artifact.hpp
-- Installing: /usr/src/tmp/pdal-buildroot/usr/include/pdal/kernels
-- Installing: /usr/src/tmp/pdal-buildroot/usr/include/pdal/kernels/private
-- Installing: /usr/src/tmp/pdal-buildroot/usr/include/pdal/kernels/private/stac
-- Installing: /usr/src/tmp/pdal-buildroot/usr/include/pdal/kernels/private/stac/StacInfo.hpp
-- Installing: /usr/src/tmp/pdal-buildroot/usr/include/pdal/kernels/private/density
-- Installing: /usr/src/tmp/pdal-buildroot/usr/include/pdal/kernels/private/density/OGR.hpp
-- Installing: /usr/src/tmp/pdal-buildroot/usr/include/pdal/kernels/private/PointlessLas.hpp
-- Installing: /usr/src/tmp/pdal-buildroot/usr/include/pdal/kernels/TranslateKernel.hpp
-- Installing: /usr/src/tmp/pdal-buildroot/usr/include/pdal/kernels/TileKernel.hpp
-- Installing: /usr/src/tmp/pdal-buildroot/usr/include/pdal/kernels/TIndexKernel.hpp
-- Installing: /usr/src/tmp/pdal-buildroot/usr/include/pdal/kernels/SplitKernel.hpp
-- Installing: /usr/src/tmp/pdal-buildroot/usr/include/pdal/kernels/SortKernel.hpp
-- Installing: /usr/src/tmp/pdal-buildroot/usr/include/pdal/kernels/RandomKernel.hpp
-- Installing: /usr/src/tmp/pdal-buildroot/usr/include/pdal/kernels/PipelineKernel.hpp
-- Installing: /usr/src/tmp/pdal-buildroot/usr/include/pdal/kernels/MergeKernel.hpp
-- Installing: /usr/src/tmp/pdal-buildroot/usr/include/pdal/kernels/InfoKernel.hpp
-- Installing: /usr/src/tmp/pdal-buildroot/usr/include/pdal/kernels/HausdorffKernel.hpp
-- Installing: /usr/src/tmp/pdal-buildroot/usr/include/pdal/kernels/GroundKernel.hpp
-- Installing: /usr/src/tmp/pdal-buildroot/usr/include/pdal/kernels/EvalKernel.hpp
-- Installing: /usr/src/tmp/pdal-buildroot/usr/include/pdal/kernels/DensityKernel.hpp
-- Installing: /usr/src/tmp/pdal-buildroot/usr/include/pdal/kernels/DeltaKernel.hpp
-- Installing: /usr/src/tmp/pdal-buildroot/usr/include/pdal/kernels/ChamferKernel.hpp
-- Installing: /usr/src/tmp/pdal-buildroot/usr/include/pdal/io
-- Installing: /usr/src/tmp/pdal-buildroot/usr/include/pdal/io/private
-- Installing: /usr/src/tmp/pdal-buildroot/usr/include/pdal/io/private/stac
-- Installing: /usr/src/tmp/pdal-buildroot/usr/include/pdal/io/private/stac/Utils.hpp
-- Installing: /usr/src/tmp/pdal-buildroot/usr/include/pdal/io/private/stac/ItemCollection.hpp
-- Installing: /usr/src/tmp/pdal-buildroot/usr/include/pdal/io/private/stac/Item.hpp
-- Installing: /usr/src/tmp/pdal-buildroot/usr/include/pdal/io/private/stac/Collection.hpp
-- Installing: /usr/src/tmp/pdal-buildroot/usr/include/pdal/io/private/stac/Catalog.hpp
-- Installing: /usr/src/tmp/pdal-buildroot/usr/include/pdal/io/private/las
-- Installing: /usr/src/tmp/pdal-buildroot/usr/include/pdal/io/private/las/Vlr.hpp
-- Installing: /usr/src/tmp/pdal-buildroot/usr/include/pdal/io/private/las/Utils.hpp
-- Installing: /usr/src/tmp/pdal-buildroot/usr/include/pdal/io/private/las/Summary.hpp
-- Installing: /usr/src/tmp/pdal-buildroot/usr/include/pdal/io/private/las/Srs.hpp
-- Installing: /usr/src/tmp/pdal-buildroot/usr/include/pdal/io/private/las/Header.hpp
-- Installing: /usr/src/tmp/pdal-buildroot/usr/include/pdal/io/private/las/Geotiff.hpp
-- Installing: /usr/src/tmp/pdal-buildroot/usr/include/pdal/io/private/esri
-- Installing: /usr/src/tmp/pdal-buildroot/usr/include/pdal/io/private/esri/PageManager.hpp
-- Installing: /usr/src/tmp/pdal-buildroot/usr/include/pdal/io/private/esri/Obb.hpp
-- Installing: /usr/src/tmp/pdal-buildroot/usr/include/pdal/io/private/esri/EsriUtil.hpp
-- Installing: /usr/src/tmp/pdal-buildroot/usr/include/pdal/io/private/ept
-- Installing: /usr/src/tmp/pdal-buildroot/usr/include/pdal/io/private/ept/VectorPointTable.hpp
-- Installing: /usr/src/tmp/pdal-buildroot/usr/include/pdal/io/private/ept/TileContents.hpp
-- Installing: /usr/src/tmp/pdal-buildroot/usr/include/pdal/io/private/ept/Overlap.hpp
-- Installing: /usr/src/tmp/pdal-buildroot/usr/include/pdal/io/private/ept/Key.hpp
-- Installing: /usr/src/tmp/pdal-buildroot/usr/include/pdal/io/private/ept/FixedPointLayout.hpp
-- Installing: /usr/src/tmp/pdal-buildroot/usr/include/pdal/io/private/ept/EptSupport.hpp
-- Installing: /usr/src/tmp/pdal-buildroot/usr/include/pdal/io/private/ept/EptInfo.hpp
-- Installing: /usr/src/tmp/pdal-buildroot/usr/include/pdal/io/private/ept/Artifact.hpp
-- Installing: /usr/src/tmp/pdal-buildroot/usr/include/pdal/io/private/ept/Addon.hpp
-- Installing: /usr/src/tmp/pdal-buildroot/usr/include/pdal/io/private/copcwriter
-- Installing: /usr/src/tmp/pdal-buildroot/usr/include/pdal/io/private/copcwriter/VoxelKey.hpp
-- Installing: /usr/src/tmp/pdal-buildroot/usr/include/pdal/io/private/copcwriter/VoxelInfo.hpp
-- Installing: /usr/src/tmp/pdal-buildroot/usr/include/pdal/io/private/copcwriter/Reprocessor.hpp
-- Installing: /usr/src/tmp/pdal-buildroot/usr/include/pdal/io/private/copcwriter/PyramidManager.hpp
-- Installing: /usr/src/tmp/pdal-buildroot/usr/include/pdal/io/private/copcwriter/Processor.hpp
-- Installing: /usr/src/tmp/pdal-buildroot/usr/include/pdal/io/private/copcwriter/Output.hpp
-- Installing: /usr/src/tmp/pdal-buildroot/usr/include/pdal/io/private/copcwriter/OctantInfo.hpp
-- Installing: /usr/src/tmp/pdal-buildroot/usr/include/pdal/io/private/copcwriter/GridKey.hpp
-- Installing: /usr/src/tmp/pdal-buildroot/usr/include/pdal/io/private/copcwriter/Grid.hpp
-- Installing: /usr/src/tmp/pdal-buildroot/usr/include/pdal/io/private/copcwriter/Common.hpp
-- Installing: /usr/src/tmp/pdal-buildroot/usr/include/pdal/io/private/copcwriter/CellManager.hpp
-- Installing: /usr/src/tmp/pdal-buildroot/usr/include/pdal/io/private/copcwriter/BuPyramid.hpp
-- Installing: /usr/src/tmp/pdal-buildroot/usr/include/pdal/io/private/copc
-- Installing: /usr/src/tmp/pdal-buildroot/usr/include/pdal/io/private/copc/Tile.hpp
-- Installing: /usr/src/tmp/pdal-buildroot/usr/include/pdal/io/private/copc/Key.hpp
-- Installing: /usr/src/tmp/pdal-buildroot/usr/include/pdal/io/private/copc/Info.hpp
-- Installing: /usr/src/tmp/pdal-buildroot/usr/include/pdal/io/private/copc/Entry.hpp
-- Installing: /usr/src/tmp/pdal-buildroot/usr/include/pdal/io/private/connector
-- Installing: /usr/src/tmp/pdal-buildroot/usr/include/pdal/io/private/connector/Connector.hpp
-- Installing: /usr/src/tmp/pdal-buildroot/usr/include/pdal/io/private/GDALGrid.hpp
-- Installing: /usr/src/tmp/pdal-buildroot/usr/include/pdal/io/point_types.hpp
-- Installing: /usr/src/tmp/pdal-buildroot/usr/include/pdal/io/TextWriter.hpp
-- Installing: /usr/src/tmp/pdal-buildroot/usr/include/pdal/io/TextReader.hpp
-- Installing: /usr/src/tmp/pdal-buildroot/usr/include/pdal/io/TerrasolidReader.hpp
-- Installing: /usr/src/tmp/pdal-buildroot/usr/include/pdal/io/TIndexReader.hpp
-- Installing: /usr/src/tmp/pdal-buildroot/usr/include/pdal/io/StacReader.hpp
-- Installing: /usr/src/tmp/pdal-buildroot/usr/include/pdal/io/SlpkReader.hpp
-- Installing: /usr/src/tmp/pdal-buildroot/usr/include/pdal/io/SbetWriter.hpp
-- Installing: /usr/src/tmp/pdal-buildroot/usr/include/pdal/io/SbetSmrmsgReader.hpp
-- Installing: /usr/src/tmp/pdal-buildroot/usr/include/pdal/io/SbetReader.hpp
-- Installing: /usr/src/tmp/pdal-buildroot/usr/include/pdal/io/SbetCommon.hpp
-- Installing: /usr/src/tmp/pdal-buildroot/usr/include/pdal/io/RasterWriter.hpp
-- Installing: /usr/src/tmp/pdal-buildroot/usr/include/pdal/io/QfitReader.hpp
-- Installing: /usr/src/tmp/pdal-buildroot/usr/include/pdal/io/PtxReader.hpp
-- Installing: /usr/src/tmp/pdal-buildroot/usr/include/pdal/io/PtsReader.hpp
-- Installing: /usr/src/tmp/pdal-buildroot/usr/include/pdal/io/PlyWriter.hpp
-- Installing: /usr/src/tmp/pdal-buildroot/usr/include/pdal/io/PlyReader.hpp
-- Installing: /usr/src/tmp/pdal-buildroot/usr/include/pdal/io/PcdWriter.hpp
-- Installing: /usr/src/tmp/pdal-buildroot/usr/include/pdal/io/PcdReader.hpp
-- Installing: /usr/src/tmp/pdal-buildroot/usr/include/pdal/io/PcdHeader.hpp
-- Installing: /usr/src/tmp/pdal-buildroot/usr/include/pdal/io/OptechRotationMatrix.hpp
-- Installing: /usr/src/tmp/pdal-buildroot/usr/include/pdal/io/OptechReader.hpp
-- Installing: /usr/src/tmp/pdal-buildroot/usr/include/pdal/io/OptechCommon.hpp
-- Installing: /usr/src/tmp/pdal-buildroot/usr/include/pdal/io/ObjReader.hpp
-- Installing: /usr/src/tmp/pdal-buildroot/usr/include/pdal/io/OGRWriter.hpp
-- Installing: /usr/src/tmp/pdal-buildroot/usr/include/pdal/io/NullWriter.hpp
-- Installing: /usr/src/tmp/pdal-buildroot/usr/include/pdal/io/MemoryViewReader.hpp
-- Installing: /usr/src/tmp/pdal-buildroot/usr/include/pdal/io/LasWriter.hpp
-- Installing: /usr/src/tmp/pdal-buildroot/usr/include/pdal/io/LasVLR.hpp
-- Installing: /usr/src/tmp/pdal-buildroot/usr/include/pdal/io/LasReader.hpp
-- Installing: /usr/src/tmp/pdal-buildroot/usr/include/pdal/io/LasHeader.hpp
-- Installing: /usr/src/tmp/pdal-buildroot/usr/include/pdal/io/Ilvis2Reader.hpp
-- Installing: /usr/src/tmp/pdal-buildroot/usr/include/pdal/io/Ilvis2MetadataReader.hpp
-- Installing: /usr/src/tmp/pdal-buildroot/usr/include/pdal/io/I3SReader.hpp
-- Installing: /usr/src/tmp/pdal-buildroot/usr/include/pdal/io/HeaderVal.hpp
-- Installing: /usr/src/tmp/pdal-buildroot/usr/include/pdal/io/GltfWriter.hpp
-- Installing: /usr/src/tmp/pdal-buildroot/usr/include/pdal/io/GDALWriter.hpp
-- Installing: /usr/src/tmp/pdal-buildroot/usr/include/pdal/io/GDALReader.hpp
-- Installing: /usr/src/tmp/pdal-buildroot/usr/include/pdal/io/FbiWriter.hpp
-- Installing: /usr/src/tmp/pdal-buildroot/usr/include/pdal/io/FbiReader.hpp
-- Installing: /usr/src/tmp/pdal-buildroot/usr/include/pdal/io/FbiHeader.hpp
-- Installing: /usr/src/tmp/pdal-buildroot/usr/include/pdal/io/FauxReader.hpp
-- Installing: /usr/src/tmp/pdal-buildroot/usr/include/pdal/io/EsriReader.hpp
-- Installing: /usr/src/tmp/pdal-buildroot/usr/include/pdal/io/EptReader.hpp
-- Installing: /usr/src/tmp/pdal-buildroot/usr/include/pdal/io/EptAddonWriter.hpp
-- Installing: /usr/src/tmp/pdal-buildroot/usr/include/pdal/io/CopcWriter.hpp
-- Installing: /usr/src/tmp/pdal-buildroot/usr/include/pdal/io/CopcReader.hpp
-- Installing: /usr/src/tmp/pdal-buildroot/usr/include/pdal/io/BufferReader.hpp
-- Installing: /usr/src/tmp/pdal-buildroot/usr/include/pdal/io/BpfWriter.hpp
-- Installing: /usr/src/tmp/pdal-buildroot/usr/include/pdal/io/BpfReader.hpp
-- Installing: /usr/src/tmp/pdal-buildroot/usr/include/pdal/io/BpfHeader.hpp
-- Installing: /usr/src/tmp/pdal-buildroot/usr/include/pdal/io/BpfCompressor.hpp
-- Installing: /usr/src/tmp/pdal-buildroot/usr/include/pdal/filters
-- Installing: /usr/src/tmp/pdal-buildroot/usr/include/pdal/filters/private
-- Installing: /usr/src/tmp/pdal-buildroot/usr/include/pdal/filters/private/straighten
-- Installing: /usr/src/tmp/pdal-buildroot/usr/include/pdal/filters/private/straighten/Utils.hpp
-- Installing: /usr/src/tmp/pdal-buildroot/usr/include/pdal/filters/private/straighten/Polyline.hpp
-- Installing: /usr/src/tmp/pdal-buildroot/usr/include/pdal/filters/private/pnp
-- Installing: /usr/src/tmp/pdal-buildroot/usr/include/pdal/filters/private/pnp/VoxelRayTrace.hpp
-- Installing: /usr/src/tmp/pdal-buildroot/usr/include/pdal/filters/private/pnp/GridPnp.hpp
-- Installing: /usr/src/tmp/pdal-buildroot/usr/include/pdal/filters/private/pnp/Grid.hpp
-- Installing: /usr/src/tmp/pdal-buildroot/usr/include/pdal/filters/private/pnp/Comparison.hpp
-- Installing: /usr/src/tmp/pdal-buildroot/usr/include/pdal/filters/private/mongoexpression
-- Installing: /usr/src/tmp/pdal-buildroot/usr/include/pdal/filters/private/mongoexpression/Support.hpp
-- Installing: /usr/src/tmp/pdal-buildroot/usr/include/pdal/filters/private/mongoexpression/LogicGate.hpp
-- Installing: /usr/src/tmp/pdal-buildroot/usr/include/pdal/filters/private/mongoexpression/Expression.hpp
-- Installing: /usr/src/tmp/pdal-buildroot/usr/include/pdal/filters/private/mongoexpression/Comparison.hpp
-- Installing: /usr/src/tmp/pdal-buildroot/usr/include/pdal/filters/private/miniball
-- Installing: /usr/src/tmp/pdal-buildroot/usr/include/pdal/filters/private/hexer
-- Installing: /usr/src/tmp/pdal-buildroot/usr/include/pdal/filters/private/hexer/exception.hpp
-- Installing: /usr/src/tmp/pdal-buildroot/usr/include/pdal/filters/private/hexer/Segment.hpp
-- Installing: /usr/src/tmp/pdal-buildroot/usr/include/pdal/filters/private/hexer/Processor.hpp
-- Installing: /usr/src/tmp/pdal-buildroot/usr/include/pdal/filters/private/hexer/Path.hpp
-- Installing: /usr/src/tmp/pdal-buildroot/usr/include/pdal/filters/private/hexer/Mathpair.hpp
-- Installing: /usr/src/tmp/pdal-buildroot/usr/include/pdal/filters/private/hexer/Hexagon.hpp
-- Installing: /usr/src/tmp/pdal-buildroot/usr/include/pdal/filters/private/hexer/HexIter.hpp
-- Installing: /usr/src/tmp/pdal-buildroot/usr/include/pdal/filters/private/hexer/HexInfo.hpp
-- Installing: /usr/src/tmp/pdal-buildroot/usr/include/pdal/filters/private/hexer/HexGrid.hpp
-- Installing: /usr/src/tmp/pdal-buildroot/usr/include/pdal/filters/private/georeference
-- Installing: /usr/src/tmp/pdal-buildroot/usr/include/pdal/filters/private/georeference/Utils.hpp
-- Installing: /usr/src/tmp/pdal-buildroot/usr/include/pdal/filters/private/georeference/Trajectory.hpp
-- Installing: /usr/src/tmp/pdal-buildroot/usr/include/pdal/filters/private/georeference/LocalCartesian.hpp
-- Installing: /usr/src/tmp/pdal-buildroot/usr/include/pdal/filters/private/expr
-- Installing: /usr/src/tmp/pdal-buildroot/usr/include/pdal/filters/private/expr/Token.hpp
-- Installing: /usr/src/tmp/pdal-buildroot/usr/include/pdal/filters/private/expr/MathParser.hpp
-- Installing: /usr/src/tmp/pdal-buildroot/usr/include/pdal/filters/private/expr/MathExpression.hpp
-- Installing: /usr/src/tmp/pdal-buildroot/usr/include/pdal/filters/private/expr/Lexer.hpp
-- Installing: /usr/src/tmp/pdal-buildroot/usr/include/pdal/filters/private/expr/IdentExpression.hpp
-- Installing: /usr/src/tmp/pdal-buildroot/usr/include/pdal/filters/private/expr/Expression.hpp
-- Installing: /usr/src/tmp/pdal-buildroot/usr/include/pdal/filters/private/expr/ConditionalParser.hpp
-- Installing: /usr/src/tmp/pdal-buildroot/usr/include/pdal/filters/private/expr/ConditionalExpression.hpp
-- Installing: /usr/src/tmp/pdal-buildroot/usr/include/pdal/filters/private/expr/BaseParser.hpp
-- Installing: /usr/src/tmp/pdal-buildroot/usr/include/pdal/filters/private/expr/AssignStatement.hpp
-- Installing: /usr/src/tmp/pdal-buildroot/usr/include/pdal/filters/private/expr/AssignParser.hpp
-- Installing: /usr/src/tmp/pdal-buildroot/usr/include/pdal/filters/private/delaunator.hpp
-- Installing: /usr/src/tmp/pdal-buildroot/usr/include/pdal/filters/private/csf
-- Installing: /usr/src/tmp/pdal-buildroot/usr/include/pdal/filters/private/Segmentation.hpp
-- Installing: /usr/src/tmp/pdal-buildroot/usr/include/pdal/filters/private/Point.hpp
-- Installing: /usr/src/tmp/pdal-buildroot/usr/include/pdal/filters/private/DimRange.hpp
-- Installing: /usr/src/tmp/pdal-buildroot/usr/include/pdal/filters/ZsmoothFilter.hpp
-- Installing: /usr/src/tmp/pdal-buildroot/usr/include/pdal/filters/VoxelDownsizeFilter.hpp
-- Installing: /usr/src/tmp/pdal-buildroot/usr/include/pdal/filters/VoxelCentroidNearestNeighborFilter.hpp
-- Installing: /usr/src/tmp/pdal-buildroot/usr/include/pdal/filters/VoxelCenterNearestNeighborFilter.hpp
-- Installing: /usr/src/tmp/pdal-buildroot/usr/include/pdal/filters/TransformationFilter.hpp
-- Installing: /usr/src/tmp/pdal-buildroot/usr/include/pdal/filters/TailFilter.hpp
-- Installing: /usr/src/tmp/pdal-buildroot/usr/include/pdal/filters/StreamCallbackFilter.hpp
-- Installing: /usr/src/tmp/pdal-buildroot/usr/include/pdal/filters/StraightenFilter.hpp
-- Installing: /usr/src/tmp/pdal-buildroot/usr/include/pdal/filters/StatsFilter.hpp
-- Installing: /usr/src/tmp/pdal-buildroot/usr/include/pdal/filters/SplitterFilter.hpp
-- Installing: /usr/src/tmp/pdal-buildroot/usr/include/pdal/filters/SortFilter.hpp
-- Installing: /usr/src/tmp/pdal-buildroot/usr/include/pdal/filters/SkewnessBalancingFilter.hpp
-- Installing: /usr/src/tmp/pdal-buildroot/usr/include/pdal/filters/ShellFilter.hpp
-- Installing: /usr/src/tmp/pdal-buildroot/usr/include/pdal/filters/SeparateScanLineFilter.hpp
-- Installing: /usr/src/tmp/pdal-buildroot/usr/include/pdal/filters/SampleFilter.hpp
-- Installing: /usr/src/tmp/pdal-buildroot/usr/include/pdal/filters/SMRFilter.hpp
-- Installing: /usr/src/tmp/pdal-buildroot/usr/include/pdal/filters/ReturnsFilter.hpp
-- Installing: /usr/src/tmp/pdal-buildroot/usr/include/pdal/filters/ReprojectionFilter.hpp
-- Installing: /usr/src/tmp/pdal-buildroot/usr/include/pdal/filters/RelaxationDartThrowing.hpp
-- Installing: /usr/src/tmp/pdal-buildroot/usr/include/pdal/filters/ReciprocityFilter.hpp
-- Installing: /usr/src/tmp/pdal-buildroot/usr/include/pdal/filters/RangeFilter.hpp
-- Installing: /usr/src/tmp/pdal-buildroot/usr/include/pdal/filters/RandomizeFilter.hpp
-- Installing: /usr/src/tmp/pdal-buildroot/usr/include/pdal/filters/RadialDensityFilter.hpp
-- Installing: /usr/src/tmp/pdal-buildroot/usr/include/pdal/filters/ProjPipelineFilter.hpp
-- Installing: /usr/src/tmp/pdal-buildroot/usr/include/pdal/filters/PoissonFilter.hpp
-- Installing: /usr/src/tmp/pdal-buildroot/usr/include/pdal/filters/PlaneFitFilter.hpp
-- Installing: /usr/src/tmp/pdal-buildroot/usr/include/pdal/filters/PMFFilter.hpp
-- Installing: /usr/src/tmp/pdal-buildroot/usr/include/pdal/filters/OverlayFilter.hpp
-- Installing: /usr/src/tmp/pdal-buildroot/usr/include/pdal/filters/OutlierFilter.hpp
-- Installing: /usr/src/tmp/pdal-buildroot/usr/include/pdal/filters/OptimalNeighborhoodFilter.hpp
-- Installing: /usr/src/tmp/pdal-buildroot/usr/include/pdal/filters/NormalFilter.hpp
-- Installing: /usr/src/tmp/pdal-buildroot/usr/include/pdal/filters/NeighborClassifierFilter.hpp
-- Installing: /usr/src/tmp/pdal-buildroot/usr/include/pdal/filters/NNDistanceFilter.hpp
-- Installing: /usr/src/tmp/pdal-buildroot/usr/include/pdal/filters/MortonOrderFilter.hpp
-- Installing: /usr/src/tmp/pdal-buildroot/usr/include/pdal/filters/MongoExpressionFilter.hpp
-- Installing: /usr/src/tmp/pdal-buildroot/usr/include/pdal/filters/MiniballFilter.hpp
-- Installing: /usr/src/tmp/pdal-buildroot/usr/include/pdal/filters/MergeFilter.hpp
-- Installing: /usr/src/tmp/pdal-buildroot/usr/include/pdal/filters/MADFilter.hpp
-- Installing: /usr/src/tmp/pdal-buildroot/usr/include/pdal/filters/LocateFilter.hpp
-- Installing: /usr/src/tmp/pdal-buildroot/usr/include/pdal/filters/LloydKMeansFilter.hpp
-- Installing: /usr/src/tmp/pdal-buildroot/usr/include/pdal/filters/LiTreeFilter.hpp
-- Installing: /usr/src/tmp/pdal-buildroot/usr/include/pdal/filters/LOFFilter.hpp
-- Installing: /usr/src/tmp/pdal-buildroot/usr/include/pdal/filters/IterativeClosestPoint.hpp
-- Installing: /usr/src/tmp/pdal-buildroot/usr/include/pdal/filters/InfoFilter.hpp
-- Installing: /usr/src/tmp/pdal-buildroot/usr/include/pdal/filters/IQRFilter.hpp
-- Installing: /usr/src/tmp/pdal-buildroot/usr/include/pdal/filters/HexBinFilter.hpp
-- Installing: /usr/src/tmp/pdal-buildroot/usr/include/pdal/filters/HeadFilter.hpp
-- Installing: /usr/src/tmp/pdal-buildroot/usr/include/pdal/filters/HagNnFilter.hpp
-- Installing: /usr/src/tmp/pdal-buildroot/usr/include/pdal/filters/HagDemFilter.hpp
-- Installing: /usr/src/tmp/pdal-buildroot/usr/include/pdal/filters/HagDelaunayFilter.hpp
-- Installing: /usr/src/tmp/pdal-buildroot/usr/include/pdal/filters/GroupByFilter.hpp
-- Installing: /usr/src/tmp/pdal-buildroot/usr/include/pdal/filters/GreedyProjection.hpp
-- Installing: /usr/src/tmp/pdal-buildroot/usr/include/pdal/filters/GpsTimeConvert.hpp
-- Installing: /usr/src/tmp/pdal-buildroot/usr/include/pdal/filters/GeoreferenceFilter.hpp
-- Installing: /usr/src/tmp/pdal-buildroot/usr/include/pdal/filters/GeomDistanceFilter.hpp
-- Installing: /usr/src/tmp/pdal-buildroot/usr/include/pdal/filters/FerryFilter.hpp
-- Installing: /usr/src/tmp/pdal-buildroot/usr/include/pdal/filters/FarthestPointSamplingFilter.hpp
-- Installing: /usr/src/tmp/pdal-buildroot/usr/include/pdal/filters/FaceRasterFilter.hpp
-- Installing: /usr/src/tmp/pdal-buildroot/usr/include/pdal/filters/ExpressionFilter.hpp
-- Installing: /usr/src/tmp/pdal-buildroot/usr/include/pdal/filters/EstimateRankFilter.hpp
-- Installing: /usr/src/tmp/pdal-buildroot/usr/include/pdal/filters/EigenvaluesFilter.hpp
-- Installing: /usr/src/tmp/pdal-buildroot/usr/include/pdal/filters/ELMFilter.hpp
-- Installing: /usr/src/tmp/pdal-buildroot/usr/include/pdal/filters/DividerFilter.hpp
-- Installing: /usr/src/tmp/pdal-buildroot/usr/include/pdal/filters/DelaunayFilter.hpp
-- Installing: /usr/src/tmp/pdal-buildroot/usr/include/pdal/filters/DecimationFilter.hpp
-- Installing: /usr/src/tmp/pdal-buildroot/usr/include/pdal/filters/DEMFilter.hpp
-- Installing: /usr/src/tmp/pdal-buildroot/usr/include/pdal/filters/DBSCANFilter.hpp
-- Installing: /usr/src/tmp/pdal-buildroot/usr/include/pdal/filters/CropFilter.hpp
-- Installing: /usr/src/tmp/pdal-buildroot/usr/include/pdal/filters/CovarianceFeaturesFilter.hpp
-- Installing: /usr/src/tmp/pdal-buildroot/usr/include/pdal/filters/ColorizationFilter.hpp
-- Installing: /usr/src/tmp/pdal-buildroot/usr/include/pdal/filters/ColorinterpFilter.hpp
-- Installing: /usr/src/tmp/pdal-buildroot/usr/include/pdal/filters/ColorInterpRamps.hpp
-- Installing: /usr/src/tmp/pdal-buildroot/usr/include/pdal/filters/ClusterFilter.hpp
-- Installing: /usr/src/tmp/pdal-buildroot/usr/include/pdal/filters/ChipperFilter.hpp
-- Installing: /usr/src/tmp/pdal-buildroot/usr/include/pdal/filters/CSFilter.hpp
-- Installing: /usr/src/tmp/pdal-buildroot/usr/include/pdal/filters/AssignFilter.hpp
-- Installing: /usr/src/tmp/pdal-buildroot/usr/include/pdal/filters/ApproximateCoplanarFilter.hpp
-- Installing: /usr/src/tmp/pdal-buildroot/usr/include/pdal/Dimension.hpp
-- Installing: /usr/src/tmp/pdal-buildroot/usr/include/pdal
-- Installing: /usr/src/tmp/pdal-buildroot/usr/lib64/cmake/PDAL/pluginmacros.cmake
-- Installing: /usr/src/tmp/pdal-buildroot/usr/lib64/cmake/PDAL/PDALTargets.cmake
-- Installing: /usr/src/tmp/pdal-buildroot/usr/lib64/cmake/PDAL/PDALTargets-noconfig.cmake
-- Installing: /usr/src/tmp/pdal-buildroot/usr/lib64/cmake/PDAL/PDALConfig.cmake
-- Installing: /usr/src/tmp/pdal-buildroot/usr/lib64/cmake/PDAL/PDALConfigVersion.cmake
-- Installing: /usr/src/tmp/pdal-buildroot/usr/lib64/libpdal_plugin_kernel_fauxplugin.so.16.2.0
-- Installing: /usr/src/tmp/pdal-buildroot/usr/lib64/libpdal_plugin_kernel_fauxplugin.so.16
-- Set runtime path of "/usr/src/tmp/pdal-buildroot/usr/lib64/libpdal_plugin_kernel_fauxplugin.so.16.2.0" to ""
-- Installing: /usr/src/tmp/pdal-buildroot/usr/lib64/libpdal_plugin_kernel_fauxplugin.so
-- Installing: /usr/src/tmp/pdal-buildroot/usr/bin/pdal
-- Set runtime path of "/usr/src/tmp/pdal-buildroot/usr/bin/pdal" to ""
-- Installing: /usr/src/tmp/pdal-buildroot/usr/lib64/pkgconfig/pdal.pc
-- Installing: /usr/src/tmp/pdal-buildroot/usr/bin/pdal-config
+ /usr/lib/rpm/brp-alt
Cleaning files in /usr/src/tmp/pdal-buildroot (auto)
mode of './usr/lib64/libpdal_plugin_kernel_fauxplugin.so.16.2.0' changed from 0755 (rwxr-xr-x) to 0644 (rw-r--r--)
mode of './usr/lib64/libpdalcpp.so.16.2.0' changed from 0755 (rwxr-xr-x) to 0644 (rw-r--r--)
Verifying and fixing files in /usr/src/tmp/pdal-buildroot (binconfig,pkgconfig,libtool,desktop,gnuconfig)
/usr/bin/pdal-config:
48c48
<     echo -I/usr/include -I/usr/include/gdal -I/usr/include/libxml2
---
>     echo  -I/usr/include/gdal -I/usr/include/libxml2
/usr/lib64/pkgconfig/pdal.pc: Cflags: '-I${includedir}/pdal  ' --> '-I${includedir}/pdal'
/usr/lib64/pkgconfig/pdal.pc: Libs: '-L${libdir} -lpdalcpp' --> '-lpdalcpp'
Checking contents of files in /usr/src/tmp/pdal-buildroot/ (default)
Compressing files in /usr/src/tmp/pdal-buildroot (auto)
Adjusting library links in /usr/src/tmp/pdal-buildroot
./usr/lib64: (from <cmdline>:0)
	libpdalcpp.so.16 -> libpdalcpp.so.16.2.0
	libpdal_plugin_kernel_fauxplugin.so.16 -> libpdal_plugin_kernel_fauxplugin.so.16.2.0
Verifying ELF objects in /usr/src/tmp/pdal-buildroot (arch=normal,fhs=normal,lfs=relaxed,lint=relaxed,rpath=normal,stack=normal,textrel=normal,unresolved=normal)
Hardlinking identical .pyc and .opt-?.pyc files
Processing files: pdal-2.6.2-alt1
Executing(%doc): /bin/sh -e /usr/src/tmp/rpm-tmp.68307
+ umask 022
+ /bin/mkdir -p /usr/src/RPM/BUILD
+ cd /usr/src/RPM/BUILD
+ cd PDAL-2.6.2
+ DOCDIR=/usr/src/tmp/pdal-buildroot/usr/share/doc/pdal-2.6.2
+ export DOCDIR
+ rm -rf /usr/src/tmp/pdal-buildroot/usr/share/doc/pdal-2.6.2
+ /bin/mkdir -p /usr/src/tmp/pdal-buildroot/usr/share/doc/pdal-2.6.2
+ cp -prL AUTHORS.txt LICENSE.txt README.md /usr/src/tmp/pdal-buildroot/usr/share/doc/pdal-2.6.2
+ chmod -R go-w /usr/src/tmp/pdal-buildroot/usr/share/doc/pdal-2.6.2
+ chmod -R a+rX /usr/src/tmp/pdal-buildroot/usr/share/doc/pdal-2.6.2
+ exit 0
Finding Provides (using /usr/lib/rpm/find-provides)
Executing: /bin/sh -e /usr/src/tmp/rpm-tmp.Xukl01
find-provides: running scripts (alternatives,debuginfo,lib,pam,perl,pkgconfig,python,python3,shell)
Finding Requires (using /usr/lib/rpm/find-requires)
Executing: /bin/sh -e /usr/src/tmp/rpm-tmp.oQcnd4
find-requires: running scripts (cpp,debuginfo,files,lib,pam,perl,pkgconfig,pkgconfiglib,python,python3,rpmlib,shebang,shell,static,symlinks,systemd-services)
Requires: /lib64/ld-linux-x86-64.so.2, libc.so.6(GLIBC_2.14)(64bit), libc.so.6(GLIBC_2.2.5)(64bit), libc.so.6(GLIBC_2.3.4)(64bit), libc.so.6(GLIBC_2.32)(64bit), libc.so.6(GLIBC_2.34)(64bit), libc.so.6(GLIBC_2.38)(64bit), libc.so.6(GLIBC_2.4)(64bit), libgcc_s.so.1(GCC_3.0)(64bit), libgcc_s.so.1(GCC_3.3.1)(64bit), libpdalcpp.so.16()(64bit) >= set:pkbFzf4j1pxKbqUqGRb6KXvUeCc5f6t3DGVpuoPZFz4f55UByV1FXBAyXwZI6XZkSy6cEpHp9MAQGZg, libstdc++.so.6(CXXABI_1.3)(64bit), libstdc++.so.6(CXXABI_1.3.7)(64bit), libstdc++.so.6(CXXABI_1.3.9)(64bit), libstdc++.so.6(GLIBCXX_3.4)(64bit), libstdc++.so.6(GLIBCXX_3.4.11)(64bit), libstdc++.so.6(GLIBCXX_3.4.14)(64bit), libstdc++.so.6(GLIBCXX_3.4.20)(64bit), libstdc++.so.6(GLIBCXX_3.4.21)(64bit), libstdc++.so.6(GLIBCXX_3.4.26)(64bit), libstdc++.so.6(GLIBCXX_3.4.29)(64bit), libstdc++.so.6(GLIBCXX_3.4.32)(64bit), libstdc++.so.6(GLIBCXX_3.4.9)(64bit), rtld(GNU_HASH)
Requires(rpmlib): rpmlib(SetVersions)
Finding debuginfo files (using /usr/lib/rpm/find-debuginfo-files)
Executing: /bin/sh -e /usr/src/tmp/rpm-tmp.zNmWuf
Creating pdal-debuginfo package
Processing files: libpdal-2.6.2-alt1
Finding Provides (using /usr/lib/rpm/find-provides)
Executing: /bin/sh -e /usr/src/tmp/rpm-tmp.ltVUSy
find-provides: running scripts (alternatives,debuginfo,lib,pam,perl,pkgconfig,python,python3,shell)
lib.prov: /usr/src/tmp/pdal-buildroot/usr/lib64/libpdal_plugin_kernel_fauxplugin.so.16: 21 symbols, 15 bpp
lib.prov: /usr/src/tmp/pdal-buildroot/usr/lib64/libpdalcpp.so.16: 3967 symbols, 22 bpp
warning: hash collision: _ZNK4pdal9BpfReader7getNameB5cxx11Ev _ZTSN4pdal20TransformationFilterE
Finding Requires (using /usr/lib/rpm/find-requires)
Executing: /bin/sh -e /usr/src/tmp/rpm-tmp.ABkqHw
find-requires: running scripts (cpp,debuginfo,files,lib,pam,perl,pkgconfig,pkgconfiglib,python,python3,rpmlib,shebang,shell,static,symlinks,systemd-services)
Provides: libpdal_plugin_kernel_fauxplugin.so.16()(64bit) = set:idKpyCzqlCEP46V4mvf3h2TqmavDMVY1PeQfbqBOueeE, libpdalcpp.so.16()(64bit) = set:pdbhK7GxlSKnJiZHrt8WT8jR5yvNv8A4l25NKjCHzCFF0ZrHd4qbaimJPQIliLG9oeYmrnOcqDSVRC9JlmAgvrRSAaabAfxX5Q9AKe5e7Nob2ZrJaJDiipzxKPU8KBQzLzjGVkNJ8ouvOm1qotEEMAZ6fDBFhTlaJdsMZqExQhKgXUaMkvrANqZLx8fEcFIAgNCr2LlLKe5C59kyBVjnT35FZKB47l6KvpGkp6fJLWx5PBTrFwInJ6y0B21d3YbBDMwGdTGULZ1dzZ7aYPbFIA3q3g5e15DvgXa2rBcWN7w3NBU8fNeaf6T3LDZeMMU9UhoVrABv4Ti2XP4rYy21HxiMBfUOLW1TXdzCRAbuh6ODCUOCx1Vj8ohi9OY4ZuZ012Ob8CZaQ5GEpklShBaq4y45CWOnGMeqm07CgmJP1H4MZ3ei3zfWmTcfB9i5uNVbZeH9IQll5Vs49LqKm1FL30ulDZ9qyAFG1l8ZhZbOK7O7FZ6iTLhSHsgVnp9ck4aAqQAq0XyZy2rKwZ2KeXIxt9rRYLt8EQsQXPCwBAq63QoDt0mzlyYnebC7fpcVxu1w6oUu85PYSy3DkripCICbRose6Znruejxstb8XsnOtxHIhWRI4AoO7ZlCsG3r2rL3dzX4QxXA4yLIP7nxAQEpcY2c7ZtC9yxlSN9e5P89vpFrjNoJIjGhOypwRanARRmKulGPgFN8uzZLmag0zfRUqCg2osvZAhJGRLOZK6bDmmLj0LcdECsuxzsrG7ikVZkmrzJcy7cLgAEMGMAdqdT0QpQuiXuCXkzltz5oIpqzdQTFrsfwYkWqEUGZwiV951S7S8tQPnH7Nc3hpwaROMDvZ1jALCWmPsBLTiAdH3DfHsGAPAp1JgZyDiaNqmBAOOGvpkpazTegIoAtMUJBZ4d56q9UWL7GPJPYKhlWZ9tqTpFoIMhJCM4o5S8CYZyGZFxG6JzwZ7U1V0ZDhpwqhsZ30Zs0LLoT4rZtV9kQwya1DdB4ZgVZzFjnvWuWrlFOcZ3EcIi7nnCfFLFZdd1q7ZJSOtBhhXdQZ4j4tZFozPq2EZ5F6DyXJSDWzvg2adrcOIR8tCZ5uhRsQ2N0ZwMyAIdZ8KJ7xZHlIvQcH1H7eoq8n6pALuEgpbqu4aZqZDnsZoO53iPfK1oKXZoVNuU9AoCeWR9wKMdULckcE5yKixZs1TzOywB5UJEQaOm9o3RjT4K5dqGMlggv4N3VZ2UJeG0kez25WWG3WhEooRLfLhEYACagjJvNVexCogWMvuuBlmVPqSs5MdarlDoGlZrG7wyCMuYpFoOJuqtYlq6TZBm5wzcUdEMZn2HUVL9s4okZpLRgakZ92hSs4dSwx63SsNLE1HiAJIR5RYBiLjM2eVaBwJnx157ov65SbAiYz29AZDltj3SreYOi1lmIanCf4qmFpbe1iS6Vbe0vczgfkvhZBikcl8CDeAcVI1JzhwWRsMtT3UVMKn35v9By82nRMINeumGDSCF55NFrxz5N7t0teQNpYQr4sAdZj81lY46o6djIxum1IWkPIFs8DTQTUwF90vw2xVikE4GUZsuMfoZtcbRCeN5Q9KvY8isPYM9hEf1AmO8txFGmBinF6rBxzLVhkGz9FoTsNZFfnccJpgQkDrdpubXE5N4bQYkqfZ1hkh9gZsEAuRawQovLKzMfaXWvCftLItfZbOEaj9XpSm8lyUBTSZtfCT2j0xEJW4oTTHZgUBUA4ml7Iug4HKouEnmJ6jzIEjaHw73Ob15PCDqWqZETQ8NkI2879ZDZ0b5Wq8sgomZFMhWijx8jybXq6AbLPm7bMyUf0EzbG0TarQnh8xaJYpRdpe28GT6ibZHTpHpfZvhFDRlSfTZq9nozd9P9kGai7Clxx1JVq4hu3RfoshWdLw8VnsIFI4sKjISZ0bRtDrVqCyDlxUx5VIL0eBkkjeoJ0oZmS3RR3WJXglZmtX8cRqIjGnxVVjG4F2CCyIfBdH6nv9dohK3Dlq3gEVlohClKrGcPP7Zg9ZxwFOTA9nfwciZBSxTy2pRuQ0X7OFDovKHw8AMVv12WGXN3p4AWqmE4UnA7ZAl7aRrcYEOkZ4ZmiP9JXGFTvhJhpAu5jigaWa8elVralzjGdTliNEtlzzcTyT9DOSD1FsZH8EoADHRHkuPGziFN7ziiBcoNXr6RwF8vxolIaOeTWLPZa3BbZkzzowOUNtwulQMjhxdoEFj4JmOwKeshKcT8C35PBMA8NxKl587Ib0kiu7L7BZ7zHwGONojIQE3ZdgIxZEqgdSMA9BrgEGVSGkqKMyzufWpuxXo4UwdmMqHZf44T2EpW4hSS8cm4lRKA6Zf3HC7AmgvraqGJUmIVcxbHKDUmGCuWOnCUdCgP4XDAdYhOmcQNaWZgjrDeLtkiLe75JK1hHnoIymqwVR2tZku87v2HeonWTO42TerG5i0a1KoCdq5vWL26xxXZ9czLgY82HtLAyTSK9LSdYue512L3qma2lBCW8OCpu5Laiaeo189zinkUVbhHJZ0Hppg9ZCarhZxQGeuk91urVVtG7q7a3tLBPm6DKVguNBhYDMGhdfhC6p46XJ27AoqyQFZznveiQ4ZCON9Mkia8vMuu5rVlyz3qitCyMfT8HlVgf24ZCnfozoo2VylB6LP793tnjEXMXEBuZEoEANSMYhPIQ8BTA5Cc3KaWFnh5hhrn8fLDmgl1PLJfRceeqjzJBA2ZuFrw4mixpsFOOElbA0vUfmUXCskgkP1x7lnh3YMbsS2tlJ38eFL6MLE7TqrzWLaVmZbSci9ioQwdw0SqARxtEOdYQKrN73KcgOSkTuN6zB2zHQCfkjEQZE8TBvX5crF6KhmjIMar6A9QjRQXlyt1eMmrDuXP0u68cckYaCPPzjJNbT7VFvuTRWWOx4PAtE9RT6ItH1tLjirNtp9hNBZ5a7AB45ZCWD6P4vjdfC9VnMJFl74KnlKKOKANGq2Zrdef3CVd7HM7EAWIQjQdDhgxTHl0pfE0DcCFFM0y9kie544nk8pYCKF9wg4h4BJEP5GrdiEZ4uaW8rTI5fZpS90mqJxmVoU27Qatly9NiGZ8xhZ0FwDpioMAtcfEEp5KGW6umtK2R2IEOrRaIN9ifVZqicJYYQnbLymPwoX0yBqRxG9ZvOHszMBcL4e7jitXAz7qsFRedLQwvuY3FbEBQwucFPr0NyLNZDvcbNJWvEqwZkg5pYdwe6GC195EfkS93VzZlv0Q6CF65SVa6ZJwvqlZtt7G23AMPXTCMSZ9FKmaiXJfzvaMlWYvCimOVXKzlZjzNOCOJp2MtFok8DsyS5WtxZ6EDhLwTwDX8gmEGJmvWS3BwAgumcaR48jEZwKdrFPNtNdNTPUAt5SQVQgRwxHReUJdQEHSA7bHn3BRgFKiorsXHLZzTvQKvVivZJV7kum2L0WNg7U8RCIdZnBqkC21pMX9z6DQTmIXgGJ7i8iQVSUKcej4JG3iCTUhUcIWUSdXQ4bZ2vYbGFLVh7H8BHJVO8NOvMsAzO5f140jATZLZ7WZCUSewyhq3YdiKUCrjQvkJL2xCfwOTRTg5y05bGgWbO3mgivAXroCCykCgTKT0awb2bZvg2w3OKghifgwAxjZtAjswSaPlhPay7i05IHQSbwdVoE9PYEZuvp9l3tv64B5DwVicwO7OjWbhhl6S8fHIispm4RAEUGS1qmHFcyzNUiopLZcBlOvcvOUMpL83pMaHcMksZAYEPwT3P5WOf2hKKiXEaGt8mU4DxRYdoWjCaLXHNvp5shToPT90fGuwBhVFDSZL7anAolDqdHIHUXsOWyhwNManKZJ7VfdAkAKqYpYfrfi5hzG6O29mzJTwrS0hnADMpFRpGp5yZDvvbNcZyDZx7Pfg1vQLlTf3YIKwlSsXpqZlGXsls7wTfxLlOmugeAvt7zMUIWGlgHn3hiTYOsLyX3WSMfwpwulu9pZbks0VCFSbhASkVcn0m7NJ6NeF46gDLXci7n3SKGYrZquozd0uQI4b7Hb5SpocwKZFbZgNhmqH3Z6M4VuDonVOKJBeq20IMOG6fCc5dJhAv8TWhQIyVtsKzZiEYJxkNQ3eu4VTKFyMzAcjlZCa7lhqkDEF9v9bBZxUYI0gHU5Z7heZqlcolj3k58bogkUXgsPsodV23bDAnhT3uwm0G46L6cme7bNJt8GdKgZkZy55N4iFKZnawzCSSRVCHPPZFjmF8YKtZlaTdYJmRKSW2G2iOAj1j2ZdHdZ5bXHoimlvL8ep9imHtRUhXUxAqIKKvLwGhYZ2PEZpMwJ2n96X7AJ7CcN5K4eB6NWFDxEnxsHEWZ4o4Xxj5gqh7h9ovZstzKS8NBoBrIVqbWEKkMI1dCtwXYTUrD6ylZCvrmFZcy6RJQPDUneLecnzDc1BIQbIuQUHg9QM2ZrGrZryJH1LhYjQT0j6ZwLaJREsSKhiUWTZuNpZxTOZ3qI8MR8u6su6c2jfBVfnAJVKURykhLNs87Qn4UiYMk9Qv09dZGFR42U5dztMJ491w7ZEETrIxvQZDawHtZardTEaVkt5cgg0pZxfNoJZclemwoSYTuZtBrTd3tLLPvcxkwvUNPmOmZ8uaouQHkgzZCtbvFRh0VFkH8Zs29nloSTfFywUjFAenJg5dE9ckMSKBH8NUf5bZc21255HrHPJRr1G9q5SbWHxGQuto0HXk5j8A9ErI8nuKk6k7xy17BSZHmC25MTPZ8qZrZe09BdP7JWkZ265R52jIG7FIOlA8MQkl5K1qZblFlKHQfmCjO8lRvTmSZnpVIOp0B2pYOETQku91Z9UdI7I0Cp4939kK6AmuYkmZHeYaLYmQTFRQt8cf1OZ71wN6hNJKGXVqRNdE6lHBZlkVD4pZjZ1wAiPWZFdWQuGpZwJBxMpsNZebQKmbrL97PU2WbHAKmtxmH6STVfLOj8FaUNhh8ZhZrBj8BfhYZ5eo8xUify9R9ZljFoWA8iH3JskZIgxzx0MGRVYDxUxYSLZAwZkFMryfFX0PsyVh5y6TRQ6dKOZaAMm6GfcGCmtJ4ZfBF3DAsTSVtCDGfDjZkee2e5Aw1PUCrhikqlQDtusnplZ0o7Snk9HndwREoHDOJmBP1ECyES9FSIqH71sl9EvYzdrnoLVer5z3LZ5KlXfL8UV3VzYuFoVcO2bXej1EyPgHYpGVSudGu3l9oXRiZjGgjcpZoAATgWKQM7H5ctCtj076bOXkrow8ZKBubr6ILSkRdT1DFdSwNAZCqIjpVlQSbcA1ZtqA4saaBEWVZrQRJaxlkQtyPDxqjlvTuSz9Bnl63Zo8jvjLfB1WMem061Ywg1Xsv4f5dBAxZ99dTU3nz0vZl3oDVwQtLUSAslouZ3FkckT8j1WHnjbVHy5iUmG8yYAwUjRkDBibh1BKsjBL01yp9YwYbMGHvZtzhKJbrp9x9LcTIWHR184UofIc1QfuFARZhZmsgZeajZ2iOG6cQP7IqZuo4S3QbmWf4FYSE0FGVSVesXo4YlqLJvbDZ1bprY5MjZ7WoNBjTitajQtP4cS6iAe5DyYpjcyfEM1YteokPf6DgzB1iu9WqDDnL7qCbKKW2GoYTMGplwiwyhgG8KpjdvCRyivZb60sG6Bnp2aLV5N2XZAsJJBO4sZjZ1Jf6TpZxhT6yOBAUcYnfRz83OSrTPlvtXZIw94enyQZBJAZnHjt2ZrawM58bZ8zhQvUCZKacnW3kqKZGZAc6zehJDU5DOFz1ycvMEn4ohIfopDTzLKKFklPpivHabYdlfcvnvCRvbAAgZKzR851GAV2CknDrF7kMkvWR9uwA3wMHEgPlyOo0XCkZA53AiIeU09tSCthlvcGDQ4sTnVR4UvplIQHXmnGucGXPN8mmu8UwB5ZpZGeczUAxO2QjVtl1mHMJGAcQn4Bn3uZBuRYPCCXsBMWNwlUUOfp69L1FTlBERAESQY47i7xaKhwTElQ909pfjLe152azAxWBEZ4jp8VQKITZd3gVhoMT8eraKJXaR9c5bo6WN7cpjOernSiN4OY8zo348f7JF4jdontD8pM3oJtc8g60LkZu95YAlad2ons68sTnCpRpXXbXxembUIN8vERp0kyD37cjReHyiTxZ0C2HjPv3wIAeOy1ISoAZ3brmA4Q4eavD56QNPBgYq4A9Gk7B5QNr88V4bwyFhq1WtACvNwZLgHuZBZ1ZcAVCSV3dtyyWwyZHdZqkijCrCZBKE1TdWDxYjcqaKjgZEYDM1Jyn8sl4XpICqoBsFuZaq4HHgk8QX66aBRZ0Xy1LyWzoEB3hAOZzwNRCJWYlG3Au71yYddfxYsZ0Z6iaCpvK9xIhE3N2D0kn321pzxDkIqhAObCbGZjZ6KTCaPrHZoQu1Amkqu2dU7lfwtjifCEmSpirtjacS1fe3CKZJuAT5yG8P23y4BboZpomjYNoUBGe762Q2y5U6CsZisQIpkJYlu9kAf6q3CZhe4dIlcCmh7G6qztOfa964BQPlHUOqkosQXEFHz9OdKUjIOcMY4aAXO27b2PEmp1NI8Wxui9NkwnNwwGZGZECtNSooNCp8HyE1AmRYE0AMi0v5QpexPJjUgMEffVIyaVWaHNQ8kapTBmlfsZaH6ZAbaQ4Z6mFYXc5K0aY45sbX9VhIowfjcaIWH88VtfsCZGtnX69OsLBaqVV7V6MartYj7M6pjzBUAqZ7zbEauTzJvdU3kVE8NVKRsZkWClGJT6O0NJV9iZ0Xf8FGZC3CTFqgz6cbV78fQNnfbUDuqly0bF2FSQ4M6Zc8TBclcJgZBWfNwlclVoWhL5Z9kqfAffu9Ec4g6XJipffLglIropQofywCOoxF3FYJI5YMdMnoBIbR3GI1ObMySrbBZzPrX0l4estwoVXDOFp0Z4ufX7RCMmPv0u0gz9vQLoJ1CawiEG8IRlnXdqbn8VFbYD8PT0qbiFNwUAzkgA73cMIVv7eYZ2Zs3xcwaYR3Q2xAMUtiQ8P1lbjhmtfBhQHVkGmJlXnm4RsiUhhR4zHkrPsSujE05a2tZH23PBZIGgKAxLF3xlFol5GeYBz4HZ4tj7hHMN7JgZ9bqUIepZoAyurAVVWsEsz7LfR3lXW2yeFQzTUQXRYGvcc3ZpsTGkqnVT6dkaiZ5RkqmZu3pCVrm3u0NKKhEZ6bubzxuiqo84HU3b6OrTpLzFc2B1ajJoKFOcyoIpa0M1zAvcGoMDeOZxUTR6IvfHe0cxBZHAI85yLqFAYwnhdhhE8f5FMjmoq5UmbsO4NL3KneHvIOzMPntb3Ed5iAnozVxcxm3uzHVOTdKtM4OHSPNzfvNure76ZtMdlNjjNafyFvABfnW1Sa3W3OpYh2fcXGnvsUEdSZlqhusJW4qJ5L9RGTuuwoXZJ95XxwcGYNWYmKfoCM3mfDpoyOIwXOHaVkWZgiThXD2TRiNVxQD926GG2xCI0Pk9KlZddgu9EHkLHnpEgQozqKG24ZgUvn7CNJjYRBTY843f0GuLx6pDh4VuZaUhv6oigNNrhCaUJZyfZ9GFvk7PqckWiLyqd8ZeWGf6am32ZCWGW3dFJOGXeNjPOU0fZjjMIHeSHwkgFqm8dZep040t0ZKcpWzZH6RHToW6b9sF9NUKZ0AxMCUlYQeUebANEUmFUK42kfiCpO32Iwu1PeBwgEVqquzBFu4LklpHMGCumskuaXgyUBnTVnYRRg5CC8a6FFleYOi3W4PTWFjP1owdPR5HsZJFoK0Ky2l5YmgqG3BgJz8d3Ls6bUoBR6ILyeknU9QlaL5QFjRkbjCwSU9phKImAjA70vyTgUzMwaWUVI1
Requires: ld-linux-x86-64.so.2()(64bit) >= set:jiids, ld-linux-x86-64.so.2(GLIBC_2.3)(64bit), libc.so.6(GLIBC_2.14)(64bit), libc.so.6(GLIBC_2.2.5)(64bit), libc.so.6(GLIBC_2.27)(64bit), libc.so.6(GLIBC_2.3.4)(64bit), libc.so.6(GLIBC_2.32)(64bit), libc.so.6(GLIBC_2.33)(64bit), libc.so.6(GLIBC_2.34)(64bit), libc.so.6(GLIBC_2.38)(64bit), libc.so.6(GLIBC_2.4)(64bit), libcrypto.so.3()(64bit) >= set:qmvV2QBieeRcHaS6E2kIRkxoI9EHzlZHG0JCDJQMwJRK1, libcrypto.so.3(OPENSSL_3.0.0)(64bit), libcurl.so.4()(64bit) >= set:kgZtdjewuBSOM3YXjuKGePG5KIVF9mA3, libgcc_s.so.1(GCC_3.0)(64bit), libgcc_s.so.1(GCC_3.3.1)(64bit), libgdal.so.34()(64bit) >= set:qi7chznjkiFtRDecOPdCCFuAAnoxxpyubrqaTZd3RKxDJV6S79UZHOtjyzY1MSHZkGrzofEb7Q5CSobmSrzcZztZ0dm3rGInizLQQ5ZIeC2t7wKZ2ey6kVLbNDhfruG3n0rbz8txJ1XDYkCbKwRKCn0HYtQvEb8jNNSza1SLI4eg1BBzv235OCm3C30pvlAAf9p7ZFj6E1DMiGl8wVdZhjVb0sqrJqFFPUmcQO5ZAef26Y1OI2KKFIJ5TwFV84AhTSaVghuLlbZIDfUPhCLe3cyPx34qndQ4l02bVrsyGNp5OcE7v2gxgs1MJiFNwurtYBfZv7rZ2WeDHoZkzlK5iZ7wPTbmXIcq6k65nbx1mZJEzgoXhkTXdihoQgbxYxdsXxCiTOqoNfvk2FG8NFDHeI8jdlorhzCmplIUsN1jCGgf2xV3SZzI47b2I1cZy6ODgh1KPhcWmYfpNk9PJvkmYk1bEeAdSdRUmRJACG, libgeotiff.so.5()(64bit) >= set:kgmGEWM6bQc0rp7bvdSZlZdOOqRb2pAb, libm.so.6(GLIBC_2.2.5)(64bit), libm.so.6(GLIBC_2.29)(64bit), libm.so.6(GLIBC_2.35)(64bit), libm.so.6(GLIBC_2.38)(64bit), libproj.so.25()(64bit) >= set:pmetTtT2fSGnOOhOC2i1, libstdc++.so.6(CXXABI_1.3)(64bit), libstdc++.so.6(CXXABI_1.3.1)(64bit), libstdc++.so.6(CXXABI_1.3.2)(64bit), libstdc++.so.6(CXXABI_1.3.5)(64bit), libstdc++.so.6(CXXABI_1.3.7)(64bit), libstdc++.so.6(CXXABI_1.3.8)(64bit), libstdc++.so.6(CXXABI_1.3.9)(64bit), libstdc++.so.6(GLIBCXX_3.4)(64bit), libstdc++.so.6(GLIBCXX_3.4.11)(64bit), libstdc++.so.6(GLIBCXX_3.4.14)(64bit), libstdc++.so.6(GLIBCXX_3.4.15)(64bit), libstdc++.so.6(GLIBCXX_3.4.18)(64bit), libstdc++.so.6(GLIBCXX_3.4.19)(64bit), libstdc++.so.6(GLIBCXX_3.4.20)(64bit), libstdc++.so.6(GLIBCXX_3.4.21)(64bit), libstdc++.so.6(GLIBCXX_3.4.22)(64bit), libstdc++.so.6(GLIBCXX_3.4.26)(64bit), libstdc++.so.6(GLIBCXX_3.4.29)(64bit), libstdc++.so.6(GLIBCXX_3.4.30)(64bit), libstdc++.so.6(GLIBCXX_3.4.32)(64bit), libstdc++.so.6(GLIBCXX_3.4.9)(64bit), libunwind.so.8()(64bit) >= set:jgZw6GIPwfxCFys, libxml2.so.2()(64bit) >= set:oii9AEUrJVxh9PiomLRZaaM358TPlWsNTOg3EbzaG86hZbp2GEGfyq4iBZ7aRGRaAK113I8gc5EIknD55jNdF9poVUun8EboZbeqpistAEooFF5Umv1, libxml2.so.2(LIBXML2_2.4.30)(64bit), libxml2.so.2(LIBXML2_2.5.8)(64bit), libxml2.so.2(LIBXML2_2.6.0)(64bit), libxml2.so.2(LIBXML2_2.6.2)(64bit), libxml2.so.2(LIBXML2_2.6.23)(64bit), libxml2.so.2(LIBXML2_2.6.5)(64bit), libz.so.1()(64bit) >= set:khdWPIUrJuazFZ5EyqZ72, libzstd.so.1()(64bit) >= set:lhGCrGgGXRZnDtii3c8U6fr1Gkxk32, rtld(GNU_HASH)
Requires(rpmlib): rpmlib(SetVersions)
Finding debuginfo files (using /usr/lib/rpm/find-debuginfo-files)
Executing: /bin/sh -e /usr/src/tmp/rpm-tmp.LYCShF
Creating libpdal-debuginfo package
Processing files: libpdal-devel-2.6.2-alt1
warning: File listed twice: /usr/lib64/libpdal_plugin_kernel_fauxplugin.so
warning: File listed twice: /usr/lib64/libpdalcpp.so
Finding Provides (using /usr/lib/rpm/find-provides)
Executing: /bin/sh -e /usr/src/tmp/rpm-tmp.WT0yxy
find-provides: running scripts (alternatives,debuginfo,lib,pam,perl,pkgconfig,python,python3,shell)
Finding Requires (using /usr/lib/rpm/find-requires)
Executing: /bin/sh -e /usr/src/tmp/rpm-tmp.iAQwd3
find-requires: running scripts (cpp,debuginfo,files,lib,pam,perl,pkgconfig,pkgconfiglib,python,python3,rpmlib,shebang,shell,static,symlinks,systemd-services)
/usr/src/tmp/pdal-buildroot/usr/include/pdal/Log.hpp:37:10: fatal error: cassert: No such file or directory
   37 | #include <cassert>
      |          ^~~~~~~~~
compilation terminated.
cpp.req: /usr/src/tmp/pdal-buildroot/usr/include/pdal/Log.hpp: cpp failed, trying c++ mode
/usr/src/tmp/pdal-buildroot/usr/include/pdal/pdal_test_main.hpp:36:10: fatal error: gtest/gtest.h: No such file or directory
   36 | #include "gtest/gtest.h"
      |          ^~~~~~~~~~~~~~~
compilation terminated.
cpp.req: WARNING: /usr/src/tmp/pdal-buildroot/usr/include/pdal/pdal_test_main.hpp: cpp failed
In file included from /usr/src/tmp/pdal-buildroot/usr/include/pdal/io/I3SReader.hpp:36:
/usr/src/tmp/pdal-buildroot/usr/include/pdal/io/EsriReader.hpp:44:10: fatal error: arbiter/arbiter.hpp: No such file or directory
   44 | #include <arbiter/arbiter.hpp>
      |          ^~~~~~~~~~~~~~~~~~~~~
compilation terminated.
cpp.req: WARNING: /usr/src/tmp/pdal-buildroot/usr/include/pdal/io/I3SReader.hpp: cpp failed
/usr/src/tmp/pdal-buildroot/usr/include/pdal/io/PcdHeader.hpp:38:10: fatal error: Eigen/Dense: No such file or directory
   38 | #include <Eigen/Dense>
      |          ^~~~~~~~~~~~~
compilation terminated.
cpp.req: WARNING: /usr/src/tmp/pdal-buildroot/usr/include/pdal/io/PcdHeader.hpp: cpp failed
In file included from /usr/src/tmp/pdal-buildroot/usr/include/pdal/io/PcdReader.hpp:41:
/usr/src/tmp/pdal-buildroot/usr/include/pdal/io/PcdHeader.hpp:38:10: fatal error: Eigen/Dense: No such file or directory
   38 | #include <Eigen/Dense>
      |          ^~~~~~~~~~~~~
compilation terminated.
cpp.req: WARNING: /usr/src/tmp/pdal-buildroot/usr/include/pdal/io/PcdReader.hpp: cpp failed
In file included from /usr/src/tmp/pdal-buildroot/usr/include/pdal/io/PcdWriter.hpp:37:
/usr/src/tmp/pdal-buildroot/usr/include/pdal/io/PcdHeader.hpp:38:10: fatal error: Eigen/Dense: No such file or directory
   38 | #include <Eigen/Dense>
      |          ^~~~~~~~~~~~~
compilation terminated.
cpp.req: WARNING: /usr/src/tmp/pdal-buildroot/usr/include/pdal/io/PcdWriter.hpp: cpp failed
/usr/src/tmp/pdal-buildroot/usr/include/pdal/io/EsriReader.hpp:44:10: fatal error: arbiter/arbiter.hpp: No such file or directory
   44 | #include <arbiter/arbiter.hpp>
      |          ^~~~~~~~~~~~~~~~~~~~~
compilation terminated.
cpp.req: WARNING: /usr/src/tmp/pdal-buildroot/usr/include/pdal/io/EsriReader.hpp: cpp failed
In file included from /usr/src/tmp/pdal-buildroot/usr/include/pdal/io/SlpkReader.hpp:39:
/usr/src/tmp/pdal-buildroot/usr/include/pdal/io/EsriReader.hpp:44:10: fatal error: arbiter/arbiter.hpp: No such file or directory
   44 | #include <arbiter/arbiter.hpp>
      |          ^~~~~~~~~~~~~~~~~~~~~
compilation terminated.
cpp.req: WARNING: /usr/src/tmp/pdal-buildroot/usr/include/pdal/io/SlpkReader.hpp: cpp failed
/usr/src/tmp/pdal-buildroot/usr/include/pdal/io/point_types.hpp:3:10: fatal error: pcd_io.h: No such file or directory
    3 | #include "pcd_io.h"
      |          ^~~~~~~~~~
compilation terminated.
cpp.req: WARNING: /usr/src/tmp/pdal-buildroot/usr/include/pdal/io/point_types.hpp: cpp failed
/usr/src/tmp/pdal-buildroot/usr/include/pdal/io/OptechRotationMatrix.hpp:39:10: fatal error: pdal/RotationMatrix.hpp: No such file or directory
   39 | #include <pdal/RotationMatrix.hpp>
      |          ^~~~~~~~~~~~~~~~~~~~~~~~~
compilation terminated.
cpp.req: WARNING: /usr/src/tmp/pdal-buildroot/usr/include/pdal/io/OptechRotationMatrix.hpp: cpp failed
/usr/src/tmp/pdal-buildroot/usr/include/pdal/private/KDImpl.hpp:37:10: fatal error: nanoflann/nanoflann.hpp: No such file or directory
   37 | #include <nanoflann/nanoflann.hpp>
      |          ^~~~~~~~~~~~~~~~~~~~~~~~~
compilation terminated.
cpp.req: WARNING: /usr/src/tmp/pdal-buildroot/usr/include/pdal/private/KDImpl.hpp: cpp failed
/usr/src/tmp/pdal-buildroot/usr/include/pdal/private/MathUtils.hpp:45:10: fatal error: Eigen/Dense: No such file or directory
   45 | #include <Eigen/Dense>
      |          ^~~~~~~~~~~~~
compilation terminated.
cpp.req: WARNING: /usr/src/tmp/pdal-buildroot/usr/include/pdal/private/MathUtils.hpp: cpp failed
/usr/src/tmp/pdal-buildroot/usr/include/pdal/kernels/EvalKernel.hpp:40:10: fatal error: Eigen/Dense: No such file or directory
   40 | #include <Eigen/Dense>
      |          ^~~~~~~~~~~~~
compilation terminated.
cpp.req: WARNING: /usr/src/tmp/pdal-buildroot/usr/include/pdal/kernels/EvalKernel.hpp: cpp failed
In file included from /usr/src/tmp/pdal-buildroot/usr/include/pdal/kernels/InfoKernel.hpp:43:
/usr/src/tmp/pdal-buildroot/usr/include/pdal/kernels/private/PointlessLas.hpp:40:10: fatal error: arbiter/arbiter.hpp: No such file or directory
   40 | #include "arbiter/arbiter.hpp"
      |          ^~~~~~~~~~~~~~~~~~~~~
compilation terminated.
cpp.req: WARNING: /usr/src/tmp/pdal-buildroot/usr/include/pdal/kernels/InfoKernel.hpp: cpp failed
/usr/src/tmp/pdal-buildroot/usr/include/pdal/filters/PlaneFitFilter.hpp:39:10: fatal error: Eigen/Dense: No such file or directory
   39 | #include <Eigen/Dense>
      |          ^~~~~~~~~~~~~
compilation terminated.
cpp.req: WARNING: /usr/src/tmp/pdal-buildroot/usr/include/pdal/filters/PlaneFitFilter.hpp: cpp failed
/usr/src/tmp/pdal-buildroot/usr/include/pdal/filters/GreedyProjection.hpp:47:10: fatal error: Eigen/Dense: No such file or directory
   47 | #include <Eigen/Dense>
      |          ^~~~~~~~~~~~~
compilation terminated.
cpp.req: WARNING: /usr/src/tmp/pdal-buildroot/usr/include/pdal/filters/GreedyProjection.hpp: cpp failed
In file included from /usr/src/tmp/pdal-buildroot/usr/include/pdal/io/private/ept/Artifact.hpp:40:
/usr/src/tmp/pdal-buildroot/usr/include/pdal/io/private/ept/../connector/Connector.hpp:37:10: fatal error: arbiter/arbiter.hpp: No such file or directory
   37 | #include <arbiter/arbiter.hpp>
      |          ^~~~~~~~~~~~~~~~~~~~~
compilation terminated.
cpp.req: WARNING: /usr/src/tmp/pdal-buildroot/usr/include/pdal/io/private/ept/Artifact.hpp: cpp failed
/usr/src/tmp/pdal-buildroot/usr/include/pdal/io/private/ept/EptSupport.hpp:37:10: fatal error: nlohmann/json.hpp: No such file or directory
   37 | #include <nlohmann/json.hpp>
      |          ^~~~~~~~~~~~~~~~~~~
compilation terminated.
cpp.req: WARNING: /usr/src/tmp/pdal-buildroot/usr/include/pdal/io/private/ept/EptSupport.hpp: cpp failed
/usr/src/tmp/pdal-buildroot/usr/include/pdal/io/private/esri/Obb.hpp:37:10: fatal error: Eigen/Geometry: No such file or directory
   37 | #include <Eigen/Geometry>
      |          ^~~~~~~~~~~~~~~~
compilation terminated.
cpp.req: WARNING: /usr/src/tmp/pdal-buildroot/usr/include/pdal/io/private/esri/Obb.hpp: cpp failed
In file included from /usr/src/tmp/pdal-buildroot/usr/include/pdal/io/private/stac/Item.hpp:43:
/usr/src/tmp/pdal-buildroot/usr/include/pdal/io/private/stac/Utils.hpp:38:10: fatal error: arbiter/arbiter.hpp: No such file or directory
   38 | #include <arbiter/arbiter.hpp>
      |          ^~~~~~~~~~~~~~~~~~~~~
compilation terminated.
cpp.req: WARNING: /usr/src/tmp/pdal-buildroot/usr/include/pdal/io/private/stac/Item.hpp: cpp failed
/usr/src/tmp/pdal-buildroot/usr/include/pdal/io/private/stac/Utils.hpp:38:10: fatal error: arbiter/arbiter.hpp: No such file or directory
   38 | #include <arbiter/arbiter.hpp>
      |          ^~~~~~~~~~~~~~~~~~~~~
compilation terminated.
cpp.req: WARNING: /usr/src/tmp/pdal-buildroot/usr/include/pdal/io/private/stac/Utils.hpp: cpp failed
In file included from /usr/src/tmp/pdal-buildroot/usr/include/pdal/io/private/stac/Catalog.hpp:40:
/usr/src/tmp/pdal-buildroot/usr/include/pdal/io/private/stac/../connector/Connector.hpp:37:10: fatal error: arbiter/arbiter.hpp: No such file or directory
   37 | #include <arbiter/arbiter.hpp>
      |          ^~~~~~~~~~~~~~~~~~~~~
compilation terminated.
cpp.req: WARNING: /usr/src/tmp/pdal-buildroot/usr/include/pdal/io/private/stac/Catalog.hpp: cpp failed
In file included from /usr/src/tmp/pdal-buildroot/usr/include/pdal/io/private/stac/Catalog.hpp:40,
                 from /usr/src/tmp/pdal-buildroot/usr/include/pdal/io/private/stac/Collection.hpp:40:
/usr/src/tmp/pdal-buildroot/usr/include/pdal/io/private/stac/../connector/Connector.hpp:37:10: fatal error: arbiter/arbiter.hpp: No such file or directory
   37 | #include <arbiter/arbiter.hpp>
      |          ^~~~~~~~~~~~~~~~~~~~~
compilation terminated.
cpp.req: WARNING: /usr/src/tmp/pdal-buildroot/usr/include/pdal/io/private/stac/Collection.hpp: cpp failed
/usr/src/tmp/pdal-buildroot/usr/include/pdal/kernels/private/PointlessLas.hpp:40:10: fatal error: arbiter/arbiter.hpp: No such file or directory
   40 | #include "arbiter/arbiter.hpp"
      |          ^~~~~~~~~~~~~~~~~~~~~
compilation terminated.
cpp.req: WARNING: /usr/src/tmp/pdal-buildroot/usr/include/pdal/kernels/private/PointlessLas.hpp: cpp failed
In file included from /usr/src/tmp/pdal-buildroot/usr/include/pdal/io/private/stac/Item.hpp:43,
                 from /usr/src/tmp/pdal-buildroot/usr/include/pdal/io/private/stac/ItemCollection.hpp:37:
/usr/src/tmp/pdal-buildroot/usr/include/pdal/io/private/stac/Utils.hpp:38:10: fatal error: arbiter/arbiter.hpp: No such file or directory
   38 | #include <arbiter/arbiter.hpp>
      |          ^~~~~~~~~~~~~~~~~~~~~
compilation terminated.
cpp.req: WARNING: /usr/src/tmp/pdal-buildroot/usr/include/pdal/io/private/stac/ItemCollection.hpp: cpp failed
/usr/src/tmp/pdal-buildroot/usr/include/pdal/io/private/connector/Connector.hpp:37:10: fatal error: arbiter/arbiter.hpp: No such file or directory
   37 | #include <arbiter/arbiter.hpp>
      |          ^~~~~~~~~~~~~~~~~~~~~
compilation terminated.
cpp.req: WARNING: /usr/src/tmp/pdal-buildroot/usr/include/pdal/io/private/connector/Connector.hpp: cpp failed
/usr/src/tmp/pdal-buildroot/usr/include/pdal/io/private/copcwriter/Common.hpp:55:10: fatal error: lazperf/vlr.hpp: No such file or directory
   55 | #include <lazperf/vlr.hpp>
      |          ^~~~~~~~~~~~~~~~~
compilation terminated.
cpp.req: WARNING: /usr/src/tmp/pdal-buildroot/usr/include/pdal/io/private/copcwriter/Common.hpp: cpp failed
In file included from /usr/src/tmp/pdal-buildroot/usr/include/pdal/io/private/copcwriter/Output.hpp:39:
/usr/src/tmp/pdal-buildroot/usr/include/pdal/io/private/copcwriter/Common.hpp:55:10: fatal error: lazperf/vlr.hpp: No such file or directory
   55 | #include <lazperf/vlr.hpp>
      |          ^~~~~~~~~~~~~~~~~
compilation terminated.
cpp.req: WARNING: /usr/src/tmp/pdal-buildroot/usr/include/pdal/io/private/copcwriter/Output.hpp: cpp failed
In file included from /usr/src/tmp/pdal-buildroot/usr/include/pdal/io/private/copcwriter/BuPyramid.hpp:43:
/usr/src/tmp/pdal-buildroot/usr/include/pdal/io/private/copcwriter/Common.hpp:55:10: fatal error: lazperf/vlr.hpp: No such file or directory
   55 | #include <lazperf/vlr.hpp>
      |          ^~~~~~~~~~~~~~~~~
compilation terminated.
cpp.req: WARNING: /usr/src/tmp/pdal-buildroot/usr/include/pdal/io/private/copcwriter/BuPyramid.hpp: cpp failed
In file included from /usr/src/tmp/pdal-buildroot/usr/include/pdal/io/private/copcwriter/Processor.hpp:39:
/usr/src/tmp/pdal-buildroot/usr/include/pdal/io/private/copcwriter/Common.hpp:55:10: fatal error: lazperf/vlr.hpp: No such file or directory
   55 | #include <lazperf/vlr.hpp>
      |          ^~~~~~~~~~~~~~~~~
compilation terminated.
cpp.req: WARNING: /usr/src/tmp/pdal-buildroot/usr/include/pdal/io/private/copcwriter/Processor.hpp: cpp failed
In file included from /usr/src/tmp/pdal-buildroot/usr/include/pdal/io/private/copcwriter/PyramidManager.hpp:44:
/usr/src/tmp/pdal-buildroot/usr/include/pdal/io/private/copcwriter/Common.hpp:55:10: fatal error: lazperf/vlr.hpp: No such file or directory
   55 | #include <lazperf/vlr.hpp>
      |          ^~~~~~~~~~~~~~~~~
compilation terminated.
cpp.req: WARNING: /usr/src/tmp/pdal-buildroot/usr/include/pdal/io/private/copcwriter/PyramidManager.hpp: cpp failed
/usr/src/tmp/pdal-buildroot/usr/include/pdal/filters/private/straighten/Utils.hpp:35:10: fatal error: Eigen/Dense: No such file or directory
   35 | #include <Eigen/Dense>
      |          ^~~~~~~~~~~~~
compilation terminated.
cpp.req: WARNING: /usr/src/tmp/pdal-buildroot/usr/include/pdal/filters/private/straighten/Utils.hpp: cpp failed
/usr/src/tmp/pdal-buildroot/usr/include/pdal/filters/private/georeference/Utils.hpp:37:10: fatal error: Eigen/Dense: No such file or directory
   37 | #include <Eigen/Dense>
      |          ^~~~~~~~~~~~~
compilation terminated.
cpp.req: WARNING: /usr/src/tmp/pdal-buildroot/usr/include/pdal/filters/private/georeference/Utils.hpp: cpp failed
/usr/src/tmp/pdal-buildroot/usr/include/pdal/filters/private/georeference/Trajectory.hpp:36:10: fatal error: nlohmann/json.hpp: No such file or directory
   36 | #include <nlohmann/json.hpp>
      |          ^~~~~~~~~~~~~~~~~~~
compilation terminated.
cpp.req: WARNING: /usr/src/tmp/pdal-buildroot/usr/include/pdal/filters/private/georeference/Trajectory.hpp: cpp failed
/usr/src/tmp/pdal-buildroot/usr/include/pdal/filters/private/mongoexpression/Comparison.hpp:39:10: fatal error: nlohmann/json.hpp: No such file or directory
   39 | #include <nlohmann/json.hpp>
      |          ^~~~~~~~~~~~~~~~~~~
compilation terminated.
cpp.req: WARNING: /usr/src/tmp/pdal-buildroot/usr/include/pdal/filters/private/mongoexpression/Comparison.hpp: cpp failed
In file included from /usr/src/tmp/pdal-buildroot/usr/include/pdal/filters/private/mongoexpression/Expression.hpp:37:
/usr/src/tmp/pdal-buildroot/usr/include/pdal/filters/private/mongoexpression/Comparison.hpp:39:10: fatal error: nlohmann/json.hpp: No such file or directory
   39 | #include <nlohmann/json.hpp>
      |          ^~~~~~~~~~~~~~~~~~~
compilation terminated.
cpp.req: WARNING: /usr/src/tmp/pdal-buildroot/usr/include/pdal/filters/private/mongoexpression/Expression.hpp: cpp failed
find-requires: FINDPACKAGE-COMMANDS: cat
Provides: pkgconfig(pdal) = 2.6.2
Requires: /bin/sh, /usr/lib64/libpdal_plugin_kernel_fauxplugin.so.16, /usr/lib64/libpdalcpp.so.16, /usr/lib64/pkgconfig, coreutils, libgdal-devel, libproj-devel, libxml2-devel, pkgconfig(gdal), pkgconfig(libxml-2.0), zlib-devel
Finding debuginfo files (using /usr/lib/rpm/find-debuginfo-files)
Executing: /bin/sh -e /usr/src/tmp/rpm-tmp.E1l4PD
Processing files: pdal-debuginfo-2.6.2-alt1
Finding Provides (using /usr/lib/rpm/find-provides)
Executing: /bin/sh -e /usr/src/tmp/rpm-tmp.j4fol2
find-provides: running scripts (debuginfo)
Finding Requires (using /usr/lib/rpm/find-requires)
Executing: /bin/sh -e /usr/src/tmp/rpm-tmp.YV4Ud1
find-requires: running scripts (debuginfo)
Requires: pdal = 2.6.2-alt1, /usr/lib/debug/lib64/ld-linux-x86-64.so.2.debug, debug64(libc.so.6), debug64(libgcc_s.so.1), debug64(libpdalcpp.so.16), debug64(libstdc++.so.6)
Processing files: libpdal-debuginfo-2.6.2-alt1
Finding Provides (using /usr/lib/rpm/find-provides)
Executing: /bin/sh -e /usr/src/tmp/rpm-tmp.OW0MJN
find-provides: running scripts (debuginfo)
Finding Requires (using /usr/lib/rpm/find-requires)
Executing: /bin/sh -e /usr/src/tmp/rpm-tmp.NNtI03
find-requires: running scripts (debuginfo)
Provides: debug64(libpdal_plugin_kernel_fauxplugin.so.16), debug64(libpdalcpp.so.16)
Requires: libpdal = 2.6.2-alt1, debug64(ld-linux-x86-64.so.2), debug64(libc.so.6), debug64(libcrypto.so.3), debug64(libcurl.so.4), debug64(libgcc_s.so.1), debug64(libgdal.so.34), debug64(libgeotiff.so.5), debug64(libm.so.6), debug64(libproj.so.25), debug64(libstdc++.so.6), debug64(libunwind.so.8), debug64(libxml2.so.2), debug64(libz.so.1), debug64(libzstd.so.1)
Adding to pdal-debuginfo a strict dependency on pdal
Adding to libpdal-debuginfo a strict dependency on libpdal
Adding to pdal a strict dependency on libpdal
Adding to libpdal-devel a strict dependency on libpdal
Adding to pdal-debuginfo a strict dependency on libpdal-debuginfo
Removing from pdal-debuginfo 20 sources provided by libpdal-debuginfo
also prunning dir /usr/src/debug/PDAL-2.6.2/pdal/private/gdal
also prunning dir /usr/src/debug/PDAL-2.6.2/pdal/util
also prunning dir /usr/src/debug/PDAL-2.6.2/vendor/nlohmann/nlohmann
also prunning dir /usr/src/debug/PDAL-2.6.2/x86_64-alt-linux/include/pdal
also prunning dir /usr/src/debug/PDAL-2.6.2/pdal/private
also prunning dir /usr/src/debug/PDAL-2.6.2/vendor/nlohmann
also prunning dir /usr/src/debug/PDAL-2.6.2/x86_64-alt-linux/include
also prunning dir /usr/src/debug/PDAL-2.6.2/pdal
also prunning dir /usr/src/debug/PDAL-2.6.2/vendor
also prunning dir /usr/src/debug/PDAL-2.6.2/x86_64-alt-linux
Removing 2 extra deps from pdal due to dependency on libpdal
Removing 2 extra deps from libpdal-devel due to dependency on libpdal
Removing 1 extra deps from pdal-debuginfo due to dependency on libpdal-debuginfo
Removing 22 extra deps from pdal due to repentancy on libpdal
Removing 3 extra deps from pdal-debuginfo due to repentancy on libpdal-debuginfo
Wrote: /usr/src/RPM/RPMS/x86_64/pdal-2.6.2-alt1.x86_64.rpm (w2.lzdio)
Wrote: /usr/src/RPM/RPMS/x86_64/libpdal-2.6.2-alt1.x86_64.rpm (w2.lzdio)
Wrote: /usr/src/RPM/RPMS/x86_64/libpdal-devel-2.6.2-alt1.x86_64.rpm (w2.lzdio)
Wrote: /usr/src/RPM/RPMS/x86_64/pdal-debuginfo-2.6.2-alt1.x86_64.rpm (w2.lzdio)
Wrote: /usr/src/RPM/RPMS/x86_64/libpdal-debuginfo-2.6.2-alt1.x86_64.rpm (w2T16.xzdio)
1163.56user 94.47system 2:37.18elapsed 800%CPU (0avgtext+0avgdata 1087936maxresident)k
0inputs+0outputs (0major+26765660minor)pagefaults 0swaps
4.26user 1.91system 2:57.13elapsed 3%CPU (0avgtext+0avgdata 128856maxresident)k
9904inputs+0outputs (0major+337930minor)pagefaults 0swaps
--- libpdal-2.6.2-alt1.x86_64.rpm.repo	2023-12-12 02:49:20.000000000 +0000
+++ libpdal-2.6.2-alt1.x86_64.rpm.hasher	2024-01-12 03:19:30.596564494 +0000
@@ -67,3 +67,3 @@
 File: /usr/lib64/libpdalcpp.so.16	120777	root:root		libpdalcpp.so.16.2.0
-File: /usr/lib64/libpdalcpp.so.16.2.0	100644	root:root	39c6a7087c8cda241e837a251398d7b7	
-RPMIdentity: 4283657ee071e84f2c4b603696d2fa3786514e4ae0701fb3af9b81197262608dd5d8ad21a009ef0fd204e3eb0508e59d90697eb7180fde22253951018a0ae330
+File: /usr/lib64/libpdalcpp.so.16.2.0	100644	root:root	9b51f879bc024540c7b144d1cc51009f	
+RPMIdentity: 8acbf269f971517893f1ccb257186fa49f98de816cd6aa700e55af0749e6ec9da8cab0a3cc2a1bb0063688a31cf6f0f44d2eeefe6bf5d44decec49eac658f2e6
--- libpdal-debuginfo-2.6.2-alt1.x86_64.rpm.repo	2023-12-12 02:49:21.000000000 +0000
+++ libpdal-debuginfo-2.6.2-alt1.x86_64.rpm.hasher	2024-01-12 03:19:30.671565986 +0000
@@ -3,5 +3,5 @@
 /usr/lib/debug/.build-id/50/9761db661568c0744e7a7942cd0e360049bb9c.debug	120777	root:root	../../usr/lib64/libpdal_plugin_kernel_fauxplugin.so.16.2.0.debug
-/usr/lib/debug/.build-id/ad	40755	root:root	
-/usr/lib/debug/.build-id/ad/b227626798ac690d9aba85c365de61f0ba2752	120777	root:root	../../../../lib64/libpdalcpp.so.16.2.0
-/usr/lib/debug/.build-id/ad/b227626798ac690d9aba85c365de61f0ba2752.debug	120777	root:root	../../usr/lib64/libpdalcpp.so.16.2.0.debug
+/usr/lib/debug/.build-id/93	40755	root:root	
+/usr/lib/debug/.build-id/93/037dde4f33fd1c820373b402cb5b3eab0b0e81	120777	root:root	../../../../lib64/libpdalcpp.so.16.2.0
+/usr/lib/debug/.build-id/93/037dde4f33fd1c820373b402cb5b3eab0b0e81.debug	120777	root:root	../../usr/lib64/libpdalcpp.so.16.2.0.debug
 /usr/lib/debug/usr/lib64/libpdal_plugin_kernel_fauxplugin.so.16.2.0.debug	100644	root:root	
@@ -918,8 +918,8 @@
 File: /usr/lib/debug/.build-id/50/9761db661568c0744e7a7942cd0e360049bb9c.debug	120777	root:root		../../usr/lib64/libpdal_plugin_kernel_fauxplugin.so.16.2.0.debug
-File: /usr/lib/debug/.build-id/ad	40755	root:root		
-File: /usr/lib/debug/.build-id/ad/b227626798ac690d9aba85c365de61f0ba2752	120777	root:root		../../../../lib64/libpdalcpp.so.16.2.0
-File: /usr/lib/debug/.build-id/ad/b227626798ac690d9aba85c365de61f0ba2752.debug	120777	root:root		../../usr/lib64/libpdalcpp.so.16.2.0.debug
+File: /usr/lib/debug/.build-id/93	40755	root:root		
+File: /usr/lib/debug/.build-id/93/037dde4f33fd1c820373b402cb5b3eab0b0e81	120777	root:root		../../../../lib64/libpdalcpp.so.16.2.0
+File: /usr/lib/debug/.build-id/93/037dde4f33fd1c820373b402cb5b3eab0b0e81.debug	120777	root:root		../../usr/lib64/libpdalcpp.so.16.2.0.debug
 File: /usr/lib/debug/usr/lib64/libpdal_plugin_kernel_fauxplugin.so.16.2.0.debug	100644	root:root	54a48a1b615bfeb6e93278bee4baa344	
 File: /usr/lib/debug/usr/lib64/libpdal_plugin_kernel_fauxplugin.so.16.debug	120777	root:root		libpdal_plugin_kernel_fauxplugin.so.16.2.0.debug
-File: /usr/lib/debug/usr/lib64/libpdalcpp.so.16.2.0.debug	100644	root:root	b4c27daeb0aa74348aaac4ce62eb2932	
+File: /usr/lib/debug/usr/lib64/libpdalcpp.so.16.2.0.debug	100644	root:root	b6209c645bf81bc72033dbdc42db385a	
 File: /usr/lib/debug/usr/lib64/libpdalcpp.so.16.debug	120777	root:root		libpdalcpp.so.16.2.0.debug
@@ -1811,2 +1811,2 @@
 File: /usr/src/debug/PDAL-2.6.2/x86_64-alt-linux/include/pdal/pdal_features.hpp	100644	root:root	621ba6dccd74fdedd7bc50c647fb964f	
-RPMIdentity: cb789f4e5dbc772ee01cc1b36adba715a8418cf8c56c3a178e76eb1f88d6cbc6afe55201c0f413a416c6d3c22a96a1336e30ddf61cc2acc86b3b84c98581a7e7
+RPMIdentity: 585b4379d9c07abcf1f9fc20c1e3e5187395333c1aaac36af1fdb1c1cdef2bc1aa3c52d88036df8c378c9f6b4b68ea5c8d88337e38f8e0321ef1f075a24b42fd