<86>Sep 19 03:01:24 userdel[294186]: delete user 'rooter'
<86>Sep 19 03:01:24 userdel[294186]: removed group 'rooter' owned by 'rooter'
<86>Sep 19 03:01:24 userdel[294186]: removed shadow group 'rooter' owned by 'rooter'
<86>Sep 19 03:01:24 groupadd[294208]: group added to /etc/group: name=rooter, GID=1790
<86>Sep 19 03:01:24 groupadd[294208]: group added to /etc/gshadow: name=rooter
<86>Sep 19 03:01:24 groupadd[294208]: new group: name=rooter, GID=1790
<86>Sep 19 03:01:24 useradd[294232]: new user: name=rooter, UID=1790, GID=1790, home=/root, shell=/bin/bash, from=none
<86>Sep 19 03:01:24 userdel[294267]: delete user 'builder'
<86>Sep 19 03:01:24 userdel[294267]: removed group 'builder' owned by 'builder'
<86>Sep 19 03:01:24 groupadd[294288]: group added to /etc/group: name=builder, GID=1791
<86>Sep 19 03:01:24 groupadd[294288]: group added to /etc/gshadow: name=builder
<86>Sep 19 03:01:24 groupadd[294288]: new group: name=builder, GID=1791
<86>Sep 19 03:01:24 useradd[294310]: new user: name=builder, UID=1791, GID=1791, home=/usr/src, shell=/bin/bash, from=none
<13>Sep 19 03:01:29 rpmi: libidn2-2.3.4-alt1 sisyphus+309023.100.1.1 1666791084 installed
<13>Sep 19 03:01:29 rpmi: libnettle8-3.9.1-alt1 sisyphus+322548.100.1.2 1686176879 installed
<13>Sep 19 03:01:29 rpmi: libp11-kit-1:0.24.1-alt2 sisyphus+324666.100.1.1 1689083439 installed
<13>Sep 19 03:01:29 rpmi: libtasn1-4.19.0-alt3 sisyphus+327816.100.1.1 1692802615 installed
<13>Sep 19 03:01:29 rpmi: libhogweed6-3.9.1-alt1 sisyphus+322548.100.1.2 1686176879 installed
<13>Sep 19 03:01:30 rpmi: libgnutls30-3.8.1-alt2 sisyphus+326772.40.3.1 1692114175 installed
<13>Sep 19 03:01:30 rpmi: libngtcp2.13-0.16.0-alt1 sisyphus+323677.40.3.1 1687690555 installed
<13>Sep 19 03:01:30 rpmi: libngtcp2_crypto_gnutls5-0.16.0-alt1 sisyphus+323677.40.3.1 1687690555 installed
<13>Sep 19 03:01:30 rpmi: rpm-macros-ninja-build-1.11.1-alt2 sisyphus+327335.100.1.1 1692285423 installed
<13>Sep 19 03:01:30 rpmi: ninja-build-1.11.1-alt2 sisyphus+327335.100.1.1 1692285423 installed
<13>Sep 19 03:01:30 rpmi: rpm-macros-cmake-3.27.1-alt1 sisyphus+328181.200.1.1 1693320941 installed
<13>Sep 19 03:01:30 rpmi: cmake-modules-3.27.1-alt1 sisyphus+328181.200.1.1 1693320941 installed
<13>Sep 19 03:01:30 rpmi: libuv-1.46.0-alt1 sisyphus+326001.100.1.1 1690655254 installed
<13>Sep 19 03:01:30 rpmi: librhash-1.3.5-alt3 sisyphus+286141.40.2.1 1632982456 installed
<13>Sep 19 03:01:30 rpmi: libjsoncpp24-1.9.4-alt2 sisyphus+286441.100.1.1 1633444232 installed
<13>Sep 19 03:01:30 rpmi: libexpat-2.5.0-alt1 sisyphus+309227.100.1.1 1667075764 installed
<13>Sep 19 03:01:30 rpmi: publicsuffix-list-dafsa-20230701-alt1 sisyphus+324303.100.1.1 1688561153 installed
<13>Sep 19 03:01:30 rpmi: libpsl-0.21.2-alt1 sisyphus+312536.100.1.1 1672131178 installed
<13>Sep 19 03:01:30 rpmi: libnghttp3.7-0.12.0-alt1 sisyphus+323677.20.3.1 1687690506 installed
<13>Sep 19 03:01:30 rpmi: libnghttp2-1.54.0-alt1 sisyphus+324359.10000.11.1 1689368798 installed
<13>Sep 19 03:01:30 rpmi: openldap-common-2.6.4-alt1 sisyphus+324359.600.5.1 1689262595 installed
<13>Sep 19 03:01:30 rpmi: libntlm-1.5-alt1 sisyphus+278100.3300.1.1 1626058899 installed
<13>Sep 19 03:01:30 rpmi: libidn-1.37-alt2 sisyphus+300849.100.1.1 1653769687 installed
<13>Sep 19 03:01:30 rpmi: libverto-0.3.2-alt1_1 sisyphus+321176.2200.10.2 1684803947 installed
<13>Sep 19 03:01:30 rpmi: liblmdb-0.9.29-alt1.1 sisyphus+306630.100.1.1 1663072360 installed
<13>Sep 19 03:01:30 rpmi: libkeyutils-1.6.3-alt1 sisyphus+266061.100.1.1 1612919566 installed
<13>Sep 19 03:01:30 rpmi: libcom_err-1.46.4.0.5.4cda-alt1 sisyphus+283826.100.1.1 1629975345 installed
<13>Sep 19 03:01:30 rpmi: libbrotlicommon-1.1.0-alt1 sisyphus+328501.100.1.1 1693598419 installed
<13>Sep 19 03:01:30 rpmi: libbrotlidec-1.1.0-alt1 sisyphus+328501.100.1.1 1693598419 installed
<13>Sep 19 03:01:30 rpmi: rpm-macros-alternatives-0.5.2-alt2 sisyphus+315270.200.2.1 1676457367 installed
<13>Sep 19 03:01:30 rpmi: alternatives-0.5.2-alt2 sisyphus+315270.200.2.1 1676457367 installed
<13>Sep 19 03:01:30 rpmi: ca-certificates-2023.07.31-alt1 sisyphus+326137.200.1.1 1690809798 installed
<13>Sep 19 03:01:30 rpmi: ca-trust-0.1.4-alt1 sisyphus+308690.100.1.1 1666182992 installed
<13>Sep 19 03:01:30 rpmi: p11-kit-trust-1:0.24.1-alt2 sisyphus+324666.100.1.1 1689083439 installed
<13>Sep 19 03:01:30 rpmi: libcrypto3-3.1.2-alt1 sisyphus+326244.100.1.1 1690906741 installed
<13>Sep 19 03:01:30 rpmi: libssl3-3.1.2-alt1 sisyphus+326244.100.1.1 1690906741 installed
<86>Sep 19 03:01:30 groupadd[315801]: group added to /etc/group: name=_keytab, GID=999
<86>Sep 19 03:01:30 groupadd[315801]: group added to /etc/gshadow: name=_keytab
<86>Sep 19 03:01:30 groupadd[315801]: new group: name=_keytab, GID=999
<13>Sep 19 03:01:30 rpmi: libkrb5-1.21.2-alt1 sisyphus+327265.100.1.1 1692185462 installed
<13>Sep 19 03:01:30 rpmi: libgsasl-1.8.0-alt3 sisyphus+275307.100.1.2 1624478543 installed
<86>Sep 19 03:01:30 groupadd[316137]: group added to /etc/group: name=sasl, GID=998
<86>Sep 19 03:01:30 groupadd[316137]: group added to /etc/gshadow: name=sasl
<86>Sep 19 03:01:30 groupadd[316137]: new group: name=sasl, GID=998
<13>Sep 19 03:01:30 rpmi: libsasl2-3-2.1.27-alt2.2 sisyphus+324359.6000.12.1 1689392001 installed
<13>Sep 19 03:01:30 rpmi: libldap2-2.6.4-alt1 sisyphus+324359.600.5.1 1689262595 installed
<13>Sep 19 03:01:30 rpmi: libarchive13-3.6.1-alt2 sisyphus+324359.1300.6.1 1689326379 installed
<13>Sep 19 03:01:30 rpmi: libssh2-1.11.0-alt1 sisyphus+327652.100.1.1 1692636577 installed
<13>Sep 19 03:01:30 rpmi: libcurl-8.3.0-alt1 sisyphus+329453.400.5.1 1694962561 installed
<13>Sep 19 03:01:30 rpmi: cmake-3.27.1-alt1 sisyphus+328181.200.1.1 1693320941 installed
<13>Sep 19 03:01:30 rpmi: rpm-build-ninja-1.11.1-alt2 sisyphus+327335.100.1.1 1692285423 installed
<13>Sep 19 03:01:32 rpmi: libpng16-1.6.40-alt1 sisyphus+323732.100.1.1 1687771851 installed
<13>Sep 19 03:01:32 rpmi: libjpeg-2:2.1.2-alt1.2 sisyphus+300827.100.2.1 1653916633 installed
<13>Sep 19 03:01:32 rpmi: libsqlite3-3.42.0-alt1 sisyphus+321513.100.1.1 1684602997 installed
<13>Sep 19 03:01:32 rpmi: libopenjpeg2.0-2.5.0-alt1 sisyphus+299926.300.3.1 1652478843 installed
<13>Sep 19 03:01:32 rpmi: libhdf5-103-1.10.6-alt2 sisyphus+271925.100.1.1 1621108446 installed
<13>Sep 19 03:01:32 rpmi: libwebp7-1.3.2-alt1 sisyphus+329541.100.1.1 1694676223 installed
<13>Sep 19 03:01:32 rpmi: libgeos-3.12.0-alt1 sisyphus+323865.100.1.1 1688017707 installed
<13>Sep 19 03:01:32 rpmi: libnspr-1:4.35-alt1 sisyphus+308164.100.1.1 1665397040 installed
<13>Sep 19 03:01:32 rpmi: libgif-4.1.6-alt3 sisyphus+276911.100.1.3 1625273979 installed
<13>Sep 19 03:01:32 rpmi: zlib-devel-1.2.13-alt1 sisyphus+309409.200.2.1 1667402043 installed
<13>Sep 19 03:01:32 rpmi: freexl-1.0.6-alt1_1 sisyphus+278482.100.1.1 1626104060 installed
<13>Sep 19 03:01:32 rpmi: libnss-3.92.0-alt1 sisyphus+326137.140.2.1 1690821390 installed
<13>Sep 19 03:01:32 rpmi: librttopo-1.1.0-alt1 sisyphus+288384.100.1.1 1635558056 installed
<13>Sep 19 03:01:32 rpmi: libhdf5-hl-100-1.10.6-alt2 sisyphus+271925.100.1.1 1621108446 installed
<13>Sep 19 03:01:32 rpmi: libnetcdf19-4.8.0-alt1 sisyphus+279368.100.1.2 1626522047 installed
<13>Sep 19 03:01:32 rpmi: libunwind-1.6.2-alt1 sisyphus+295035.100.1.1 1644339139 installed
<13>Sep 19 03:01:32 rpmi: libncurses6-6.3.20220618-alt4 sisyphus+328055.40.2.1 1693212977 installed
<13>Sep 19 03:01:32 rpmi: libtinfo-devel-6.3.20220618-alt4 sisyphus+328055.40.2.1 1693212977 installed
<13>Sep 19 03:01:32 rpmi: libncurses-devel-6.3.20220618-alt4 sisyphus+328055.40.2.1 1693212977 installed
<13>Sep 19 03:01:32 rpmi: libmpdec3-2.5.1-alt3 sisyphus+314490.500.5.1 1675432004 installed
<13>Sep 19 03:01:32 rpmi: libgdbm-1.8.3-alt10 sisyphus+278100.1600.1.1 1626058413 installed
<13>Sep 19 03:01:32 rpmi: libxerces-c-3.2.4-alt1 sisyphus+312657.100.1.1 1672359207 installed
<13>Sep 19 03:01:32 rpmi: libminizip-1.2.13-alt1 sisyphus+309409.200.2.1 1667402043 installed
<13>Sep 19 03:01:32 rpmi: liblz4-1:1.9.4-alt1 sisyphus+309416.100.1.1 1667412981 installed
<13>Sep 19 03:01:32 rpmi: libqhull-2020.2-alt1 sisyphus+279488.100.1.2 1626573478 installed
<13>Sep 19 03:01:33 rpmi: libpq5-16.0-alt1 sisyphus+329622.100.1.1 1694764476 installed
<13>Sep 19 03:01:33 rpmi: liblcms2-2.15-alt1 sisyphus+316039.100.1.1 1677666328 installed
<13>Sep 19 03:01:33 rpmi: poppler-data-0.4.12-alt1 sisyphus+322151.100.1.1 1685438511 installed
<13>Sep 19 03:01:33 rpmi: libltdl7-2.4.7-alt3 sisyphus+328983.1500.12.1 1695073832 installed
<13>Sep 19 03:01:33 rpmi: libunixODBC2-2.3.11-alt1 sisyphus+325970.100.1.1 1690647363 installed
<13>Sep 19 03:01:33 rpmi: libunixODBC-devel-compat-2.3.11-alt1 sisyphus+325970.100.1.1 1690647363 installed
<13>Sep 19 03:01:33 rpmi: libunixODBC-devel-2.3.11-alt1 sisyphus+325970.100.1.1 1690647363 installed
<13>Sep 19 03:01:33 rpmi: libmysqlclient21-8.0.30-alt2 sisyphus+324359.5140.12.1 1689391661 installed
<13>Sep 19 03:01:33 rpmi: libnuma-2.0.14-alt2 sisyphus+278485.100.1.1 1626104244 installed
<13>Sep 19 03:01:33 rpmi: libx265-199-3.5-alt1.1 sisyphus+277560.100.1.1 1625697230 installed
<13>Sep 19 03:01:33 rpmi: librav1e-0.6.6-alt1 sisyphus+320651.100.1.1 1684313161 installed
<13>Sep 19 03:01:33 rpmi: desktop-file-utils-0.26-alt4 sisyphus+324226.100.1.1 1688469484 installed
<13>Sep 19 03:01:33 rpmi: shared-mime-info-2.2-alt1 sisyphus+297388.100.1.1 1648466615 installed
<13>Sep 19 03:01:33 rpmi: libgdk-pixbuf-locales-2.42.10-alt1 sisyphus+308991.100.1.1 1666721198 installed
<13>Sep 19 03:01:33 rpmi: ocl-icd-2.2.14-alt1 sisyphus+279155.100.1.3 1626458582 installed
<13>Sep 19 03:01:33 rpmi: libdeflate-1.18-alt1 sisyphus+317484.100.1.1 1679768609 installed
<13>Sep 19 03:01:33 rpmi: libtiff5-4.4.0-alt4 sisyphus+322581.100.1.2 1686180089 installed
<13>Sep 19 03:01:33 rpmi: libproj-9.2.1-alt1 sisyphus+324973.100.1.1 1689396677 installed
<13>Sep 19 03:01:33 rpmi: libgeotiff5-1.6.0-alt2 sisyphus+308658.1020.16.1 1666988306 installed
<13>Sep 19 03:01:33 rpmi: libspatialite-5.0.1-alt1 sisyphus+308658.1040.16.1 1666988358 installed
<13>Sep 19 03:01:33 rpmi: libtiff-devel-4.4.0-alt4 sisyphus+322581.100.1.2 1686180089 installed
<13>Sep 19 03:01:33 rpmi: libde265-1.0.12-alt1 sisyphus+329539.100.1.1 1694672070 installed
<13>Sep 19 03:01:33 rpmi: libdav1d-1.2.1-alt1 sisyphus+323931.100.1.1 1688113641 installed
<13>Sep 19 03:01:33 rpmi: libpixman-3:0.42.2-alt1 sisyphus+309549.100.1.1 1667649219 installed
<13>Sep 19 03:01:33 rpmi: libgraphite2-1.3.14-alt2.1 sisyphus+279571.100.1.2 1626605111 installed
<13>Sep 19 03:01:33 rpmi: libharfbuzz-8.2.0-alt1 sisyphus+329180.100.1.1 1694246966 installed
<13>Sep 19 03:01:33 rpmi: libfreetype-2.13.2-alt1 sisyphus+328677.100.1.1 1693834345 installed
<13>Sep 19 03:01:33 rpmi: libfontconfig1-2.14.2-alt8 sisyphus+328444.100.1.1 1693553402 installed
<13>Sep 19 03:01:34 rpmi: libpoppler126-23.02.0-alt1 sisyphus+325701.100.1.1 1690470643 installed
<13>Sep 19 03:01:34 rpmi: libb2-0.98.1-alt1_1 sisyphus+291614.100.1.1 1638962877 installed
<13>Sep 19 03:01:34 rpmi: python3-3.11.4-alt3 sisyphus+328191.1000.5.1 1693610531 installed
<13>Sep 19 03:01:34 rpmi: python3-base-3.11.4-alt3 sisyphus+328191.1000.5.1 1693610531 installed
<13>Sep 19 03:01:34 rpmi: libpython3-3.11.4-alt3 sisyphus+328191.1000.5.1 1693610531 installed
<13>Sep 19 03:01:34 rpmi: python3-module-py3dephell-0.1.0-alt2 sisyphus+328191.600.5.1 1693609196 installed
<13>Sep 19 03:01:34 rpmi: tests-for-installed-python3-pkgs-0.1.24-alt1 sisyphus+328191.700.5.1 1693609218 installed
<13>Sep 19 03:01:34 rpmi: rpm-build-python3-0.1.24-alt1 sisyphus+328191.700.5.1 1693609218 installed
<13>Sep 19 03:01:34 rpmi: libaom3-3.5.0-alt1 sisyphus+312085.100.1.1 1671551546 installed
<13>Sep 19 03:01:34 rpmi: libXdmcp-1.1.4-alt1 sisyphus+311188.1000.1.1 1670233857 installed
<13>Sep 19 03:01:34 rpmi: libXau-1.0.11-alt1 sisyphus+311428.100.1.1 1670577439 installed
<13>Sep 19 03:01:34 rpmi: libxcb-1.16-alt1 sisyphus+327325.200.1.1 1692276261 installed
<13>Sep 19 03:01:34 rpmi: libX11-locales-3:1.8.6-alt1 sisyphus+323114.100.1.1 1686850054 installed
<13>Sep 19 03:01:34 rpmi: libX11-3:1.8.6-alt1 sisyphus+323114.100.1.1 1686850054 installed
<13>Sep 19 03:01:34 rpmi: libXext-1.3.5-alt1 sisyphus+309285.100.1.1 1667212412 installed
<13>Sep 19 03:01:34 rpmi: libXrender-0.9.11-alt1 sisyphus+308841.100.1.1 1666436130 installed
<13>Sep 19 03:01:34 rpmi: libcairo-1:1.17.8-alt1 sisyphus+324101.100.2.1 1690287710 installed
<13>Sep 19 03:01:35 rpmi: librasterlite2-1.1.0-alt1.1 sisyphus+315672.100.1.1 1677138123 installed
<13>Sep 19 03:01:35 rpmi: libtirpc-1.3.3-alt1 sisyphus+304955.100.1.1 1659950884 installed
<13>Sep 19 03:01:35 rpmi: hdf-4.2.15-alt2 sisyphus+285206.100.2.1 1631717633 installed
<13>Sep 19 03:01:35 rpmi: gsettings-desktop-schemas-data-44.0-alt1 sisyphus+317076.300.1.1 1679344430 installed
<13>Sep 19 03:01:35 rpmi: libgio-2.78.0-alt1 sisyphus+329802.100.1.1 1694991222 installed
<13>Sep 19 03:01:35 rpmi: gsettings-desktop-schemas-44.0-alt1 sisyphus+317076.300.1.1 1679344430 installed
<13>Sep 19 03:01:35 rpmi: libgdk-pixbuf-2.42.10-alt1 sisyphus+308991.100.1.1 1666721198 installed
<13>Sep 19 03:01:35 rpmi: libheif-1.15.2-alt1.1 sisyphus+328363.100.1.1 1693460604 installed
<13>Sep 19 03:01:35 rpmi: libgdal-3.6.2-alt1.1 sisyphus+311250.102140.182.1 1686008136 installed
<13>Sep 19 03:01:35 rpmi: gcc-c++-common-1.4.27-alt1 sisyphus+278099.1300.1.1 1626028636 installed
<13>Sep 19 03:01:35 rpmi: libstdc++13-devel-13.2.1-alt2 sisyphus+327572.100.1.1 1692472816 installed
<13>Sep 19 03:01:36 rpmi: gcc13-c++-13.2.1-alt2 sisyphus+327572.100.1.1 1692472816 installed
<13>Sep 19 03:01:36 rpmi: bc-1:1.07.1-alt1 sisyphus+278100.400.1.1 1626056612 installed
<13>Sep 19 03:01:36 rpmi: libcurl-devel-8.3.0-alt1 sisyphus+329453.400.5.1 1694962561 installed
<13>Sep 19 03:01:36 rpmi: libproj-devel-9.2.1-alt1 sisyphus+324973.100.1.1 1689396677 installed
<13>Sep 19 03:01:36 rpmi: libgeotiff-devel-1.6.0-alt2 sisyphus+308658.1020.16.1 1666988306 installed
<13>Sep 19 03:01:36 rpmi: gcc-c++-13-alt1 sisyphus+323337.300.1.1 1687267966 installed
<13>Sep 19 03:01:36 rpmi: libgdal-devel-3.6.2-alt1.1 sisyphus+311250.102140.182.1 1686008136 installed
<13>Sep 19 03:01:36 rpmi: hdf-devel-4.2.15-alt2 sisyphus+285206.100.2.1 1631717633 installed
<13>Sep 19 03:01:37 rpmi: python3-dev-3.11.4-alt3 sisyphus+328191.1000.5.1 1693610531 installed
<13>Sep 19 03:01:37 rpmi: libunwind-devel-1.6.2-alt1 sisyphus+295035.100.1.1 1644339139 installed
<13>Sep 19 03:01:37 rpmi: libzstd-devel-1.5.5-alt2 sisyphus+327847.100.1.1 1692867219 installed
<13>Sep 19 03:01:37 rpmi: libxml2-devel-1:2.10.4-alt1 sisyphus+311250.4140.175.1 1685628991 installed
<13>Sep 19 03:01:37 rpmi: libssl-devel-3.1.2-alt1 sisyphus+326244.100.1.1 1690906741 installed
<13>Sep 19 03:01:37 rpmi: bash-completion-1:2.11-alt3.git.157.g59d2322e sisyphus+314768.100.1.1 1675690562 installed
Building target platforms: x86_64
Building for target x86_64
Wrote: /usr/src/in/nosrpm/pdal-2.5.6-alt2.nosrc.rpm (w1.gzdio)
Installing pdal-2.5.6-alt2.src.rpm
Building target platforms: x86_64
Building for target x86_64
Executing(%prep): /bin/sh -e /usr/src/tmp/rpm-tmp.43394
+ umask 022
+ /bin/mkdir -p /usr/src/RPM/BUILD
+ cd /usr/src/RPM/BUILD
+ cd /usr/src/RPM/BUILD
+ rm -rf PDAL-2.5.6
+ echo 'Source #0 (PDAL-2.5.6.tar):'
Source #0 (PDAL-2.5.6.tar):
+ /bin/tar -xf /usr/src/RPM/SOURCES/PDAL-2.5.6.tar
+ cd PDAL-2.5.6
+ /bin/chmod -c -Rf u+rwX,go-w .
+ exit 0
Executing(%build): /bin/sh -e /usr/src/tmp/rpm-tmp.43394
+ umask 022
+ /bin/mkdir -p /usr/src/RPM/BUILD
+ cd /usr/src/RPM/BUILD
+ cd PDAL-2.5.6
+ mkdir -p x86_64-alt-linux
+ cmake -DCMAKE_SKIP_INSTALL_RPATH:BOOL=yes '-DCMAKE_C_FLAGS:STRING=-pipe -frecord-gcc-switches -Wall -g -O2 -flto=auto' '-DCMAKE_CXX_FLAGS:STRING=-pipe -frecord-gcc-switches -Wall -g -O2 -flto=auto' '-DCMAKE_Fortran_FLAGS:STRING=-pipe -frecord-gcc-switches -Wall -g -O2 -flto=auto' -DCMAKE_INSTALL_PREFIX=/usr -DINCLUDE_INSTALL_DIR:PATH=/usr/include -DLIB_INSTALL_DIR:PATH=/usr/lib64 -DSYSCONF_INSTALL_DIR:PATH=/etc -DSHARE_INSTALL_PREFIX:PATH=/usr/share -DLIB_DESTINATION=lib64 -DLIB_SUFFIX=64 -S . -B x86_64-alt-linux -GNinja -Wno-dev -DPDAL_LIB_INSTALL_DIR=/usr/lib64
-- The CXX compiler identification is GNU 13.2.1
-- The C compiler identification is GNU 13.2.1
-- Detecting CXX compiler ABI info
-- Detecting CXX compiler ABI info - done
-- Check for working CXX compiler: /usr/bin/c++ - skipped
-- Detecting CXX compile features
-- Detecting CXX compile features - done
-- Detecting C compiler ABI info
-- Detecting C compiler ABI info - done
-- Check for working C compiler: /usr/bin/cc - skipped
-- Detecting C compile features
-- Detecting C compile features - done
-- Found GDAL: /usr/lib64/libgdal.so (found suitable version "3.6.2", minimum required is "3.0") 
-- Found GeoTIFF: /usr/lib64/libgeotiff.so  
-- Performing Test CMAKE_HAVE_LIBC_PTHREAD
-- Performing Test CMAKE_HAVE_LIBC_PTHREAD - Success
-- Found Threads: TRUE  
-- Found ZLIB: /usr/lib64/libz.so (found version "1.2.13")  
-- Found LibXml2: /usr/lib64/libxml2.so (found version "2.10.4") 
-- Found CURL: /usr/lib64/libcurl.so (found version "8.3.0")  
-- Found OpenSSL: /usr/lib64/libcrypto.so (found suitable version "3.1.2", minimum required is "1.1")  
-- Found Python: /usr/bin/python3.11 (found version "3.11.4") found components: Interpreter 
-- Could NOT find LIBEXECINFO (missing: LIBEXECINFO_LIBRARY) 
-- Found LIBUNWIND: /usr/lib64/libunwind.so  
-- The following features have been enabled:

 * Unit tests, PDAL unit tests

-- The following OPTIONAL packages have been found:

 * ZSTD
   General compression support
 * LibXml2
 * PkgConfig
 * OpenSSL (required version >= 1.1)
 * Python
 * Libunwind

-- The following REQUIRED packages have been found:

 * GDAL (required version >= 3.0)
   Provides general purpose raster, vector, and reference system support
 * GeoTIFF
 * ZLIB
   Compression support in BPF
 * CURL
 * Threads, The thread library of the system

-- The following features have been disabled:

 * Bash completion, completion for PDAL command line
 * CPD plugin, Coherent Point Drift (CPD) computes rigid or nonrigid transformations between point sets
 * Draco plugin, Read data in the draco format
 * I3S plugin, Read from a I3S server or from a SLPK file
 * Icebridge plugin, read data in the Icebridge format
 * HDF plugin, read data in the HDF format
 * Matlab plugin, write data to a .mat file
 * NITF plugin, read/write LAS data wrapped in NITF
 * OpenSceneGraph plugin, read/write OpenSceneGraph objects
 * PostgreSQL PointCloud plugin, read/write PostgreSQL PointCloud objects
 * RiVLib plugin, read data in the RXP format
 * rdblib plugin, read data in the RDB format
 * MBIO plugin, add features that depend on MBIO
 * FBX plugin, add features that depend on FBX
 * TEASER++ plugin, TEASER++ computes transformations between point sets
 * TileDB plugin, read/write data from TileDB
 * Trajectory plugin, Compute trajectory from LAS input
 * E57 plugin, read/write data to and from e57 format
 * Abseil debugging support , unit tests

-- The following OPTIONAL packages have not been found:

 * PostgreSQL
 * Libexecinfo

-- Configuring done (0.6s)
-- Generating done (0.1s)
CMake Warning:
  Manually-specified variables were not used by the project:

    CMAKE_Fortran_FLAGS
    LIB_DESTINATION
    LIB_SUFFIX
    SHARE_INSTALL_PREFIX
    SYSCONF_INSTALL_DIR


-- Build files have been written to: /usr/src/RPM/BUILD/PDAL-2.5.6/x86_64-alt-linux
+ /usr/bin/ninja -j16 -C x86_64-alt-linux
ninja: Entering directory `x86_64-alt-linux'
[1/539] Building CXX object vendor/kazhdan/CMakeFiles/pdal_kazhdan.dir/Factor.cpp.o
[2/539] Building CXX object vendor/kazhdan/CMakeFiles/pdal_kazhdan.dir/Geometry.cpp.o
[3/539] Building CXX object vendor/lazperf/CMakeFiles/pdal_lazperf.dir/charbuf.cpp.o
[4/539] Building CXX object vendor/kazhdan/CMakeFiles/pdal_kazhdan.dir/MarchingCubes.cpp.o
[5/539] Linking CXX static library usr/lib64/libpdal_kazhdan.a
[6/539] Building CXX object vendor/lazperf/CMakeFiles/pdal_lazperf.dir/detail/field_byte10.cpp.o
[7/539] Building CXX object vendor/lazperf/CMakeFiles/pdal_lazperf.dir/detail/field_byte14.cpp.o
[8/539] Building CXX object dimbuilder/CMakeFiles/dimbuilder.dir/__/pdal/util/Utils.cpp.o
[9/539] Building CXX object vendor/gtest/CMakeFiles/gtest_main.dir/src/gtest_main.cc.o
[10/539] Building CXX object vendor/lazperf/CMakeFiles/pdal_lazperf.dir/detail/field_nir14.cpp.o
[11/539] Building CXX object vendor/lazperf/CMakeFiles/pdal_lazperf.dir/detail/field_gpstime10.cpp.o
[12/539] Building CXX object vendor/lazperf/CMakeFiles/pdal_lazperf.dir/detail/field_point10.cpp.o
[13/539] Building CXX object vendor/lazperf/CMakeFiles/pdal_lazperf.dir/detail/field_point14.cpp.o
[14/539] Building CXX object vendor/lazperf/CMakeFiles/pdal_lazperf.dir/header.cpp.o
[15/539] Building CXX object vendor/lazperf/CMakeFiles/pdal_lazperf.dir/detail/field_rgb10.cpp.o
[16/539] Building CXX object vendor/lazperf/CMakeFiles/pdal_lazperf.dir/filestream.cpp.o
[17/539] Building CXX object vendor/schema-validator/CMakeFiles/pdal_json_schema.dir/json-uri.cpp.o
[18/539] Building CXX object vendor/lazperf/CMakeFiles/pdal_lazperf.dir/detail/field_rgb14.cpp.o
[19/539] Building CXX object pdal/util/CMakeFiles/pdal_util.dir/Charbuf.cpp.o
[20/539] Building CXX object vendor/lazperf/CMakeFiles/pdal_lazperf.dir/vlr.cpp.o
[21/539] Building CXX object vendor/schema-validator/CMakeFiles/pdal_json_schema.dir/json-schema-draft7.json.cpp.o
[22/539] Building CXX object pdal/util/CMakeFiles/pdal_util.dir/Georeference.cpp.o
[23/539] Building CXX object vendor/lazperf/CMakeFiles/pdal_lazperf.dir/readers.cpp.o
[24/539] Building CXX object pdal/util/CMakeFiles/pdal_util.dir/Bounds.cpp.o
[25/539] Building CXX object vendor/lazperf/CMakeFiles/pdal_lazperf.dir/lazperf.cpp.o
[26/539] Building CXX object vendor/lazperf/CMakeFiles/pdal_lazperf.dir/writers.cpp.o
[27/539] Linking CXX static library usr/lib64/libpdal_lazperf.a
[28/539] Building CXX object pdal/util/CMakeFiles/pdal_util.dir/private/BacktraceUnwind.cpp.o
/usr/src/RPM/BUILD/PDAL-2.5.6/pdal/util/private/BacktraceUnwind.cpp: In function 'pdal::Utils::BacktraceEntries pdal::Utils::backtraceImpl()':
/usr/src/RPM/BUILD/PDAL-2.5.6/pdal/util/private/BacktraceUnwind.cpp:64:11: warning: dereferencing type-punned pointer will break strict-aliasing rules [-Wstrict-aliasing]
   64 |         *(reinterpret_cast<unw_word_t *>(&entry.addr)) = val;
      |          ~^~~~~~~~~~~~~~~~~~~~~~~~~~~~~~~~~~~~~~~~~~~~
[29/539] Building CXX object vendor/schema-validator/CMakeFiles/pdal_json_schema.dir/json-patch.cpp.o
[30/539] Building CXX object pdal/util/CMakeFiles/pdal_util.dir/Random.cpp.o
[31/539] Building CXX object pdal/util/CMakeFiles/pdal_util.dir/Backtrace.cpp.o
[32/539] Building CXX object pdal/util/CMakeFiles/pdal_util.dir/Utils.cpp.o
[33/539] Building CXX object tools/lasdump/CMakeFiles/lasdump.dir/Header.cpp.o
[34/539] Building CXX object vendor/schema-validator/CMakeFiles/pdal_json_schema.dir/string-format-check.cpp.o
[35/539] Building CXX object pdal/util/CMakeFiles/pdal_util.dir/ThreadPool.cpp.o
[36/539] Building CXX object pdal/util/CMakeFiles/pdal_util.dir/FileUtils.cpp.o
[37/539] Building CXX object tools/lasdump/CMakeFiles/lasdump.dir/Dumper.cpp.o
[38/539] Building CXX object dimbuilder/CMakeFiles/dimbuilder.dir/DimBuilder.cpp.o
[39/539] Building CXX object vendor/gtest/CMakeFiles/gtest.dir/src/gtest-all.cc.o
[40/539] Linking CXX static library lib/libgtest.a
[41/539] Linking CXX static library lib/libgtest_main.a
[42/539] Linking CXX shared library usr/lib64/libpdal_util.so.15.6.0
[43/539] Creating library symlink usr/lib64/libpdal_util.so.15 usr/lib64/libpdal_util.so
[44/539] Linking CXX executable bin/dimbuilder
[45/539] Generating include/pdal/Dimension.hpp
[46/539] Building CXX object vendor/schema-validator/CMakeFiles/pdal_json_schema.dir/json-validator.cpp.o
[47/539] Building CXX object vendor/arbiter/CMakeFiles/pdal_arbiter.dir/arbiter.cpp.o
[48/539] Linking CXX executable bin/lasdump
[49/539] Building CXX object CMakeFiles/pdal_base.dir/filters/DelaunayFilter.cpp.o
[50/539] Building CXX object CMakeFiles/pdal_base.dir/filters/DecimationFilter.cpp.o
[51/539] Building CXX object CMakeFiles/pdal_base.dir/filters/ChipperFilter.cpp.o
[52/539] Building CXX object CMakeFiles/pdal_base.dir/filters/ColorizationFilter.cpp.o
[53/539] Building CXX object CMakeFiles/pdal_base.dir/filters/DBSCANFilter.cpp.o
[54/539] Building CXX object CMakeFiles/pdal_base.dir/filters/ClusterFilter.cpp.o
[55/539] Building CXX object CMakeFiles/pdal_base.dir/filters/DEMFilter.cpp.o
[56/539] Building CXX object CMakeFiles/pdal_base.dir/filters/DividerFilter.cpp.o
[57/539] Building CXX object CMakeFiles/pdal_base.dir/filters/AssignFilter.cpp.o
[58/539] Building CXX object CMakeFiles/pdal_base.dir/filters/ColorinterpFilter.cpp.o
[59/539] Building CXX object CMakeFiles/pdal_base.dir/filters/ELMFilter.cpp.o
[60/539] Building CXX object CMakeFiles/pdal_base.dir/filters/CropFilter.cpp.o
[61/539] Building CXX object CMakeFiles/pdal_base.dir/filters/CSFilter.cpp.o
[62/539] Building CXX object CMakeFiles/pdal_base.dir/filters/ApproximateCoplanarFilter.cpp.o
[63/539] Building CXX object CMakeFiles/pdal_base.dir/filters/CovarianceFeaturesFilter.cpp.o
[64/539] Building CXX object CMakeFiles/pdal_base.dir/filters/ExpressionFilter.cpp.o
[65/539] Building CXX object CMakeFiles/pdal_base.dir/filters/FarthestPointSamplingFilter.cpp.o
[66/539] Building CXX object CMakeFiles/pdal_base.dir/filters/FerryFilter.cpp.o
[67/539] Building CXX object CMakeFiles/pdal_base.dir/filters/GpsTimeConvert.cpp.o
[68/539] Building CXX object CMakeFiles/pdal_base.dir/filters/GeomDistanceFilter.cpp.o
[69/539] Building CXX object CMakeFiles/pdal_base.dir/filters/GroupByFilter.cpp.o
[70/539] Building CXX object CMakeFiles/pdal_base.dir/filters/EstimateRankFilter.cpp.o
[71/539] Building CXX object CMakeFiles/pdal_base.dir/filters/EigenvaluesFilter.cpp.o
[72/539] Building CXX object CMakeFiles/pdal_base.dir/filters/FaceRasterFilter.cpp.o
[73/539] Building CXX object CMakeFiles/pdal_base.dir/filters/HagDemFilter.cpp.o
[74/539] Building CXX object CMakeFiles/pdal_base.dir/filters/HagNnFilter.cpp.o
[75/539] Building CXX object CMakeFiles/pdal_base.dir/filters/HeadFilter.cpp.o
[76/539] Building CXX object CMakeFiles/pdal_base.dir/filters/HagDelaunayFilter.cpp.o
[77/539] Building CXX object CMakeFiles/pdal_base.dir/filters/HexBinFilter.cpp.o
[78/539] Building CXX object CMakeFiles/pdal_base.dir/filters/IQRFilter.cpp.o
[79/539] Building CXX object CMakeFiles/pdal_base.dir/filters/GreedyProjection.cpp.o
[80/539] Building CXX object CMakeFiles/pdal_base.dir/filters/InfoFilter.cpp.o
[81/539] Building CXX object CMakeFiles/pdal_base.dir/filters/LocateFilter.cpp.o
[82/539] Building CXX object CMakeFiles/pdal_base.dir/filters/LOFFilter.cpp.o
[83/539] Building CXX object CMakeFiles/pdal_base.dir/filters/LiTreeFilter.cpp.o
[84/539] Building CXX object CMakeFiles/pdal_base.dir/filters/LloydKMeansFilter.cpp.o
[85/539] Building CXX object CMakeFiles/pdal_base.dir/filters/MADFilter.cpp.o
[86/539] Building CXX object CMakeFiles/pdal_base.dir/filters/MergeFilter.cpp.o
[87/539] Building CXX object CMakeFiles/pdal_base.dir/filters/MiniballFilter.cpp.o
[88/539] Building CXX object CMakeFiles/pdal_base.dir/filters/MortonOrderFilter.cpp.o
[89/539] Building CXX object CMakeFiles/pdal_base.dir/filters/NNDistanceFilter.cpp.o
[90/539] Building CXX object CMakeFiles/pdal_base.dir/filters/NeighborClassifierFilter.cpp.o
[91/539] Building CXX object CMakeFiles/pdal_base.dir/filters/OutlierFilter.cpp.o
[92/539] Building CXX object CMakeFiles/pdal_base.dir/filters/OverlayFilter.cpp.o
[93/539] Building CXX object CMakeFiles/pdal_base.dir/filters/RadialDensityFilter.cpp.o
[94/539] Building CXX object CMakeFiles/pdal_base.dir/filters/ProjPipelineFilter.cpp.o
[95/539] Building CXX object CMakeFiles/pdal_base.dir/filters/MongoExpressionFilter.cpp.o
[96/539] Building CXX object CMakeFiles/pdal_base.dir/filters/RandomizeFilter.cpp.o
[97/539] Building CXX object CMakeFiles/pdal_base.dir/filters/OptimalNeighborhoodFilter.cpp.o
[98/539] Building CXX object CMakeFiles/pdal_base.dir/filters/ReciprocityFilter.cpp.o
[99/539] Building CXX object CMakeFiles/pdal_base.dir/filters/RangeFilter.cpp.o
[100/539] Building CXX object CMakeFiles/pdal_base.dir/filters/NormalFilter.cpp.o
[101/539] Building CXX object CMakeFiles/pdal_base.dir/filters/PMFFilter.cpp.o
[102/539] Building CXX object CMakeFiles/pdal_base.dir/filters/RelaxationDartThrowing.cpp.o
[103/539] Building CXX object CMakeFiles/pdal_base.dir/filters/PlaneFitFilter.cpp.o
[104/539] Building CXX object CMakeFiles/pdal_base.dir/filters/ReprojectionFilter.cpp.o
[105/539] Building CXX object CMakeFiles/pdal_base.dir/filters/ReturnsFilter.cpp.o
[106/539] Building CXX object CMakeFiles/pdal_base.dir/filters/SkewnessBalancingFilter.cpp.o
[107/539] Building CXX object CMakeFiles/pdal_base.dir/filters/ShellFilter.cpp.o
[108/539] Building CXX object CMakeFiles/pdal_base.dir/filters/SeparateScanLineFilter.cpp.o
[109/539] Building CXX object CMakeFiles/pdal_base.dir/filters/SampleFilter.cpp.o
[110/539] Building CXX object CMakeFiles/pdal_base.dir/filters/StreamCallbackFilter.cpp.o
[111/539] Building CXX object CMakeFiles/pdal_base.dir/filters/SortFilter.cpp.o
[112/539] Building CXX object CMakeFiles/pdal_base.dir/io/BpfCompressor.cpp.o
[113/539] Building CXX object CMakeFiles/pdal_base.dir/filters/SplitterFilter.cpp.o
[114/539] Building CXX object CMakeFiles/pdal_base.dir/filters/TailFilter.cpp.o
[115/539] Building CXX object CMakeFiles/pdal_base.dir/filters/StatsFilter.cpp.o
[116/539] Building CXX object CMakeFiles/pdal_base.dir/io/BpfHeader.cpp.o
[117/539] Building CXX object CMakeFiles/pdal_base.dir/filters/VoxelCenterNearestNeighborFilter.cpp.o
[118/539] Building CXX object CMakeFiles/pdal_base.dir/filters/PoissonFilter.cpp.o
[119/539] Building CXX object CMakeFiles/pdal_base.dir/filters/VoxelDownsizeFilter.cpp.o
[120/539] Building CXX object CMakeFiles/pdal_base.dir/filters/SMRFilter.cpp.o
[121/539] Building CXX object CMakeFiles/pdal_base.dir/filters/ZsmoothFilter.cpp.o
[122/539] Building CXX object CMakeFiles/pdal_base.dir/filters/VoxelCentroidNearestNeighborFilter.cpp.o
[123/539] Building CXX object CMakeFiles/pdal_base.dir/io/FbiHeader.cpp.o
[124/539] Building CXX object CMakeFiles/pdal_base.dir/filters/TransformationFilter.cpp.o
[125/539] Building CXX object CMakeFiles/pdal_base.dir/io/FbiReader.cpp.o
[126/539] Building CXX object CMakeFiles/pdal_base.dir/io/FauxReader.cpp.o
[127/539] Building CXX object CMakeFiles/pdal_base.dir/io/FbiWriter.cpp.o
[128/539] Building CXX object CMakeFiles/pdal_base.dir/io/Ilvis2MetadataReader.cpp.o
[129/539] Building CXX object CMakeFiles/pdal_base.dir/io/BpfReader.cpp.o
[130/539] Building CXX object CMakeFiles/pdal_base.dir/io/BpfWriter.cpp.o
[131/539] Building CXX object CMakeFiles/pdal_base.dir/io/GDALReader.cpp.o
[132/539] Building CXX object CMakeFiles/pdal_base.dir/io/CopcWriter.cpp.o
[133/539] Building CXX object CMakeFiles/pdal_base.dir/io/LasHeader.cpp.o
[134/539] Building CXX object CMakeFiles/pdal_base.dir/io/Ilvis2Reader.cpp.o
[135/539] Building CXX object CMakeFiles/pdal_base.dir/io/GDALWriter.cpp.o
[136/539] Building CXX object CMakeFiles/pdal_base.dir/io/LasVLR.cpp.o
[137/539] Building CXX object CMakeFiles/pdal_base.dir/io/EptAddonWriter.cpp.o
[138/539] Building CXX object CMakeFiles/pdal_base.dir/io/CopcReader.cpp.o
[139/539] Building CXX object CMakeFiles/pdal_base.dir/io/NullWriter.cpp.o
[140/539] Building CXX object CMakeFiles/pdal_base.dir/filters/IterativeClosestPoint.cpp.o
[141/539] Building CXX object CMakeFiles/pdal_base.dir/io/EptReader.cpp.o
[142/539] Building CXX object CMakeFiles/pdal_base.dir/io/ObjReader.cpp.o
[143/539] Building CXX object CMakeFiles/pdal_base.dir/io/GltfWriter.cpp.o
[144/539] Building CXX object CMakeFiles/pdal_base.dir/io/MemoryViewReader.cpp.o
[145/539] Building CXX object CMakeFiles/pdal_base.dir/io/PcdHeader.cpp.o
[146/539] Building CXX object CMakeFiles/pdal_base.dir/io/LasReader.cpp.o
[147/539] Building CXX object CMakeFiles/pdal_base.dir/io/OptechReader.cpp.o
[148/539] Building CXX object CMakeFiles/pdal_base.dir/io/OGRWriter.cpp.o
[149/539] Building CXX object CMakeFiles/pdal_base.dir/io/LasWriter.cpp.o
[150/539] Building CXX object CMakeFiles/pdal_base.dir/io/PtsReader.cpp.o
[151/539] Building CXX object CMakeFiles/pdal_base.dir/io/PlyReader.cpp.o
[152/539] Building CXX object CMakeFiles/pdal_base.dir/io/PcdWriter.cpp.o
[153/539] Building CXX object CMakeFiles/pdal_base.dir/io/QfitReader.cpp.o
[154/539] Building CXX object CMakeFiles/pdal_base.dir/io/PtxReader.cpp.o
[155/539] Building CXX object CMakeFiles/pdal_base.dir/io/PcdReader.cpp.o
[156/539] Building CXX object CMakeFiles/pdal_base.dir/io/SbetSmrmsgReader.cpp.o
[157/539] Building CXX object CMakeFiles/pdal_base.dir/io/PlyWriter.cpp.o
[158/539] Building CXX object CMakeFiles/pdal_base.dir/io/SbetReader.cpp.o
[159/539] Building CXX object CMakeFiles/pdal_base.dir/io/SbetWriter.cpp.o
[160/539] Building CXX object CMakeFiles/pdal_base.dir/io/TerrasolidReader.cpp.o
[161/539] Building CXX object CMakeFiles/pdal_base.dir/io/RasterWriter.cpp.o
[162/539] Building CXX object CMakeFiles/pdal_base.dir/io/TIndexReader.cpp.o
[163/539] Building CXX object CMakeFiles/pdal_base.dir/io/TextReader.cpp.o
[164/539] Building CXX object CMakeFiles/pdal_base.dir/io/TextWriter.cpp.o
[165/539] Building CXX object CMakeFiles/pdal_base.dir/kernels/ChamferKernel.cpp.o
[166/539] Building CXX object CMakeFiles/pdal_base.dir/kernels/DeltaKernel.cpp.o
[167/539] Building CXX object CMakeFiles/pdal_base.dir/kernels/DensityKernel.cpp.o
[168/539] Building CXX object CMakeFiles/pdal_base.dir/kernels/HausdorffKernel.cpp.o
[169/539] Building CXX object CMakeFiles/pdal_base.dir/kernels/GroundKernel.cpp.o
[170/539] Building CXX object CMakeFiles/pdal_base.dir/kernels/InfoKernel.cpp.o
[171/539] Building CXX object CMakeFiles/pdal_base.dir/kernels/MergeKernel.cpp.o
[172/539] Building CXX object CMakeFiles/pdal_base.dir/kernels/RandomKernel.cpp.o
[173/539] Building CXX object CMakeFiles/pdal_base.dir/kernels/SortKernel.cpp.o
[174/539] Building CXX object CMakeFiles/pdal_base.dir/pdal/ColumnPointTable.cpp.o
[175/539] Building CXX object CMakeFiles/pdal_base.dir/pdal/DynamicLibrary.cpp.o
[176/539] Building CXX object CMakeFiles/pdal_base.dir/kernels/SplitKernel.cpp.o
[177/539] Building CXX object CMakeFiles/pdal_base.dir/kernels/EvalKernel.cpp.o
[178/539] Building CXX object CMakeFiles/pdal_base.dir/kernels/PipelineKernel.cpp.o
[179/539] Building CXX object CMakeFiles/pdal_base.dir/kernels/TIndexKernel.cpp.o
[180/539] Building CXX object CMakeFiles/pdal_base.dir/pdal/DbReader.cpp.o
[181/539] Building CXX object CMakeFiles/pdal_base.dir/kernels/TranslateKernel.cpp.o
[182/539] Building CXX object CMakeFiles/pdal_base.dir/pdal/Log.cpp.o
[183/539] Building CXX object CMakeFiles/pdal_base.dir/kernels/TileKernel.cpp.o
[184/539] Building CXX object CMakeFiles/pdal_base.dir/pdal/Geometry.cpp.o
[185/539] Building CXX object CMakeFiles/pdal_base.dir/pdal/DbWriter.cpp.o
[186/539] Building CXX object CMakeFiles/pdal_base.dir/pdal/Metadata.cpp.o
[187/539] Building CXX object CMakeFiles/pdal_base.dir/pdal/Filter.cpp.o
[188/539] Building CXX object CMakeFiles/pdal_base.dir/pdal/KDIndex.cpp.o
[189/539] Building CXX object CMakeFiles/pdal_base.dir/pdal/PipelineExecutor.cpp.o
[190/539] Building CXX object CMakeFiles/pdal_base.dir/io/StacReader.cpp.o
[191/539] Building CXX object CMakeFiles/pdal_base.dir/pdal/PluginDirectory.cpp.o
[192/539] Building CXX object CMakeFiles/pdal_base.dir/pdal/Kernel.cpp.o
[193/539] Building CXX object CMakeFiles/pdal_base.dir/pdal/PDALUtils.cpp.o
[194/539] Building CXX object CMakeFiles/pdal_base.dir/pdal/PipelineWriter.cpp.o
[195/539] Building CXX object CMakeFiles/pdal_base.dir/pdal/PointTable.cpp.o
[196/539] Building CXX object CMakeFiles/pdal_base.dir/pdal/PointLayout.cpp.o
[197/539] Building CXX object CMakeFiles/pdal_base.dir/pdal/PipelineManager.cpp.o
[198/539] Building CXX object CMakeFiles/pdal_base.dir/pdal/QuadIndex.cpp.o
[199/539] Building CXX object CMakeFiles/pdal_base.dir/pdal/PointView.cpp.o
[200/539] Building CXX object CMakeFiles/pdal_base.dir/pdal/PluginManager.cpp.o
[201/539] Building CXX object CMakeFiles/pdal_base.dir/pdal/SrsBounds.cpp.o
[202/539] Building CXX object CMakeFiles/pdal_base.dir/pdal/SpatialReference.cpp.o
[203/539] Building CXX object CMakeFiles/pdal_base.dir/pdal/Options.cpp.o
[204/539] Building CXX object CMakeFiles/pdal_base.dir/pdal/Polygon.cpp.o
[205/539] Building CXX object CMakeFiles/pdal_base.dir/pdal/Scaling.cpp.o
[206/539] Building CXX object CMakeFiles/pdal_base.dir/pdal/StageExtensions.cpp.o
[207/539] Building CXX object CMakeFiles/pdal_base.dir/pdal/Reader.cpp.o
[208/539] Building CXX object CMakeFiles/pdal_base.dir/pdal/compression/DeflateCompression.cpp.o
[209/539] Building CXX object CMakeFiles/pdal_base.dir/pdal/StageFactory.cpp.o
[210/539] Building CXX object CMakeFiles/pdal_base.dir/pdal/PipelineReaderJSON.cpp.o
[211/539] Building CXX object CMakeFiles/pdal_base.dir/pdal/compression/ZstdCompression.cpp.o
[212/539] Building CXX object CMakeFiles/pdal_base.dir/pdal/pdal_config.cpp.o
[213/539] Building CXX object CMakeFiles/pdal_base.dir/pdal/compression/LazPerfVlrCompression.cpp.o
[214/539] Building CXX object CMakeFiles/pdal_base.dir/pdal/Streamable.cpp.o
[215/539] Building CXX object CMakeFiles/pdal_base.dir/filters/private/csf/Constraint.cpp.o
[216/539] Building CXX object CMakeFiles/pdal_base.dir/pdal/XMLSchema.cpp.o
[217/539] Building CXX object CMakeFiles/pdal_base.dir/pdal/SubcommandKernel.cpp.o
[218/539] Building CXX object CMakeFiles/pdal_base.dir/filters/private/csf/point_cloud.cpp.o
[219/539] Building CXX object CMakeFiles/pdal_base.dir/filters/private/Point.cpp.o
[220/539] Building CXX object CMakeFiles/pdal_base.dir/filters/private/csf/XYZReader.cpp.o
[221/539] Building CXX object CMakeFiles/pdal_base.dir/filters/private/csf/Cloth.cpp.o
[222/539] Building CXX object CMakeFiles/pdal_base.dir/filters/private/csf/Particle.cpp.o
[223/539] Building CXX object CMakeFiles/pdal_base.dir/filters/private/DimRange.cpp.o
[224/539] Building CXX object CMakeFiles/pdal_base.dir/filters/private/csf/c2cdist.cpp.o
[225/539] Building CXX object CMakeFiles/pdal_base.dir/pdal/Writer.cpp.o
[226/539] Building CXX object CMakeFiles/pdal_base.dir/filters/private/csf/Rasterization.cpp.o
[227/539] Building CXX object CMakeFiles/pdal_base.dir/filters/private/csf/CSF.cpp.o
[228/539] Building CXX object CMakeFiles/pdal_base.dir/filters/private/hexer/Hexagon.cpp.o
[229/539] Building CXX object CMakeFiles/pdal_base.dir/filters/private/delaunator.cpp.o
[230/539] Building CXX object CMakeFiles/pdal_base.dir/pdal/Stage.cpp.o
[231/539] Building CXX object CMakeFiles/pdal_base.dir/filters/private/expr/Lexer.cpp.o
[232/539] Building CXX object CMakeFiles/pdal_base.dir/filters/private/hexer/Path.cpp.o
[233/539] Building CXX object CMakeFiles/pdal_base.dir/filters/private/hexer/Segment.cpp.o
[234/539] Building CXX object CMakeFiles/pdal_base.dir/filters/private/hexer/Processor.cpp.o
[235/539] Building CXX object CMakeFiles/pdal_base.dir/filters/private/Segmentation.cpp.o
[236/539] Building CXX object CMakeFiles/pdal_base.dir/filters/private/expr/AssignStatement.cpp.o
[237/539] Building CXX object CMakeFiles/pdal_base.dir/filters/private/expr/AssignParser.cpp.o
[238/539] Building CXX object CMakeFiles/pdal_base.dir/filters/private/expr/MathParser.cpp.o
[239/539] Building CXX object CMakeFiles/pdal_base.dir/filters/private/expr/ConditionalExpression.cpp.o
[240/539] Building CXX object CMakeFiles/pdal_base.dir/filters/private/expr/ConditionalParser.cpp.o
[241/539] Building CXX object CMakeFiles/pdal_base.dir/filters/private/expr/BaseParser.cpp.o
[242/539] Building CXX object CMakeFiles/pdal_base.dir/filters/private/expr/Expression.cpp.o
[243/539] Building CXX object CMakeFiles/pdal_base.dir/filters/private/expr/IdentExpression.cpp.o
[244/539] Building CXX object CMakeFiles/pdal_base.dir/filters/private/hexer/HexGrid.cpp.o
[245/539] Building CXX object CMakeFiles/pdal_base.dir/filters/private/expr/MathExpression.cpp.o
[246/539] Building CXX object CMakeFiles/pdal_base.dir/io/private/GDALGrid.cpp.o
[247/539] Building CXX object CMakeFiles/pdal_base.dir/filters/private/mongoexpression/LogicGate.cpp.o
[248/539] Building CXX object CMakeFiles/pdal_base.dir/io/private/copc/Entry.cpp.o
[249/539] Building CXX object CMakeFiles/pdal_base.dir/io/private/ept/FixedPointLayout.cpp.o
[250/539] Building CXX object CMakeFiles/pdal_base.dir/filters/private/mongoexpression/Expression.cpp.o
[251/539] Building CXX object CMakeFiles/pdal_base.dir/io/private/las/Header.cpp.o
[252/539] Building CXX object CMakeFiles/pdal_base.dir/io/private/copcwriter/Grid.cpp.o
[253/539] Building CXX object CMakeFiles/pdal_base.dir/io/private/copcwriter/Reprocessor.cpp.o
[254/539] Building CXX object CMakeFiles/pdal_base.dir/io/private/las/Geotiff.cpp.o
In file included from /usr/include/libgeotiff/geo_tiffp.h:38,
                 from /usr/src/RPM/BUILD/PDAL-2.5.6/io/private/las/Geotiff.cpp:41:
/usr/include/libgeotiff/cpl_serv.h:132:25: warning: redundant redeclaration of 'void _GTIFFree(void*)' in same scope [-Wredundant-decls]
  132 | #define VSIFree         _GTIFFree
      |                         ^~~~~~~~~
/usr/src/RPM/BUILD/PDAL-2.5.6/io/private/las/Geotiff.cpp:78:6: note: in expansion of macro 'VSIFree'
   78 | void VSIFree(void *data);
      |      ^~~~~~~
/usr/include/libgeotiff/geo_tiffp.h:105:22: note: previous declaration of 'void _GTIFFree(gdata_t)'
  105 | extern void GTIF_DLL _GTIFFree(gdata_t data);
      |                      ^~~~~~~~~
[255/539] Building CXX object CMakeFiles/pdal_base.dir/io/private/copcwriter/BuPyramid.cpp.o
[256/539] Building CXX object CMakeFiles/pdal_base.dir/io/private/copcwriter/Output.cpp.o
[257/539] Building CXX object CMakeFiles/pdal_base.dir/filters/private/mongoexpression/Comparison.cpp.o
[258/539] Building CXX object CMakeFiles/pdal_base.dir/io/private/copcwriter/PyramidManager.cpp.o
[259/539] Building CXX object CMakeFiles/pdal_base.dir/io/private/copc/Tile.cpp.o
[260/539] Building CXX object CMakeFiles/pdal_base.dir/io/private/las/Summary.cpp.o
[261/539] Building CXX object CMakeFiles/pdal_base.dir/io/private/connector/Connector.cpp.o
[262/539] Building CXX object CMakeFiles/pdal_base.dir/io/private/copcwriter/Processor.cpp.o
[263/539] Building CXX object CMakeFiles/pdal_base.dir/io/private/ept/Addon.cpp.o
[264/539] Building CXX object CMakeFiles/pdal_base.dir/pdal/private/Raster.cpp.o
[265/539] Building CXX object CMakeFiles/pdal_base.dir/pdal/private/SrsTransform.cpp.o
[266/539] Building CXX object CMakeFiles/pdal_base.dir/kernels/private/density/OGR.cpp.o
[267/539] Building CXX object CMakeFiles/pdal_base.dir/io/private/las/Srs.cpp.o
[268/539] Building CXX object CMakeFiles/pdal_base.dir/pdal/private/gdal/SpatialRef.cpp.o
[269/539] Building CXX object CMakeFiles/pdal_base.dir/io/private/ept/EptInfo.cpp.o
[270/539] Building CXX object CMakeFiles/pdal_base.dir/io/private/ept/TileContents.cpp.o
[271/539] Building CXX object CMakeFiles/pdal_base.dir/pdal/private/gdal/ErrorHandler.cpp.o
[272/539] Building CXX object CMakeFiles/pdal_base.dir/pdal/private/gdal/BaseBand.cpp.o
[273/539] Building CXX object CMakeFiles/pdal_base.dir/pdal/private/StageRunner.cpp.o
[274/539] Building CXX object CMakeFiles/pdal_base.dir/io/private/las/Utils.cpp.o
[275/539] Building CXX object plugins/faux/CMakeFiles/pdal_plugin_kernel_fauxplugin.dir/kernel/FauxPluginKernel.cpp.o
[276/539] Building CXX object CMakeFiles/pdal_base.dir/pdal/private/gdal/Raster.cpp.o
[277/539] Building CXX object test/unit/CMakeFiles/pdal_file_utils_test.dir/FileUtilsTest.cpp.o
[278/539] Building CXX object test/unit/CMakeFiles/pdal_config_test.dir/ConfigTest.cpp.o
[279/539] Building CXX object test/unit/CMakeFiles/pdal_georeference_test.dir/GeoreferenceTest.cpp.o
[280/539] Building CXX object CMakeFiles/pdal_base.dir/io/private/las/Vlr.cpp.o
[281/539] Building CXX object CMakeFiles/pdal_base.dir/pdal/private/gdal/GDALUtils.cpp.o
[282/539] Building CXX object test/unit/CMakeFiles/pdal_test_support.dir/Support.cpp.o
[283/539] Building CXX object test/unit/CMakeFiles/pdal_log_test.dir/LogTest.cpp.o
[284/539] Building CXX object test/unit/CMakeFiles/pdal_kdindex_test.dir/KDIndexTest.cpp.o
[285/539] Building CXX object test/unit/CMakeFiles/pdal_bounds_test.dir/BoundsTest.cpp.o
[286/539] Building CXX object test/unit/CMakeFiles/pdal_kernel_test.dir/KernelTest.cpp.o
[287/539] Building CXX object CMakeFiles/pdal_base.dir/pdal/private/MathUtils.cpp.o
[288/539] Building CXX object test/unit/CMakeFiles/pdal_eigen_test.dir/EigenTest.cpp.o
[289/539] Building CXX object test/unit/CMakeFiles/pdal_metadata_test.dir/MetadataTest.cpp.o
[290/539] Building CXX object test/unit/CMakeFiles/pdal_dimension_test.dir/DimensionTest.cpp.o
[291/539] Building CXX object test/unit/CMakeFiles/pdal_pipeline_writer_test.dir/PipelineWriterTest.cpp.o
[292/539] Building CXX object test/unit/CMakeFiles/pdal_oldpclblock_test.dir/OldPCLBlockTest.cpp.o
[293/539] Building CXX object test/unit/CMakeFiles/pdal_polygon_test.dir/PolygonTest.cpp.o
[294/539] Building CXX object test/unit/CMakeFiles/pdal_pipeline_manager_test.dir/PipelineManagerTest.cpp.o
[295/539] Building CXX object test/unit/CMakeFiles/pdal_plugin_manager_test.dir/PluginManagerTest.cpp.o
[296/539] Building CXX object test/unit/CMakeFiles/pdal_point_view_test.dir/PointViewTest.cpp.o
[297/539] Building CXX object test/unit/CMakeFiles/pdal_point_table_test.dir/PointTableTest.cpp.o
[298/539] Building CXX object test/unit/CMakeFiles/pdal_eigen_test.dir/__/__/pdal/private/MathUtils.cpp.o
[299/539] Building CXX object test/unit/CMakeFiles/pdal_segmentation_test.dir/SegmentationTest.cpp.o
[300/539] Building CXX object test/unit/CMakeFiles/pdal_artifact_test.dir/ArtifactTest.cpp.o
[301/539] Building CXX object test/unit/CMakeFiles/pdal_uuid_test.dir/UuidTest.cpp.o
[302/539] Building CXX object test/unit/CMakeFiles/pdal_utils_test.dir/UtilsTest.cpp.o
[303/539] Building CXX object test/unit/CMakeFiles/pdal_spatial_reference_test.dir/SpatialReferenceTest.cpp.o
[304/539] Building CXX object test/unit/CMakeFiles/pdal_zstd_test.dir/ZstdTest.cpp.o
[305/539] Building CXX object test/unit/CMakeFiles/pdal_support_test.dir/SupportTest.cpp.o
[306/539] Building CXX object test/unit/CMakeFiles/pdal_options_test.dir/OptionsTest.cpp.o
[307/539] Building CXX object test/unit/CMakeFiles/pdal_deflate_test.dir/DeflateTest.cpp.o
[308/539] Building CXX object test/unit/CMakeFiles/pdal_stage_factory_test.dir/StageFactoryTest.cpp.o
[309/539] Building CXX object test/unit/CMakeFiles/pdal_where_test.dir/WhereTest.cpp.o
[310/539] Building CXX object test/unit/CMakeFiles/pdal_io_bpf_zlib_test.dir/io/BpfTestZlib.cpp.o
[311/539] Building CXX object test/unit/CMakeFiles/pdal_program_arg_test.dir/ProgramArgsTest.cpp.o
[312/539] Building CXX object test/unit/CMakeFiles/pdal_streaming_test.dir/StreamingTest.cpp.o
[313/539] Building CXX object test/unit/CMakeFiles/pdal_io_ogr_writer_test.dir/io/OGRWriterTest.cpp.o
[314/539] Building CXX object test/unit/CMakeFiles/pdal_io_faux_test.dir/io/FauxReaderTest.cpp.o
[315/539] Building CXX object test/unit/CMakeFiles/pdal_io_obj_reader_test.dir/io/ObjReaderTest.cpp.o
[316/539] Building CXX object test/unit/CMakeFiles/pdal_io_las_reader_test.dir/io/LasReaderTest.cpp.o
[317/539] Building CXX object test/unit/CMakeFiles/pdal_io_buffer_test.dir/io/BufferTest.cpp.o
[318/539] Building CXX object test/unit/CMakeFiles/pdal_io_bpf_base_test.dir/io/BpfTestBase.cpp.o
[319/539] Building CXX object test/unit/CMakeFiles/pdal_io_stac_reader_test.dir/io/StacReaderTest.cpp.o
[320/539] Building CXX object test/unit/CMakeFiles/pdal_io_optech_test.dir/io/OptechReaderTest.cpp.o
[321/539] Building CXX object test/unit/CMakeFiles/pdal_io_gdal_reader_test.dir/io/GDALReaderTest.cpp.o
[322/539] Building CXX object test/unit/CMakeFiles/pdal_io_pcd_reader_test.dir/io/PcdReaderTest.cpp.o
[323/539] Building CXX object test/unit/CMakeFiles/pdal_io_gdal_writer_test.dir/io/GDALWriterTest.cpp.o
[324/539] Building CXX object test/unit/CMakeFiles/pdal_io_ept_addon_writer_test.dir/io/EptAddonWriterTest.cpp.o
[325/539] Building CXX object test/unit/CMakeFiles/pdal_io_pcd_writer_test.dir/io/PcdWriterTest.cpp.o
[326/539] Building CXX object test/unit/CMakeFiles/pdal_io_ply_writer_test.dir/io/PlyWriterTest.cpp.o
[327/539] Building CXX object test/unit/CMakeFiles/pdal_io_copc_reader_test.dir/io/CopcReaderTest.cpp.o
[328/539] Building CXX object test/unit/CMakeFiles/pdal_io_ply_reader_test.dir/io/PlyReaderTest.cpp.o
[329/539] Building CXX object test/unit/CMakeFiles/pdal_io_sbet_reader_test.dir/io/SbetReaderTest.cpp.o
[330/539] Building CXX object test/unit/CMakeFiles/pdal_io_las_writer_test.dir/io/LasWriterTest.cpp.o
[331/539] Building CXX object test/unit/CMakeFiles/pdal_io_qfit_test.dir/io/QFITReaderTest.cpp.o
[332/539] Building CXX object test/unit/CMakeFiles/pdal_io_ptx_reader_test.dir/io/PtxReaderTest.cpp.o
[333/539] Building CXX object test/unit/CMakeFiles/pdal_io_sbet_writer_test.dir/io/SbetWriterTest.cpp.o
[334/539] Building CXX object test/unit/CMakeFiles/pdal_io_pts_reader_test.dir/io/PtsReaderTest.cpp.o
[335/539] Building CXX object test/unit/CMakeFiles/pdal_io_ept_reader_test.dir/io/EptReaderTest.cpp.o
[336/539] Building CXX object test/unit/CMakeFiles/pdal_io_fbi_test.dir/io/FbiReaderTest.cpp.o
[337/539] Building CXX object test/unit/CMakeFiles/pdal_io_terrasolid_test.dir/io/TerrasolidReaderTest.cpp.o
[338/539] Building CXX object test/unit/CMakeFiles/pdal_io_text_writer_test.dir/io/TextWriterTest.cpp.o
[339/539] Building CXX object test/unit/CMakeFiles/pdal_io_smrmsg_reader_test.dir/io/SmrmsgReaderTest.cpp.o
[340/539] Building CXX object test/unit/CMakeFiles/pdal_io_gltf_writer_test.dir/io/GltfWriterTest.cpp.o
[341/539] Building CXX object test/unit/CMakeFiles/pdal_filters_nndistance_test.dir/filters/NNDistanceTest.cpp.o
[342/539] Building CXX object test/unit/CMakeFiles/pdal_filters_assign_test.dir/filters/AssignFilterTest.cpp.o
[343/539] Building CXX object test/unit/CMakeFiles/pdal_io_text_reader_test.dir/io/TextReaderTest.cpp.o
[344/539] Building CXX object test/unit/CMakeFiles/pdal_filters_chipper_test.dir/filters/ChipperTest.cpp.o
[345/539] Building CXX object test/unit/CMakeFiles/pdal_filters_colorinterp_test.dir/filters/ColorinterpFilterTest.cpp.o
[346/539] Building CXX object test/unit/CMakeFiles/pdal_filters_delaunay_test.dir/filters/DelaunayFilterTest.cpp.o
[347/539] Building CXX object test/unit/CMakeFiles/pdal_filters_csf_test.dir/filters/CSFilterTest.cpp.o
[348/539] Building CXX object test/unit/CMakeFiles/pdal_filters_geomdistance_test.dir/filters/GeomDistanceFilterTest.cpp.o
[349/539] Building CXX object test/unit/CMakeFiles/pdal_filters_decimation_test.dir/filters/DecimationFilterTest.cpp.o
[350/539] Building CXX object test/unit/CMakeFiles/pdal_filters_colorization_test.dir/filters/ColorizationFilterTest.cpp.o
[351/539] Building CXX object test/unit/CMakeFiles/pdal_filters_covariancefeatures_test.dir/filters/CovarianceFeaturesTest.cpp.o
[352/539] Building CXX object test/unit/CMakeFiles/pdal_filters_crop_test.dir/filters/CropFilterTest.cpp.o
[353/539] Building CXX object test/unit/CMakeFiles/pdal_filters_divider_test.dir/filters/DividerFilterTest.cpp.o
[354/539] Building CXX object test/unit/CMakeFiles/pdal_filters_faceraster_test.dir/filters/FaceRasterTest.cpp.o
[355/539] Building CXX object test/unit/CMakeFiles/pdal_filters_elm_test.dir/filters/ELMFilterTest.cpp.o
[356/539] Building CXX object test/unit/CMakeFiles/pdal_filters_groupby_test.dir/filters/GroupByFilterTest.cpp.o
[357/539] Building CXX object test/unit/CMakeFiles/pdal_filters_gpstimeconvert_test.dir/filters/GpsTimeConvertTest.cpp.o
[358/539] Building CXX object test/unit/CMakeFiles/pdal_filters_ferry_test.dir/filters/FerryFilterTest.cpp.o
[359/539] Building CXX object test/unit/CMakeFiles/pdal_filters_hag_test.dir/filters/HAGFilterTest.cpp.o
[360/539] Building CXX object test/unit/CMakeFiles/pdal_filters_separatescanline_test.dir/filters/SeparatescanlineFilterTest.cpp.o
[361/539] Building CXX object test/unit/CMakeFiles/pdal_filters_mongoexpression_test.dir/filters/MongoExpressionFilterTest.cpp.o
[362/539] Building CXX object test/unit/CMakeFiles/pdal_filters_merge_test.dir/filters/MergeTest.cpp.o
[363/539] Building CXX object test/unit/CMakeFiles/pdal_filters_info_test.dir/filters/InfoFilterTest.cpp.o
[364/539] Building CXX object test/unit/CMakeFiles/pdal_filters_lloydkmeans_test.dir/filters/LloydKMeansFilterTest.cpp.o
[365/539] Building CXX object test/unit/CMakeFiles/pdal_filters_ht_test.dir/filters/HeadTailFilterTest.cpp.o
[366/539] Building CXX object test/unit/CMakeFiles/pdal_filters_neighborclassifier_test.dir/filters/NeighborClassifierFilterTest.cpp.o
[367/539] Building CXX object test/unit/CMakeFiles/pdal_filters_locate_test.dir/filters/LocateFilterTest.cpp.o
[368/539] Building CXX object test/unit/CMakeFiles/pdal_filters_miniball_test.dir/filters/MiniballFilterTest.cpp.o
[369/539] Building CXX object test/unit/CMakeFiles/pdal_filters_icp_test.dir/filters/IcpFilterTest.cpp.o
[370/539] Building CXX object test/unit/CMakeFiles/pdal_morton_order_test.dir/filters/MortonOrderTest.cpp.o
[371/539] Building CXX object test/unit/CMakeFiles/pdal_filters_normal_test.dir/filters/NormalFilterTest.cpp.o
[372/539] Building CXX object test/unit/CMakeFiles/pdal_filters_overlay_test.dir/filters/OverlayFilterTest.cpp.o
[373/539] Building CXX object test/unit/CMakeFiles/pdal_filters_additional_merge_test.dir/filters/AdditionalMergeTest.cpp.o
[374/539] Building CXX object test/unit/CMakeFiles/pdal_filters_pmf_test.dir/filters/PMFFilterTest.cpp.o
[375/539] Building CXX object test/unit/CMakeFiles/pdal_filters_planefit_test.dir/filters/PlaneFitFilterTest.cpp.o
[376/539] Building CXX object test/unit/CMakeFiles/pdal_filters_returns_test.dir/filters/ReturnsFilterTest.cpp.o
[377/539] Building CXX object test/unit/CMakeFiles/pdal_filters_reprojection_test.dir/filters/ReprojectionFilterTest.cpp.o
[378/539] Building CXX object test/unit/CMakeFiles/pdal_filters_reciprocity_test.dir/filters/ReciprocityFilterTest.cpp.o
[379/539] Building CXX object test/unit/CMakeFiles/pdal_filters_randomize_test.dir/filters/RandomizeFilterTest.cpp.o
[380/539] Building CXX object test/unit/CMakeFiles/pdal_filters_shell_test.dir/filters/ShellFilterTest.cpp.o
[381/539] Building CXX object test/unit/CMakeFiles/pdal_filters_expression_test.dir/filters/ExpressionFilterTest.cpp.o
[382/539] Building CXX object test/unit/CMakeFiles/pdal_filters_skewness_test.dir/filters/SkewnessFilterTest.cpp.o
[383/539] Building CXX object test/unit/CMakeFiles/pdal_filters_range_test.dir/filters/RangeFilterTest.cpp.o
[384/539] Building CXX object test/unit/CMakeFiles/pdal_filters_smrf_test.dir/filters/SMRFilterTest.cpp.o
[385/539] Building CXX object test/unit/CMakeFiles/pdal_filters_sort_test.dir/filters/SortFilterTest.cpp.o
[386/539] Building CXX object test/unit/CMakeFiles/pdal_app_test.dir/apps/AppTest.cpp.o
[387/539] Building CXX object test/unit/CMakeFiles/pdal_app_plugin_test.dir/apps/AppPluginTest.cpp.o
[388/539] Building CXX object test/unit/CMakeFiles/pdal_info_test.dir/apps/InfoTest.cpp.o
[389/539] Building CXX object test/unit/CMakeFiles/pdal_filters_splitter_test.dir/filters/SplitterTest.cpp.o
[390/539] Building CXX object test/unit/CMakeFiles/pdal_tindex_test.dir/apps/TIndexTest.cpp.o
[391/539] Building CXX object test/unit/CMakeFiles/pdal_merge_test.dir/apps/MergeTest.cpp.o
[392/539] Building CXX object test/unit/CMakeFiles/pdal_tile_test.dir/apps/TileTest.cpp.o
[393/539] Building CXX object test/unit/CMakeFiles/pdal_filters_voxel_test.dir/filters/VoxelTest.cpp.o
[394/539] Linking CXX static library usr/lib64/libpdal_arbiter.a
[395/539] Linking CXX static library usr/lib64/libpdal_json_schema.a
[396/539] Building CXX object test/unit/CMakeFiles/pdal_filters_hexbin_test.dir/filters/HexbinFilterTest.cpp.o
[397/539] Building CXX object test/unit/CMakeFiles/pdal_filters_transformation_test.dir/filters/TransformationFilterTest.cpp.o
[398/539] Building CXX object test/unit/CMakeFiles/pdal_filters_voxel_downsize_test.dir/filters/VoxelDownsizeFilterTest.cpp.o
[399/539] Building CXX object test/unit/CMakeFiles/pdal_filters_stats_test.dir/filters/StatsFilterTest.cpp.o
[400/539] Building CXX object test/unit/CMakeFiles/chamfer_test.dir/apps/ChamferTest.cpp.o
[401/539] Building CXX object test/unit/CMakeFiles/pc2pc_test.dir/apps/pc2pcTest.cpp.o
[402/539] Building CXX object test/unit/CMakeFiles/hausdorff_test.dir/apps/HausdorffTest.cpp.o
[403/539] Building CXX object test/unit/CMakeFiles/pdal_io_ilvis2_metadata_test.dir/io/Ilvis2MetadataReaderTest.cpp.o
[404/539] Building CXX object test/unit/CMakeFiles/translate_test.dir/apps/TranslateTest.cpp.o
[405/539] Building CXX object test/unit/CMakeFiles/xml_schema_test.dir/XMLSchemaTest.cpp.o
[406/539] Building CXX object test/unit/CMakeFiles/random_test.dir/apps/RandomTest.cpp.o
[407/539] Building CXX object test/unit/CMakeFiles/pdal_io_ilvis2_reader_metadata_test.dir/io/Ilvis2ReaderWithMDReaderTest.cpp.o
[408/539] Building CXX object test/unit/CMakeFiles/pdal_io_ilvis2_test.dir/io/Ilvis2ReaderTest.cpp.o
[409/539] Building CXX object apps/CMakeFiles/pdal.dir/pdal.cpp.o
[410/539] Linking CXX shared library usr/lib64/libpdal_base.so.15.6.0
[411/539] Creating library symlink usr/lib64/libpdal_base.so.15 usr/lib64/libpdal_base.so
[412/539] Linking CXX shared library usr/lib64/libpdal_plugin_kernel_fauxplugin.so.15.6.0
[413/539] Creating library symlink usr/lib64/libpdal_plugin_kernel_fauxplugin.so.15 usr/lib64/libpdal_plugin_kernel_fauxplugin.so
[414/539] Linking CXX executable bin/pdal_config_test
[415/539] Linking CXX executable bin/pdal_pipeline_manager_test
[416/539] Linking CXX executable bin/pdal_file_utils_test
[417/539] Linking CXX executable bin/pdal_options_test
[418/539] Linking CXX executable bin/pdal_bounds_test
[419/539] Linking CXX executable bin/pdal_dimension_test
[420/539] Linking CXX executable bin/pdal_log_test
[421/539] Linking CXX executable bin/pdal_kdindex_test
[422/539] Linking CXX executable bin/pdal_georeference_test
[423/539] Linking CXX executable bin/pdal_oldpclblock_test
[424/539] Linking CXX executable bin/pdal_plugin_manager_test
[425/539] Linking CXX executable bin/pdal_kernel_test
[426/539] Linking CXX executable bin/pdal_point_view_test
[427/539] Linking CXX executable bin/pdal_pipeline_writer_test
[428/539] Linking CXX executable bin/pdal_metadata_test
[429/539] Linking CXX executable bin/pdal_eigen_test
[430/539] Linking CXX executable bin/pdal_point_table_test
[431/539] Linking CXX executable bin/pdal_streaming_test
[432/539] Linking CXX executable bin/pdal_stage_factory_test
[433/539] Linking CXX executable bin/pdal_io_bpf_zlib_test
[434/539] Linking CXX executable bin/pdal_polygon_test
[435/539] Linking CXX executable bin/pdal_spatial_reference_test
[436/539] Linking CXX executable bin/pdal_artifact_test
[437/539] Linking CXX executable bin/pdal_segmentation_test
[438/539] Linking CXX executable bin/pdal_uuid_test
[439/539] Linking CXX executable bin/pdal_where_test
[440/539] Linking CXX executable bin/pdal_utils_test
[441/539] Linking CXX executable bin/pdal_io_bpf_base_test
[442/539] Linking CXX executable bin/pdal_zstd_test
[443/539] Linking CXX executable bin/pdal_deflate_test
[444/539] Linking CXX executable bin/pdal_program_arg_test
[445/539] Linking CXX executable bin/pdal_support_test
[446/539] Linking CXX executable bin/pdal_io_stac_reader_test
[447/539] Linking CXX executable bin/pdal_io_copc_reader_test
[448/539] Linking CXX executable bin/pdal_io_ept_reader_test
[449/539] Linking CXX executable bin/pdal_io_buffer_test
[450/539] Linking CXX executable bin/pdal_io_pcd_reader_test
[451/539] Linking CXX executable bin/pdal_io_ept_addon_writer_test
[452/539] Linking CXX executable bin/pdal_io_ply_reader_test
[453/539] Linking CXX executable bin/pdal_io_las_writer_test
[454/539] Linking CXX executable bin/pdal_io_gdal_reader_test
[455/539] Linking CXX executable bin/pdal_io_faux_test
[456/539] Linking CXX executable bin/pdal_io_obj_reader_test
[457/539] Linking CXX executable bin/pdal_io_ogr_writer_test
[458/539] Linking CXX executable bin/pdal_io_las_reader_test
[459/539] Linking CXX executable bin/pdal_io_optech_test
[460/539] Linking CXX executable bin/pdal_io_pcd_writer_test
[461/539] Linking CXX executable bin/pdal_io_gdal_writer_test
[462/539] Linking CXX executable bin/pdal_io_ptx_reader_test
[463/539] Linking CXX executable bin/pdal_io_qfit_test
[464/539] Linking CXX executable bin/pdal_io_text_writer_test
[465/539] Linking CXX executable bin/pdal_io_ply_writer_test
[466/539] Linking CXX executable bin/pdal_io_terrasolid_test
[467/539] Linking CXX executable bin/pdal_io_sbet_writer_test
[468/539] Linking CXX executable bin/pdal_io_sbet_reader_test
[469/539] Linking CXX executable bin/pdal_io_fbi_test
[470/539] Linking CXX executable bin/pdal_io_pts_reader_test
[471/539] Linking CXX executable bin/pdal_filters_assign_test
[472/539] Linking CXX executable bin/pdal_io_gltf_writer_test
[473/539] Linking CXX executable bin/pdal_io_smrmsg_reader_test
[474/539] Linking CXX executable bin/pdal_io_text_reader_test
[475/539] Linking CXX executable bin/pdal_filters_nndistance_test
[476/539] Linking CXX executable bin/pdal_filters_chipper_test
[477/539] Linking CXX executable bin/pdal_filters_colorinterp_test
[478/539] Linking CXX executable bin/pdal_filters_colorization_test
[479/539] Linking CXX executable bin/pdal_filters_crop_test
[480/539] Linking CXX executable bin/pdal_filters_covariancefeatures_test
[481/539] Linking CXX executable bin/pdal_filters_geomdistance_test
[482/539] Linking CXX executable bin/pdal_filters_csf_test
[483/539] Linking CXX executable bin/pdal_filters_delaunay_test
[484/539] Linking CXX executable bin/pdal_filters_decimation_test
[485/539] Linking CXX executable bin/pdal_filters_divider_test
[486/539] Linking CXX executable bin/pdal_filters_faceraster_test
[487/539] Linking CXX executable bin/pdal_filters_ferry_test
[488/539] Linking CXX executable bin/pdal_filters_elm_test
[489/539] Linking CXX executable bin/pdal_filters_groupby_test
[490/539] Linking CXX executable bin/pdal_filters_mongoexpression_test
[491/539] Linking CXX executable bin/pdal_filters_gpstimeconvert_test
[492/539] Linking CXX executable bin/pdal_filters_hag_test
[493/539] Linking CXX executable bin/pdal_filters_separatescanline_test
[494/539] Linking CXX executable bin/pdal_filters_ht_test
[495/539] Linking CXX executable bin/pdal_filters_info_test
[496/539] Linking CXX executable bin/pdal_filters_locate_test
[497/539] Linking CXX executable bin/pdal_filters_icp_test
[498/539] Linking CXX executable bin/pdal_filters_neighborclassifier_test
[499/539] Linking CXX executable bin/pdal_filters_miniball_test
[500/539] Linking CXX executable bin/pdal_filters_lloydkmeans_test
[501/539] Linking CXX executable bin/pdal_filters_merge_test
[502/539] Linking CXX executable bin/pdal_morton_order_test
[503/539] Linking CXX executable bin/pdal_filters_normal_test
[504/539] Linking CXX executable bin/pdal_filters_overlay_test
[505/539] Linking CXX executable bin/pdal_filters_reprojection_test
[506/539] Linking CXX executable bin/pdal_filters_additional_merge_test
[507/539] Linking CXX executable bin/pdal_filters_planefit_test
[508/539] Linking CXX executable bin/pdal_filters_pmf_test
[509/539] Linking CXX executable bin/pdal_filters_range_test
[510/539] Linking CXX executable bin/pdal_filters_expression_test
[511/539] Linking CXX executable bin/pdal_filters_randomize_test
[512/539] Linking CXX executable bin/pdal_filters_reciprocity_test
[513/539] Linking CXX executable bin/pdal_filters_returns_test
[514/539] Linking CXX executable bin/pdal_filters_smrf_test
[515/539] Linking CXX executable bin/pdal_filters_transformation_test
[516/539] Linking CXX executable bin/pdal_filters_shell_test
[517/539] Linking CXX executable bin/pdal_filters_splitter_test
[518/539] Linking CXX executable bin/pdal_filters_skewness_test
[519/539] Linking CXX executable bin/pdal_filters_sort_test
[520/539] Linking CXX executable bin/pdal_filters_hexbin_test
[521/539] Linking CXX executable bin/pdal_filters_voxel_test
[522/539] Linking CXX executable bin/pdal_app_test
[523/539] Linking CXX executable bin/pdal_app_plugin_test
[524/539] Linking CXX executable bin/pdal_filters_voxel_downsize_test
[525/539] Linking CXX executable bin/pdal_filters_stats_test
[526/539] Linking CXX executable bin/pdal_info_test
[527/539] Linking CXX executable bin/pdal_tile_test
[528/539] Linking CXX executable bin/pdal_tindex_test
[529/539] Linking CXX executable bin/pdal_merge_test
[530/539] Linking CXX executable bin/pc2pc_test
[531/539] Linking CXX executable bin/hausdorff_test
[532/539] Linking CXX executable bin/pdal_io_ilvis2_metadata_test
[533/539] Linking CXX executable bin/translate_test
[534/539] Linking CXX executable bin/chamfer_test
[535/539] Linking CXX executable bin/random_test
[536/539] Linking CXX executable bin/pdal_io_ilvis2_reader_metadata_test
[537/539] Linking CXX executable bin/pdal_io_ilvis2_test
[538/539] Linking CXX executable bin/pdal
[539/539] Linking CXX executable bin/xml_schema_test
+ exit 0
Executing(%install): /bin/sh -e /usr/src/tmp/rpm-tmp.22851
+ umask 022
+ /bin/mkdir -p /usr/src/RPM/BUILD
+ cd /usr/src/RPM/BUILD
+ /bin/chmod -Rf u+rwX -- /usr/src/tmp/pdal-buildroot
+ :
+ /bin/rm -rf -- /usr/src/tmp/pdal-buildroot
+ PATH=/usr/libexec/rpm-build:/usr/src/bin:/bin:/usr/bin:/usr/X11R6/bin:/usr/games
+ cd PDAL-2.5.6
+ DESTDIR=/usr/src/tmp/pdal-buildroot
+ /usr/bin/ninja -j16 install -C x86_64-alt-linux
ninja: Entering directory `x86_64-alt-linux'
[0/1] Install the project...
-- Install configuration: ""
-- Installing: /usr/src/tmp/pdal-buildroot/usr/lib64/libpdal_base.so.15.6.0
-- Installing: /usr/src/tmp/pdal-buildroot/usr/lib64/libpdal_base.so.15
-- Set runtime path of "/usr/src/tmp/pdal-buildroot/usr/lib64/libpdal_base.so.15.6.0" to ""
-- Installing: /usr/src/tmp/pdal-buildroot/usr/lib64/libpdal_base.so
-- Installing: /usr/src/tmp/pdal-buildroot/usr/lib64/libpdalcpp.so
-- Installing: /usr/src/tmp/pdal-buildroot/usr/include/pdal
-- Installing: /usr/src/tmp/pdal-buildroot/usr/include/pdal/util
-- Installing: /usr/src/tmp/pdal-buildroot/usr/include/pdal/util/private
-- Installing: /usr/src/tmp/pdal-buildroot/usr/include/pdal/util/private/BacktraceImpl.hpp
-- Installing: /usr/src/tmp/pdal-buildroot/usr/include/pdal/util/portable_endian.hpp
-- Installing: /usr/src/tmp/pdal-buildroot/usr/include/pdal/util/pdal_util_internal.hpp
-- Installing: /usr/src/tmp/pdal-buildroot/usr/include/pdal/util/pdal_util_export.hpp
-- Installing: /usr/src/tmp/pdal-buildroot/usr/include/pdal/util/Uuid.hpp
-- Installing: /usr/src/tmp/pdal-buildroot/usr/include/pdal/util/Utils.hpp
-- Installing: /usr/src/tmp/pdal-buildroot/usr/include/pdal/util/ThreadPool.hpp
-- Installing: /usr/src/tmp/pdal-buildroot/usr/include/pdal/util/Random.hpp
-- Installing: /usr/src/tmp/pdal-buildroot/usr/include/pdal/util/ProgramArgs.hpp
-- Installing: /usr/src/tmp/pdal-buildroot/usr/include/pdal/util/OStream.hpp
-- Installing: /usr/src/tmp/pdal-buildroot/usr/include/pdal/util/NullOStream.hpp
-- Installing: /usr/src/tmp/pdal-buildroot/usr/include/pdal/util/Inserter.hpp
-- Installing: /usr/src/tmp/pdal-buildroot/usr/include/pdal/util/IStream.hpp
-- Installing: /usr/src/tmp/pdal-buildroot/usr/include/pdal/util/Georeference.hpp
-- Installing: /usr/src/tmp/pdal-buildroot/usr/include/pdal/util/FileUtils.hpp
-- Installing: /usr/src/tmp/pdal-buildroot/usr/include/pdal/util/Extractor.hpp
-- Installing: /usr/src/tmp/pdal-buildroot/usr/include/pdal/util/Charbuf.hpp
-- Installing: /usr/src/tmp/pdal-buildroot/usr/include/pdal/util/Bounds.hpp
-- Installing: /usr/src/tmp/pdal-buildroot/usr/include/pdal/util/Backtrace.hpp
-- Installing: /usr/src/tmp/pdal-buildroot/usr/include/pdal/util/Algorithm.hpp
-- Installing: /usr/src/tmp/pdal-buildroot/usr/include/pdal/private
-- Installing: /usr/src/tmp/pdal-buildroot/usr/include/pdal/private/gdal
-- Installing: /usr/src/tmp/pdal-buildroot/usr/include/pdal/private/gdal/SpatialRef.hpp
-- Installing: /usr/src/tmp/pdal-buildroot/usr/include/pdal/private/gdal/Raster.hpp
-- Installing: /usr/src/tmp/pdal-buildroot/usr/include/pdal/private/gdal/GDALUtils.hpp
-- Installing: /usr/src/tmp/pdal-buildroot/usr/include/pdal/private/gdal/GDALError.hpp
-- Installing: /usr/src/tmp/pdal-buildroot/usr/include/pdal/private/gdal/ErrorHandler.hpp
-- Installing: /usr/src/tmp/pdal-buildroot/usr/include/pdal/private/StageRunner.hpp
-- Installing: /usr/src/tmp/pdal-buildroot/usr/include/pdal/private/SrsTransform.hpp
-- Installing: /usr/src/tmp/pdal-buildroot/usr/include/pdal/private/Raster.hpp
-- Installing: /usr/src/tmp/pdal-buildroot/usr/include/pdal/private/MathUtils.hpp
-- Installing: /usr/src/tmp/pdal-buildroot/usr/include/pdal/private/KDImpl.hpp
-- Installing: /usr/src/tmp/pdal-buildroot/usr/include/pdal/private/DynamicLibrary.hpp
-- Installing: /usr/src/tmp/pdal-buildroot/usr/include/pdal/pdal_types.hpp
-- Installing: /usr/src/tmp/pdal-buildroot/usr/include/pdal/pdal_test_main.hpp
-- Installing: /usr/src/tmp/pdal-buildroot/usr/include/pdal/pdal_internal.hpp
-- Installing: /usr/src/tmp/pdal-buildroot/usr/include/pdal/pdal_export.hpp
-- Installing: /usr/src/tmp/pdal-buildroot/usr/include/pdal/pdal_config.hpp
-- Installing: /usr/src/tmp/pdal-buildroot/usr/include/pdal/pdal.hpp
-- Installing: /usr/src/tmp/pdal-buildroot/usr/include/pdal/compression
-- Installing: /usr/src/tmp/pdal-buildroot/usr/include/pdal/compression/ZstdCompression.hpp
-- Installing: /usr/src/tmp/pdal-buildroot/usr/include/pdal/compression/LzmaCompression.hpp
-- Installing: /usr/src/tmp/pdal-buildroot/usr/include/pdal/compression/LazPerfVlrCompression.hpp
-- Installing: /usr/src/tmp/pdal-buildroot/usr/include/pdal/compression/GzipCompression.hpp
-- Installing: /usr/src/tmp/pdal-buildroot/usr/include/pdal/compression/DeflateCompression.hpp
-- Installing: /usr/src/tmp/pdal-buildroot/usr/include/pdal/compression/Compression.hpp
-- Installing: /usr/src/tmp/pdal-buildroot/usr/include/pdal/XMLSchema.hpp
-- Installing: /usr/src/tmp/pdal-buildroot/usr/include/pdal/Writer.hpp
-- Installing: /usr/src/tmp/pdal-buildroot/usr/include/pdal/SubcommandKernel.hpp
-- Installing: /usr/src/tmp/pdal-buildroot/usr/include/pdal/Streamable.hpp
-- Installing: /usr/src/tmp/pdal-buildroot/usr/include/pdal/StageWrapper.hpp
-- Installing: /usr/src/tmp/pdal-buildroot/usr/include/pdal/StageFactory.hpp
-- Installing: /usr/src/tmp/pdal-buildroot/usr/include/pdal/StageExtensions.hpp
-- Installing: /usr/src/tmp/pdal-buildroot/usr/include/pdal/Stage.hpp
-- Installing: /usr/src/tmp/pdal-buildroot/usr/include/pdal/SrsBounds.hpp
-- Installing: /usr/src/tmp/pdal-buildroot/usr/include/pdal/SpatialReference.hpp
-- Installing: /usr/src/tmp/pdal-buildroot/usr/include/pdal/Scaling.hpp
-- Installing: /usr/src/tmp/pdal-buildroot/usr/include/pdal/Reader.hpp
-- Installing: /usr/src/tmp/pdal-buildroot/usr/include/pdal/QuickInfo.hpp
-- Installing: /usr/src/tmp/pdal-buildroot/usr/include/pdal/QuadIndex.hpp
-- Installing: /usr/src/tmp/pdal-buildroot/usr/include/pdal/Polygon.hpp
-- Installing: /usr/src/tmp/pdal-buildroot/usr/include/pdal/PointView.hpp
-- Installing: /usr/src/tmp/pdal-buildroot/usr/include/pdal/PointTable.hpp
-- Installing: /usr/src/tmp/pdal-buildroot/usr/include/pdal/PointRef.hpp
-- Installing: /usr/src/tmp/pdal-buildroot/usr/include/pdal/PointLayout.hpp
-- Installing: /usr/src/tmp/pdal-buildroot/usr/include/pdal/PointContainer.hpp
-- Installing: /usr/src/tmp/pdal-buildroot/usr/include/pdal/PluginManager.hpp
-- Installing: /usr/src/tmp/pdal-buildroot/usr/include/pdal/PluginInfo.hpp
-- Installing: /usr/src/tmp/pdal-buildroot/usr/include/pdal/PluginHelper.hpp
-- Installing: /usr/src/tmp/pdal-buildroot/usr/include/pdal/PluginDirectory.hpp
-- Installing: /usr/src/tmp/pdal-buildroot/usr/include/pdal/PipelineWriter.hpp
-- Installing: /usr/src/tmp/pdal-buildroot/usr/include/pdal/PipelineReaderJSON.hpp
-- Installing: /usr/src/tmp/pdal-buildroot/usr/include/pdal/PipelineManager.hpp
-- Installing: /usr/src/tmp/pdal-buildroot/usr/include/pdal/PipelineExecutor.hpp
-- Installing: /usr/src/tmp/pdal-buildroot/usr/include/pdal/PDALUtils.hpp
-- Installing: /usr/src/tmp/pdal-buildroot/usr/include/pdal/Options.hpp
-- Installing: /usr/src/tmp/pdal-buildroot/usr/include/pdal/Metadata.hpp
-- Installing: /usr/src/tmp/pdal-buildroot/usr/include/pdal/Mesh.hpp
-- Installing: /usr/src/tmp/pdal-buildroot/usr/include/pdal/Log.hpp
-- Installing: /usr/src/tmp/pdal-buildroot/usr/include/pdal/Kernel.hpp
-- Installing: /usr/src/tmp/pdal-buildroot/usr/include/pdal/KDIndex.hpp
-- Installing: /usr/src/tmp/pdal-buildroot/usr/include/pdal/JsonFwd.hpp
-- Installing: /usr/src/tmp/pdal-buildroot/usr/include/pdal/Geometry.hpp
-- Installing: /usr/src/tmp/pdal-buildroot/usr/include/pdal/FlexWriter.hpp
-- Installing: /usr/src/tmp/pdal-buildroot/usr/include/pdal/Filter.hpp
-- Installing: /usr/src/tmp/pdal-buildroot/usr/include/pdal/DimUtil.hpp
-- Installing: /usr/src/tmp/pdal-buildroot/usr/include/pdal/DimType.hpp
-- Installing: /usr/src/tmp/pdal-buildroot/usr/include/pdal/DimDetail.hpp
-- Installing: /usr/src/tmp/pdal-buildroot/usr/include/pdal/DbWriter.hpp
-- Installing: /usr/src/tmp/pdal-buildroot/usr/include/pdal/DbReader.hpp
-- Installing: /usr/src/tmp/pdal-buildroot/usr/include/pdal/ArtifactManager.hpp
-- Installing: /usr/src/tmp/pdal-buildroot/usr/include/pdal/Artifact.hpp
-- Installing: /usr/src/tmp/pdal-buildroot/usr/include/pdal/kernels
-- Installing: /usr/src/tmp/pdal-buildroot/usr/include/pdal/kernels/private
-- Installing: /usr/src/tmp/pdal-buildroot/usr/include/pdal/kernels/private/density
-- Installing: /usr/src/tmp/pdal-buildroot/usr/include/pdal/kernels/private/density/OGR.hpp
-- Installing: /usr/src/tmp/pdal-buildroot/usr/include/pdal/kernels/TranslateKernel.hpp
-- Installing: /usr/src/tmp/pdal-buildroot/usr/include/pdal/kernels/TileKernel.hpp
-- Installing: /usr/src/tmp/pdal-buildroot/usr/include/pdal/kernels/TIndexKernel.hpp
-- Installing: /usr/src/tmp/pdal-buildroot/usr/include/pdal/kernels/SplitKernel.hpp
-- Installing: /usr/src/tmp/pdal-buildroot/usr/include/pdal/kernels/SortKernel.hpp
-- Installing: /usr/src/tmp/pdal-buildroot/usr/include/pdal/kernels/RandomKernel.hpp
-- Installing: /usr/src/tmp/pdal-buildroot/usr/include/pdal/kernels/PipelineKernel.hpp
-- Installing: /usr/src/tmp/pdal-buildroot/usr/include/pdal/kernels/MergeKernel.hpp
-- Installing: /usr/src/tmp/pdal-buildroot/usr/include/pdal/kernels/InfoKernel.hpp
-- Installing: /usr/src/tmp/pdal-buildroot/usr/include/pdal/kernels/HausdorffKernel.hpp
-- Installing: /usr/src/tmp/pdal-buildroot/usr/include/pdal/kernels/GroundKernel.hpp
-- Installing: /usr/src/tmp/pdal-buildroot/usr/include/pdal/kernels/EvalKernel.hpp
-- Installing: /usr/src/tmp/pdal-buildroot/usr/include/pdal/kernels/DensityKernel.hpp
-- Installing: /usr/src/tmp/pdal-buildroot/usr/include/pdal/kernels/DeltaKernel.hpp
-- Installing: /usr/src/tmp/pdal-buildroot/usr/include/pdal/kernels/ChamferKernel.hpp
-- Installing: /usr/src/tmp/pdal-buildroot/usr/include/pdal/io
-- Installing: /usr/src/tmp/pdal-buildroot/usr/include/pdal/io/private
-- Installing: /usr/src/tmp/pdal-buildroot/usr/include/pdal/io/private/las
-- Installing: /usr/src/tmp/pdal-buildroot/usr/include/pdal/io/private/las/Vlr.hpp
-- Installing: /usr/src/tmp/pdal-buildroot/usr/include/pdal/io/private/las/Utils.hpp
-- Installing: /usr/src/tmp/pdal-buildroot/usr/include/pdal/io/private/las/Summary.hpp
-- Installing: /usr/src/tmp/pdal-buildroot/usr/include/pdal/io/private/las/Srs.hpp
-- Installing: /usr/src/tmp/pdal-buildroot/usr/include/pdal/io/private/las/Header.hpp
-- Installing: /usr/src/tmp/pdal-buildroot/usr/include/pdal/io/private/las/Geotiff.hpp
-- Installing: /usr/src/tmp/pdal-buildroot/usr/include/pdal/io/private/ept
-- Installing: /usr/src/tmp/pdal-buildroot/usr/include/pdal/io/private/ept/VectorPointTable.hpp
-- Installing: /usr/src/tmp/pdal-buildroot/usr/include/pdal/io/private/ept/TileContents.hpp
-- Installing: /usr/src/tmp/pdal-buildroot/usr/include/pdal/io/private/ept/Overlap.hpp
-- Installing: /usr/src/tmp/pdal-buildroot/usr/include/pdal/io/private/ept/Key.hpp
-- Installing: /usr/src/tmp/pdal-buildroot/usr/include/pdal/io/private/ept/FixedPointLayout.hpp
-- Installing: /usr/src/tmp/pdal-buildroot/usr/include/pdal/io/private/ept/EptSupport.hpp
-- Installing: /usr/src/tmp/pdal-buildroot/usr/include/pdal/io/private/ept/EptInfo.hpp
-- Installing: /usr/src/tmp/pdal-buildroot/usr/include/pdal/io/private/ept/Artifact.hpp
-- Installing: /usr/src/tmp/pdal-buildroot/usr/include/pdal/io/private/ept/Addon.hpp
-- Installing: /usr/src/tmp/pdal-buildroot/usr/include/pdal/io/private/copcwriter
-- Installing: /usr/src/tmp/pdal-buildroot/usr/include/pdal/io/private/copcwriter/VoxelKey.hpp
-- Installing: /usr/src/tmp/pdal-buildroot/usr/include/pdal/io/private/copcwriter/VoxelInfo.hpp
-- Installing: /usr/src/tmp/pdal-buildroot/usr/include/pdal/io/private/copcwriter/Reprocessor.hpp
-- Installing: /usr/src/tmp/pdal-buildroot/usr/include/pdal/io/private/copcwriter/PyramidManager.hpp
-- Installing: /usr/src/tmp/pdal-buildroot/usr/include/pdal/io/private/copcwriter/Processor.hpp
-- Installing: /usr/src/tmp/pdal-buildroot/usr/include/pdal/io/private/copcwriter/Output.hpp
-- Installing: /usr/src/tmp/pdal-buildroot/usr/include/pdal/io/private/copcwriter/OctantInfo.hpp
-- Installing: /usr/src/tmp/pdal-buildroot/usr/include/pdal/io/private/copcwriter/GridKey.hpp
-- Installing: /usr/src/tmp/pdal-buildroot/usr/include/pdal/io/private/copcwriter/Grid.hpp
-- Installing: /usr/src/tmp/pdal-buildroot/usr/include/pdal/io/private/copcwriter/Common.hpp
-- Installing: /usr/src/tmp/pdal-buildroot/usr/include/pdal/io/private/copcwriter/CellManager.hpp
-- Installing: /usr/src/tmp/pdal-buildroot/usr/include/pdal/io/private/copcwriter/BuPyramid.hpp
-- Installing: /usr/src/tmp/pdal-buildroot/usr/include/pdal/io/private/copc
-- Installing: /usr/src/tmp/pdal-buildroot/usr/include/pdal/io/private/copc/Tile.hpp
-- Installing: /usr/src/tmp/pdal-buildroot/usr/include/pdal/io/private/copc/Key.hpp
-- Installing: /usr/src/tmp/pdal-buildroot/usr/include/pdal/io/private/copc/Info.hpp
-- Installing: /usr/src/tmp/pdal-buildroot/usr/include/pdal/io/private/copc/Entry.hpp
-- Installing: /usr/src/tmp/pdal-buildroot/usr/include/pdal/io/private/connector
-- Installing: /usr/src/tmp/pdal-buildroot/usr/include/pdal/io/private/connector/Connector.hpp
-- Installing: /usr/src/tmp/pdal-buildroot/usr/include/pdal/io/private/GDALGrid.hpp
-- Installing: /usr/src/tmp/pdal-buildroot/usr/include/pdal/io/point_types.hpp
-- Installing: /usr/src/tmp/pdal-buildroot/usr/include/pdal/io/TextWriter.hpp
-- Installing: /usr/src/tmp/pdal-buildroot/usr/include/pdal/io/TextReader.hpp
-- Installing: /usr/src/tmp/pdal-buildroot/usr/include/pdal/io/TerrasolidReader.hpp
-- Installing: /usr/src/tmp/pdal-buildroot/usr/include/pdal/io/TIndexReader.hpp
-- Installing: /usr/src/tmp/pdal-buildroot/usr/include/pdal/io/StacReader.hpp
-- Installing: /usr/src/tmp/pdal-buildroot/usr/include/pdal/io/SbetWriter.hpp
-- Installing: /usr/src/tmp/pdal-buildroot/usr/include/pdal/io/SbetSmrmsgReader.hpp
-- Installing: /usr/src/tmp/pdal-buildroot/usr/include/pdal/io/SbetReader.hpp
-- Installing: /usr/src/tmp/pdal-buildroot/usr/include/pdal/io/SbetCommon.hpp
-- Installing: /usr/src/tmp/pdal-buildroot/usr/include/pdal/io/RasterWriter.hpp
-- Installing: /usr/src/tmp/pdal-buildroot/usr/include/pdal/io/QfitReader.hpp
-- Installing: /usr/src/tmp/pdal-buildroot/usr/include/pdal/io/PtxReader.hpp
-- Installing: /usr/src/tmp/pdal-buildroot/usr/include/pdal/io/PtsReader.hpp
-- Installing: /usr/src/tmp/pdal-buildroot/usr/include/pdal/io/PlyWriter.hpp
-- Installing: /usr/src/tmp/pdal-buildroot/usr/include/pdal/io/PlyReader.hpp
-- Installing: /usr/src/tmp/pdal-buildroot/usr/include/pdal/io/PcdWriter.hpp
-- Installing: /usr/src/tmp/pdal-buildroot/usr/include/pdal/io/PcdReader.hpp
-- Installing: /usr/src/tmp/pdal-buildroot/usr/include/pdal/io/PcdHeader.hpp
-- Installing: /usr/src/tmp/pdal-buildroot/usr/include/pdal/io/OptechRotationMatrix.hpp
-- Installing: /usr/src/tmp/pdal-buildroot/usr/include/pdal/io/OptechReader.hpp
-- Installing: /usr/src/tmp/pdal-buildroot/usr/include/pdal/io/OptechCommon.hpp
-- Installing: /usr/src/tmp/pdal-buildroot/usr/include/pdal/io/ObjReader.hpp
-- Installing: /usr/src/tmp/pdal-buildroot/usr/include/pdal/io/OGRWriter.hpp
-- Installing: /usr/src/tmp/pdal-buildroot/usr/include/pdal/io/NullWriter.hpp
-- Installing: /usr/src/tmp/pdal-buildroot/usr/include/pdal/io/MemoryViewReader.hpp
-- Installing: /usr/src/tmp/pdal-buildroot/usr/include/pdal/io/LasWriter.hpp
-- Installing: /usr/src/tmp/pdal-buildroot/usr/include/pdal/io/LasVLR.hpp
-- Installing: /usr/src/tmp/pdal-buildroot/usr/include/pdal/io/LasReader.hpp
-- Installing: /usr/src/tmp/pdal-buildroot/usr/include/pdal/io/LasHeader.hpp
-- Installing: /usr/src/tmp/pdal-buildroot/usr/include/pdal/io/Ilvis2Reader.hpp
-- Installing: /usr/src/tmp/pdal-buildroot/usr/include/pdal/io/Ilvis2MetadataReader.hpp
-- Installing: /usr/src/tmp/pdal-buildroot/usr/include/pdal/io/HeaderVal.hpp
-- Installing: /usr/src/tmp/pdal-buildroot/usr/include/pdal/io/GltfWriter.hpp
-- Installing: /usr/src/tmp/pdal-buildroot/usr/include/pdal/io/GDALWriter.hpp
-- Installing: /usr/src/tmp/pdal-buildroot/usr/include/pdal/io/GDALReader.hpp
-- Installing: /usr/src/tmp/pdal-buildroot/usr/include/pdal/io/FbiWriter.hpp
-- Installing: /usr/src/tmp/pdal-buildroot/usr/include/pdal/io/FbiReader.hpp
-- Installing: /usr/src/tmp/pdal-buildroot/usr/include/pdal/io/FbiHeader.hpp
-- Installing: /usr/src/tmp/pdal-buildroot/usr/include/pdal/io/FauxReader.hpp
-- Installing: /usr/src/tmp/pdal-buildroot/usr/include/pdal/io/EptReader.hpp
-- Installing: /usr/src/tmp/pdal-buildroot/usr/include/pdal/io/EptAddonWriter.hpp
-- Installing: /usr/src/tmp/pdal-buildroot/usr/include/pdal/io/CopcWriter.hpp
-- Installing: /usr/src/tmp/pdal-buildroot/usr/include/pdal/io/CopcReader.hpp
-- Installing: /usr/src/tmp/pdal-buildroot/usr/include/pdal/io/BufferReader.hpp
-- Installing: /usr/src/tmp/pdal-buildroot/usr/include/pdal/io/BpfWriter.hpp
-- Installing: /usr/src/tmp/pdal-buildroot/usr/include/pdal/io/BpfReader.hpp
-- Installing: /usr/src/tmp/pdal-buildroot/usr/include/pdal/io/BpfHeader.hpp
-- Installing: /usr/src/tmp/pdal-buildroot/usr/include/pdal/io/BpfCompressor.hpp
-- Installing: /usr/src/tmp/pdal-buildroot/usr/include/pdal/filters
-- Installing: /usr/src/tmp/pdal-buildroot/usr/include/pdal/filters/private
-- Installing: /usr/src/tmp/pdal-buildroot/usr/include/pdal/filters/private/pnp
-- Installing: /usr/src/tmp/pdal-buildroot/usr/include/pdal/filters/private/pnp/VoxelRayTrace.hpp
-- Installing: /usr/src/tmp/pdal-buildroot/usr/include/pdal/filters/private/pnp/GridPnp.hpp
-- Installing: /usr/src/tmp/pdal-buildroot/usr/include/pdal/filters/private/pnp/Grid.hpp
-- Installing: /usr/src/tmp/pdal-buildroot/usr/include/pdal/filters/private/pnp/Comparison.hpp
-- Installing: /usr/src/tmp/pdal-buildroot/usr/include/pdal/filters/private/mongoexpression
-- Installing: /usr/src/tmp/pdal-buildroot/usr/include/pdal/filters/private/mongoexpression/Support.hpp
-- Installing: /usr/src/tmp/pdal-buildroot/usr/include/pdal/filters/private/mongoexpression/LogicGate.hpp
-- Installing: /usr/src/tmp/pdal-buildroot/usr/include/pdal/filters/private/mongoexpression/Expression.hpp
-- Installing: /usr/src/tmp/pdal-buildroot/usr/include/pdal/filters/private/mongoexpression/Comparison.hpp
-- Installing: /usr/src/tmp/pdal-buildroot/usr/include/pdal/filters/private/miniball
-- Installing: /usr/src/tmp/pdal-buildroot/usr/include/pdal/filters/private/hexer
-- Installing: /usr/src/tmp/pdal-buildroot/usr/include/pdal/filters/private/hexer/exception.hpp
-- Installing: /usr/src/tmp/pdal-buildroot/usr/include/pdal/filters/private/hexer/Segment.hpp
-- Installing: /usr/src/tmp/pdal-buildroot/usr/include/pdal/filters/private/hexer/Processor.hpp
-- Installing: /usr/src/tmp/pdal-buildroot/usr/include/pdal/filters/private/hexer/Path.hpp
-- Installing: /usr/src/tmp/pdal-buildroot/usr/include/pdal/filters/private/hexer/Mathpair.hpp
-- Installing: /usr/src/tmp/pdal-buildroot/usr/include/pdal/filters/private/hexer/Hexagon.hpp
-- Installing: /usr/src/tmp/pdal-buildroot/usr/include/pdal/filters/private/hexer/HexIter.hpp
-- Installing: /usr/src/tmp/pdal-buildroot/usr/include/pdal/filters/private/hexer/HexInfo.hpp
-- Installing: /usr/src/tmp/pdal-buildroot/usr/include/pdal/filters/private/hexer/HexGrid.hpp
-- Installing: /usr/src/tmp/pdal-buildroot/usr/include/pdal/filters/private/expr
-- Installing: /usr/src/tmp/pdal-buildroot/usr/include/pdal/filters/private/expr/Token.hpp
-- Installing: /usr/src/tmp/pdal-buildroot/usr/include/pdal/filters/private/expr/MathParser.hpp
-- Installing: /usr/src/tmp/pdal-buildroot/usr/include/pdal/filters/private/expr/MathExpression.hpp
-- Installing: /usr/src/tmp/pdal-buildroot/usr/include/pdal/filters/private/expr/Lexer.hpp
-- Installing: /usr/src/tmp/pdal-buildroot/usr/include/pdal/filters/private/expr/IdentExpression.hpp
-- Installing: /usr/src/tmp/pdal-buildroot/usr/include/pdal/filters/private/expr/Expression.hpp
-- Installing: /usr/src/tmp/pdal-buildroot/usr/include/pdal/filters/private/expr/ConditionalParser.hpp
-- Installing: /usr/src/tmp/pdal-buildroot/usr/include/pdal/filters/private/expr/ConditionalExpression.hpp
-- Installing: /usr/src/tmp/pdal-buildroot/usr/include/pdal/filters/private/expr/BaseParser.hpp
-- Installing: /usr/src/tmp/pdal-buildroot/usr/include/pdal/filters/private/expr/AssignStatement.hpp
-- Installing: /usr/src/tmp/pdal-buildroot/usr/include/pdal/filters/private/expr/AssignParser.hpp
-- Installing: /usr/src/tmp/pdal-buildroot/usr/include/pdal/filters/private/delaunator.hpp
-- Installing: /usr/src/tmp/pdal-buildroot/usr/include/pdal/filters/private/csf
-- Installing: /usr/src/tmp/pdal-buildroot/usr/include/pdal/filters/private/Segmentation.hpp
-- Installing: /usr/src/tmp/pdal-buildroot/usr/include/pdal/filters/private/Point.hpp
-- Installing: /usr/src/tmp/pdal-buildroot/usr/include/pdal/filters/private/DimRange.hpp
-- Installing: /usr/src/tmp/pdal-buildroot/usr/include/pdal/filters/ZsmoothFilter.hpp
-- Installing: /usr/src/tmp/pdal-buildroot/usr/include/pdal/filters/VoxelDownsizeFilter.hpp
-- Installing: /usr/src/tmp/pdal-buildroot/usr/include/pdal/filters/VoxelCentroidNearestNeighborFilter.hpp
-- Installing: /usr/src/tmp/pdal-buildroot/usr/include/pdal/filters/VoxelCenterNearestNeighborFilter.hpp
-- Installing: /usr/src/tmp/pdal-buildroot/usr/include/pdal/filters/TransformationFilter.hpp
-- Installing: /usr/src/tmp/pdal-buildroot/usr/include/pdal/filters/TailFilter.hpp
-- Installing: /usr/src/tmp/pdal-buildroot/usr/include/pdal/filters/StreamCallbackFilter.hpp
-- Installing: /usr/src/tmp/pdal-buildroot/usr/include/pdal/filters/StatsFilter.hpp
-- Installing: /usr/src/tmp/pdal-buildroot/usr/include/pdal/filters/SplitterFilter.hpp
-- Installing: /usr/src/tmp/pdal-buildroot/usr/include/pdal/filters/SortFilter.hpp
-- Installing: /usr/src/tmp/pdal-buildroot/usr/include/pdal/filters/SkewnessBalancingFilter.hpp
-- Installing: /usr/src/tmp/pdal-buildroot/usr/include/pdal/filters/ShellFilter.hpp
-- Installing: /usr/src/tmp/pdal-buildroot/usr/include/pdal/filters/SeparateScanLineFilter.hpp
-- Installing: /usr/src/tmp/pdal-buildroot/usr/include/pdal/filters/SampleFilter.hpp
-- Installing: /usr/src/tmp/pdal-buildroot/usr/include/pdal/filters/SMRFilter.hpp
-- Installing: /usr/src/tmp/pdal-buildroot/usr/include/pdal/filters/ReturnsFilter.hpp
-- Installing: /usr/src/tmp/pdal-buildroot/usr/include/pdal/filters/ReprojectionFilter.hpp
-- Installing: /usr/src/tmp/pdal-buildroot/usr/include/pdal/filters/RelaxationDartThrowing.hpp
-- Installing: /usr/src/tmp/pdal-buildroot/usr/include/pdal/filters/ReciprocityFilter.hpp
-- Installing: /usr/src/tmp/pdal-buildroot/usr/include/pdal/filters/RangeFilter.hpp
-- Installing: /usr/src/tmp/pdal-buildroot/usr/include/pdal/filters/RandomizeFilter.hpp
-- Installing: /usr/src/tmp/pdal-buildroot/usr/include/pdal/filters/RadialDensityFilter.hpp
-- Installing: /usr/src/tmp/pdal-buildroot/usr/include/pdal/filters/ProjPipelineFilter.hpp
-- Installing: /usr/src/tmp/pdal-buildroot/usr/include/pdal/filters/PoissonFilter.hpp
-- Installing: /usr/src/tmp/pdal-buildroot/usr/include/pdal/filters/PlaneFitFilter.hpp
-- Installing: /usr/src/tmp/pdal-buildroot/usr/include/pdal/filters/PMFFilter.hpp
-- Installing: /usr/src/tmp/pdal-buildroot/usr/include/pdal/filters/OverlayFilter.hpp
-- Installing: /usr/src/tmp/pdal-buildroot/usr/include/pdal/filters/OutlierFilter.hpp
-- Installing: /usr/src/tmp/pdal-buildroot/usr/include/pdal/filters/OptimalNeighborhoodFilter.hpp
-- Installing: /usr/src/tmp/pdal-buildroot/usr/include/pdal/filters/NormalFilter.hpp
-- Installing: /usr/src/tmp/pdal-buildroot/usr/include/pdal/filters/NeighborClassifierFilter.hpp
-- Installing: /usr/src/tmp/pdal-buildroot/usr/include/pdal/filters/NNDistanceFilter.hpp
-- Installing: /usr/src/tmp/pdal-buildroot/usr/include/pdal/filters/MortonOrderFilter.hpp
-- Installing: /usr/src/tmp/pdal-buildroot/usr/include/pdal/filters/MongoExpressionFilter.hpp
-- Installing: /usr/src/tmp/pdal-buildroot/usr/include/pdal/filters/MiniballFilter.hpp
-- Installing: /usr/src/tmp/pdal-buildroot/usr/include/pdal/filters/MergeFilter.hpp
-- Installing: /usr/src/tmp/pdal-buildroot/usr/include/pdal/filters/MADFilter.hpp
-- Installing: /usr/src/tmp/pdal-buildroot/usr/include/pdal/filters/LocateFilter.hpp
-- Installing: /usr/src/tmp/pdal-buildroot/usr/include/pdal/filters/LloydKMeansFilter.hpp
-- Installing: /usr/src/tmp/pdal-buildroot/usr/include/pdal/filters/LiTreeFilter.hpp
-- Installing: /usr/src/tmp/pdal-buildroot/usr/include/pdal/filters/LOFFilter.hpp
-- Installing: /usr/src/tmp/pdal-buildroot/usr/include/pdal/filters/IterativeClosestPoint.hpp
-- Installing: /usr/src/tmp/pdal-buildroot/usr/include/pdal/filters/InfoFilter.hpp
-- Installing: /usr/src/tmp/pdal-buildroot/usr/include/pdal/filters/IQRFilter.hpp
-- Installing: /usr/src/tmp/pdal-buildroot/usr/include/pdal/filters/HexBinFilter.hpp
-- Installing: /usr/src/tmp/pdal-buildroot/usr/include/pdal/filters/HeadFilter.hpp
-- Installing: /usr/src/tmp/pdal-buildroot/usr/include/pdal/filters/HagNnFilter.hpp
-- Installing: /usr/src/tmp/pdal-buildroot/usr/include/pdal/filters/HagDemFilter.hpp
-- Installing: /usr/src/tmp/pdal-buildroot/usr/include/pdal/filters/HagDelaunayFilter.hpp
-- Installing: /usr/src/tmp/pdal-buildroot/usr/include/pdal/filters/GroupByFilter.hpp
-- Installing: /usr/src/tmp/pdal-buildroot/usr/include/pdal/filters/GreedyProjection.hpp
-- Installing: /usr/src/tmp/pdal-buildroot/usr/include/pdal/filters/GpsTimeConvert.hpp
-- Installing: /usr/src/tmp/pdal-buildroot/usr/include/pdal/filters/GeomDistanceFilter.hpp
-- Installing: /usr/src/tmp/pdal-buildroot/usr/include/pdal/filters/FerryFilter.hpp
-- Installing: /usr/src/tmp/pdal-buildroot/usr/include/pdal/filters/FarthestPointSamplingFilter.hpp
-- Installing: /usr/src/tmp/pdal-buildroot/usr/include/pdal/filters/FaceRasterFilter.hpp
-- Installing: /usr/src/tmp/pdal-buildroot/usr/include/pdal/filters/ExpressionFilter.hpp
-- Installing: /usr/src/tmp/pdal-buildroot/usr/include/pdal/filters/EstimateRankFilter.hpp
-- Installing: /usr/src/tmp/pdal-buildroot/usr/include/pdal/filters/EigenvaluesFilter.hpp
-- Installing: /usr/src/tmp/pdal-buildroot/usr/include/pdal/filters/ELMFilter.hpp
-- Installing: /usr/src/tmp/pdal-buildroot/usr/include/pdal/filters/DividerFilter.hpp
-- Installing: /usr/src/tmp/pdal-buildroot/usr/include/pdal/filters/DelaunayFilter.hpp
-- Installing: /usr/src/tmp/pdal-buildroot/usr/include/pdal/filters/DecimationFilter.hpp
-- Installing: /usr/src/tmp/pdal-buildroot/usr/include/pdal/filters/DEMFilter.hpp
-- Installing: /usr/src/tmp/pdal-buildroot/usr/include/pdal/filters/DBSCANFilter.hpp
-- Installing: /usr/src/tmp/pdal-buildroot/usr/include/pdal/filters/CropFilter.hpp
-- Installing: /usr/src/tmp/pdal-buildroot/usr/include/pdal/filters/CovarianceFeaturesFilter.hpp
-- Installing: /usr/src/tmp/pdal-buildroot/usr/include/pdal/filters/ColorizationFilter.hpp
-- Installing: /usr/src/tmp/pdal-buildroot/usr/include/pdal/filters/ColorinterpFilter.hpp
-- Installing: /usr/src/tmp/pdal-buildroot/usr/include/pdal/filters/ColorInterpRamps.hpp
-- Installing: /usr/src/tmp/pdal-buildroot/usr/include/pdal/filters/ClusterFilter.hpp
-- Installing: /usr/src/tmp/pdal-buildroot/usr/include/pdal/filters/ChipperFilter.hpp
-- Installing: /usr/src/tmp/pdal-buildroot/usr/include/pdal/filters/CSFilter.hpp
-- Installing: /usr/src/tmp/pdal-buildroot/usr/include/pdal/filters/AssignFilter.hpp
-- Installing: /usr/src/tmp/pdal-buildroot/usr/include/pdal/filters/ApproximateCoplanarFilter.hpp
-- Installing: /usr/src/tmp/pdal-buildroot/usr/include/pdal/Dimension.hpp
-- Installing: /usr/src/tmp/pdal-buildroot/usr/include/pdal/pdal_features.hpp
-- Installing: /usr/src/tmp/pdal-buildroot/usr/lib64/cmake/PDAL/pluginmacros.cmake
-- Installing: /usr/src/tmp/pdal-buildroot/usr/lib64/cmake/PDAL/PDALTargets.cmake
-- Installing: /usr/src/tmp/pdal-buildroot/usr/lib64/cmake/PDAL/PDALTargets-noconfig.cmake
-- Installing: /usr/src/tmp/pdal-buildroot/usr/lib64/cmake/PDAL/PDALConfig.cmake
-- Installing: /usr/src/tmp/pdal-buildroot/usr/lib64/cmake/PDAL/PDALConfigVersion.cmake
-- Installing: /usr/src/tmp/pdal-buildroot/usr/lib64/libpdal_plugin_kernel_fauxplugin.so.15.6.0
-- Installing: /usr/src/tmp/pdal-buildroot/usr/lib64/libpdal_plugin_kernel_fauxplugin.so.15
-- Set runtime path of "/usr/src/tmp/pdal-buildroot/usr/lib64/libpdal_plugin_kernel_fauxplugin.so.15.6.0" to ""
-- Installing: /usr/src/tmp/pdal-buildroot/usr/lib64/libpdal_plugin_kernel_fauxplugin.so
-- Installing: /usr/src/tmp/pdal-buildroot/usr/lib64/libpdal_util.so.15.6.0
-- Installing: /usr/src/tmp/pdal-buildroot/usr/lib64/libpdal_util.so.15
-- Installing: /usr/src/tmp/pdal-buildroot/usr/lib64/libpdal_util.so
-- Installing: /usr/src/tmp/pdal-buildroot/usr/bin/pdal
-- Set runtime path of "/usr/src/tmp/pdal-buildroot/usr/bin/pdal" to ""
-- Installing: /usr/src/tmp/pdal-buildroot/usr/lib64/pkgconfig/pdal.pc
-- Installing: /usr/src/tmp/pdal-buildroot/usr/bin/pdal-config
+ /usr/lib/rpm/brp-alt
Cleaning files in /usr/src/tmp/pdal-buildroot (auto)
mode of './usr/lib64/libpdal_util.so.15.6.0' changed from 0755 (rwxr-xr-x) to 0644 (rw-r--r--)
mode of './usr/lib64/libpdal_plugin_kernel_fauxplugin.so.15.6.0' changed from 0755 (rwxr-xr-x) to 0644 (rw-r--r--)
mode of './usr/lib64/libpdal_base.so.15.6.0' changed from 0755 (rwxr-xr-x) to 0644 (rw-r--r--)
Verifying and fixing files in /usr/src/tmp/pdal-buildroot (binconfig,pkgconfig,libtool,desktop,gnuconfig)
/usr/bin/pdal-config:
48c48
<     echo -I/usr/include -I/usr/include/gdal -I/usr/include/libxml2
---
>     echo  -I/usr/include/gdal -I/usr/include/libxml2
/usr/lib64/pkgconfig/pdal.pc: Cflags: '-I${includedir}/pdal  ' --> '-I${includedir}/pdal'
Checking contents of files in /usr/src/tmp/pdal-buildroot/ (default)
Compressing files in /usr/src/tmp/pdal-buildroot (auto)
Adjusting library links in /usr/src/tmp/pdal-buildroot
./usr/lib64: (from <cmdline>:0)
	libpdal_base.so.15 -> libpdal_base.so.15.6.0
	libpdal_plugin_kernel_fauxplugin.so.15 -> libpdal_plugin_kernel_fauxplugin.so.15.6.0
	libpdal_util.so.15 -> libpdal_util.so.15.6.0
Verifying ELF objects in /usr/src/tmp/pdal-buildroot (arch=normal,fhs=normal,lfs=relaxed,lint=relaxed,rpath=normal,stack=normal,textrel=normal,unresolved=normal)
Hardlinking identical .pyc and .opt-?.pyc files
Processing files: pdal-2.5.6-alt2
Executing(%doc): /bin/sh -e /usr/src/tmp/rpm-tmp.1370
+ umask 022
+ /bin/mkdir -p /usr/src/RPM/BUILD
+ cd /usr/src/RPM/BUILD
+ cd PDAL-2.5.6
+ DOCDIR=/usr/src/tmp/pdal-buildroot/usr/share/doc/pdal-2.5.6
+ export DOCDIR
+ rm -rf /usr/src/tmp/pdal-buildroot/usr/share/doc/pdal-2.5.6
+ /bin/mkdir -p /usr/src/tmp/pdal-buildroot/usr/share/doc/pdal-2.5.6
+ cp -prL AUTHORS.txt LICENSE.txt README.md /usr/src/tmp/pdal-buildroot/usr/share/doc/pdal-2.5.6
+ chmod -R go-w /usr/src/tmp/pdal-buildroot/usr/share/doc/pdal-2.5.6
+ chmod -R a+rX /usr/src/tmp/pdal-buildroot/usr/share/doc/pdal-2.5.6
+ exit 0
Finding Provides (using /usr/lib/rpm/find-provides)
Executing: /bin/sh -e /usr/src/tmp/rpm-tmp.lS9se1
find-provides: running scripts (alternatives,debuginfo,lib,pam,perl,pkgconfig,python,python3,shell)
Finding Requires (using /usr/lib/rpm/find-requires)
Executing: /bin/sh -e /usr/src/tmp/rpm-tmp.0YUtTE
find-requires: running scripts (cpp,debuginfo,files,lib,pam,perl,pkgconfig,pkgconfiglib,python,python3,rpmlib,shebang,shell,static,symlinks,systemd-services)
Requires: /lib64/ld-linux-x86-64.so.2, libc.so.6(GLIBC_2.14)(64bit), libc.so.6(GLIBC_2.2.5)(64bit), libc.so.6(GLIBC_2.3.4)(64bit), libc.so.6(GLIBC_2.32)(64bit), libc.so.6(GLIBC_2.34)(64bit), libc.so.6(GLIBC_2.38)(64bit), libc.so.6(GLIBC_2.4)(64bit), libgcc_s.so.1(GCC_3.0)(64bit), libgcc_s.so.1(GCC_3.3.1)(64bit), libpdal_base.so.15()(64bit) >= set:pkbFzftQKbqUqGRb6KXvUeCc5f6y0EvoPZFz4f55UByV1FXBAyXwvcUicrdb1C4, libpdal_util.so.15()(64bit) >= set:kh5nOxI4NX7XjsI0, libstdc++.so.6(CXXABI_1.3)(64bit), libstdc++.so.6(CXXABI_1.3.7)(64bit), libstdc++.so.6(CXXABI_1.3.9)(64bit), libstdc++.so.6(GLIBCXX_3.4)(64bit), libstdc++.so.6(GLIBCXX_3.4.11)(64bit), libstdc++.so.6(GLIBCXX_3.4.14)(64bit), libstdc++.so.6(GLIBCXX_3.4.20)(64bit), libstdc++.so.6(GLIBCXX_3.4.21)(64bit), libstdc++.so.6(GLIBCXX_3.4.26)(64bit), libstdc++.so.6(GLIBCXX_3.4.29)(64bit), libstdc++.so.6(GLIBCXX_3.4.32)(64bit), libstdc++.so.6(GLIBCXX_3.4.9)(64bit), rtld(GNU_HASH)
Requires(rpmlib): rpmlib(SetVersions)
Finding debuginfo files (using /usr/lib/rpm/find-debuginfo-files)
Executing: /bin/sh -e /usr/src/tmp/rpm-tmp.snRoAP
Creating pdal-debuginfo package
Processing files: libpdal-2.5.6-alt2
Finding Provides (using /usr/lib/rpm/find-provides)
Executing: /bin/sh -e /usr/src/tmp/rpm-tmp.LsFMwX
find-provides: running scripts (alternatives,debuginfo,lib,pam,perl,pkgconfig,python,python3,shell)
lib.prov: /usr/src/tmp/pdal-buildroot/usr/lib64/libpdal_base.so.15: 3727 symbols, 22 bpp
warning: hash collision: _ZNK4pdal9BpfReader7getNameB5cxx11Ev _ZTSN4pdal20TransformationFilterE
lib.prov: /usr/src/tmp/pdal-buildroot/usr/lib64/libpdal_plugin_kernel_fauxplugin.so.15: 21 symbols, 15 bpp
lib.prov: /usr/src/tmp/pdal-buildroot/usr/lib64/libpdal_util.so.15: 116 symbols, 17 bpp
Finding Requires (using /usr/lib/rpm/find-requires)
Executing: /bin/sh -e /usr/src/tmp/rpm-tmp.Gt2a0Z
find-requires: running scripts (cpp,debuginfo,files,lib,pam,perl,pkgconfig,pkgconfiglib,python,python3,rpmlib,shebang,shell,static,symlinks,systemd-services)
Provides: libpdal_base.so.15()(64bit) = set:pdbhK7GxlSKnJiZHrt8WT8jR5yvw8ik9k4XepKeqCC2ULHd4qbaGZ9CJiWld1PxTqXiChXkcqxmrCQ56DC81DACkhpxY9sLwexQRFMV86rhMvrlqfBAO63tDNhsbF7v7DkPFyrhMYZkSag3H355Ak97RtBir3BhdAeO5q7n1CWrzcmXZz4V1B9JpIVCMype5C59kyBVjnnYCWB47J5PkFOcuq779LXbLTi1pLqd41a5o8tFY4YeqlYTZoup3ZIbFIA3q3g5e15DvgXa2rBcWN7w3NBU8fNeaf6T3LDZeMMU9UhoVrABv4Ti2XP4rYy21HxiMBfUOLW1TXdzCRAbuh6ODCUOCx1Vj8ohi9OY4ZuZ012Ob8iPb5BeqrlBtkFy6x8hxFKYBaIzC8j8HSVwl2UZh7FxxYEpuajAaYyPnWZ5joFHGaOV8iuRsJ2iv702iu3DZ9qyAFG1l8ZhZbOK7O7FZ6iTLhSHsgVnp9ck4aAqQAq0XyZy2rKwZ2KeXIxt9rRYLt8EQsQVhB5pw6XI3MqIiAZyD5PzDcCYgL0g3csfAypZutiJ9BpOqKkzhjNJVVc5ORJwIP5ltBdiLCBw4jZgZyjeRxdxJTxCNt2WMtQLIP7nxAk1W5oesBzxlSN9e5P89vpFrPbqDkzA5P0HlK8HHJsZait6ad6NrYZJi1UPeKC9A06TTf5RGmZGYLrIsqpZe4MbzIguxzsrG7ikVZkmrzJcy7cLgAEMGMAdqdT0QpQuiXuCXkzltz5oIpqzdQTFrsfwYkWqEUGZwiV951S7S8tQPnH7Nc3hpwaROMDvZ1jALCWmPsBr0QIesZsaDaVcpmgbQLsaF4HpliabHZl6lCO8UceOeosQljxxm2KZr7GPJPYKhlWZ9tqTpFoIMhJCM4o5S8CYZyGZFxG6JzwZ7U1V0ZDhpwqNz5v6UZ5IrydZKY4aqghBwPCi2v8ZL9tWWjTjvjKwZh8e0dECMTw7MvrbTl65JTgTjj4tZFozPq2EZ5F6DyXJSDWzvg2adrcOIR8tCZ5uhRsQ2N0ZwMyAIdZ8KJ7xZHlIvQcH1H7eoq8n6pALuEgpbqu4aZqZDnsZoO53iPfK1oKXZoVNuU9AoCeWR9wKMdULckcEPrFWHkEf7sfab2mmwTyiH8rBwdkftjoEj5K22Wz8u8LnM9UhVca8ZF3WhwTMZkI1jj5EFSLUsDgjc8tgOqBzCk14R9DoGlZrG7wyCMuYpFoOJuqtYlq6TZBmbpMrgxZf4mNPvjU8MEYPTq85GZkx8rey6rMgz1rKUnQwl9o69GVbBuDw5sOla1rL23aeMitLgaNfaAgZvlRddoLVMbb5kpNGspZgxClqSyjwAJhZie0vczgfkvhZBikcl8CDeAcVI1f4RbFvfwD3XudkYBkay8sl3P6XUpFuqrCmk4DK5eiJ3EPxeezDuzwzINvg2GU9cMcqCo3p8Qcra7OVdZdUwF90vw2xVikE4GUaafoZtcbRCeN5Q9KvI9HVxjygv28JAhW2jlJaBeYZBEZo8I34XCbZvYVOY64dRVmjCTOeqhcN2dfBSjv4h5B0VPEAuRawQovLKzMfaXWvCftLItfZbOEaj9XpSm8lyUBTSZtfCT2j0xESWKLnZ1MbN99IGeoZ0yoR5P3Z2HmzFhmQhba6An2aCdfRQRZhLFhyFo5geiZvWxB2td4ewKgU8txOsSRc8nuDJemw5Nv0g7nk1KlSELygOISUnZsGrOs4gkLdAmZnLPmPQsifHHIvKZ5jKM6riCjEklAecH233qPR8yY4mybiLV549ZyeSkm2eT9mXuoFKXsbnPkYIa4fI8DZ50DiaG97ImEz3nXI7GH7QrTxGYJKt4CqdS9RHMYY9lyk1jjhSDOClzHLA6I8TxPaJ18QYaI8vCGcPP7Zg9ZxwFOTA9nfwciZBSxTy2pRuQ0X7OFDovKHw8AMVv12WGXgIJpxiwvhuYjl7aRrcsiX9vjqeFtndZeLESEciLy9985t54DGYdBGN9RCXaFoQKGNhCrNXAjpXPwkKZB4kcOPRWlaLpRhFQUzh9Fi6IUZdcG1jhZi4HylhSVmZJVutEsND67N0BNzX0Zay6uaaI13dtyERi6QRxbOBV6NsEoK4C49eQJG0Vwt1uKE8ZuhpZJUaEGscS4bdWgv3N6ZjG1Ro3jCkK1xGCrHiFV2beWZ8uCnUe61eoz5ISqZz1y3pW4hSS8cm4lRKA6Zf3HC7AmgvraqGJUmIVcxbHKDUmGCuWo1Ro2dhNIxfiSyxemhT7CSetuXEAuteaqt3ymLMo5JQ0PH5WY9fAzfxl7IbZbB94KtSkbA4YypSElYFZGwhoU6JIb4fyMqTbFUJJrOHt3LDjhwMXwCBygEu4pPcLyn5957I0AAhFbaYYhZ97mPOwiZtkSyZjEltx5UJBD99RxOgTrVIBNFreAnsp4ZFMGhdfhC6p46XJ27AoqyQFZznveiQ4ZCON9Mkia81JLxEQOH477QA2fZIdOqleQz0NLtZ0S86CgKolFNXYhOgTR4GIQiLv43BcS6YHbdiVdpx9PwHyuWlkhkQS5OPXF5klMYrjq77JFNSii1vft3AMiaczblm6JqMfZzmUXCskgkP1x7lnx97d4nlIGQn3UnQzrJJhZ7lOJWnr6F49cqM6g0zGGtEOdYQKrN73KcgOSkTuN6zB2zHQCfkjEQZE8TBvX5crF6KhmjIMar6A9QjRQXlyt1eMmr4a3UpwhzguCTUBXzYQfLXqYAgKs8Ncp7qiZd6Yw7EJ5TBB45nSna7AB45F35P4vjdfC9VnMJFl74KnlKKOKANGq2Zrdef3CVd7HM7EAWIQjQdDjLnH0Oug1epcjjxCo9VkggshxANrWCC02h4hkSyenEKR8xSjuaW8rTI5fSK0bJSM3Z2sgHQl9C4b9LGWxkMPc9coOeC7kQI2nlt3fHenxq1mkVJq5SU4FDsvlyFBDDZqBnhHpgIt0NiJWgR4ZDVlKhUiCn2Dz9FKtON3dKQqDCnqMffZhingbF1Z89tu38mYdZvXzp9CtH6Ef1lANT0WoEq6AkwZgBtOgZoZlv0Q6CF65W56WZJwvqlZtt7G23AMPXTCMCAymaiXJfzvaMlWYvCimOVXKzlZjzNOCOJp2MtFok8DsyS5WtxZ6wY7L1fThwIwvNjTuE4A4OPyhF69CvMJ9EtnsjYZcUAt5SQVQgRwxHReUJxfhjuIIudkm3VsrzrvZdZFXfqTLsFLZKY3afbxn0Z8xeMhGdprYLidajxwcUZ46deFLdT0JZ0949Wsrsn6D9ymR19PrY8s6mtsXCtqyBuVzvhdZdcdnBHJVO8NOvMsAzO5f140Z7YTvWZCUSewyhq3YdiKUCXiFqv52dv0BLHLxa418rGL8fo19Z1VZmoCCykCgTKT0awb2bZvg2w3OKghifgwAxjWayBsy3QmpKaqmhYg2EwtBSu1I973dpC7RTZybFqEXPwEIU4cny1kZgV9Z5yyGcIhumpBUOI8G9hNlJ3QImjp47zNBMyA2HAZEZwSBcesSbOg6IOa3c5TfNzezQ174UVZEgAb9l5Re4bsyPMqZmMQDcluTnzZyHwbW6rZu4w7lfMO8ATZL7anAolDqd1ZnDjmnc2c6m4tZzdAkAEuWvSuAay6ldA5iI6rL1TI1yK8fxPyZJmxUZJTTicPDIeCzYhZClZ3OW2mpjq5vFKPlNt0uZAUHMf87OLKzhosmtRaERHx8FrupKnNZ1QJxv0P0ZaOb9HvFU0OdjJny8JFOpK0Ieyrdyti9cwevTpAeK6ItlVTYlfIN60fqmyBzRB2Xcc6gTZI5v8eOirtETw9O7dXAonVOKJBeq20IMOG6fCc5dJhAv8TqH5PXUs7Z5gVr3FyF7sY8OLtj5x79pCGZtAjpmedVbpFYfMVp1wmNbWL87vJy1HqqwG0p132x6KpeICsH8dcfU1q1EioYqMoVsI4TSxESU2VjZy55N4iFKZnawzCSSRVCHPbKUhIY2LrDvFsTMTqlXqHbEiSuaoigcFLmSnNAIGZu5N9bhOqJH6fq7fAkzMZbwGhYZ2jso6ZAMBHicSf8rfcpybs9sadyRjf3hL2VmhRX9cyZ0DawQ21BZ9fTdWqz4nylKNCHJEzWi1P6QoS1KPvzLtq8mZbZdClqfbqkTaWPH3PRE2L38EABuxRz6v5ax6mMvRCDJH1LhYjQT0j6ZwLaJlFQ69xHvXXxWROZ3qI8MR8u6su6c2jf5AgSCX2sBXdC3VwZi2swJhEZw8FVnjH94Mbq6Xwr9i20fZhhLTo3ZEZvj1sJHnTqKhlOFWaoww0OZjuyNqXVa7bgcrZrZcLbDXRZeXY7j85oZLq9rRzuaouQHkgzZENzm71ADiJyUP29nloSTfFywUjFAenJg5dE9ckMSKBH8NUf5bZc21255HrHPJRrkSVIL6GiXRx1IKjlAg3tz5VOPBOwW8kcUEQZp0s1YZcZ0zWegipPYhjJNEEKgoyd2mejpBH8hwFFGas3QWTGQaTlW7bP9pAGWLrbriCHsmNcupQrqaLAwZkY6S3m0PcyJsSJYUFIZntUluVJELjHFXgou2AXL0MozEUmnRZcRGzrgdGmbZbEOf9OYDZgg5YZFdWQuGpZwJBxMpsNZebQKmDKKNELIiWqR5qJqovDZIHY4iG2oW5ZwZJO9AOD8U2cAgHz9R9ZljFoWA8iH3JskZIgNDe590gAWD1FNiMCTOZmyfFX0PsyVh5y6TRQ6dKOZaAMm6GfknluZrctUAAXSeLPYkZ9P9vONhMFwMYKVmA4Bm5Z9tusn9nJ3XbGARH6MqkIRjVmHOV001y2M9FSIqHZwyqZEFnYCXIlc8gVmJZwEZwAfQ1mezIMOKPk0GUsOdRsrL6lLxG4IZaBY7lE9CcvAAY6iTB6ZoR2CePK9Moh9M2bMsDq334VTbJ6ZeHdltPtMpqzdocVLFNejESuxxcMLR89UkkahRPZ7FHrl2HEEXsJBgSJDZ89Bnl63Zo8jvjLfB1Ws7c2U1x2SVZoUFEFAcIfjqKN7K61ZsL6MeP1FXuNJ9VGMYWDka6GJ5WHnjbVHy5iUmG8yYAwUjRkDBibh1BKszc38CBM3OL0Her36VSKIBB4CYOsPGLm7wgwzZ0bj0Z3uFARZhZmsgZeajZ2iOG6cQP7IqZuo4S3QbmWf4FYSE0FGVSVesXo4YlAtlImOSUbwDWftIUOFrFeB9WKp26r39iDyjhZsCo4vgx3UXsMECvcex6b3AYiQRefLufUaQlng5zZCoRIag9gN88l4TIFCfPq9DhoE10DaVb2aLV5N2XZAsJJBO4sZjZ1Jf6TpZxhT6yOBAUcYnfRz83OSrTPlvtXZIwpO6FZHq9ZfmDW4Yn5gUdZ8zhQvg9acnW3kqKZGZAc6zehJDU5DOFfha0hCfoQb2I8S7IIPXNnnTkGGVcFLlB5ZmGuoZuWPIZr5iiEvvI6F8gBcnMAWsK2aoGfZajY0970xnhxCH4BNgN5vKFy1i9m7swAerPIMdGDQ4sTnVR4UvplIQHXmnGucGXPN8AZ07IIMfZBto6N93B5EDO0rJ2TaDxTI1LZyLqZpddTVaxRz1HMxkO8Vd8ZaZa7FCDUgWwH9Udaa1Kout2a4kaPnySjjp8VQKITZd3gVhoMT8eraKJXaR9sRdQzfoOCAtSKIBy9AVh6N6UISCicLHX493Or732A1MbBLDkMjmFQ8wt17ZebPIWIZdnmTk1Dd6V3Je3wbdpxeHg6X1jxRFVL1gmi7pN0mrcOZpBdbiXb715jiZxfn2NHhgCEitkmg7LxwAjI0aC6F5EThqZlcUZzQGTvyFOsjXYxCehhtgNZJ6vBiqOsPYLsh3KrQf3VDokz5Z3Ov27QauxMlhIDNqGxlOBWRHq4H9jFTdcI1n4RZ0Xy1LyWzoEB3hAVZEHdrRVHk78Ze8gALFV9ADH7Wd95PIfTAgS8Qxoxj0GH1xwINMjqDFZdyGZALVurGcLJWzQu1Amkqu2dU7lfwtjifCEmmgXCkoI3us6ctZHZ8YKgk5pmogAEYwXXf63LkRVMgwK1Kx9DLMhPChROnVBghZoxSwFvUgQMmNoq5tEqEdS9ZEiy1h9ZclHUOqkosQXEFHz9OdKUjIOcMY4aAXO27b2PEmp1NI8Wxui9NkwnNwwGZGZECtNCHdPgm5h38JGVh18xB0ZqweP9sKt2726Z9DsmNvfHNQ8kapTBmlfsZaH6ZAbaQ4Z6mFYXc5K0aYUwSjOzoN0vCokoRnhgOXuUcZBXKSdiAV6QBDvAr0HIRNft0rAddWSHZCs1lNXuIZb6Y1GskAUsTqeviTIiJZ63pwUSY4FuwW2IsrMYel3qQwp9ZwA7WUHD5YjfJahwBkxkrq2ozu6VKAFyF5WLQvy1HoGONQzubWjIyuuYigppITaBZcPbk5X6m6dMKnpIMQxkZmpbUxrwLMapnG7kp3Anw5JTmaZDCTS1qVR1yBLvaDC1HfjRTPZhRCMmPv0u0gz9vMWGL1e4d3g9kl4UpSrQmKgrHfZBUfhCL1QmAiz1N97Fw8f6owhyMxLnYVxg6g5Zq7E529xNXAEhC3GmCyIWuahLjFqRmJvphkP9x75ljcKiJdPpXdx2kE8QZfaccnZjH2Vi6ZmWgolamlxG3vV8NqfRdt4J27vQ2RDbqUIepZoAyM1zHPxOduYmZbtt1hDkWNrsWFbYoo6YjKrlaJHYrz6a5FZqqadbvv8PcjQ7gIHr4qLJUJc6W9FxxgIyfcYVsSXoazgpwOkbCrGcz86rC20wDlcGoMDeOZxUTR6IvfHe0cxBZHAI85yLqx6LyqyyghuaixDIMQaMJmUA9yv7sLsmZEFUZ5tb3Ed5iAnozVxcxm3uzHVOTdKtM4OHSPNzfvZ1yKOsecYrUCi4RafyFvABfnW1Sa3W3OpYh2fcXGnvsUEdSZlqhusJW4qJ5L9RGTuuwoXZJ95XxwcGYNWYmKnOboZcp6CEcbUKYGieBeSLqZAxXqFUYgWP413llxgjmwpaPEX68L4QlGTRHck8qIhdnl12v0ZHH3PUS9ZqP1kcQSXdQ8Xcy8THnNzZs0j2aeubOk1LZ7VFfljZEGTfBKQHEm3iLHHZohuijogUTQlR7qirBlTtyDCBN1uYD9oSl7xOlFqm8dZep040t0ZKcpWzZH6RHToW6XrjyNtX1OgojYauq7sD5OoksHksn21G79PcV11mgLwpDi0jCQYIZ1NbllSvnfbeafhoWBnTVnYRRgdTkcijHsUBB6Q9CLRjDC3M0rCHbmVMgs1s55GaUJwQk7axq7hq6uVcmMNaHd838LyeknoRkubEjDGFmCc1WgbH5V4V1MDUd4ZoMwaWUVI1, libpdal_plugin_kernel_fauxplugin.so.15()(64bit) = set:idKpyCzqlCEP46V4mvf3h2TqmavDMVY1PeQfbqBOueeE, libpdal_util.so.15()(64bit) = set:kdqan8re9X5ehaG1fN1q38eYpUQcA4imotrhL9p4AgZgcK3ZjBJNrmDHbSzSiV9cAZdM62aVq4yCQmT8liQxWsqjlzELLTjBiP0MggMZqZnWuXMI6s0ZHlgrs8wtL47xLO6VPm0bjNwffJwfQFZlhcEXYxfATzl3B18ubWwYm34xbFDyJtSJqDBO39chu7HUmCqRyPr73MRGwQVoRcnzxNG5BxUvZ3VuwNNXO72
Requires: ld-linux-x86-64.so.2()(64bit) >= set:jiids, ld-linux-x86-64.so.2(GLIBC_2.3)(64bit), libc.so.6(GLIBC_2.14)(64bit), libc.so.6(GLIBC_2.2.5)(64bit), libc.so.6(GLIBC_2.27)(64bit), libc.so.6(GLIBC_2.3.4)(64bit), libc.so.6(GLIBC_2.32)(64bit), libc.so.6(GLIBC_2.33)(64bit), libc.so.6(GLIBC_2.34)(64bit), libc.so.6(GLIBC_2.38)(64bit), libc.so.6(GLIBC_2.4)(64bit), libcrypto.so.3()(64bit) >= set:qmvV2QBieeRcHaS6E2kIRkxoI9EHzlZHG0JCDJQMwJRK1, libcrypto.so.3(OPENSSL_3.0.0)(64bit), libcurl.so.4()(64bit) >= set:kgZtdjewuBSOM3YXjuKGePG5KIVF9mA3, libgcc_s.so.1(GCC_3.0)(64bit), libgcc_s.so.1(GCC_3.3.1)(64bit), libgdal.so.32()(64bit) >= set:qi7chznjkiFtRDecOPdCCFuAAnoxxpyubrqarqEToRoGQs3Xz4YZBVK9NhZgwJnZ9kDgsM1txFdSyBZ6zcZztZ0dm3rGInizLQQ5ZIeC2t7wKZ2ey6kVLbNDhfHwruLPM5wR2zJ13VelnPbwlZuEZwt1paeSuk9MZlm27EwOONfxx2pjH1P1wILanTUsMCAtYDj6E1DMiGl8wVdZhjVb0sqrZjoL53JsNfVY8oM78PaUWCOSms3CCzgg6trHA35VZ6ROfvZgZsh6w0H9swgXGxCE2go9vzjkdeHgCgZo2xU2wrBiz1Z6HzLYNZLoHnQtenNYFNaT2FZjMVX5Htm6d3azyHBM0HZCQh8IZ8EKTrAyMExm2V3rUS3dBKBRMyvZoi8l59eZcl7mAFCaIJEhjHIamsKUw9jlE7xMY1XZxmyz51S0CvNgZkEE0TV86tbZnOyFiCrZEOyDao1RxINKF6TGK5, libgeotiff.so.5()(64bit) >= set:kgmGEWM6bQc0rp7bvdSZlZdOOqRb2pAb, libm.so.6(GLIBC_2.2.5)(64bit), libm.so.6(GLIBC_2.29)(64bit), libm.so.6(GLIBC_2.38)(64bit), libstdc++.so.6(CXXABI_1.3)(64bit), libstdc++.so.6(CXXABI_1.3.1)(64bit), libstdc++.so.6(CXXABI_1.3.2)(64bit), libstdc++.so.6(CXXABI_1.3.5)(64bit), libstdc++.so.6(CXXABI_1.3.7)(64bit), libstdc++.so.6(CXXABI_1.3.8)(64bit), libstdc++.so.6(CXXABI_1.3.9)(64bit), libstdc++.so.6(GLIBCXX_3.4)(64bit), libstdc++.so.6(GLIBCXX_3.4.11)(64bit), libstdc++.so.6(GLIBCXX_3.4.14)(64bit), libstdc++.so.6(GLIBCXX_3.4.15)(64bit), libstdc++.so.6(GLIBCXX_3.4.18)(64bit), libstdc++.so.6(GLIBCXX_3.4.19)(64bit), libstdc++.so.6(GLIBCXX_3.4.20)(64bit), libstdc++.so.6(GLIBCXX_3.4.21)(64bit), libstdc++.so.6(GLIBCXX_3.4.22)(64bit), libstdc++.so.6(GLIBCXX_3.4.26)(64bit), libstdc++.so.6(GLIBCXX_3.4.29)(64bit), libstdc++.so.6(GLIBCXX_3.4.30)(64bit), libstdc++.so.6(GLIBCXX_3.4.32)(64bit), libstdc++.so.6(GLIBCXX_3.4.9)(64bit), libunwind.so.8()(64bit) >= set:jgZw6GIPwfxCFys, libxml2.so.2()(64bit) >= set:oii9AEUrJVxh9PiomLRZaaM358TPlWsNTOg3EbzaG86hZbp2GEGfyq4iBZ7aRGRaAK113I8gc5EIknD55jNdF9poVUun8EboZbeqpistAEooFF5Umv1, libxml2.so.2(LIBXML2_2.4.30)(64bit), libxml2.so.2(LIBXML2_2.5.8)(64bit), libxml2.so.2(LIBXML2_2.6.0)(64bit), libxml2.so.2(LIBXML2_2.6.2)(64bit), libxml2.so.2(LIBXML2_2.6.23)(64bit), libxml2.so.2(LIBXML2_2.6.5)(64bit), libz.so.1()(64bit) >= set:khdWPIUrJuazFZ5EyqZ72, libzstd.so.1()(64bit) >= set:lhGCrGgGXRZnDtii3c8U6fr1Gkxk32, rtld(GNU_HASH)
Requires(rpmlib): rpmlib(SetVersions)
Finding debuginfo files (using /usr/lib/rpm/find-debuginfo-files)
Executing: /bin/sh -e /usr/src/tmp/rpm-tmp.8M55lD
Creating libpdal-debuginfo package
Processing files: libpdal-devel-2.5.6-alt2
warning: File listed twice: /usr/lib64/libpdal_base.so
warning: File listed twice: /usr/lib64/libpdal_plugin_kernel_fauxplugin.so
warning: File listed twice: /usr/lib64/libpdal_util.so
warning: File listed twice: /usr/lib64/libpdalcpp.so
Finding Provides (using /usr/lib/rpm/find-provides)
Executing: /bin/sh -e /usr/src/tmp/rpm-tmp.DazBPG
find-provides: running scripts (alternatives,debuginfo,lib,pam,perl,pkgconfig,python,python3,shell)
Finding Requires (using /usr/lib/rpm/find-requires)
Executing: /bin/sh -e /usr/src/tmp/rpm-tmp.4HECz7
find-requires: running scripts (cpp,debuginfo,files,lib,pam,perl,pkgconfig,pkgconfiglib,python,python3,rpmlib,shebang,shell,static,symlinks,systemd-services)
/usr/src/tmp/pdal-buildroot/usr/include/pdal/Log.hpp:37:10: fatal error: cassert: No such file or directory
   37 | #include <cassert>
      |          ^~~~~~~~~
compilation terminated.
cpp.req: /usr/src/tmp/pdal-buildroot/usr/include/pdal/Log.hpp: cpp failed, trying c++ mode
/usr/src/tmp/pdal-buildroot/usr/include/pdal/pdal_test_main.hpp:36:10: fatal error: gtest/gtest.h: No such file or directory
   36 | #include "gtest/gtest.h"
      |          ^~~~~~~~~~~~~~~
compilation terminated.
cpp.req: WARNING: /usr/src/tmp/pdal-buildroot/usr/include/pdal/pdal_test_main.hpp: cpp failed
/usr/src/tmp/pdal-buildroot/usr/include/pdal/io/PcdHeader.hpp:38:10: fatal error: Eigen/Dense: No such file or directory
   38 | #include <Eigen/Dense>
      |          ^~~~~~~~~~~~~
compilation terminated.
cpp.req: WARNING: /usr/src/tmp/pdal-buildroot/usr/include/pdal/io/PcdHeader.hpp: cpp failed
In file included from /usr/src/tmp/pdal-buildroot/usr/include/pdal/io/PcdReader.hpp:41:
/usr/src/tmp/pdal-buildroot/usr/include/pdal/io/PcdHeader.hpp:38:10: fatal error: Eigen/Dense: No such file or directory
   38 | #include <Eigen/Dense>
      |          ^~~~~~~~~~~~~
compilation terminated.
cpp.req: WARNING: /usr/src/tmp/pdal-buildroot/usr/include/pdal/io/PcdReader.hpp: cpp failed
In file included from /usr/src/tmp/pdal-buildroot/usr/include/pdal/io/PcdWriter.hpp:37:
/usr/src/tmp/pdal-buildroot/usr/include/pdal/io/PcdHeader.hpp:38:10: fatal error: Eigen/Dense: No such file or directory
   38 | #include <Eigen/Dense>
      |          ^~~~~~~~~~~~~
compilation terminated.
cpp.req: WARNING: /usr/src/tmp/pdal-buildroot/usr/include/pdal/io/PcdWriter.hpp: cpp failed
/usr/src/tmp/pdal-buildroot/usr/include/pdal/io/point_types.hpp:3:10: fatal error: pcd_io.h: No such file or directory
    3 | #include "pcd_io.h"
      |          ^~~~~~~~~~
compilation terminated.
cpp.req: WARNING: /usr/src/tmp/pdal-buildroot/usr/include/pdal/io/point_types.hpp: cpp failed
/usr/src/tmp/pdal-buildroot/usr/include/pdal/io/OptechRotationMatrix.hpp:39:10: fatal error: pdal/RotationMatrix.hpp: No such file or directory
   39 | #include <pdal/RotationMatrix.hpp>
      |          ^~~~~~~~~~~~~~~~~~~~~~~~~
compilation terminated.
cpp.req: WARNING: /usr/src/tmp/pdal-buildroot/usr/include/pdal/io/OptechRotationMatrix.hpp: cpp failed
/usr/src/tmp/pdal-buildroot/usr/include/pdal/private/KDImpl.hpp:37:10: fatal error: nanoflann/nanoflann.hpp: No such file or directory
   37 | #include <nanoflann/nanoflann.hpp>
      |          ^~~~~~~~~~~~~~~~~~~~~~~~~
compilation terminated.
cpp.req: WARNING: /usr/src/tmp/pdal-buildroot/usr/include/pdal/private/KDImpl.hpp: cpp failed
/usr/src/tmp/pdal-buildroot/usr/include/pdal/private/MathUtils.hpp:45:10: fatal error: Eigen/Dense: No such file or directory
   45 | #include <Eigen/Dense>
      |          ^~~~~~~~~~~~~
compilation terminated.
cpp.req: WARNING: /usr/src/tmp/pdal-buildroot/usr/include/pdal/private/MathUtils.hpp: cpp failed
/usr/src/tmp/pdal-buildroot/usr/include/pdal/kernels/EvalKernel.hpp:40:10: fatal error: Eigen/Dense: No such file or directory
   40 | #include <Eigen/Dense>
      |          ^~~~~~~~~~~~~
compilation terminated.
cpp.req: WARNING: /usr/src/tmp/pdal-buildroot/usr/include/pdal/kernels/EvalKernel.hpp: cpp failed
/usr/src/tmp/pdal-buildroot/usr/include/pdal/filters/PlaneFitFilter.hpp:39:10: fatal error: Eigen/Dense: No such file or directory
   39 | #include <Eigen/Dense>
      |          ^~~~~~~~~~~~~
compilation terminated.
cpp.req: WARNING: /usr/src/tmp/pdal-buildroot/usr/include/pdal/filters/PlaneFitFilter.hpp: cpp failed
/usr/src/tmp/pdal-buildroot/usr/include/pdal/filters/GreedyProjection.hpp:47:10: fatal error: Eigen/Dense: No such file or directory
   47 | #include <Eigen/Dense>
      |          ^~~~~~~~~~~~~
compilation terminated.
cpp.req: WARNING: /usr/src/tmp/pdal-buildroot/usr/include/pdal/filters/GreedyProjection.hpp: cpp failed
In file included from /usr/src/tmp/pdal-buildroot/usr/include/pdal/io/private/ept/Artifact.hpp:40:
/usr/src/tmp/pdal-buildroot/usr/include/pdal/io/private/ept/../connector/Connector.hpp:37:10: fatal error: arbiter/arbiter.hpp: No such file or directory
   37 | #include <arbiter/arbiter.hpp>
      |          ^~~~~~~~~~~~~~~~~~~~~
compilation terminated.
cpp.req: WARNING: /usr/src/tmp/pdal-buildroot/usr/include/pdal/io/private/ept/Artifact.hpp: cpp failed
/usr/src/tmp/pdal-buildroot/usr/include/pdal/io/private/ept/EptSupport.hpp:37:10: fatal error: nlohmann/json.hpp: No such file or directory
   37 | #include <nlohmann/json.hpp>
      |          ^~~~~~~~~~~~~~~~~~~
compilation terminated.
cpp.req: WARNING: /usr/src/tmp/pdal-buildroot/usr/include/pdal/io/private/ept/EptSupport.hpp: cpp failed
/usr/src/tmp/pdal-buildroot/usr/include/pdal/io/private/connector/Connector.hpp:37:10: fatal error: arbiter/arbiter.hpp: No such file or directory
   37 | #include <arbiter/arbiter.hpp>
      |          ^~~~~~~~~~~~~~~~~~~~~
compilation terminated.
cpp.req: WARNING: /usr/src/tmp/pdal-buildroot/usr/include/pdal/io/private/connector/Connector.hpp: cpp failed
/usr/src/tmp/pdal-buildroot/usr/include/pdal/io/private/copcwriter/Common.hpp:55:10: fatal error: lazperf/vlr.hpp: No such file or directory
   55 | #include <lazperf/vlr.hpp>
      |          ^~~~~~~~~~~~~~~~~
compilation terminated.
cpp.req: WARNING: /usr/src/tmp/pdal-buildroot/usr/include/pdal/io/private/copcwriter/Common.hpp: cpp failed
In file included from /usr/src/tmp/pdal-buildroot/usr/include/pdal/io/private/copcwriter/Output.hpp:39:
/usr/src/tmp/pdal-buildroot/usr/include/pdal/io/private/copcwriter/Common.hpp:55:10: fatal error: lazperf/vlr.hpp: No such file or directory
   55 | #include <lazperf/vlr.hpp>
      |          ^~~~~~~~~~~~~~~~~
compilation terminated.
cpp.req: WARNING: /usr/src/tmp/pdal-buildroot/usr/include/pdal/io/private/copcwriter/Output.hpp: cpp failed
In file included from /usr/src/tmp/pdal-buildroot/usr/include/pdal/io/private/copcwriter/BuPyramid.hpp:43:
/usr/src/tmp/pdal-buildroot/usr/include/pdal/io/private/copcwriter/Common.hpp:55:10: fatal error: lazperf/vlr.hpp: No such file or directory
   55 | #include <lazperf/vlr.hpp>
      |          ^~~~~~~~~~~~~~~~~
compilation terminated.
cpp.req: WARNING: /usr/src/tmp/pdal-buildroot/usr/include/pdal/io/private/copcwriter/BuPyramid.hpp: cpp failed
In file included from /usr/src/tmp/pdal-buildroot/usr/include/pdal/io/private/copcwriter/Processor.hpp:39:
/usr/src/tmp/pdal-buildroot/usr/include/pdal/io/private/copcwriter/Common.hpp:55:10: fatal error: lazperf/vlr.hpp: No such file or directory
   55 | #include <lazperf/vlr.hpp>
      |          ^~~~~~~~~~~~~~~~~
compilation terminated.
cpp.req: WARNING: /usr/src/tmp/pdal-buildroot/usr/include/pdal/io/private/copcwriter/Processor.hpp: cpp failed
In file included from /usr/src/tmp/pdal-buildroot/usr/include/pdal/io/private/copcwriter/PyramidManager.hpp:44:
/usr/src/tmp/pdal-buildroot/usr/include/pdal/io/private/copcwriter/Common.hpp:55:10: fatal error: lazperf/vlr.hpp: No such file or directory
   55 | #include <lazperf/vlr.hpp>
      |          ^~~~~~~~~~~~~~~~~
compilation terminated.
cpp.req: WARNING: /usr/src/tmp/pdal-buildroot/usr/include/pdal/io/private/copcwriter/PyramidManager.hpp: cpp failed
/usr/src/tmp/pdal-buildroot/usr/include/pdal/filters/private/mongoexpression/Comparison.hpp:39:10: fatal error: nlohmann/json.hpp: No such file or directory
   39 | #include <nlohmann/json.hpp>
      |          ^~~~~~~~~~~~~~~~~~~
compilation terminated.
cpp.req: WARNING: /usr/src/tmp/pdal-buildroot/usr/include/pdal/filters/private/mongoexpression/Comparison.hpp: cpp failed
In file included from /usr/src/tmp/pdal-buildroot/usr/include/pdal/filters/private/mongoexpression/Expression.hpp:37:
/usr/src/tmp/pdal-buildroot/usr/include/pdal/filters/private/mongoexpression/Comparison.hpp:39:10: fatal error: nlohmann/json.hpp: No such file or directory
   39 | #include <nlohmann/json.hpp>
      |          ^~~~~~~~~~~~~~~~~~~
compilation terminated.
cpp.req: WARNING: /usr/src/tmp/pdal-buildroot/usr/include/pdal/filters/private/mongoexpression/Expression.hpp: cpp failed
find-requires: FINDPACKAGE-COMMANDS: cat
Provides: pkgconfig(pdal) = 2.5.6
Requires: /bin/sh, /usr/lib64/libpdal_base.so.15, /usr/lib64/libpdal_plugin_kernel_fauxplugin.so.15, /usr/lib64/libpdal_util.so.15, /usr/lib64/pkgconfig, coreutils, libgdal-devel, libxml2-devel, pkgconfig(gdal), pkgconfig(libxml-2.0), zlib-devel
Finding debuginfo files (using /usr/lib/rpm/find-debuginfo-files)
Executing: /bin/sh -e /usr/src/tmp/rpm-tmp.4oGczP
Processing files: pdal-debuginfo-2.5.6-alt2
Finding Provides (using /usr/lib/rpm/find-provides)
Executing: /bin/sh -e /usr/src/tmp/rpm-tmp.WCTn3t
find-provides: running scripts (debuginfo)
Finding Requires (using /usr/lib/rpm/find-requires)
Executing: /bin/sh -e /usr/src/tmp/rpm-tmp.3w5Ebp
find-requires: running scripts (debuginfo)
Requires: pdal = 2.5.6-alt2, /usr/lib/debug/lib64/ld-linux-x86-64.so.2.debug, debug64(libc.so.6), debug64(libgcc_s.so.1), debug64(libpdal_base.so.15), debug64(libpdal_util.so.15), debug64(libstdc++.so.6)
Processing files: libpdal-debuginfo-2.5.6-alt2
Finding Provides (using /usr/lib/rpm/find-provides)
Executing: /bin/sh -e /usr/src/tmp/rpm-tmp.W9luCH
find-provides: running scripts (debuginfo)
Finding Requires (using /usr/lib/rpm/find-requires)
Executing: /bin/sh -e /usr/src/tmp/rpm-tmp.HvY80s
find-requires: running scripts (debuginfo)
Provides: debug64(libpdal_base.so.15), debug64(libpdal_plugin_kernel_fauxplugin.so.15), debug64(libpdal_util.so.15)
Requires: libpdal = 2.5.6-alt2, debug64(ld-linux-x86-64.so.2), debug64(libc.so.6), debug64(libcrypto.so.3), debug64(libcurl.so.4), debug64(libgcc_s.so.1), debug64(libgdal.so.32), debug64(libgeotiff.so.5), debug64(libm.so.6), debug64(libstdc++.so.6), debug64(libunwind.so.8), debug64(libxml2.so.2), debug64(libz.so.1), debug64(libzstd.so.1)
Adding to pdal-debuginfo a strict dependency on pdal
Adding to libpdal-debuginfo a strict dependency on libpdal
Adding to pdal a strict dependency on libpdal
Adding to libpdal-devel a strict dependency on libpdal
Adding to pdal-debuginfo a strict dependency on libpdal-debuginfo
Removing from pdal-debuginfo 20 sources provided by libpdal-debuginfo
also prunning dir /usr/src/debug/PDAL-2.5.6/pdal/private/gdal
also prunning dir /usr/src/debug/PDAL-2.5.6/pdal/util
also prunning dir /usr/src/debug/PDAL-2.5.6/vendor/nlohmann/nlohmann
also prunning dir /usr/src/debug/PDAL-2.5.6/x86_64-alt-linux/include/pdal
also prunning dir /usr/src/debug/PDAL-2.5.6/pdal/private
also prunning dir /usr/src/debug/PDAL-2.5.6/vendor/nlohmann
also prunning dir /usr/src/debug/PDAL-2.5.6/x86_64-alt-linux/include
also prunning dir /usr/src/debug/PDAL-2.5.6/pdal
also prunning dir /usr/src/debug/PDAL-2.5.6/vendor
also prunning dir /usr/src/debug/PDAL-2.5.6/x86_64-alt-linux
Removing 3 extra deps from pdal due to dependency on libpdal
Removing 3 extra deps from libpdal-devel due to dependency on libpdal
Removing 2 extra deps from pdal-debuginfo due to dependency on libpdal-debuginfo
Removing 22 extra deps from pdal due to repentancy on libpdal
Removing 3 extra deps from pdal-debuginfo due to repentancy on libpdal-debuginfo
Wrote: /usr/src/RPM/RPMS/x86_64/pdal-2.5.6-alt2.x86_64.rpm (w2.lzdio)
Wrote: /usr/src/RPM/RPMS/x86_64/libpdal-2.5.6-alt2.x86_64.rpm (w2.lzdio)
Wrote: /usr/src/RPM/RPMS/x86_64/libpdal-devel-2.5.6-alt2.x86_64.rpm (w2.lzdio)
Wrote: /usr/src/RPM/RPMS/x86_64/pdal-debuginfo-2.5.6-alt2.x86_64.rpm (w2.lzdio)
Wrote: /usr/src/RPM/RPMS/x86_64/libpdal-debuginfo-2.5.6-alt2.x86_64.rpm (w2T16.xzdio)
2706.98user 191.38system 4:43.44elapsed 1022%CPU (0avgtext+0avgdata 1089568maxresident)k
0inputs+0outputs (0major+55485350minor)pagefaults 0swaps
4.01user 1.54system 5:00.20elapsed 1%CPU (0avgtext+0avgdata 126768maxresident)k
31728inputs+0outputs (0major+317988minor)pagefaults 0swaps
--- libpdal-2.5.6-alt2.x86_64.rpm.repo	2023-08-20 15:31:09.000000000 +0000
+++ libpdal-2.5.6-alt2.x86_64.rpm.hasher	2023-09-19 03:06:23.259146039 +0000
@@ -16,4 +16,4 @@
 Requires: libc.so.6(GLIBC_2.34)(64bit)  
+Requires: libc.so.6(GLIBC_2.38)(64bit)  
 Requires: libc.so.6(GLIBC_2.4)(64bit)  
-Requires: libc.so.6(GLIBC_2.7)(64bit)  
 Requires: libcrypto.so.3()(64bit) >= set:qmvV2QBieeRcHaS6E2kIRkxoI9EHzlZHG0JCDJQMwJRK1
@@ -27,2 +27,3 @@
 Requires: libm.so.6(GLIBC_2.29)(64bit)  
+Requires: libm.so.6(GLIBC_2.38)(64bit)  
 Requires: libstdc++.so.6(CXXABI_1.3)(64bit)  
@@ -65,7 +66,7 @@
 File: /usr/lib64/libpdal_base.so.15	120777	root:root		libpdal_base.so.15.6.0
-File: /usr/lib64/libpdal_base.so.15.6.0	100644	root:root	4e30a6dfab5898bde8881fce34759a4d	
+File: /usr/lib64/libpdal_base.so.15.6.0	100644	root:root	4f13b2fe7940f724a73d0ad33f9b1f1e	
 File: /usr/lib64/libpdal_plugin_kernel_fauxplugin.so.15	120777	root:root		libpdal_plugin_kernel_fauxplugin.so.15.6.0
-File: /usr/lib64/libpdal_plugin_kernel_fauxplugin.so.15.6.0	100644	root:root	b41bc4f8573ba2f98e05702f47bdcaab	
+File: /usr/lib64/libpdal_plugin_kernel_fauxplugin.so.15.6.0	100644	root:root	e57492dd4182e0e604039f550ab38ecd	
 File: /usr/lib64/libpdal_util.so.15	120777	root:root		libpdal_util.so.15.6.0
-File: /usr/lib64/libpdal_util.so.15.6.0	100644	root:root	eb912e4f6c38f5aadcd6bdbd02effae7	
-RPMIdentity: 476252d04061cc84e9742fbd44d3d26a39ad9451037641b4ae78ce9b72a0423465dee5294390ef4224b451221c4c14db18e56f7ae896d26c37aef3bd06162664
+File: /usr/lib64/libpdal_util.so.15.6.0	100644	root:root	da5590f90dff479b22d1db94e463312f	
+RPMIdentity: e15ddf8a09bdee2582cc241226ad482b576c6a266343109dd696e4ab76ea0438fcc006cea8956e53ecc370ac6f62acbafb33528c0a4db0dc49e8b179b32745f8
--- libpdal-debuginfo-2.5.6-alt2.x86_64.rpm.repo	2023-08-20 15:31:09.000000000 +0000
+++ libpdal-debuginfo-2.5.6-alt2.x86_64.rpm.hasher	2023-09-19 03:06:23.481150657 +0000
@@ -1,10 +1,10 @@
-/usr/lib/debug/.build-id/57	40755	root:root	
-/usr/lib/debug/.build-id/57/edf601e992636b3fc7345c5fac57e4a592af41	120777	root:root	../../../../lib64/libpdal_plugin_kernel_fauxplugin.so.15.6.0
-/usr/lib/debug/.build-id/57/edf601e992636b3fc7345c5fac57e4a592af41.debug	120777	root:root	../../usr/lib64/libpdal_plugin_kernel_fauxplugin.so.15.6.0.debug
-/usr/lib/debug/.build-id/6d	40755	root:root	
-/usr/lib/debug/.build-id/6d/550d274b559bbf6eedf550da9e82343f073528	120777	root:root	../../../../lib64/libpdal_util.so.15.6.0
-/usr/lib/debug/.build-id/6d/550d274b559bbf6eedf550da9e82343f073528.debug	120777	root:root	../../usr/lib64/libpdal_util.so.15.6.0.debug
-/usr/lib/debug/.build-id/87	40755	root:root	
-/usr/lib/debug/.build-id/87/194828617497a83ba7419720da655604940da6	120777	root:root	../../../../lib64/libpdal_base.so.15.6.0
-/usr/lib/debug/.build-id/87/194828617497a83ba7419720da655604940da6.debug	120777	root:root	../../usr/lib64/libpdal_base.so.15.6.0.debug
+/usr/lib/debug/.build-id/4d	40755	root:root	
+/usr/lib/debug/.build-id/4d/526ee86b54929ff6fb5b66ea03db032850fbb1	120777	root:root	../../../../lib64/libpdal_base.so.15.6.0
+/usr/lib/debug/.build-id/4d/526ee86b54929ff6fb5b66ea03db032850fbb1.debug	120777	root:root	../../usr/lib64/libpdal_base.so.15.6.0.debug
+/usr/lib/debug/.build-id/ca	40755	root:root	
+/usr/lib/debug/.build-id/ca/3f6ba3f218dd164d8b4463055ae001295e5473	120777	root:root	../../../../lib64/libpdal_util.so.15.6.0
+/usr/lib/debug/.build-id/ca/3f6ba3f218dd164d8b4463055ae001295e5473.debug	120777	root:root	../../usr/lib64/libpdal_util.so.15.6.0.debug
+/usr/lib/debug/.build-id/d4	40755	root:root	
+/usr/lib/debug/.build-id/d4/f3b8dd07c5a1361bf6408bea0be70bfc6090fc	120777	root:root	../../../../lib64/libpdal_plugin_kernel_fauxplugin.so.15.6.0
+/usr/lib/debug/.build-id/d4/f3b8dd07c5a1361bf6408bea0be70bfc6090fc.debug	120777	root:root	../../usr/lib64/libpdal_plugin_kernel_fauxplugin.so.15.6.0.debug
 /usr/lib/debug/usr/lib64/libpdal_base.so.15.6.0.debug	100644	root:root	
@@ -854,16 +854,16 @@
 Provides: libpdal-debuginfo = 2.5.6-alt2:sisyphus+327605.100.1.1
-File: /usr/lib/debug/.build-id/57	40755	root:root		
-File: /usr/lib/debug/.build-id/57/edf601e992636b3fc7345c5fac57e4a592af41	120777	root:root		../../../../lib64/libpdal_plugin_kernel_fauxplugin.so.15.6.0
-File: /usr/lib/debug/.build-id/57/edf601e992636b3fc7345c5fac57e4a592af41.debug	120777	root:root		../../usr/lib64/libpdal_plugin_kernel_fauxplugin.so.15.6.0.debug
-File: /usr/lib/debug/.build-id/6d	40755	root:root		
-File: /usr/lib/debug/.build-id/6d/550d274b559bbf6eedf550da9e82343f073528	120777	root:root		../../../../lib64/libpdal_util.so.15.6.0
-File: /usr/lib/debug/.build-id/6d/550d274b559bbf6eedf550da9e82343f073528.debug	120777	root:root		../../usr/lib64/libpdal_util.so.15.6.0.debug
-File: /usr/lib/debug/.build-id/87	40755	root:root		
-File: /usr/lib/debug/.build-id/87/194828617497a83ba7419720da655604940da6	120777	root:root		../../../../lib64/libpdal_base.so.15.6.0
-File: /usr/lib/debug/.build-id/87/194828617497a83ba7419720da655604940da6.debug	120777	root:root		../../usr/lib64/libpdal_base.so.15.6.0.debug
-File: /usr/lib/debug/usr/lib64/libpdal_base.so.15.6.0.debug	100644	root:root	3e0a2574b4390d5d604d1df1faca1fed	
+File: /usr/lib/debug/.build-id/4d	40755	root:root		
+File: /usr/lib/debug/.build-id/4d/526ee86b54929ff6fb5b66ea03db032850fbb1	120777	root:root		../../../../lib64/libpdal_base.so.15.6.0
+File: /usr/lib/debug/.build-id/4d/526ee86b54929ff6fb5b66ea03db032850fbb1.debug	120777	root:root		../../usr/lib64/libpdal_base.so.15.6.0.debug
+File: /usr/lib/debug/.build-id/ca	40755	root:root		
+File: /usr/lib/debug/.build-id/ca/3f6ba3f218dd164d8b4463055ae001295e5473	120777	root:root		../../../../lib64/libpdal_util.so.15.6.0
+File: /usr/lib/debug/.build-id/ca/3f6ba3f218dd164d8b4463055ae001295e5473.debug	120777	root:root		../../usr/lib64/libpdal_util.so.15.6.0.debug
+File: /usr/lib/debug/.build-id/d4	40755	root:root		
+File: /usr/lib/debug/.build-id/d4/f3b8dd07c5a1361bf6408bea0be70bfc6090fc	120777	root:root		../../../../lib64/libpdal_plugin_kernel_fauxplugin.so.15.6.0
+File: /usr/lib/debug/.build-id/d4/f3b8dd07c5a1361bf6408bea0be70bfc6090fc.debug	120777	root:root		../../usr/lib64/libpdal_plugin_kernel_fauxplugin.so.15.6.0.debug
+File: /usr/lib/debug/usr/lib64/libpdal_base.so.15.6.0.debug	100644	root:root	cd7c86a5a91a625a943ec46dfd5f6806	
 File: /usr/lib/debug/usr/lib64/libpdal_base.so.15.debug	120777	root:root		libpdal_base.so.15.6.0.debug
-File: /usr/lib/debug/usr/lib64/libpdal_plugin_kernel_fauxplugin.so.15.6.0.debug	100644	root:root	8ba5ebe794770fdd7a8334dc9bb123f0	
+File: /usr/lib/debug/usr/lib64/libpdal_plugin_kernel_fauxplugin.so.15.6.0.debug	100644	root:root	12ac01d93840663c83197e462a9dbab8	
 File: /usr/lib/debug/usr/lib64/libpdal_plugin_kernel_fauxplugin.so.15.debug	120777	root:root		libpdal_plugin_kernel_fauxplugin.so.15.6.0.debug
-File: /usr/lib/debug/usr/lib64/libpdal_util.so.15.6.0.debug	100644	root:root	45bfe4223ee6fd19cbc2a4b27cc89faf	
+File: /usr/lib/debug/usr/lib64/libpdal_util.so.15.6.0.debug	100644	root:root	fc4722c73783c2c2743652f750f44bbe	
 File: /usr/lib/debug/usr/lib64/libpdal_util.so.15.debug	120777	root:root		libpdal_util.so.15.6.0.debug
@@ -1689,2 +1689,2 @@
 File: /usr/src/debug/PDAL-2.5.6/x86_64-alt-linux/include/pdal/pdal_features.hpp	100644	root:root	821bec206b4b3fca163a9614c537957f	
-RPMIdentity: b79fa201b5c274f1656ed049f309591851e1750ad3d97effe148e684599fdb530447aedeb9880aca663e7c0a32fa1c80dcca0b5f008de2d4f976953ba54c143f
+RPMIdentity: 10f3c25d01b6d6ed598ca12d75cd7d4d46e2216c8b77d0e87788f98fe646647e42c1790ff3c39dedc0b068d0863c610bd1f4f42ea5c0b35d476f28fb7f6b1a41
--- pdal-2.5.6-alt2.x86_64.rpm.repo	2023-08-20 15:31:09.000000000 +0000
+++ pdal-2.5.6-alt2.x86_64.rpm.hasher	2023-09-19 03:06:23.613153403 +0000
@@ -9,3 +9,3 @@
 Provides: pdal = 2.5.6-alt2:sisyphus+327605.100.1.1
-File: /usr/bin/pdal	100755	root:root	583be5c3a422c48b70227baa8716fe90	
+File: /usr/bin/pdal	100755	root:root	f0d5df0e3527f9433dbe160087677c7a	
 File: /usr/share/doc/pdal-2.5.6	40755	root:root		
@@ -14,2 +14,2 @@
 File: /usr/share/doc/pdal-2.5.6/README.md	100644	root:root	057e723282e483094566883ad97b7c83	
-RPMIdentity: 81db0ada05343e79444cfe7a142dd23e96fde7b7ccfac822a5d3ba083394977bf13e06825e7b39b1e9b74ac25955ebe2b81f76c27f9bffaff84efd6672023c8b
+RPMIdentity: 8d8d36c319d4be54ef5df68f5ceba59a8c769edd340264a663903d40a90b823f9b0f01c3708ab04140b90da0c560b131ea7f07b2a57b8776b30da3fe1bba7610
--- pdal-debuginfo-2.5.6-alt2.x86_64.rpm.repo	2023-08-20 15:31:08.000000000 +0000
+++ pdal-debuginfo-2.5.6-alt2.x86_64.rpm.hasher	2023-09-19 03:06:24.068162868 +0000
@@ -1,4 +1,4 @@
-/usr/lib/debug/.build-id/71	40755	root:root	
-/usr/lib/debug/.build-id/71/a61d6b3f6bfbe31fbd400952fde35708943583	120777	root:root	../../../../bin/pdal
-/usr/lib/debug/.build-id/71/a61d6b3f6bfbe31fbd400952fde35708943583.debug	120777	root:root	../../usr/bin/pdal.debug
+/usr/lib/debug/.build-id/c8	40755	root:root	
+/usr/lib/debug/.build-id/c8/beb1c777e19f2ad86d993b550b8abe219d4cea	120777	root:root	../../../../bin/pdal
+/usr/lib/debug/.build-id/c8/beb1c777e19f2ad86d993b550b8abe219d4cea.debug	120777	root:root	../../usr/bin/pdal.debug
 /usr/lib/debug/usr/bin/pdal.debug	100644	root:root	
@@ -12,6 +12,6 @@
 Provides: pdal-debuginfo = 2.5.6-alt2:sisyphus+327605.100.1.1
-File: /usr/lib/debug/.build-id/71	40755	root:root		
-File: /usr/lib/debug/.build-id/71/a61d6b3f6bfbe31fbd400952fde35708943583	120777	root:root		../../../../bin/pdal
-File: /usr/lib/debug/.build-id/71/a61d6b3f6bfbe31fbd400952fde35708943583.debug	120777	root:root		../../usr/bin/pdal.debug
-File: /usr/lib/debug/usr/bin/pdal.debug	100644	root:root	92c6932b9b0c51aea6d7873f8468f47f	
+File: /usr/lib/debug/.build-id/c8	40755	root:root		
+File: /usr/lib/debug/.build-id/c8/beb1c777e19f2ad86d993b550b8abe219d4cea	120777	root:root		../../../../bin/pdal
+File: /usr/lib/debug/.build-id/c8/beb1c777e19f2ad86d993b550b8abe219d4cea.debug	120777	root:root		../../usr/bin/pdal.debug
+File: /usr/lib/debug/usr/bin/pdal.debug	100644	root:root	b8d2ec842633f31fa866b541e08cf172	
 File: /usr/src/debug/PDAL-2.5.6	40755	root:root		
@@ -19,2 +19,2 @@
 File: /usr/src/debug/PDAL-2.5.6/apps/pdal.cpp	100644	root:root	6e9d0b5d9a460e860941ea53f6019b16	
-RPMIdentity: 11a98344132988b1fe84ab27293320cea9c9a4503047eebadd134ecf137e11487903868b88038768b967ba60527af1c91f00bd24c7b6c56c2577983ac21e1207
+RPMIdentity: 05f0c71de9a62dc7a6361693dd8beeaa910ca57c01f1da02904cb5369cc7978853c62b64d65b2f8d74f973759aa640ea0a31ec64d34e83d91f8eb665d31f2d74