<86>Jun 25 05:23:57 userdel[1407205]: delete user 'rooter'
<86>Jun 25 05:23:57 userdel[1407205]: removed group 'rooter' owned by 'rooter'
<86>Jun 25 05:23:57 userdel[1407205]: removed shadow group 'rooter' owned by 'rooter'
<86>Jun 25 05:23:57 groupadd[1407278]: group added to /etc/group: name=rooter, GID=1847
<86>Jun 25 05:23:57 groupadd[1407278]: group added to /etc/gshadow: name=rooter
<86>Jun 25 05:23:57 groupadd[1407278]: new group: name=rooter, GID=1847
<86>Jun 25 05:23:57 useradd[1407299]: new user: name=rooter, UID=1847, GID=1847, home=/root, shell=/bin/bash, from=none
<86>Jun 25 05:23:57 userdel[1407355]: delete user 'builder'
<86>Jun 25 05:23:57 userdel[1407355]: removed group 'builder' owned by 'builder'
<86>Jun 25 05:23:57 userdel[1407355]: removed shadow group 'builder' owned by 'builder'
<86>Jun 25 05:23:57 groupadd[1407403]: group added to /etc/group: name=builder, GID=1848
<86>Jun 25 05:23:57 groupadd[1407403]: group added to /etc/gshadow: name=builder
<86>Jun 25 05:23:57 groupadd[1407403]: new group: name=builder, GID=1848
<86>Jun 25 05:23:57 useradd[1407430]: new user: name=builder, UID=1848, GID=1848, home=/usr/src, shell=/bin/bash, from=none
<13>Jun 25 05:23:59 rpmi: libnuma-2.0.14-alt2 sisyphus+278485.100.1.1 1626104244 installed
<13>Jun 25 05:23:59 rpmi: libopenblas-0.3.23-alt1.1 sisyphus+323359.100.1.1 1687257417 installed
<13>Jun 25 05:23:59 rpmi: libnl3-3.7.0-alt1 sisyphus+307975.100.1.1 1665071443 installed
<13>Jun 25 05:23:59 rpmi: libibverbs-44.0-alt2 sisyphus+316411.100.1.1 1678346418 installed
<13>Jun 25 05:23:59 rpmi: librdmacm-44.0-alt2 sisyphus+316411.100.1.1 1678346418 installed
<13>Jun 25 05:23:59 rpmi: libquadmath0-13.1.1-alt1 sisyphus+323337.100.1.1 1687259761 installed
<13>Jun 25 05:23:59 rpmi: libgfortran5-13.1.1-alt1 sisyphus+323337.100.1.1 1687259761 installed
<13>Jun 25 05:23:59 rpmi: libquadmath13-devel-13.1.1-alt1 sisyphus+323337.100.1.1 1687259761 installed
<13>Jun 25 05:23:59 rpmi: libopenblas-devel-0.3.23-alt1.1 sisyphus+323359.100.1.1 1687257417 installed
<13>Jun 25 05:23:59 rpmi: libnuma-devel-2.0.14-alt2 sisyphus+278485.100.1.1 1626104244 installed
<13>Jun 25 05:23:59 rpmi: rpm-macros-mpi-selector-1.0.3-alt4 sisyphus+299671.100.1.1 1651928220 installed
<13>Jun 25 05:23:59 rpmi: tcsh-6.20.00-alt4 sisyphus+278971.100.1.1 1626339285 installed
<13>Jun 25 05:23:59 rpmi: mpi-selector-1.0.3-alt4 sisyphus+299671.100.1.1 1651928220 installed
<13>Jun 25 05:23:59 rpmi: openmpi-2.0.1-alt8 sisyphus+275152.100.1.1 1624410685 installed
<13>Jun 25 05:23:59 rpmi: libmetis-5.1.0-alt2 sisyphus+278431.100.1.3 1626214443 installed
<13>Jun 25 05:23:59 rpmi: liblz4-1:1.9.4-alt1 sisyphus+309416.100.1.1 1667412981 installed
<13>Jun 25 05:23:59 rpmi: libsystemd-1:252.7-alt1 sisyphus+316321.100.1.1 1678130436 installed
<13>Jun 25 05:23:59 rpmi: libxblas-1.0.248-alt2 sisyphus+285045.40.2.1 1631388330 installed
<13>Jun 25 05:24:00 rpmi: liblapack-1:3.8.0-alt7 sisyphus+293726.100.1.1 1642544497 installed
<13>Jun 25 05:24:00 rpmi: libibumad-44.0-alt2 sisyphus+316411.100.1.1 1678346418 installed
<13>Jun 25 05:24:00 rpmi: libibmad-44.0-alt2 sisyphus+316411.100.1.1 1678346418 installed
<13>Jun 25 05:24:00 rpmi: libibnetdisc-44.0-alt2 sisyphus+316411.100.1.1 1678346418 installed
<13>Jun 25 05:24:00 rpmi: gcc-fortran-common-1.4.27-alt1 sisyphus+278099.1300.1.1 1626028636 installed
<13>Jun 25 05:24:00 rpmi: libgfortran13-devel-13.1.1-alt1 sisyphus+323337.100.1.1 1687259761 installed
<13>Jun 25 05:24:00 rpmi: gcc13-fortran-13.1.1-alt1 sisyphus+323337.100.1.1 1687259761 installed
<13>Jun 25 05:24:00 rpmi: gcc-fortran-13-alt1 sisyphus+323337.300.1.1 1687267966 installed
<13>Jun 25 05:24:00 rpmi: gcc-c++-common-1.4.27-alt1 sisyphus+278099.1300.1.1 1626028636 installed
<13>Jun 25 05:24:00 rpmi: libstdc++13-devel-13.1.1-alt1 sisyphus+323337.100.1.1 1687259761 installed
<13>Jun 25 05:24:01 rpmi: gcc13-c++-13.1.1-alt1 sisyphus+323337.100.1.1 1687259761 installed
<13>Jun 25 05:24:01 rpmi: gcc-c++-13-alt1 sisyphus+323337.300.1.1 1687267966 installed
<13>Jun 25 05:24:01 rpmi: libdevmapper-1.02.193-alt1 sisyphus+317421.100.1.1 1679684411 installed
<13>Jun 25 05:24:01 rpmi: mount-2.38.1-alt1 sisyphus+308470.100.1.1 1665845329 installed
<13>Jun 25 05:24:01 rpmi: losetup-2.38.1-alt1 sisyphus+308470.100.1.1 1665845329 installed
<13>Jun 25 05:24:01 rpmi: lsblk-2.38.1-alt1 sisyphus+308470.100.1.1 1665845329 installed
<13>Jun 25 05:24:01 rpmi: libp11-kit-0.24.1-alt1 sisyphus+293720.100.1.1 1642535264 installed
<13>Jun 25 05:24:01 rpmi: libtasn1-4.19.0-alt2 sisyphus+323514.100.1.1 1687445894 installed
<13>Jun 25 05:24:01 rpmi: rpm-macros-alternatives-0.5.2-alt2 sisyphus+315270.200.2.1 1676457367 installed
<13>Jun 25 05:24:01 rpmi: alternatives-0.5.2-alt2 sisyphus+315270.200.2.1 1676457367 installed
<13>Jun 25 05:24:01 rpmi: ca-certificates-2022.12.14-alt1 sisyphus+311754.200.1.1 1671046143 installed
<13>Jun 25 05:24:01 rpmi: ca-trust-0.1.4-alt1 sisyphus+308690.100.1.1 1666182992 installed
<13>Jun 25 05:24:01 rpmi: p11-kit-trust-0.24.1-alt1 sisyphus+293720.100.1.1 1642535264 installed
<13>Jun 25 05:24:01 rpmi: libcrypto1.1-1.1.1u-alt1 sisyphus+322200.100.1.1 1685474736 installed
<13>Jun 25 05:24:01 rpmi: libkmod-30-alt1 sisyphus+307195.200.2.1 1663842341 installed
<13>Jun 25 05:24:01 rpmi: kmod-30-alt1 sisyphus+307195.200.2.1 1663842341 installed
<13>Jun 25 05:24:01 rpmi: dmsetup-1.02.193-alt1 sisyphus+317421.100.1.1 1679684411 installed
<86>Jun 25 05:24:01 groupadd[1431394]: group added to /etc/group: name=tape, GID=999
<86>Jun 25 05:24:01 groupadd[1431394]: group added to /etc/gshadow: name=tape
<86>Jun 25 05:24:01 groupadd[1431394]: new group: name=tape, GID=999
<86>Jun 25 05:24:01 groupadd[1431413]: group added to /etc/group: name=dialout, GID=998
<86>Jun 25 05:24:01 groupadd[1431413]: group added to /etc/gshadow: name=dialout
<86>Jun 25 05:24:01 groupadd[1431413]: new group: name=dialout, GID=998
<86>Jun 25 05:24:01 groupadd[1431431]: group added to /etc/group: name=input, GID=997
<86>Jun 25 05:24:01 groupadd[1431431]: group added to /etc/gshadow: name=input
<86>Jun 25 05:24:01 groupadd[1431431]: new group: name=input, GID=997
<86>Jun 25 05:24:01 groupadd[1431445]: group added to /etc/group: name=video, GID=996
<86>Jun 25 05:24:01 groupadd[1431445]: group added to /etc/gshadow: name=video
<86>Jun 25 05:24:01 groupadd[1431445]: new group: name=video, GID=996
<86>Jun 25 05:24:01 groupadd[1431462]: group added to /etc/group: name=render, GID=995
<86>Jun 25 05:24:01 groupadd[1431462]: group added to /etc/gshadow: name=render
<86>Jun 25 05:24:01 groupadd[1431462]: new group: name=render, GID=995
<86>Jun 25 05:24:01 groupadd[1431476]: group added to /etc/group: name=sgx, GID=994
<86>Jun 25 05:24:01 groupadd[1431476]: group added to /etc/gshadow: name=sgx
<86>Jun 25 05:24:01 groupadd[1431476]: new group: name=sgx, GID=994
<13>Jun 25 05:24:01 rpmi: udev-1:252.7-alt1 sisyphus+316321.100.1.1 1678130436 installed
<13>Jun 25 05:24:02 rpmi: rdma-core-44.0-alt2 sisyphus+316411.100.1.1 1678346418 installed
<13>Jun 25 05:24:02 rpmi: rdma-core-devel-44.0-alt2 sisyphus+316411.100.1.1 1678346418 installed
<13>Jun 25 05:24:02 rpmi: openmpi-devel-2.0.1-alt8 sisyphus+275152.100.1.1 1624410685 installed
<13>Jun 25 05:24:02 rpmi: liblapack-devel-1:3.8.0-alt7 sisyphus+293726.100.1.1 1642544497 installed
<13>Jun 25 05:24:02 rpmi: libmetis-devel-5.1.0-alt2 sisyphus+278431.100.1.3 1626214443 installed
Building target platforms: x86_64
Building for target x86_64
Wrote: /usr/src/in/nosrpm/parms-3.2-alt10.nosrc.rpm (w1.gzdio)
Installing parms-3.2-alt10.src.rpm
Building target platforms: x86_64
Building for target x86_64
Executing(%prep): /bin/sh -e /usr/src/tmp/rpm-tmp.98930
+ umask 022
+ /bin/mkdir -p /usr/src/RPM/BUILD
+ cd /usr/src/RPM/BUILD
+ cd /usr/src/RPM/BUILD
+ rm -rf parms-3.2
+ echo 'Source #0 (pARMS_3.2.tar):'
Source #0 (pARMS_3.2.tar):
+ /bin/tar -xf /usr/src/RPM/SOURCES/pARMS_3.2.tar
+ cd parms-3.2
+ /bin/chmod -c -Rf u+rwX,go-w .
+ exit 0
Executing(%build): /bin/sh -e /usr/src/tmp/rpm-tmp.98930
+ umask 022
+ /bin/mkdir -p /usr/src/RPM/BUILD
+ cd /usr/src/RPM/BUILD
+ cd parms-3.2
+ mpi-selector --set openmpi
+ source /usr/lib64/openmpi/bin/mpivars.sh
++ echo /usr/src/bin:/bin:/usr/bin:/usr/X11R6/bin:/usr/games
++ grep -q /usr/lib64/openmpi/bin
++ PATH=/usr/lib64/openmpi/bin:/usr/src/bin:/bin:/usr/bin:/usr/X11R6/bin:/usr/games
++ export PATH
++ echo
++ grep -q /usr/lib64/openmpi/lib
++ LD_LIBRARY_PATH=/usr/lib64/openmpi/lib
++ export LD_LIBRARY_PATH
++ echo
++ grep -q /usr/lib64/openmpi/man
++ MANPATH=/usr/lib64/openmpi/man:
++ export MANPATH
+ export 'OMPI_LDFLAGS=-Wl,--as-needed,-rpath=/usr/lib64/openmpi/lib -L/usr/lib64/openmpi/lib'
+ OMPI_LDFLAGS='-Wl,--as-needed,-rpath=/usr/lib64/openmpi/lib -L/usr/lib64/openmpi/lib'
+ export MPIDIR=/usr/lib64/openmpi
+ MPIDIR=/usr/lib64/openmpi
+ make -j16 TOPDIR=/usr/src/RPM/BUILD/parms-3.2
make: Entering directory '/usr/src/RPM/BUILD/parms-3.2'
mpicc -I./include -I./src/include	  -pipe -O3 -Wall -fPIC -DPIC -g \
-DUSE_MPI -DREAL=double -DDBL -DHAS_BLAS  -I/usr/lib64/openmpi/include -I/usr/src/RPM/BUILD/parms-3.2/src/include -I/usr/include/metis -g -DFORTRAN_UNDERSCORE -DVOID_POINTER_SIZE_8  src/parms_mem.c -c -o src/parms_mem.o
make: Leaving directory '/usr/src/RPM/BUILD/parms-3.2'
make: Entering directory '/usr/src/RPM/BUILD/parms-3.2'
mpicc -I./include -I./src/include	  -pipe -O3 -Wall -fPIC -DPIC -g \
-DUSE_MPI -DREAL=double -DDBL -DHAS_BLAS  -I/usr/lib64/openmpi/include -I/usr/src/RPM/BUILD/parms-3.2/src/include -I/usr/include/metis -g -DFORTRAN_UNDERSCORE -DVOID_POINTER_SIZE_8  src/parms_operator.c -c -o src/parms_operator.o
make: Leaving directory '/usr/src/RPM/BUILD/parms-3.2'
make: Entering directory '/usr/src/RPM/BUILD/parms-3.2'
mpicc -I./include -I./src/include	  -pipe -O3 -Wall -fPIC -DPIC -g \
-DUSE_MPI -DREAL=double -DDBL -DHAS_BLAS  -I/usr/lib64/openmpi/include -I/usr/src/RPM/BUILD/parms-3.2/src/include -I/usr/include/metis -g -DFORTRAN_UNDERSCORE -DVOID_POINTER_SIZE_8  src/parms_pc_bj.c -c -o src/parms_pc_bj.o
make: Leaving directory '/usr/src/RPM/BUILD/parms-3.2'
make: Entering directory '/usr/src/RPM/BUILD/parms-3.2'
mpicc -I./include -I./src/include	  -pipe -O3 -Wall -fPIC -DPIC -g \
-DUSE_MPI -DREAL=double -DDBL -DHAS_BLAS  -I/usr/lib64/openmpi/include -I/usr/src/RPM/BUILD/parms-3.2/src/include -I/usr/include/metis -g -DFORTRAN_UNDERSCORE -DVOID_POINTER_SIZE_8  src/parms_timer.c -c -o src/parms_timer.o
make: Leaving directory '/usr/src/RPM/BUILD/parms-3.2'
make: Entering directory '/usr/src/RPM/BUILD/parms-3.2'
mpicc -I./include -I./src/include	  -pipe -O3 -Wall -fPIC -DPIC -g \
-DUSE_MPI -DREAL=double -DDBL -DHAS_BLAS  -I/usr/lib64/openmpi/include -I/usr/src/RPM/BUILD/parms-3.2/src/include -I/usr/include/metis -g -DFORTRAN_UNDERSCORE -DVOID_POINTER_SIZE_8  src/parms_qsplit.c -c -o src/parms_qsplit.o
make: Leaving directory '/usr/src/RPM/BUILD/parms-3.2'
make: Entering directory '/usr/src/RPM/BUILD/parms-3.2'
mpicc -I./include -I./src/include	  -pipe -O3 -Wall -fPIC -DPIC -g \
-DUSE_MPI -DREAL=double -DDBL -DHAS_BLAS  -I/usr/lib64/openmpi/include -I/usr/src/RPM/BUILD/parms-3.2/src/include -I/usr/include/metis -g -DFORTRAN_UNDERSCORE -DVOID_POINTER_SIZE_8  src/parms_pc_ras.c -c -o src/parms_pc_ras.o
make: Leaving directory '/usr/src/RPM/BUILD/parms-3.2'
make: Entering directory '/usr/src/RPM/BUILD/parms-3.2'
mpicc -I./include -I./src/include	  -pipe -O3 -Wall -fPIC -DPIC -g \
-DUSE_MPI -DREAL=double -DDBL -DHAS_BLAS  -I/usr/lib64/openmpi/include -I/usr/src/RPM/BUILD/parms-3.2/src/include -I/usr/include/metis -g -DFORTRAN_UNDERSCORE -DVOID_POINTER_SIZE_8  src/parms_solver.c -c -o src/parms_solver.o
make: Leaving directory '/usr/src/RPM/BUILD/parms-3.2'
make: Entering directory '/usr/src/RPM/BUILD/parms-3.2'
mpicc -I./include -I./src/include	  -pipe -O3 -Wall -fPIC -DPIC -g \
-DUSE_MPI -DREAL=double -DDBL -DHAS_BLAS  -I/usr/lib64/openmpi/include -I/usr/src/RPM/BUILD/parms-3.2/src/include -I/usr/include/metis -g -DFORTRAN_UNDERSCORE -DVOID_POINTER_SIZE_8  src/parms_mat_vcsr.c -c -o src/parms_mat_vcsr.o
make: Leaving directory '/usr/src/RPM/BUILD/parms-3.2'
make: Entering directory '/usr/src/RPM/BUILD/parms-3.2'
mpicc -I./include -I./src/include	  -pipe -O3 -Wall -fPIC -DPIC -g \
-DUSE_MPI -DREAL=double -DDBL -DHAS_BLAS  -I/usr/lib64/openmpi/include -I/usr/src/RPM/BUILD/parms-3.2/src/include -I/usr/include/metis -g -DFORTRAN_UNDERSCORE -DVOID_POINTER_SIZE_8  src/parms_table.c -c -o src/parms_table.o
make: Leaving directory '/usr/src/RPM/BUILD/parms-3.2'
make: Entering directory '/usr/src/RPM/BUILD/parms-3.2'
mpicc -I./include -I./src/include	  -pipe -O3 -Wall -fPIC -DPIC -g \
-DUSE_MPI -DREAL=double -DDBL -DHAS_BLAS  -I/usr/lib64/openmpi/include -I/usr/src/RPM/BUILD/parms-3.2/src/include -I/usr/include/metis -g -DFORTRAN_UNDERSCORE -DVOID_POINTER_SIZE_8  src/parms_viewer.c -c -o src/parms_viewer.o
In file included from /usr/include/stdio.h:906,
                 from ./include/parms_viewer.h:13,
                 from src/./include/parms_viewer_impl.h:13,
                 from src/parms_viewer.c:25:
In function 'sprintf',
    inlined from 'parms_ViewerCreate' at src/parms_viewer.c:62:5:
/usr/include/bits/stdio2.h:30:10: warning: '__builtin___sprintf_chk' argument 5 overlaps destination object '<unknown>' [-Wrestrict]
   30 |   return __builtin___sprintf_chk (__s, __USE_FORTIFY_LEVEL - 1,
      |          ^~~~~~~~~~~~~~~~~~~~~~~~~~~~~~~~~~~~~~~~~~~~~~~~~~~~~~
   31 |                                   __glibc_objsize (__s), __fmt,
      |                                   ~~~~~~~~~~~~~~~~~~~~~~~~~~~~~
   32 |                                   __va_arg_pack ());
      |                                   ~~~~~~~~~~~~~~~~~
make: Leaving directory '/usr/src/RPM/BUILD/parms-3.2'
make: Entering directory '/usr/src/RPM/BUILD/parms-3.2'
mpicc -I./include -I./src/include	  -pipe -O3 -Wall -fPIC -DPIC -g \
-DUSE_MPI -DREAL=double -DDBL -DHAS_BLAS  -I/usr/lib64/openmpi/include -I/usr/src/RPM/BUILD/parms-3.2/src/include -I/usr/include/metis -g -DFORTRAN_UNDERSCORE -DVOID_POINTER_SIZE_8  src/parms_comm.c -c -o src/parms_comm.o
make: Leaving directory '/usr/src/RPM/BUILD/parms-3.2'
make: Entering directory '/usr/src/RPM/BUILD/parms-3.2'
mpicc -I./include -I./src/include	  -pipe -O3 -Wall -fPIC -DPIC -g \
-DUSE_MPI -DREAL=double -DDBL -DHAS_BLAS  -I/usr/lib64/openmpi/include -I/usr/src/RPM/BUILD/parms-3.2/src/include -I/usr/include/metis -g -DFORTRAN_UNDERSCORE -DVOID_POINTER_SIZE_8  src/parms_complex.c -c -o src/parms_complex.o
make: Leaving directory '/usr/src/RPM/BUILD/parms-3.2'
make: Entering directory '/usr/src/RPM/BUILD/parms-3.2'
mpicc -I./include -I./src/include	  -pipe -O3 -Wall -fPIC -DPIC -g \
-DUSE_MPI -DREAL=double -DDBL -DHAS_BLAS  -I/usr/lib64/openmpi/include -I/usr/src/RPM/BUILD/parms-3.2/src/include -I/usr/include/metis -g -DFORTRAN_UNDERSCORE -DVOID_POINTER_SIZE_8  src/parms_pc.c -c -o src/parms_pc.o
make: Leaving directory '/usr/src/RPM/BUILD/parms-3.2'
make: Entering directory '/usr/src/RPM/BUILD/parms-3.2'
mpicc -I./include -I./src/include	  -pipe -O3 -Wall -fPIC -DPIC -g \
-DUSE_MPI -DREAL=double -DDBL -DHAS_BLAS  -I/usr/lib64/openmpi/include -I/usr/src/RPM/BUILD/parms-3.2/src/include -I/usr/include/metis -g -DFORTRAN_UNDERSCORE -DVOID_POINTER_SIZE_8  src/parms_pc_schur.c -c -o src/parms_pc_schur.o
make: Leaving directory '/usr/src/RPM/BUILD/parms-3.2'
make: Entering directory '/usr/src/RPM/BUILD/parms-3.2'
mpicc -I./include -I./src/include	  -pipe -O3 -Wall -fPIC -DPIC -g \
-DUSE_MPI -DREAL=double -DDBL -DHAS_BLAS  -I/usr/lib64/openmpi/include -I/usr/src/RPM/BUILD/parms-3.2/src/include -I/usr/include/metis -g -DFORTRAN_UNDERSCORE -DVOID_POINTER_SIZE_8  src/gmres.c -c -o src/gmres.o
make: Leaving directory '/usr/src/RPM/BUILD/parms-3.2'
make: Entering directory '/usr/src/RPM/BUILD/parms-3.2'
mpicc -I./include -I./src/include	  -pipe -O3 -Wall -fPIC -DPIC -g \
-DUSE_MPI -DREAL=double -DDBL -DHAS_BLAS  -I/usr/lib64/openmpi/include -I/usr/src/RPM/BUILD/parms-3.2/src/include -I/usr/include/metis -g -DFORTRAN_UNDERSCORE -DVOID_POINTER_SIZE_8  src/fgmres.c -c -o src/fgmres.o
make: Leaving directory '/usr/src/RPM/BUILD/parms-3.2'
make: Entering directory '/usr/src/RPM/BUILD/parms-3.2'
mpicc -I./include -I./src/include	  -pipe -O3 -Wall -fPIC -DPIC -g \
-DUSE_MPI -DREAL=double -DDBL -DHAS_BLAS  -I/usr/lib64/openmpi/include -I/usr/src/RPM/BUILD/parms-3.2/src/include -I/usr/include/metis -g -DFORTRAN_UNDERSCORE -DVOID_POINTER_SIZE_8  src/parms_map.c -c -o src/parms_map.o
src/parms_map.c: In function 'parms_MapGlobalToLocal':
src/parms_map.c:744:10: warning: function may return address of local variable [-Wreturn-local-addr]
  744 |   return lindex;
      |          ^~~~~~
src/parms_map.c:735:49: note: declared here
  735 | int *parms_MapGlobalToLocal(parms_Map self, int gindex)
      |                                             ~~~~^~~~~~
make: Leaving directory '/usr/src/RPM/BUILD/parms-3.2'
make: Entering directory '/usr/src/RPM/BUILD/parms-3.2'
mpicc -I./include -I./src/include	  -pipe -O3 -Wall -fPIC -DPIC -g \
-DUSE_MPI -DREAL=double -DDBL -DHAS_BLAS  -I/usr/lib64/openmpi/include -I/usr/src/RPM/BUILD/parms-3.2/src/include -I/usr/include/metis -g -DFORTRAN_UNDERSCORE -DVOID_POINTER_SIZE_8  src/DDPQ/arms2.c -c -o src/DDPQ/arms2.o
make: Leaving directory '/usr/src/RPM/BUILD/parms-3.2'
make: Entering directory '/usr/src/RPM/BUILD/parms-3.2'
mpicc -I./include -I./src/include	  -pipe -O3 -Wall -fPIC -DPIC -g \
-DUSE_MPI -DREAL=double -DDBL -DHAS_BLAS  -I/usr/lib64/openmpi/include -I/usr/src/RPM/BUILD/parms-3.2/src/include -I/usr/include/metis -g -DFORTRAN_UNDERSCORE -DVOID_POINTER_SIZE_8  src/FORTRAN/parms_mapf.c -c -o src/FORTRAN/parms_mapf.o
make: Leaving directory '/usr/src/RPM/BUILD/parms-3.2'
make: Entering directory '/usr/src/RPM/BUILD/parms-3.2'
mpicc -I./include -I./src/include	  -pipe -O3 -Wall -fPIC -DPIC -g \
-DUSE_MPI -DREAL=double -DDBL -DHAS_BLAS  -I/usr/lib64/openmpi/include -I/usr/src/RPM/BUILD/parms-3.2/src/include -I/usr/include/metis -g -DFORTRAN_UNDERSCORE -DVOID_POINTER_SIZE_8  src/DDPQ/svdInvC.c -c -o src/DDPQ/svdInvC.o
make: Leaving directory '/usr/src/RPM/BUILD/parms-3.2'
make: Entering directory '/usr/src/RPM/BUILD/parms-3.2'
mpicc -I./include -I./src/include	  -pipe -O3 -Wall -fPIC -DPIC -g \
-DUSE_MPI -DREAL=double -DDBL -DHAS_BLAS  -I/usr/lib64/openmpi/include -I/usr/src/RPM/BUILD/parms-3.2/src/include -I/usr/include/metis -g -DFORTRAN_UNDERSCORE -DVOID_POINTER_SIZE_8  src/DDPQ/setblks.c -c -o src/DDPQ/setblks.o
src/DDPQ/setblks.c: In function 'init_blocks':
src/DDPQ/setblks.c:72:33: warning: unused variable 't2' [-Wunused-variable]
   72 |   double eps_2 = eps * eps, t1, t2;
      |                                 ^~
src/DDPQ/setblks.c:72:29: warning: unused variable 't1' [-Wunused-variable]
   72 |   double eps_2 = eps * eps, t1, t2;
      |                             ^~
make: Leaving directory '/usr/src/RPM/BUILD/parms-3.2'
make: Entering directory '/usr/src/RPM/BUILD/parms-3.2'
mpicc -I./include -I./src/include	  -pipe -O3 -Wall -fPIC -DPIC -g \
-DUSE_MPI -DREAL=double -DDBL -DHAS_BLAS  -I/usr/lib64/openmpi/include -I/usr/src/RPM/BUILD/parms-3.2/src/include -I/usr/include/metis -g -DFORTRAN_UNDERSCORE -DVOID_POINTER_SIZE_8  src/FORTRAN/parms_matf.c -c -o src/FORTRAN/parms_matf.o
make: Leaving directory '/usr/src/RPM/BUILD/parms-3.2'
make: Entering directory '/usr/src/RPM/BUILD/parms-3.2'
mpicc -I./include -I./src/include	  -pipe -O3 -Wall -fPIC -DPIC -g \
-DUSE_MPI -DREAL=double -DDBL -DHAS_BLAS  -I/usr/lib64/openmpi/include -I/usr/src/RPM/BUILD/parms-3.2/src/include -I/usr/include/metis -g -DFORTRAN_UNDERSCORE -DVOID_POINTER_SIZE_8  src/FORTRAN/parms_timerf.c -c -o src/FORTRAN/parms_timerf.o
make: Leaving directory '/usr/src/RPM/BUILD/parms-3.2'
make: Entering directory '/usr/src/RPM/BUILD/parms-3.2'
mpicc -I./include -I./src/include	  -pipe -O3 -Wall -fPIC -DPIC -g \
-DUSE_MPI -DREAL=double -DDBL -DHAS_BLAS  -I/usr/lib64/openmpi/include -I/usr/src/RPM/BUILD/parms-3.2/src/include -I/usr/include/metis -g -DFORTRAN_UNDERSCORE -DVOID_POINTER_SIZE_8  src/parms_vec.c -c -o src/parms_vec.o
make: Leaving directory '/usr/src/RPM/BUILD/parms-3.2'
make: Entering directory '/usr/src/RPM/BUILD/parms-3.2'
mpicc -I./include -I./src/include	  -pipe -O3 -Wall -fPIC -DPIC -g \
-DUSE_MPI -DREAL=double -DDBL -DHAS_BLAS  -I/usr/lib64/openmpi/include -I/usr/src/RPM/BUILD/parms-3.2/src/include -I/usr/include/metis -g -DFORTRAN_UNDERSCORE -DVOID_POINTER_SIZE_8  src/FORTRAN/parms_vecf.c -c -o src/FORTRAN/parms_vecf.o
make: Leaving directory '/usr/src/RPM/BUILD/parms-3.2'
make: Entering directory '/usr/src/RPM/BUILD/parms-3.2'
mpicc -I./include -I./src/include	  -pipe -O3 -Wall -fPIC -DPIC -g \
-DUSE_MPI -DREAL=double -DDBL -DHAS_BLAS  -I/usr/lib64/openmpi/include -I/usr/src/RPM/BUILD/parms-3.2/src/include -I/usr/include/metis -g -DFORTRAN_UNDERSCORE -DVOID_POINTER_SIZE_8  src/FORTRAN/parms_solverf.c -c -o src/FORTRAN/parms_solverf.o
make: Leaving directory '/usr/src/RPM/BUILD/parms-3.2'
make: Entering directory '/usr/src/RPM/BUILD/parms-3.2'
mpicc -I./include -I./src/include	  -pipe -O3 -Wall -fPIC -DPIC -g \
-DUSE_MPI -DREAL=double -DDBL -DHAS_BLAS  -I/usr/lib64/openmpi/include -I/usr/src/RPM/BUILD/parms-3.2/src/include -I/usr/include/metis -g -DFORTRAN_UNDERSCORE -DVOID_POINTER_SIZE_8  src/DDPQ/ilutpC.c -c -o src/DDPQ/ilutpC.o
make: Leaving directory '/usr/src/RPM/BUILD/parms-3.2'
make: Entering directory '/usr/src/RPM/BUILD/parms-3.2'
mpicc -I./include -I./src/include	  -pipe -O3 -Wall -fPIC -DPIC -g \
-DUSE_MPI -DREAL=double -DDBL -DHAS_BLAS  -I/usr/lib64/openmpi/include -I/usr/src/RPM/BUILD/parms-3.2/src/include -I/usr/include/metis -g -DFORTRAN_UNDERSCORE -DVOID_POINTER_SIZE_8  src/DDPQ/MatOps.c -c -o src/DDPQ/MatOps.o
make: Leaving directory '/usr/src/RPM/BUILD/parms-3.2'
make: Entering directory '/usr/src/RPM/BUILD/parms-3.2'
mpicc -I./include -I./src/include	  -pipe -O3 -Wall -fPIC -DPIC -g \
-DUSE_MPI -DREAL=double -DDBL -DHAS_BLAS  -I/usr/lib64/openmpi/include -I/usr/src/RPM/BUILD/parms-3.2/src/include -I/usr/include/metis -g -DFORTRAN_UNDERSCORE -DVOID_POINTER_SIZE_8  src/FORTRAN/parms_viewerf.c -c -o src/FORTRAN/parms_viewerf.o
make: Leaving directory '/usr/src/RPM/BUILD/parms-3.2'
make: Entering directory '/usr/src/RPM/BUILD/parms-3.2'
mpicc -I./include -I./src/include	  -pipe -O3 -Wall -fPIC -DPIC -g \
-DUSE_MPI -DREAL=double -DDBL -DHAS_BLAS  -I/usr/lib64/openmpi/include -I/usr/src/RPM/BUILD/parms-3.2/src/include -I/usr/include/metis -g -DFORTRAN_UNDERSCORE -DVOID_POINTER_SIZE_8  src/FORTRAN/parms_pcf.c -c -o src/FORTRAN/parms_pcf.o
make: Leaving directory '/usr/src/RPM/BUILD/parms-3.2'
make: Entering directory '/usr/src/RPM/BUILD/parms-3.2'
mpicc -I./include -I./src/include	  -pipe -O3 -Wall -fPIC -DPIC -g \
-DUSE_MPI -DREAL=double -DDBL -DHAS_BLAS  -I/usr/lib64/openmpi/include -I/usr/src/RPM/BUILD/parms-3.2/src/include -I/usr/include/metis -g -DFORTRAN_UNDERSCORE -DVOID_POINTER_SIZE_8  src/DDPQ/PQ.c -c -o src/DDPQ/PQ.o
make: Leaving directory '/usr/src/RPM/BUILD/parms-3.2'
make: Entering directory '/usr/src/RPM/BUILD/parms-3.2'
mpicc -I./include -I./src/include	  -pipe -O3 -Wall -fPIC -DPIC -g \
-DUSE_MPI -DREAL=double -DDBL -DHAS_BLAS  -I/usr/lib64/openmpi/include -I/usr/src/RPM/BUILD/parms-3.2/src/include -I/usr/include/metis -g -DFORTRAN_UNDERSCORE -DVOID_POINTER_SIZE_8  src/DDPQ/misc.c -c -o src/DDPQ/misc.o
make: Leaving directory '/usr/src/RPM/BUILD/parms-3.2'
make: Entering directory '/usr/src/RPM/BUILD/parms-3.2'
mpicc -I./include -I./src/include	  -pipe -O3 -Wall -fPIC -DPIC -g \
-DUSE_MPI -DREAL=double -DDBL -DHAS_BLAS  -I/usr/lib64/openmpi/include -I/usr/src/RPM/BUILD/parms-3.2/src/include -I/usr/include/metis -g -DFORTRAN_UNDERSCORE -DVOID_POINTER_SIZE_8  src/parms_mat.c -c -o src/parms_mat.o
make: Leaving directory '/usr/src/RPM/BUILD/parms-3.2'
make: Entering directory '/usr/src/RPM/BUILD/parms-3.2'
mpicc -I./include -I./src/include	  -pipe -O3 -Wall -fPIC -DPIC -g \
-DUSE_MPI -DREAL=double -DDBL -DHAS_BLAS  -I/usr/lib64/openmpi/include -I/usr/src/RPM/BUILD/parms-3.2/src/include -I/usr/include/metis -g -DFORTRAN_UNDERSCORE -DVOID_POINTER_SIZE_8  src/DDPQ/sets.c -c -o src/DDPQ/sets.o
src/DDPQ/sets.c: In function 'lev4_nnz':
src/DDPQ/sets.c:745:3: warning: this 'if' clause does not guard... [-Wmisleading-indentation]
  745 |   if (nextmat != NULL)
      |   ^~
src/DDPQ/sets.c:747:4: note: ...this statement, but the latter is misleadingly indented as if it were guarded by the 'if'
  747 |    return (nnzT+nnzDown);
      |    ^~~~~~
src/DDPQ/sets.c: In function 'errexit':
src/DDPQ/sets.c:20:25: warning: '%s' directive writing up to 255 bytes into a region of size 249 [-Wformat-overflow=]
   20 |   sprintf(out2, "Error! %s\n", out1);
      |                         ^~     ~~~~
In file included from /usr/include/stdio.h:906,
                 from src/DDPQ/sets.c:1:
In function 'sprintf',
    inlined from 'errexit' at src/DDPQ/sets.c:20:3:
/usr/include/bits/stdio2.h:30:10: note: '__builtin___sprintf_chk' output between 9 and 264 bytes into a destination of size 256
   30 |   return __builtin___sprintf_chk (__s, __USE_FORTIFY_LEVEL - 1,
      |          ^~~~~~~~~~~~~~~~~~~~~~~~~~~~~~~~~~~~~~~~~~~~~~~~~~~~~~
   31 |                                   __glibc_objsize (__s), __fmt,
      |                                   ~~~~~~~~~~~~~~~~~~~~~~~~~~~~~
   32 |                                   __va_arg_pack ());
      |                                   ~~~~~~~~~~~~~~~~~
make: Leaving directory '/usr/src/RPM/BUILD/parms-3.2'
make: Entering directory '/usr/src/RPM/BUILD/parms-3.2'
mpicc -I./include -I./src/include	  -pipe -O3 -Wall -fPIC -DPIC -g \
-DUSE_MPI -DREAL=double -DDBL -DHAS_BLAS  -I/usr/lib64/openmpi/include -I/usr/src/RPM/BUILD/parms-3.2/src/include -I/usr/include/metis -g -DFORTRAN_UNDERSCORE -DVOID_POINTER_SIZE_8  src/DDPQ/piluNEW.c -c -o src/DDPQ/piluNEW.o
make: Leaving directory '/usr/src/RPM/BUILD/parms-3.2'
make: Entering directory '/usr/src/RPM/BUILD/parms-3.2'
mpicc -I./include -I./src/include	  -pipe -O3 -Wall -fPIC -DPIC -g \
-DUSE_MPI -DREAL=double -DDBL -DHAS_BLAS  -I/usr/lib64/openmpi/include -I/usr/src/RPM/BUILD/parms-3.2/src/include -I/usr/include/metis -g -DFORTRAN_UNDERSCORE -DVOID_POINTER_SIZE_8  src/parms_mat_dvcsr.c -c -o src/parms_mat_dvcsr.o
make: Leaving directory '/usr/src/RPM/BUILD/parms-3.2'
make: Entering directory '/usr/src/RPM/BUILD/parms-3.2'
mpicc -I./include -I./src/include	  -pipe -O3 -Wall -fPIC -DPIC -g \
-DUSE_MPI -DREAL=double -DDBL -DHAS_BLAS  -I/usr/lib64/openmpi/include -I/usr/src/RPM/BUILD/parms-3.2/src/include -I/usr/include/metis -g -DFORTRAN_UNDERSCORE -DVOID_POINTER_SIZE_8  src/parms_ilu_vcsr.c -c -o src/parms_ilu_vcsr.o
make: Leaving directory '/usr/src/RPM/BUILD/parms-3.2'
make: Entering directory '/usr/src/RPM/BUILD/parms-3.2'
if [ ! -d lib ]; then \
  mkdir lib; \
fi
ar -cr ./lib/libparms.a ./src/parms_comm.o ./src/parms_map.o  ./src/parms_mat.o ./src/parms_mat_vcsr.o ./src/parms_mat_dvcsr.o ./src/parms_mem.o ./src/parms_operator.o ./src/parms_ilu_vcsr.o ./src/parms_pc.o ./src/parms_pc_bj.o  ./src/parms_pc_ras.o ./src/parms_pc_schur.o ./src/parms_qsplit.o ./src/parms_solver.o ./src/parms_table.o ./src/parms_timer.o ./src/parms_vec.o ./src/parms_viewer.o ./src/fgmres.o ./src/gmres.o ./src/parms_complex.o  ./src/DDPQ/arms2.o ./src/DDPQ/ilutpC.o ./src/DDPQ/MatOps.o ./src/DDPQ/misc.o ./src/DDPQ/PQ.o ./src/DDPQ/piluNEW.o ./src/DDPQ/setblks.o ./src/DDPQ/sets.o ./src/DDPQ/svdInvC.o  ./src/FORTRAN/parms_mapf.o ./src/FORTRAN/parms_matf.o ./src/FORTRAN/parms_pcf.o ./src/FORTRAN/parms_solverf.o ./src/FORTRAN/parms_timerf.o ./src/FORTRAN/parms_vecf.o ./src/FORTRAN/parms_viewerf.o	 
make: Leaving directory '/usr/src/RPM/BUILD/parms-3.2'
+ make -j16 TOPDIR=/usr/src/RPM/BUILD/parms-3.2 examples
make: Nothing to be done for 'examples'.
+ make -j16 -C examples/general
make: Entering directory '/usr/src/RPM/BUILD/parms-3.2/examples/general'
mpicc -I../../include -I../../src/include	 -I/usr/include/metis -pipe -O3 -Wall -fPIC -DPIC -g \
-DUSE_MPI -DREAL=double -DDBL -DHAS_BLAS  -I/usr/lib64/openmpi/include -I/src/include -I/usr/include/metis -g -DFORTRAN_UNDERSCORE -DVOID_POINTER_SIZE_8  aux.c -c -o aux.o
aux.c: In function 'fread_param_':
aux.c:280:3: warning: '__builtin_strncpy' output truncated before terminating nul copying as many bytes from a string as its length [-Wstringop-truncation]
  280 |   strncpy(matrix, buff, strlen(buff));
      |   ^
aux.c:280:3: note: length computed here
  280 |   strncpy(matrix, buff, strlen(buff));
      |   ^~~~~~~~~~~~~~~~~~~~~~~~~~~~~~~~~~~
make: Leaving directory '/usr/src/RPM/BUILD/parms-3.2/examples/general'
make: Entering directory '/usr/src/RPM/BUILD/parms-3.2/examples/general'
mpicc -I../../include -I../../src/include	 -I/usr/include/metis -pipe -O3 -Wall -fPIC -DPIC -g \
-DUSE_MPI -DREAL=double -DDBL -DHAS_BLAS  -I/usr/lib64/openmpi/include -I/src/include -I/usr/include/metis -g -DFORTRAN_UNDERSCORE -DVOID_POINTER_SIZE_8  dd-HB-dse.c -c -o dd-HB-dse.o
make: Leaving directory '/usr/src/RPM/BUILD/parms-3.2/examples/general'
make: Entering directory '/usr/src/RPM/BUILD/parms-3.2/examples/general'
mpif90 -I../../include -pipe	-O3 -Wall -fPIC -DPIC -DVOID_POINTER_SIZE_8 -DDBL -DHAS_BLAS -g fdd-HB-dse.F -c -o fdd-HB-dse.o
f951: Warning: Nonconforming tab character in column 1 of line 19 [-Wtabs]
f951: Warning: Nonconforming tab character in column 1 of line 20 [-Wtabs]
f951: Warning: Nonconforming tab character in column 1 of line 21 [-Wtabs]
f951: Warning: Nonconforming tab character in column 1 of line 22 [-Wtabs]
f951: Warning: Nonconforming tab character in column 1 of line 23 [-Wtabs]
f951: Warning: Nonconforming tab character in column 1 of line 24 [-Wtabs]
f951: Warning: Nonconforming tab character in column 1 of line 25 [-Wtabs]
f951: Warning: Nonconforming tab character in column 1 of line 26 [-Wtabs]
f951: Warning: Nonconforming tab character in column 1 of line 27 [-Wtabs]
f951: Warning: Nonconforming tab character in column 1 of line 28 [-Wtabs]
f951: Warning: Nonconforming tab character in column 1 of line 29 [-Wtabs]
f951: Warning: Nonconforming tab character in column 1 of line 30 [-Wtabs]
f951: Warning: Nonconforming tab character in column 1 of line 31 [-Wtabs]
f951: Warning: Nonconforming tab character in column 1 of line 32 [-Wtabs]
../../include/fparms.h:24:72:

   24 |         parameter(SAME_NONZERO_STRUCTURE=0,DIFFERENT_NONZERO_STRUCTURE=1)
      |                                                                                     1
Warning: Nonconforming tab character at (1) [-Wtabs]
fdd-HB-dse.F:34:27:

   34 |       integer :: ierr, i, j, its, n, ncol, i1, len, nloc, matlen
      |                           1
Warning: Unused variable 'j' declared at (1) [-Wunused-variable]
make: Leaving directory '/usr/src/RPM/BUILD/parms-3.2/examples/general'
make: Entering directory '/usr/src/RPM/BUILD/parms-3.2/examples/general'
mpif77 -pipe	-O3 -Wall -fPIC -DPIC -DVOID_POINTER_SIZE_8 -DDBL -DHAS_BLAS -g skit.f -c -o skit.o
f951: Warning: Nonconforming tab character in column 1 of line 948 [-Wtabs]
f951: Warning: Nonconforming tab character in column 1 of line 949 [-Wtabs]
f951: Warning: Nonconforming tab character in column 1 of line 956 [-Wtabs]
f951: Warning: Nonconforming tab character in column 1 of line 957 [-Wtabs]
f951: Warning: Nonconforming tab character in column 1 of line 1412 [-Wtabs]
f951: Warning: Nonconforming tab character in column 1 of line 1825 [-Wtabs]
f951: Warning: Nonconforming tab character in column 1 of line 1826 [-Wtabs]
f951: Warning: Nonconforming tab character in column 1 of line 1834 [-Wtabs]
f951: Warning: Nonconforming tab character in column 1 of line 1835 [-Wtabs]
f951: Warning: Nonconforming tab character in column 1 of line 4055 [-Wtabs]
skit.f:2024:11:

 2024 |       tmp       = x(init)
      |                 1
Warning: Nonconforming tab character at (1) [-Wtabs]
skit.f:2035:12:

 2035 |       tmp1        = x(ii)
      |                 1
Warning: Nonconforming tab character at (1) [-Wtabs]
skit.f:2037:12:

 2037 |       next        = perm(ii)
      |                 1
Warning: Nonconforming tab character at (1) [-Wtabs]
skit.f:2056:11:

 2056 |       tmp       = x(init)
      |                 1
Warning: Nonconforming tab character at (1) [-Wtabs]
skit.f:2057:10:

 2057 |       ii        = perm(init)
      |                 1
Warning: Nonconforming tab character at (1) [-Wtabs]
skit.f:2099:11:

 2099 |       tmp       = ix(init)
      |                 1
Warning: Nonconforming tab character at (1) [-Wtabs]
skit.f:2110:12:

 2110 |       tmp1        = ix(ii)
      |                 1
Warning: Nonconforming tab character at (1) [-Wtabs]
skit.f:2112:12:

 2112 |       next        = perm(ii)
      |                 1
Warning: Nonconforming tab character at (1) [-Wtabs]
skit.f:2131:11:

 2131 |       tmp       = ix(init)
      |                 1
Warning: Nonconforming tab character at (1) [-Wtabs]
skit.f:2132:10:

 2132 |       ii        = perm(init)
      |                 1
Warning: Nonconforming tab character at (1) [-Wtabs]
skit.f:3066:24:

 3066 |          i = riord(ir)
      |                         1       
Warning: Nonconforming tab character at (1) [-Wtabs]
skit.f:3577:72:

 3577 |       subroutine zwreadmtc (nmax,nzmax,job,fname,length,a,ja,ia,rhs,nrhs,
      |                                                                        1
Warning: Line truncated at (1) [-Wline-truncation]
skit.f:3026:3:

 3026 |  13   continue
      |   1
Warning: Label 13 at (1) defined but not used [-Wunused-label]
skit.f:3050:2:

 3050 |  3    levels(nlev+1) = iend+1
      |  1
Warning: Label 3 at (1) defined but not used [-Wunused-label]
skit.f:3460:41:

 3460 |       subroutine add_lk(new,nod,idom,ndom,lkend,levst,link,nodes,marker)
      |                                         1
Warning: Unused dummy argument 'ndom' at (1) [-Wunused-dummy-argument]
skit.f:3438:36:

 3438 |       function mindom(n, ndom, levst, link)
      |                                    1
Warning: Unused dummy argument 'levst' at (1) [-Wunused-dummy-argument]
skit.f:3058:42:

 3058 |       subroutine add_lvst(istart,iend,nlev,riord,ja,ia,mask,maskval)
      |                                          1
Warning: Unused dummy argument 'nlev' at (1) [-Wunused-dummy-argument]
skit.f:2464:57:

 2464 |      &     nnz, neltvl, nrhs, nmax, nzmax, nrwindx, stlen
      |                                                         1
Warning: Unused variable 'stlen' declared at (1) [-Wunused-variable]
skit.f:1119:42:

 1119 |       subroutine rnrms   (nrow, nrm, a, ja, ia, diag)
      |                                          1
Warning: Unused dummy argument 'ja' at (1) [-Wunused-dummy-argument]
skit.f:577:58:

  577 |       subroutine part0 (nx,ny,mpx,mpy,ovlp,lst,lstptr,iout)
      |                                                          1
Warning: Unused dummy argument 'iout' at (1) [-Wunused-dummy-argument]
skit.f:634:58:

  634 |       subroutine part1 (nx,ny,mpx,mpy,ovlp,lst,lstptr,iout)
      |                                                          1
Warning: Unused dummy argument 'iout' at (1) [-Wunused-dummy-argument]
skit.f:698:65:

  698 |       subroutine part2 (nx,ny,nz,mpx,mpy,mpz,ovlp,lst,lstptr,iout)
      |                                                                 1
Warning: Unused dummy argument 'iout' at (1) [-Wunused-dummy-argument]
skit.f:3578:17:

 3578 |      *     guesol,nrow,ncol,nnz,title,key,type,ierr)
      |                 1
Warning: Unused dummy argument 'nrhsguesol' at (1) [-Wunused-dummy-argument]
skit.f:3438:6:

 3438 |       function mindom(n, ndom, levst, link)
      |      ^
Warning: '__result_mindom' may be used uninitialized [-Wmaybe-uninitialized]
skit.f:2764:72:

 2764 |       init = iptr(nextdom)
      |                                                                        ^
Warning: 'nextdom' may be used uninitialized [-Wmaybe-uninitialized]
skit.f:2734:27:

 2734 |      *     maxsiz,j,nextdom
      |                           ^
note: 'nextdom' was declared here
make: Leaving directory '/usr/src/RPM/BUILD/parms-3.2/examples/general'
make: Entering directory '/usr/src/RPM/BUILD/parms-3.2/examples/general'
mpif77 -pipe	-O3 -Wall -fPIC -DPIC -DVOID_POINTER_SIZE_8 -DDBL -DHAS_BLAS -g  -o dd-HB-dse.ex dd-HB-dse.o aux.o skit.o \
  -L../../lib -lparms \
 -Wl,-rpath,/usr/lib64/openmpi/lib  -llapack -lopenblas -lgfortran \
 -lm 
make: Leaving directory '/usr/src/RPM/BUILD/parms-3.2/examples/general'
make: Entering directory '/usr/src/RPM/BUILD/parms-3.2/examples/general'
mpif90 -pipe	-O3 -Wall -fPIC -DPIC -DVOID_POINTER_SIZE_8 -DDBL -DHAS_BLAS -g  -o fdd-HB-dse.ex fdd-HB-dse.o aux.o skit.o \
  -L../../lib -lparms \
 -Wl,-rpath,/usr/lib64/openmpi/lib   -llapack -lopenblas -lgfortran \
 -lm 
make: Leaving directory '/usr/src/RPM/BUILD/parms-3.2/examples/general'
+ make -j16 -C examples/grid
make: Entering directory '/usr/src/RPM/BUILD/parms-3.2/examples/grid'
mpif77 -pipe	-O3 -Wall -fPIC -DPIC -DVOID_POINTER_SIZE_8 -DDBL -DHAS_BLAS -g skit.f -c -o skit.o
skit.f:1:58:

    1 |       subroutine part1 (nx,ny,mpx,mpy,ovlp,lst,lstptr,iout)
      |                                                          1
Warning: Unused dummy argument 'iout' at (1) [-Wunused-dummy-argument]
skit.f:65:65:

   65 |       subroutine part2 (nx,ny,nz,mpx,mpy,mpz,ovlp,lst,lstptr,iout)
      |                                                                 1
Warning: Unused dummy argument 'iout' at (1) [-Wunused-dummy-argument]
make: Leaving directory '/usr/src/RPM/BUILD/parms-3.2/examples/grid'
make: Entering directory '/usr/src/RPM/BUILD/parms-3.2/examples/grid'
mpicc -I../../include -I../../src/include	  -pipe -O3 -Wall -fPIC -DPIC -g \
-DUSE_MPI -DREAL=double -DDBL -DHAS_BLAS  -I/usr/lib64/openmpi/include -I/src/include -I/usr/include/metis -g -DFORTRAN_UNDERSCORE -DVOID_POINTER_SIZE_8  dd-grid.c -c -o dd-grid.o
make: Leaving directory '/usr/src/RPM/BUILD/parms-3.2/examples/grid'
make: Entering directory '/usr/src/RPM/BUILD/parms-3.2/examples/grid'
mpicc -I../../include -I../../src/include	  -pipe -O3 -Wall -fPIC -DPIC -g \
-DUSE_MPI -DREAL=double -DDBL -DHAS_BLAS  -I/usr/lib64/openmpi/include -I/src/include -I/usr/include/metis -g -DFORTRAN_UNDERSCORE -DVOID_POINTER_SIZE_8  aux.c -c -o aux.o
make: Leaving directory '/usr/src/RPM/BUILD/parms-3.2/examples/grid'
make: Entering directory '/usr/src/RPM/BUILD/parms-3.2/examples/grid'
mpif77 -pipe	-O3 -Wall -fPIC -DPIC -DVOID_POINTER_SIZE_8 -DDBL -DHAS_BLAS -g functs.f -c -o functs.o
f951: Warning: Nonconforming tab character in column 1 of line 67 [-Wtabs]
f951: Warning: Nonconforming tab character in column 1 of line 77 [-Wtabs]
f951: Warning: Nonconforming tab character in column 1 of line 85 [-Wtabs]
f951: Warning: Nonconforming tab character in column 1 of line 86 [-Wtabs]
f951: Warning: Nonconforming tab character in column 3 of line 90 [-Wtabs]
f951: Warning: Nonconforming tab character in column 1 of line 92 [-Wtabs]
f951: Warning: Nonconforming tab character in column 1 of line 97 [-Wtabs]
f951: Warning: Nonconforming tab character in column 1 of line 107 [-Wtabs]
f951: Warning: Nonconforming tab character in column 1 of line 127 [-Wtabs]
f951: Warning: Nonconforming tab character in column 1 of line 243 [-Wtabs]
f951: Warning: Nonconforming tab character in column 1 of line 254 [-Wtabs]
f951: Warning: Nonconforming tab character in column 1 of line 263 [-Wtabs]
f951: Warning: Nonconforming tab character in column 1 of line 264 [-Wtabs]
f951: Warning: Nonconforming tab character in column 3 of line 268 [-Wtabs]
f951: Warning: Nonconforming tab character in column 1 of line 270 [-Wtabs]
f951: Warning: Nonconforming tab character in column 1 of line 276 [-Wtabs]
f951: Warning: Nonconforming tab character in column 1 of line 287 [-Wtabs]
f951: Warning: Nonconforming tab character in column 1 of line 309 [-Wtabs]
functs.f:185:25:

  185 |       zafun = cmplx(-1.0,0.0d0)
      |                         1
Warning: Conversion from REAL(8) to default-kind COMPLEX(4) at (1) might lose precision, consider using the KIND argument [-Wconversion]
functs.f:192:26:

  192 |       zbfun = cmplx(-1.0, 0.0d0)
      |                          1
Warning: Conversion from REAL(8) to default-kind COMPLEX(4) at (1) might lose precision, consider using the KIND argument [-Wconversion]
functs.f:199:20:

  199 |       zcfun = cmplx(-1.0d0, 0.0d0)
      |                    1
Warning: Conversion from REAL(8) to default-kind COMPLEX(4) at (1) might lose precision, consider using the KIND argument [-Wconversion]
functs.f:207:20:

  207 |       zdfun = cmplx(gamma*dexp(x*y), 0.0)
      |                    1
Warning: Conversion from REAL(8) to default-kind COMPLEX(4) at (1) might lose precision, consider using the KIND argument [-Wconversion]
functs.f:215:20:

  215 |       zefun = cmplx(gamma*dexp(-x*y), 0.0)
      |                    1
Warning: Conversion from REAL(8) to default-kind COMPLEX(4) at (1) might lose precision, consider using the KIND argument [-Wconversion]
functs.f:222:20:

  222 |       zffun = cmplx(0.0d0, 0.0d0)
      |                    1
Warning: Conversion from REAL(8) to default-kind COMPLEX(4) at (1) might lose precision, consider using the KIND argument [-Wconversion]
functs.f:232:20:

  232 |       zgfun = cmplx(-10.0d0, 0.0d0);
      |                    1
Warning: Conversion from REAL(8) to default-kind COMPLEX(4) at (1) might lose precision, consider using the KIND argument [-Wconversion]
functs.f:243:39:

  243 |             coeff((j-1)*nfree+i) = cmplx(0.0d0, 0.0d0)
      |                                              1
Warning: Conversion from REAL(8) to default-kind COMPLEX(4) at (1) might lose precision, consider using the KIND argument [-Wconversion]
functs.f:245:38:

  245 |          coeff((j-1)*nfree+j) = cmplx(-1.0d0, 0.0d0)
      |                                      1
Warning: Conversion from REAL(8) to default-kind COMPLEX(4) at (1) might lose precision, consider using the KIND argument [-Wconversion]
functs.f:254:39:

  254 |             coeff((j-1)*nfree+i) = cmplx(0.0d0, 0.0d0)
      |                                              1
Warning: Conversion from REAL(8) to default-kind COMPLEX(4) at (1) might lose precision, consider using the KIND argument [-Wconversion]
functs.f:256:38:

  256 |          coeff((j-1)*nfree+j) = cmplx(-1.0d0, 0.0d0)
      |                                      1
Warning: Conversion from REAL(8) to default-kind COMPLEX(4) at (1) might lose precision, consider using the KIND argument [-Wconversion]
functs.f:265:43:

  265 |               coeff((j-1)*nfree+i) = cmplx(0.0d0, 0.0d0)
      |                                           1
Warning: Conversion from REAL(8) to default-kind COMPLEX(4) at (1) might lose precision, consider using the KIND argument [-Wconversion]
functs.f:267:40:

  267 |            coeff((j-1)*nfree+j) = cmplx(-1.0d0, 0.0d0)
      |                                        1
Warning: Conversion from REAL(8) to default-kind COMPLEX(4) at (1) might lose precision, consider using the KIND argument [-Wconversion]
functs.f:276:39:

  276 |             coeff((j-1)*nfree+i) = cmplx(0.0d0, 0.0d0)
      |                                              1
Warning: Conversion from REAL(8) to default-kind COMPLEX(4) at (1) might lose precision, consider using the KIND argument [-Wconversion]
functs.f:287:39:

  287 |             coeff((j-1)*nfree+i) = cmplx(0.0d0, 0.0d0)
      |                                              1
Warning: Conversion from REAL(8) to default-kind COMPLEX(4) at (1) might lose precision, consider using the KIND argument [-Wconversion]
functs.f:298:41:

  298 |             coeff((j-1)*nfree+i) = cmplx(0.0d0, 0.0d0)
      |                                         1
Warning: Conversion from REAL(8) to default-kind COMPLEX(4) at (1) might lose precision, consider using the KIND argument [-Wconversion]
functs.f:309:39:

  309 |             coeff((j-1)*nfree+i) = cmplx(0.0d0, 0.0d0)
      |                                              1
Warning: Conversion from REAL(8) to default-kind COMPLEX(4) at (1) might lose precision, consider using the KIND argument [-Wconversion]
functs.f:14:22:

   14 |       function afun (x,y,z)
      |                      1
Warning: Unused dummy argument 'x' at (1) [-Wunused-dummy-argument]
functs.f:14:24:

   14 |       function afun (x,y,z)
      |                        1
Warning: Unused dummy argument 'y' at (1) [-Wunused-dummy-argument]
functs.f:14:26:

   14 |       function afun (x,y,z)
      |                          1
Warning: Unused dummy argument 'z' at (1) [-Wunused-dummy-argument]
functs.f:20:22:

   20 |       function bfun (x,y,z)
      |                      1
Warning: Unused dummy argument 'x' at (1) [-Wunused-dummy-argument]
functs.f:20:24:

   20 |       function bfun (x,y,z)
      |                        1
Warning: Unused dummy argument 'y' at (1) [-Wunused-dummy-argument]
functs.f:20:26:

   20 |       function bfun (x,y,z)
      |                          1
Warning: Unused dummy argument 'z' at (1) [-Wunused-dummy-argument]
functs.f:26:22:

   26 |       function cfun (x,y,z)
      |                      1
Warning: Unused dummy argument 'x' at (1) [-Wunused-dummy-argument]
functs.f:26:24:

   26 |       function cfun (x,y,z)
      |                        1
Warning: Unused dummy argument 'y' at (1) [-Wunused-dummy-argument]
functs.f:26:26:

   26 |       function cfun (x,y,z)
      |                          1
Warning: Unused dummy argument 'z' at (1) [-Wunused-dummy-argument]
functs.f:32:26:

   32 |       function dfun (x,y,z)
      |                          1
Warning: Unused dummy argument 'z' at (1) [-Wunused-dummy-argument]
functs.f:39:26:

   39 |       function efun (x,y,z)
      |                          1
Warning: Unused dummy argument 'z' at (1) [-Wunused-dummy-argument]
functs.f:46:22:

   46 |       function ffun (x,y,z)
      |                      1
Warning: Unused dummy argument 'x' at (1) [-Wunused-dummy-argument]
functs.f:46:24:

   46 |       function ffun (x,y,z)
      |                        1
Warning: Unused dummy argument 'y' at (1) [-Wunused-dummy-argument]
functs.f:46:26:

   46 |       function ffun (x,y,z)
      |                          1
Warning: Unused dummy argument 'z' at (1) [-Wunused-dummy-argument]
functs.f:52:22:

   52 |       function gfun (x,y,z)
      |                      1
Warning: Unused dummy argument 'x' at (1) [-Wunused-dummy-argument]
functs.f:52:24:

   52 |       function gfun (x,y,z)
      |                        1
Warning: Unused dummy argument 'y' at (1) [-Wunused-dummy-argument]
functs.f:52:26:

   52 |       function gfun (x,y,z)
      |                          1
Warning: Unused dummy argument 'z' at (1) [-Wunused-dummy-argument]
functs.f:63:32:

   63 |       subroutine afunbl (nfree,x,y,z,coeff)
      |                                1
Warning: Unused dummy argument 'x' at (1) [-Wunused-dummy-argument]
functs.f:63:34:

   63 |       subroutine afunbl (nfree,x,y,z,coeff)
      |                                  1
Warning: Unused dummy argument 'y' at (1) [-Wunused-dummy-argument]
functs.f:63:36:

   63 |       subroutine afunbl (nfree,x,y,z,coeff)
      |                                    1
Warning: Unused dummy argument 'z' at (1) [-Wunused-dummy-argument]
functs.f:73:32:

   73 |       subroutine bfunbl (nfree,x,y,z,coeff)
      |                                1
Warning: Unused dummy argument 'x' at (1) [-Wunused-dummy-argument]
functs.f:73:34:

   73 |       subroutine bfunbl (nfree,x,y,z,coeff)
      |                                  1
Warning: Unused dummy argument 'y' at (1) [-Wunused-dummy-argument]
functs.f:73:36:

   73 |       subroutine bfunbl (nfree,x,y,z,coeff)
      |                                    1
Warning: Unused dummy argument 'z' at (1) [-Wunused-dummy-argument]
functs.f:83:34:

   83 |         subroutine cfunbl (nfree,x,y,z,coeff)
      |                                  1
Warning: Unused dummy argument 'x' at (1) [-Wunused-dummy-argument]
functs.f:83:36:

   83 |         subroutine cfunbl (nfree,x,y,z,coeff)
      |                                    1
Warning: Unused dummy argument 'y' at (1) [-Wunused-dummy-argument]
functs.f:83:38:

   83 |         subroutine cfunbl (nfree,x,y,z,coeff)
      |                                      1
Warning: Unused dummy argument 'z' at (1) [-Wunused-dummy-argument]
functs.f:93:32:

   93 |       subroutine dfunbl (nfree,x,y,z,coeff)
      |                                1
Warning: Unused dummy argument 'x' at (1) [-Wunused-dummy-argument]
functs.f:93:34:

   93 |       subroutine dfunbl (nfree,x,y,z,coeff)
      |                                  1
Warning: Unused dummy argument 'y' at (1) [-Wunused-dummy-argument]
functs.f:93:36:

   93 |       subroutine dfunbl (nfree,x,y,z,coeff)
      |                                    1
Warning: Unused dummy argument 'z' at (1) [-Wunused-dummy-argument]
functs.f:103:32:

  103 |       subroutine efunbl (nfree,x,y,z,coeff)
      |                                1
Warning: Unused dummy argument 'x' at (1) [-Wunused-dummy-argument]
functs.f:103:34:

  103 |       subroutine efunbl (nfree,x,y,z,coeff)
      |                                  1
Warning: Unused dummy argument 'y' at (1) [-Wunused-dummy-argument]
functs.f:103:36:

  103 |       subroutine efunbl (nfree,x,y,z,coeff)
      |                                    1
Warning: Unused dummy argument 'z' at (1) [-Wunused-dummy-argument]
functs.f:113:32:

  113 |       subroutine ffunbl (nfree,x,y,z,coeff)
      |                                1
Warning: Unused dummy argument 'x' at (1) [-Wunused-dummy-argument]
functs.f:113:34:

  113 |       subroutine ffunbl (nfree,x,y,z,coeff)
      |                                  1
Warning: Unused dummy argument 'y' at (1) [-Wunused-dummy-argument]
functs.f:113:36:

  113 |       subroutine ffunbl (nfree,x,y,z,coeff)
      |                                    1
Warning: Unused dummy argument 'z' at (1) [-Wunused-dummy-argument]
functs.f:123:32:

  123 |       subroutine gfunbl (nfree,x,y,z,coeff)
      |                                1
Warning: Unused dummy argument 'x' at (1) [-Wunused-dummy-argument]
functs.f:123:34:

  123 |       subroutine gfunbl (nfree,x,y,z,coeff)
      |                                  1
Warning: Unused dummy argument 'y' at (1) [-Wunused-dummy-argument]
functs.f:123:36:

  123 |       subroutine gfunbl (nfree,x,y,z,coeff)
      |                                    1
Warning: Unused dummy argument 'z' at (1) [-Wunused-dummy-argument]
functs.f:136:37:

  136 |       subroutine xyk(nel,xyke,x,y,ijk,node)
      |                                     1
Warning: Unused dummy argument 'ijk' at (1) [-Wunused-dummy-argument]
functs.f:136:24:

  136 |       subroutine xyk(nel,xyke,x,y,ijk,node)
      |                        1
Warning: Unused dummy argument 'nel' at (1) [-Wunused-dummy-argument]
functs.f:136:31:

  136 |       subroutine xyk(nel,xyke,x,y,ijk,node)
      |                               1
Warning: Unused dummy argument 'x' at (1) [-Wunused-dummy-argument]
functs.f:136:33:

  136 |       subroutine xyk(nel,xyke,x,y,ijk,node)
      |                                 1
Warning: Unused dummy argument 'y' at (1) [-Wunused-dummy-argument]
functs.f:182:23:

  182 |       function zafun (x,y,z)
      |                       1
Warning: Unused dummy argument 'x' at (1) [-Wunused-dummy-argument]
functs.f:182:25:

  182 |       function zafun (x,y,z)
      |                         1
Warning: Unused dummy argument 'y' at (1) [-Wunused-dummy-argument]
functs.f:182:27:

  182 |       function zafun (x,y,z)
      |                           1
Warning: Unused dummy argument 'z' at (1) [-Wunused-dummy-argument]
functs.f:189:23:

  189 |       function zbfun (x,y,z)
      |                       1
Warning: Unused dummy argument 'x' at (1) [-Wunused-dummy-argument]
functs.f:189:25:

  189 |       function zbfun (x,y,z)
      |                         1
Warning: Unused dummy argument 'y' at (1) [-Wunused-dummy-argument]
functs.f:189:27:

  189 |       function zbfun (x,y,z)
      |                           1
Warning: Unused dummy argument 'z' at (1) [-Wunused-dummy-argument]
functs.f:196:23:

  196 |       function zcfun (x,y,z)
      |                       1
Warning: Unused dummy argument 'x' at (1) [-Wunused-dummy-argument]
functs.f:196:25:

  196 |       function zcfun (x,y,z)
      |                         1
Warning: Unused dummy argument 'y' at (1) [-Wunused-dummy-argument]
functs.f:196:27:

  196 |       function zcfun (x,y,z)
      |                           1
Warning: Unused dummy argument 'z' at (1) [-Wunused-dummy-argument]
functs.f:203:27:

  203 |       function zdfun (x,y,z)
      |                           1
Warning: Unused dummy argument 'z' at (1) [-Wunused-dummy-argument]
functs.f:211:27:

  211 |       function zefun (x,y,z)
      |                           1
Warning: Unused dummy argument 'z' at (1) [-Wunused-dummy-argument]
functs.f:219:23:

  219 |       function zffun (x,y,z)
      |                       1
Warning: Unused dummy argument 'x' at (1) [-Wunused-dummy-argument]
functs.f:219:25:

  219 |       function zffun (x,y,z)
      |                         1
Warning: Unused dummy argument 'y' at (1) [-Wunused-dummy-argument]
functs.f:219:27:

  219 |       function zffun (x,y,z)
      |                           1
Warning: Unused dummy argument 'z' at (1) [-Wunused-dummy-argument]
functs.f:226:23:

  226 |       function zgfun (x,y,z)
      |                       1
Warning: Unused dummy argument 'x' at (1) [-Wunused-dummy-argument]
functs.f:226:25:

  226 |       function zgfun (x,y,z)
      |                         1
Warning: Unused dummy argument 'y' at (1) [-Wunused-dummy-argument]
functs.f:226:27:

  226 |       function zgfun (x,y,z)
      |                           1
Warning: Unused dummy argument 'z' at (1) [-Wunused-dummy-argument]
functs.f:238:33:

  238 |       subroutine zafunbl (nfree,x,y,z,coeff)
      |                                 1
Warning: Unused dummy argument 'x' at (1) [-Wunused-dummy-argument]
functs.f:238:35:

  238 |       subroutine zafunbl (nfree,x,y,z,coeff)
      |                                   1
Warning: Unused dummy argument 'y' at (1) [-Wunused-dummy-argument]
functs.f:238:37:

  238 |       subroutine zafunbl (nfree,x,y,z,coeff)
      |                                     1
Warning: Unused dummy argument 'z' at (1) [-Wunused-dummy-argument]
functs.f:249:33:

  249 |       subroutine zbfunbl (nfree,x,y,z,coeff)
      |                                 1
Warning: Unused dummy argument 'x' at (1) [-Wunused-dummy-argument]
functs.f:249:35:

  249 |       subroutine zbfunbl (nfree,x,y,z,coeff)
      |                                   1
Warning: Unused dummy argument 'y' at (1) [-Wunused-dummy-argument]
functs.f:249:37:

  249 |       subroutine zbfunbl (nfree,x,y,z,coeff)
      |                                     1
Warning: Unused dummy argument 'z' at (1) [-Wunused-dummy-argument]
functs.f:260:35:

  260 |         subroutine zcfunbl (nfree,x,y,z,coeff)
      |                                   1
Warning: Unused dummy argument 'x' at (1) [-Wunused-dummy-argument]
functs.f:260:37:

  260 |         subroutine zcfunbl (nfree,x,y,z,coeff)
      |                                     1
Warning: Unused dummy argument 'y' at (1) [-Wunused-dummy-argument]
functs.f:260:39:

  260 |         subroutine zcfunbl (nfree,x,y,z,coeff)
      |                                       1
Warning: Unused dummy argument 'z' at (1) [-Wunused-dummy-argument]
functs.f:271:33:

  271 |       subroutine zdfunbl (nfree,x,y,z,coeff)
      |                                 1
Warning: Unused dummy argument 'x' at (1) [-Wunused-dummy-argument]
functs.f:271:35:

  271 |       subroutine zdfunbl (nfree,x,y,z,coeff)
      |                                   1
Warning: Unused dummy argument 'y' at (1) [-Wunused-dummy-argument]
functs.f:271:37:

  271 |       subroutine zdfunbl (nfree,x,y,z,coeff)
      |                                     1
Warning: Unused dummy argument 'z' at (1) [-Wunused-dummy-argument]
functs.f:282:33:

  282 |       subroutine zefunbl (nfree,x,y,z,coeff)
      |                                 1
Warning: Unused dummy argument 'x' at (1) [-Wunused-dummy-argument]
functs.f:282:35:

  282 |       subroutine zefunbl (nfree,x,y,z,coeff)
      |                                   1
Warning: Unused dummy argument 'y' at (1) [-Wunused-dummy-argument]
functs.f:282:37:

  282 |       subroutine zefunbl (nfree,x,y,z,coeff)
      |                                     1
Warning: Unused dummy argument 'z' at (1) [-Wunused-dummy-argument]
functs.f:293:33:

  293 |       subroutine zffunbl (nfree,x,y,z,coeff)
      |                                 1
Warning: Unused dummy argument 'x' at (1) [-Wunused-dummy-argument]
functs.f:293:35:

  293 |       subroutine zffunbl (nfree,x,y,z,coeff)
      |                                   1
Warning: Unused dummy argument 'y' at (1) [-Wunused-dummy-argument]
functs.f:293:37:

  293 |       subroutine zffunbl (nfree,x,y,z,coeff)
      |                                     1
Warning: Unused dummy argument 'z' at (1) [-Wunused-dummy-argument]
functs.f:304:33:

  304 |       subroutine zgfunbl (nfree,x,y,z,coeff)
      |                                 1
Warning: Unused dummy argument 'x' at (1) [-Wunused-dummy-argument]
functs.f:304:35:

  304 |       subroutine zgfunbl (nfree,x,y,z,coeff)
      |                                   1
Warning: Unused dummy argument 'y' at (1) [-Wunused-dummy-argument]
functs.f:304:37:

  304 |       subroutine zgfunbl (nfree,x,y,z,coeff)
      |                                     1
Warning: Unused dummy argument 'z' at (1) [-Wunused-dummy-argument]
functs.f:318:38:

  318 |       subroutine zxyk(nel,xyke,x,y,ijk,node)
      |                                      1
Warning: Unused dummy argument 'ijk' at (1) [-Wunused-dummy-argument]
functs.f:318:25:

  318 |       subroutine zxyk(nel,xyke,x,y,ijk,node)
      |                         1
Warning: Unused dummy argument 'nel' at (1) [-Wunused-dummy-argument]
functs.f:318:32:

  318 |       subroutine zxyk(nel,xyke,x,y,ijk,node)
      |                                1
Warning: Unused dummy argument 'x' at (1) [-Wunused-dummy-argument]
functs.f:318:34:

  318 |       subroutine zxyk(nel,xyke,x,y,ijk,node)
      |                                  1
Warning: Unused dummy argument 'y' at (1) [-Wunused-dummy-argument]
make: Leaving directory '/usr/src/RPM/BUILD/parms-3.2/examples/grid'
make: Entering directory '/usr/src/RPM/BUILD/parms-3.2/examples/grid'
mpif77 -pipe	-O3 -Wall -fPIC -DPIC -DVOID_POINTER_SIZE_8 -DDBL -DHAS_BLAS -g fdmat.f -c -o fdmat.o
f951: Warning: Nonconforming tab character in column 1 of line 84 [-Wtabs]
f951: Warning: Nonconforming tab character in column 1 of line 90 [-Wtabs]
f951: Warning: Nonconforming tab character in column 1 of line 96 [-Wtabs]
f951: Warning: Nonconforming tab character in column 1 of line 108 [-Wtabs]
f951: Warning: Nonconforming tab character in column 1 of line 114 [-Wtabs]
f951: Warning: Nonconforming tab character in column 1 of line 400 [-Wtabs]
f951: Warning: Nonconforming tab character in column 1 of line 406 [-Wtabs]
f951: Warning: Nonconforming tab character in column 1 of line 412 [-Wtabs]
f951: Warning: Nonconforming tab character in column 1 of line 424 [-Wtabs]
f951: Warning: Nonconforming tab character in column 1 of line 430 [-Wtabs]
fdmat.f:70:26:

   70 |       h = 1.0/real(nx+1)
      |                                 1
Warning: Nonconforming tab character at (1) [-Wtabs]
fdmat.f:160:26:

  160 |       h = 1.0/real(nx+1)
      |                                 1
Warning: Nonconforming tab character at (1) [-Wtabs]
fdmat.f:386:26:

  386 |       h = 1.0/real(nx+1)
      |                                 1
Warning: Nonconforming tab character at (1) [-Wtabs]
fdmat.f:481:26:

  481 |       h = 1.0/real(nx+1)
      |                                 1
Warning: Nonconforming tab character at (1) [-Wtabs]
fdmat.f:228:29:

  228 |        subroutine getsten (nx,ny,nz,kx,ky,kz,stencil,h)
      |                             1
Warning: Unused dummy argument 'nx' at (1) [-Wunused-dummy-argument]
fdmat.f:549:30:

  549 |        subroutine zgetsten (nx,ny,nz,kx,ky,kz,stencil,h)
      |                              1
Warning: Unused dummy argument 'nx' at (1) [-Wunused-dummy-argument]
make: Leaving directory '/usr/src/RPM/BUILD/parms-3.2/examples/grid'
make: Entering directory '/usr/src/RPM/BUILD/parms-3.2/examples/grid'
mpif90 -I../../include -pipe	-O3 -Wall -fPIC -DPIC -DVOID_POINTER_SIZE_8 -DDBL -DHAS_BLAS -g fdd-grid.F -c -o fdd-grid.o
f951: Warning: Nonconforming tab character in column 1 of line 19 [-Wtabs]
f951: Warning: Nonconforming tab character in column 1 of line 20 [-Wtabs]
f951: Warning: Nonconforming tab character in column 1 of line 21 [-Wtabs]
f951: Warning: Nonconforming tab character in column 1 of line 22 [-Wtabs]
f951: Warning: Nonconforming tab character in column 1 of line 23 [-Wtabs]
f951: Warning: Nonconforming tab character in column 1 of line 24 [-Wtabs]
f951: Warning: Nonconforming tab character in column 1 of line 25 [-Wtabs]
f951: Warning: Nonconforming tab character in column 1 of line 26 [-Wtabs]
f951: Warning: Nonconforming tab character in column 1 of line 27 [-Wtabs]
f951: Warning: Nonconforming tab character in column 1 of line 28 [-Wtabs]
f951: Warning: Nonconforming tab character in column 1 of line 29 [-Wtabs]
f951: Warning: Nonconforming tab character in column 1 of line 30 [-Wtabs]
f951: Warning: Nonconforming tab character in column 1 of line 31 [-Wtabs]
f951: Warning: Nonconforming tab character in column 1 of line 32 [-Wtabs]
../../include/fparms.h:24:72:

   24 |         parameter(SAME_NONZERO_STRUCTURE=0,DIFFERENT_NONZERO_STRUCTURE=1)
      |                                                                                     1
Warning: Nonconforming tab character at (1) [-Wtabs]
fdd-grid.F:22:22:

   22 |       logical :: cnpro
      |                      1
Warning: Unused variable 'cnpro' declared at (1) [-Wunused-variable]
fdd-grid.F:21:26:

   21 |       integer :: nnz, i, j, its, len
      |                          1
Warning: Unused variable 'j' declared at (1) [-Wunused-variable]
fdd-grid.F:11:41:

   11 |       integer :: nrow, start, pos, nnzrow
      |                                         1
Warning: Unused variable 'nnzrow' declared at (1) [-Wunused-variable]
fdd-grid.F:11:33:

   11 |       integer :: nrow, start, pos, nnzrow
      |                                 1
Warning: Unused variable 'pos' declared at (1) [-Wunused-variable]
make: Leaving directory '/usr/src/RPM/BUILD/parms-3.2/examples/grid'
make: Entering directory '/usr/src/RPM/BUILD/parms-3.2/examples/grid'
mpif77 -pipe	-O3 -Wall -fPIC -DPIC -DVOID_POINTER_SIZE_8 -DDBL -DHAS_BLAS -g  -o dd-grid.ex dd-grid.o skit.o functs.o fdmat.o aux.o \
  -L../../lib -lparms   \
 -Wl,-rpath,/usr/lib64/openmpi/lib   -llapack -lopenblas -lgfortran \
 -lm 
make: Leaving directory '/usr/src/RPM/BUILD/parms-3.2/examples/grid'
make: Entering directory '/usr/src/RPM/BUILD/parms-3.2/examples/grid'
mpif90 -pipe	-O3 -Wall -fPIC -DPIC -DVOID_POINTER_SIZE_8 -DDBL -DHAS_BLAS -g  -o fdd-grid.ex fdd-grid.o skit.o functs.o fdmat.o aux.o \
  -L../../lib -lparms   \
 -Wl,-rpath,/usr/lib64/openmpi/lib   -llapack -lopenblas -lgfortran \
 -lm 
make: Leaving directory '/usr/src/RPM/BUILD/parms-3.2/examples/grid'
+ exit 0
Executing(%install): /bin/sh -e /usr/src/tmp/rpm-tmp.80881
+ umask 022
+ /bin/mkdir -p /usr/src/RPM/BUILD
+ cd /usr/src/RPM/BUILD
+ /bin/chmod -Rf u+rwX -- /usr/src/tmp/parms-buildroot
+ :
+ /bin/rm -rf -- /usr/src/tmp/parms-buildroot
+ PATH=/usr/libexec/rpm-build:/usr/src/bin:/bin:/usr/bin:/usr/X11R6/bin:/usr/games
+ cd parms-3.2
+ source /usr/lib64/openmpi/bin/mpivars.sh
++ echo /usr/libexec/rpm-build:/usr/src/bin:/bin:/usr/bin:/usr/X11R6/bin:/usr/games
++ grep -q /usr/lib64/openmpi/bin
++ PATH=/usr/lib64/openmpi/bin:/usr/libexec/rpm-build:/usr/src/bin:/bin:/usr/bin:/usr/X11R6/bin:/usr/games
++ export PATH
++ echo
++ grep -q /usr/lib64/openmpi/lib
++ LD_LIBRARY_PATH=/usr/lib64/openmpi/lib
++ export LD_LIBRARY_PATH
++ echo
++ grep -q /usr/lib64/openmpi/man
++ MANPATH=/usr/lib64/openmpi/man:
++ export MANPATH
+ export 'OMPI_LDFLAGS=-Wl,--as-needed,-rpath=/usr/lib64/openmpi/lib -L/usr/lib64/openmpi/lib'
+ OMPI_LDFLAGS='-Wl,--as-needed,-rpath=/usr/lib64/openmpi/lib -L/usr/lib64/openmpi/lib'
+ install -d /usr/src/tmp/parms-buildroot/usr/bin
+ install -d /usr/src/tmp/parms-buildroot/usr/lib64
+ install -d /usr/src/tmp/parms-buildroot/usr/include
+ install -d /usr/src/tmp/parms-buildroot/usr/share/parms/examples
+ install -d /usr/src/tmp/parms-buildroot/usr/share/doc/libparms-devel/examples/general
+ install -d /usr/src/tmp/parms-buildroot/usr/share/doc/libparms-devel/examples/grid
+ install -m644 lib/libparms.a /usr/src/tmp/parms-buildroot/usr/lib64
+ install -p -m644 include/fparms.h include/parms.h include/parms_comm.h include/parms_map.h include/parms_mat.h include/parms_mem.h include/parms_operator.h include/parms_pc.h include/parms_solver.h include/parms_sys.h include/parms_sys_cmplx.h include/parms_sys_dbl.h include/parms_table.h include/parms_timer.h include/parms_vec.h include/parms_viewer.h src/include/parms_comm_impl.h src/include/parms_map_impl.h src/include/parms_mat_impl.h src/include/parms_opt_impl.h src/include/parms_pc_impl.h src/include/parms_solver_impl.h src/include/parms_table_impl.h src/include/parms_timer_impl.h src/include/parms_viewer_impl.h /usr/src/tmp/parms-buildroot/usr/include
+ install -p -m644 docs/README docs/refmanual.pdf docs/ug.pdf /usr/src/tmp/parms-buildroot/usr/share/doc/libparms-devel
+ pushd examples
~/RPM/BUILD/parms-3.2/examples ~/RPM/BUILD/parms-3.2
+ install -m755 general/dd-HB-dse.ex general/fdd-HB-dse.ex grid/dd-grid.ex grid/fdd-grid.ex /usr/src/tmp/parms-buildroot/usr/bin
+ rm -f general/dd-HB-dse.ex general/fdd-HB-dse.ex grid/dd-grid.ex grid/fdd-grid.ex general/aux.o general/dd-HB-dse.o general/fdd-HB-dse.o general/skit.o grid/aux.o grid/dd-grid.o grid/fdd-grid.o grid/fdmat.o grid/functs.o grid/skit.o general/makefile grid/makefile
+ rm -fR petsc general/extras grid/extras
+ mv general/aux.c general/dd-HB-dse.c general/fdd-HB-dse.F general/skit.f general/aux.h general/faux.h /usr/src/tmp/parms-buildroot/usr/share/doc/libparms-devel/examples/general/
+ mv grid/aux.c grid/dd-grid.c grid/fdd-grid.F grid/fdmat.f grid/functs.f grid/skit.f grid/aux.h grid/faux.h /usr/src/tmp/parms-buildroot/usr/share/doc/libparms-devel/examples/grid/
+ mv DOTESTS README README-DOTESTS general grid matrices /usr/src/tmp/parms-buildroot/usr/share/parms/examples/
+ popd
~/RPM/BUILD/parms-3.2
+ pushd /usr/src/tmp/parms-buildroot/usr/lib64
~/tmp/parms-buildroot/usr/lib64 ~/RPM/BUILD/parms-3.2
+ mkdir tmp
+ pushd tmp
~/tmp/parms-buildroot/usr/lib64/tmp ~/tmp/parms-buildroot/usr/lib64 ~/RPM/BUILD/parms-3.2
+ ar x ../libparms.a
+ mpif77 -shared MatOps.o PQ.o arms2.o fgmres.o gmres.o ilutpC.o misc.o parms_comm.o parms_complex.o parms_ilu_vcsr.o parms_map.o parms_mapf.o parms_mat.o parms_mat_dvcsr.o parms_mat_vcsr.o parms_matf.o parms_mem.o parms_operator.o parms_pc.o parms_pc_bj.o parms_pc_ras.o parms_pc_schur.o parms_pcf.o parms_qsplit.o parms_solver.o parms_solverf.o parms_table.o parms_timer.o parms_timerf.o parms_vec.o parms_vecf.o parms_viewer.o parms_viewerf.o piluNEW.o setblks.o sets.o svdInvC.o -llapack -lopenblas -Wl,-rpath,/usr/lib64/openmpi/lib -Wl,-soname,libparms.so.3 -o ../libparms.so.3.2.0
+ rm -f MatOps.o PQ.o arms2.o fgmres.o gmres.o ilutpC.o misc.o parms_comm.o parms_complex.o parms_ilu_vcsr.o parms_map.o parms_mapf.o parms_mat.o parms_mat_dvcsr.o parms_mat_vcsr.o parms_matf.o parms_mem.o parms_operator.o parms_pc.o parms_pc_bj.o parms_pc_ras.o parms_pc_schur.o parms_pcf.o parms_qsplit.o parms_solver.o parms_solverf.o parms_table.o parms_timer.o parms_timerf.o parms_vec.o parms_vecf.o parms_viewer.o parms_viewerf.o piluNEW.o setblks.o sets.o svdInvC.o
+ popd
~/tmp/parms-buildroot/usr/lib64 ~/RPM/BUILD/parms-3.2
+ rmdir tmp
+ ln -s libparms.so.3.2.0 libparms.so.3
+ ln -s libparms.so.3 libparms.so
+ popd
~/RPM/BUILD/parms-3.2
+ rm -f /usr/src/tmp/parms-buildroot/usr/lib64/libparms.a
+ /usr/lib/rpm/brp-alt
Cleaning files in /usr/src/tmp/parms-buildroot (auto)
mode of './usr/lib64/libparms.so.3.2.0' changed from 0755 (rwxr-xr-x) to 0644 (rw-r--r--)
Verifying and fixing files in /usr/src/tmp/parms-buildroot (binconfig,pkgconfig,libtool,desktop,gnuconfig)
Checking contents of files in /usr/src/tmp/parms-buildroot/ (default)
Compressing files in /usr/src/tmp/parms-buildroot (auto)
Adjusting library links in /usr/src/tmp/parms-buildroot
./usr/lib64: (from <cmdline>:0)
	libparms.so.3 -> libparms.so.3.2.0
Verifying ELF objects in /usr/src/tmp/parms-buildroot (arch=normal,fhs=normal,lfs=relaxed,lint=relaxed,rpath=normal,stack=normal,textrel=normal,unresolved=normal)
verify-elf: WARNING: ./usr/lib64/libparms.so.3.2.0: RPATH entry found: /usr/lib64/openmpi/lib
verify-elf: WARNING: ./usr/bin/fdd-grid.ex: RPATH entry found: /usr/lib64/openmpi/lib
verify-elf: WARNING: ./usr/bin/dd-grid.ex: RPATH entry found: /usr/lib64/openmpi/lib
verify-elf: WARNING: ./usr/bin/fdd-HB-dse.ex: RPATH entry found: /usr/lib64/openmpi/lib
verify-elf: WARNING: ./usr/bin/dd-HB-dse.ex: RPATH entry found: /usr/lib64/openmpi/lib
Processing files: parms-3.2-alt10
Executing(%doc): /bin/sh -e /usr/src/tmp/rpm-tmp.99807
+ umask 022
+ /bin/mkdir -p /usr/src/RPM/BUILD
+ cd /usr/src/RPM/BUILD
+ cd parms-3.2
+ DOCDIR=/usr/src/tmp/parms-buildroot/usr/share/doc/parms-3.2
+ export DOCDIR
+ rm -rf /usr/src/tmp/parms-buildroot/usr/share/doc/parms-3.2
+ /bin/mkdir -p /usr/src/tmp/parms-buildroot/usr/share/doc/parms-3.2
+ cp -prL COPYRIGHT LGPL README /usr/src/tmp/parms-buildroot/usr/share/doc/parms-3.2
+ chmod -R go-w /usr/src/tmp/parms-buildroot/usr/share/doc/parms-3.2
+ chmod -R a+rX /usr/src/tmp/parms-buildroot/usr/share/doc/parms-3.2
+ exit 0
Finding Provides (using /usr/lib/rpm/find-provides)
Executing: /bin/sh -e /usr/src/tmp/rpm-tmp.9R4qwL
find-provides: running scripts (alternatives,debuginfo,lib,pam,perl,pkgconfig,python,python3,shell)
Finding Requires (using /usr/lib/rpm/find-requires)
Executing: /bin/sh -e /usr/src/tmp/rpm-tmp.2u6mxC
find-requires: running scripts (cpp,debuginfo,files,lib,pam,perl,pkgconfig,pkgconfiglib,python,python3,rpmlib,shebang,shell,static,symlinks,systemd-services)
lib.req: WARNING: /usr/src/tmp/parms-buildroot/usr/bin/dd-HB-dse.ex: overlinked libraries: /lib64/libgcc_s.so.1
lib.req: WARNING: /usr/src/tmp/parms-buildroot/usr/bin/dd-grid.ex: overlinked libraries: /lib64/libgcc_s.so.1
lib.req: WARNING: /usr/src/tmp/parms-buildroot/usr/bin/fdd-HB-dse.ex: overlinked libraries: /lib64/libgcc_s.so.1
lib.req: WARNING: /usr/src/tmp/parms-buildroot/usr/bin/fdd-grid.ex: overlinked libraries: /lib64/libgcc_s.so.1
Requires: /bin/csh, /lib64/ld-linux-x86-64.so.2, /usr/lib64/openmpi/lib/libmpi.so.20, /usr/lib64/openmpi/lib/libmpi_mpifh.so.20, libc.so.6(GLIBC_2.14)(64bit), libc.so.6(GLIBC_2.2.5)(64bit), libc.so.6(GLIBC_2.3)(64bit), libc.so.6(GLIBC_2.3.4)(64bit), libc.so.6(GLIBC_2.34)(64bit), libc.so.6(GLIBC_2.4)(64bit), libc.so.6(GLIBC_2.7)(64bit), libgcc_s.so.1()(64bit), libgfortran.so.5()(64bit) >= set:ojToWZ5nodSGAR10mg1GcLqf9rIiRZtsA9HCBGFe2jDCNAQKdTid, libgfortran.so.5(GFORTRAN_8)(64bit), libm.so.6(GLIBC_2.2.5)(64bit), libm.so.6(GLIBC_2.29)(64bit), libmvec.so.1(GLIBC_2.22)(64bit), libopenblas.so.0()(64bit) >= set:roO3nmJ2H8mGVGyaDGVW61, rtld(GNU_HASH)
Requires(rpmlib): rpmlib(SetVersions)
Finding debuginfo files (using /usr/lib/rpm/find-debuginfo-files)
Executing: /bin/sh -e /usr/src/tmp/rpm-tmp.3OLsDi
Creating parms-debuginfo package
Processing files: libparms-3.2-alt10
Finding Provides (using /usr/lib/rpm/find-provides)
Executing: /bin/sh -e /usr/src/tmp/rpm-tmp.sqlnly
find-provides: running scripts (alternatives,debuginfo,lib,pam,perl,pkgconfig,python,python3,shell)
lib.prov: /usr/src/tmp/parms-buildroot/usr/lib64/libparms.so.3: 297 symbols, 19 bpp
Finding Requires (using /usr/lib/rpm/find-requires)
Executing: /bin/sh -e /usr/src/tmp/rpm-tmp.8NLgZF
find-requires: running scripts (cpp,debuginfo,files,lib,pam,perl,pkgconfig,pkgconfiglib,python,python3,rpmlib,shebang,shell,static,symlinks,systemd-services)
lib.req: WARNING: /usr/src/tmp/parms-buildroot/usr/lib64/libparms.so.3.2.0: overlinked libraries: /lib64/libgcc_s.so.1
lib.req: WARNING: /usr/src/tmp/parms-buildroot/usr/lib64/libparms.so.3: overlinked libraries: /lib64/libgcc_s.so.1
Provides: libparms.so.3()(64bit) = set:md6JZ1gIqVZHEJXmZBoLDtMVAd7Zd4Z1eYxm1XM90NZy2EstgMx9yv9JKsgmGgSGSVmdLeC2BInU43gqeJ2W5mCvcmeWrTJk7R5his0OWUn5w95CDdMKslLfdQe82HDoKgPPm5tmUz3l1UftNNVC3Sq15Ctx9EMsNRaiq5W6vMo5AorAzAvN3Rs4ie5yW3Mfu82RZjvrLEZaDoBl36OapPK6YPZzkGPYkwEZ0Mnh3UIDf9loyLw1tf1HzNVsV3g8b38bUh4GDrYbairunaDOr5SuMGM74W1u19ssfUc1iBFlIhmOXeIAdeXbDlcpalga0WgrGoV9dyx1SmtKXp1r6kHkjYoagH5MlFF4dEsYw9xUYkug1OYa2CeIQH8Gfd0ZcPLIuXJO1KbKIMJFZDTVjZ0HeK0xEfTovyFDdegZ1E4sn0LyZz8Lo9EMHHQW475acPCuwNRREC2rAYdJed70UoWSxMsenVR9ZHJJWZaoXRnmwWX7OLj0qvhhRaUg0D2kfz72Y8uztw49YBZt1KuY0amNVBgF4Q1ZLHC8Qu5uSpIRuSDtZoYvjVdZDqddJZmE3S3fRVlvagJ5Zll2HTslgR3HzO4a96g5AZxChCZIW4
Requires: /usr/lib64/openmpi/lib/libmpi.so.20, libc.so.6(GLIBC_2.14)(64bit), libc.so.6(GLIBC_2.2.5)(64bit), libc.so.6(GLIBC_2.3.4)(64bit), libc.so.6(GLIBC_2.4)(64bit), libgcc_s.so.1()(64bit), liblapack.so.4()(64bit) >= set:omtGrTStsrjN, libm.so.6(GLIBC_2.2.5)(64bit), libopenblas.so.0()(64bit) >= set:roO3nmJ2H8zhXoWo8nkVkdnT8, rtld(GNU_HASH)
Requires(rpmlib): rpmlib(SetVersions)
Finding debuginfo files (using /usr/lib/rpm/find-debuginfo-files)
Executing: /bin/sh -e /usr/src/tmp/rpm-tmp.JqXZvV
Creating libparms-debuginfo package
Processing files: libparms-devel-3.2-alt10
Finding Provides (using /usr/lib/rpm/find-provides)
Executing: /bin/sh -e /usr/src/tmp/rpm-tmp.Rryo93
find-provides: running scripts (alternatives,debuginfo,lib,pam,perl,pkgconfig,python,python3,shell)
Finding Requires (using /usr/lib/rpm/find-requires)
Executing: /bin/sh -e /usr/src/tmp/rpm-tmp.zpI9SG
find-requires: running scripts (cpp,debuginfo,files,lib,pam,perl,pkgconfig,pkgconfiglib,python,python3,rpmlib,shebang,shell,static,symlinks,systemd-services)
In file included from /usr/src/tmp/parms-buildroot/usr/include/parms_mem.h:24,
                 from /usr/src/tmp/parms-buildroot/usr/include/parms.h:14:
/usr/src/tmp/parms-buildroot/usr/include/parms_sys.h:46:10: fatal error: mpi.h: No such file or directory
   46 | #include "mpi.h"
      |          ^~~~~~~
compilation terminated.
cpp.req: /usr/src/tmp/parms-buildroot/usr/include/parms.h: cpp failed, trying c++ mode
In file included from /usr/src/tmp/parms-buildroot/usr/include/parms_mem.h:24,
                 from /usr/src/tmp/parms-buildroot/usr/include/parms.h:14:
/usr/src/tmp/parms-buildroot/usr/include/parms_sys.h:46:10: fatal error: mpi.h: No such file or directory
   46 | #include "mpi.h"
      |          ^~~~~~~
compilation terminated.
cpp.req: WARNING: /usr/src/tmp/parms-buildroot/usr/include/parms.h: cpp failed
In file included from /usr/src/tmp/parms-buildroot/usr/include/parms_pc.h:13:
/usr/src/tmp/parms-buildroot/usr/include/parms_sys.h:46:10: fatal error: mpi.h: No such file or directory
   46 | #include "mpi.h"
      |          ^~~~~~~
compilation terminated.
cpp.req: /usr/src/tmp/parms-buildroot/usr/include/parms_pc.h: cpp failed, trying c++ mode
In file included from /usr/src/tmp/parms-buildroot/usr/include/parms_pc.h:13:
/usr/src/tmp/parms-buildroot/usr/include/parms_sys.h:46:10: fatal error: mpi.h: No such file or directory
   46 | #include "mpi.h"
      |          ^~~~~~~
compilation terminated.
cpp.req: WARNING: /usr/src/tmp/parms-buildroot/usr/include/parms_pc.h: cpp failed
In file included from /usr/src/tmp/parms-buildroot/usr/include/parms_map.h:16:
/usr/src/tmp/parms-buildroot/usr/include/parms_sys.h:46:10: fatal error: mpi.h: No such file or directory
   46 | #include "mpi.h"
      |          ^~~~~~~
compilation terminated.
cpp.req: /usr/src/tmp/parms-buildroot/usr/include/parms_map.h: cpp failed, trying c++ mode
In file included from /usr/src/tmp/parms-buildroot/usr/include/parms_map.h:16:
/usr/src/tmp/parms-buildroot/usr/include/parms_sys.h:46:10: fatal error: mpi.h: No such file or directory
   46 | #include "mpi.h"
      |          ^~~~~~~
compilation terminated.
cpp.req: WARNING: /usr/src/tmp/parms-buildroot/usr/include/parms_map.h: cpp failed
In file included from /usr/src/tmp/parms-buildroot/usr/include/parms_mat.h:14:
/usr/src/tmp/parms-buildroot/usr/include/parms_sys.h:46:10: fatal error: mpi.h: No such file or directory
   46 | #include "mpi.h"
      |          ^~~~~~~
compilation terminated.
cpp.req: /usr/src/tmp/parms-buildroot/usr/include/parms_mat.h: cpp failed, trying c++ mode
In file included from /usr/src/tmp/parms-buildroot/usr/include/parms_mat.h:14:
/usr/src/tmp/parms-buildroot/usr/include/parms_sys.h:46:10: fatal error: mpi.h: No such file or directory
   46 | #include "mpi.h"
      |          ^~~~~~~
compilation terminated.
cpp.req: WARNING: /usr/src/tmp/parms-buildroot/usr/include/parms_mat.h: cpp failed
In file included from /usr/src/tmp/parms-buildroot/usr/include/parms_mem.h:24:
/usr/src/tmp/parms-buildroot/usr/include/parms_sys.h:46:10: fatal error: mpi.h: No such file or directory
   46 | #include "mpi.h"
      |          ^~~~~~~
compilation terminated.
cpp.req: /usr/src/tmp/parms-buildroot/usr/include/parms_mem.h: cpp failed, trying c++ mode
In file included from /usr/src/tmp/parms-buildroot/usr/include/parms_mem.h:24:
/usr/src/tmp/parms-buildroot/usr/include/parms_sys.h:46:10: fatal error: mpi.h: No such file or directory
   46 | #include "mpi.h"
      |          ^~~~~~~
compilation terminated.
cpp.req: WARNING: /usr/src/tmp/parms-buildroot/usr/include/parms_mem.h: cpp failed
/usr/src/tmp/parms-buildroot/usr/include/parms_sys.h:46:10: fatal error: mpi.h: No such file or directory
   46 | #include "mpi.h"
      |          ^~~~~~~
compilation terminated.
cpp.req: /usr/src/tmp/parms-buildroot/usr/include/parms_sys.h: cpp failed, trying c++ mode
/usr/src/tmp/parms-buildroot/usr/include/parms_sys.h:46:10: fatal error: mpi.h: No such file or directory
   46 | #include "mpi.h"
      |          ^~~~~~~
compilation terminated.
cpp.req: WARNING: /usr/src/tmp/parms-buildroot/usr/include/parms_sys.h: cpp failed
In file included from /usr/src/tmp/parms-buildroot/usr/include/parms_vec.h:14:
/usr/src/tmp/parms-buildroot/usr/include/parms_sys.h:46:10: fatal error: mpi.h: No such file or directory
   46 | #include "mpi.h"
      |          ^~~~~~~
compilation terminated.
cpp.req: /usr/src/tmp/parms-buildroot/usr/include/parms_vec.h: cpp failed, trying c++ mode
In file included from /usr/src/tmp/parms-buildroot/usr/include/parms_vec.h:14:
/usr/src/tmp/parms-buildroot/usr/include/parms_sys.h:46:10: fatal error: mpi.h: No such file or directory
   46 | #include "mpi.h"
      |          ^~~~~~~
compilation terminated.
cpp.req: WARNING: /usr/src/tmp/parms-buildroot/usr/include/parms_vec.h: cpp failed
In file included from /usr/src/tmp/parms-buildroot/usr/include/parms_comm.h:15:
/usr/src/tmp/parms-buildroot/usr/include/parms_sys.h:46:10: fatal error: mpi.h: No such file or directory
   46 | #include "mpi.h"
      |          ^~~~~~~
compilation terminated.
cpp.req: /usr/src/tmp/parms-buildroot/usr/include/parms_comm.h: cpp failed, trying c++ mode
In file included from /usr/src/tmp/parms-buildroot/usr/include/parms_comm.h:15:
/usr/src/tmp/parms-buildroot/usr/include/parms_sys.h:46:10: fatal error: mpi.h: No such file or directory
   46 | #include "mpi.h"
      |          ^~~~~~~
compilation terminated.
cpp.req: WARNING: /usr/src/tmp/parms-buildroot/usr/include/parms_comm.h: cpp failed
In file included from /usr/src/tmp/parms-buildroot/usr/include/parms_table.h:14:
/usr/src/tmp/parms-buildroot/usr/include/parms_sys.h:46:10: fatal error: mpi.h: No such file or directory
   46 | #include "mpi.h"
      |          ^~~~~~~
compilation terminated.
cpp.req: /usr/src/tmp/parms-buildroot/usr/include/parms_table.h: cpp failed, trying c++ mode
In file included from /usr/src/tmp/parms-buildroot/usr/include/parms_table.h:14:
/usr/src/tmp/parms-buildroot/usr/include/parms_sys.h:46:10: fatal error: mpi.h: No such file or directory
   46 | #include "mpi.h"
      |          ^~~~~~~
compilation terminated.
cpp.req: WARNING: /usr/src/tmp/parms-buildroot/usr/include/parms_table.h: cpp failed
In file included from /usr/src/tmp/parms-buildroot/usr/include/parms_timer.h:14:
/usr/src/tmp/parms-buildroot/usr/include/parms_sys.h:46:10: fatal error: mpi.h: No such file or directory
   46 | #include "mpi.h"
      |          ^~~~~~~
compilation terminated.
cpp.req: /usr/src/tmp/parms-buildroot/usr/include/parms_timer.h: cpp failed, trying c++ mode
In file included from /usr/src/tmp/parms-buildroot/usr/include/parms_timer.h:14:
/usr/src/tmp/parms-buildroot/usr/include/parms_sys.h:46:10: fatal error: mpi.h: No such file or directory
   46 | #include "mpi.h"
      |          ^~~~~~~
compilation terminated.
cpp.req: WARNING: /usr/src/tmp/parms-buildroot/usr/include/parms_timer.h: cpp failed
In file included from /usr/src/tmp/parms-buildroot/usr/include/parms_vec.h:14,
                 from /usr/src/tmp/parms-buildroot/usr/include/parms_solver.h:14:
/usr/src/tmp/parms-buildroot/usr/include/parms_sys.h:46:10: fatal error: mpi.h: No such file or directory
   46 | #include "mpi.h"
      |          ^~~~~~~
compilation terminated.
cpp.req: /usr/src/tmp/parms-buildroot/usr/include/parms_solver.h: cpp failed, trying c++ mode
In file included from /usr/src/tmp/parms-buildroot/usr/include/parms_vec.h:14,
                 from /usr/src/tmp/parms-buildroot/usr/include/parms_solver.h:14:
/usr/src/tmp/parms-buildroot/usr/include/parms_sys.h:46:10: fatal error: mpi.h: No such file or directory
   46 | #include "mpi.h"
      |          ^~~~~~~
compilation terminated.
cpp.req: WARNING: /usr/src/tmp/parms-buildroot/usr/include/parms_solver.h: cpp failed
In file included from /usr/src/tmp/parms-buildroot/usr/include/parms_viewer.h:15:
/usr/src/tmp/parms-buildroot/usr/include/parms_sys.h:46:10: fatal error: mpi.h: No such file or directory
   46 | #include "mpi.h"
      |          ^~~~~~~
compilation terminated.
cpp.req: /usr/src/tmp/parms-buildroot/usr/include/parms_viewer.h: cpp failed, trying c++ mode
In file included from /usr/src/tmp/parms-buildroot/usr/include/parms_viewer.h:15:
/usr/src/tmp/parms-buildroot/usr/include/parms_sys.h:46:10: fatal error: mpi.h: No such file or directory
   46 | #include "mpi.h"
      |          ^~~~~~~
compilation terminated.
cpp.req: WARNING: /usr/src/tmp/parms-buildroot/usr/include/parms_viewer.h: cpp failed
In file included from /usr/src/tmp/parms-buildroot/usr/include/parms_pc.h:13,
                 from /usr/src/tmp/parms-buildroot/usr/include/parms_pc_impl.h:4:
/usr/src/tmp/parms-buildroot/usr/include/parms_sys.h:46:10: fatal error: mpi.h: No such file or directory
   46 | #include "mpi.h"
      |          ^~~~~~~
compilation terminated.
cpp.req: /usr/src/tmp/parms-buildroot/usr/include/parms_pc_impl.h: cpp failed, trying c++ mode
In file included from /usr/src/tmp/parms-buildroot/usr/include/parms_pc.h:13,
                 from /usr/src/tmp/parms-buildroot/usr/include/parms_pc_impl.h:4:
/usr/src/tmp/parms-buildroot/usr/include/parms_sys.h:46:10: fatal error: mpi.h: No such file or directory
   46 | #include "mpi.h"
      |          ^~~~~~~
compilation terminated.
cpp.req: WARNING: /usr/src/tmp/parms-buildroot/usr/include/parms_pc_impl.h: cpp failed
In file included from /usr/src/tmp/parms-buildroot/usr/include/parms_mem.h:24,
                 from /usr/src/tmp/parms-buildroot/usr/include/parms_map_impl.h:12:
/usr/src/tmp/parms-buildroot/usr/include/parms_sys.h:46:10: fatal error: mpi.h: No such file or directory
   46 | #include "mpi.h"
      |          ^~~~~~~
compilation terminated.
cpp.req: /usr/src/tmp/parms-buildroot/usr/include/parms_map_impl.h: cpp failed, trying c++ mode
In file included from /usr/src/tmp/parms-buildroot/usr/include/parms_mem.h:24,
                 from /usr/src/tmp/parms-buildroot/usr/include/parms_map_impl.h:12:
/usr/src/tmp/parms-buildroot/usr/include/parms_sys.h:46:10: fatal error: mpi.h: No such file or directory
   46 | #include "mpi.h"
      |          ^~~~~~~
compilation terminated.
cpp.req: WARNING: /usr/src/tmp/parms-buildroot/usr/include/parms_map_impl.h: cpp failed
In file included from /usr/src/tmp/parms-buildroot/usr/include/parms_mat.h:14,
                 from /usr/src/tmp/parms-buildroot/usr/include/parms_mat_impl.h:12:
/usr/src/tmp/parms-buildroot/usr/include/parms_sys.h:46:10: fatal error: mpi.h: No such file or directory
   46 | #include "mpi.h"
      |          ^~~~~~~
compilation terminated.
cpp.req: /usr/src/tmp/parms-buildroot/usr/include/parms_mat_impl.h: cpp failed, trying c++ mode
In file included from /usr/src/tmp/parms-buildroot/usr/include/parms_mat.h:14,
                 from /usr/src/tmp/parms-buildroot/usr/include/parms_mat_impl.h:12:
/usr/src/tmp/parms-buildroot/usr/include/parms_sys.h:46:10: fatal error: mpi.h: No such file or directory
   46 | #include "mpi.h"
      |          ^~~~~~~
compilation terminated.
cpp.req: WARNING: /usr/src/tmp/parms-buildroot/usr/include/parms_mat_impl.h: cpp failed
In file included from /usr/src/tmp/parms-buildroot/usr/include/parms_operator.h:17:
/usr/src/tmp/parms-buildroot/usr/include/parms_sys.h:46:10: fatal error: mpi.h: No such file or directory
   46 | #include "mpi.h"
      |          ^~~~~~~
compilation terminated.
cpp.req: /usr/src/tmp/parms-buildroot/usr/include/parms_operator.h: cpp failed, trying c++ mode
In file included from /usr/src/tmp/parms-buildroot/usr/include/parms_operator.h:17:
/usr/src/tmp/parms-buildroot/usr/include/parms_sys.h:46:10: fatal error: mpi.h: No such file or directory
   46 | #include "mpi.h"
      |          ^~~~~~~
compilation terminated.
cpp.req: WARNING: /usr/src/tmp/parms-buildroot/usr/include/parms_operator.h: cpp failed
In file included from /usr/src/tmp/parms-buildroot/usr/include/parms_vec.h:14,
                 from /usr/src/tmp/parms-buildroot/usr/include/parms_opt_impl.h:4:
/usr/src/tmp/parms-buildroot/usr/include/parms_sys.h:46:10: fatal error: mpi.h: No such file or directory
   46 | #include "mpi.h"
      |          ^~~~~~~
compilation terminated.
cpp.req: /usr/src/tmp/parms-buildroot/usr/include/parms_opt_impl.h: cpp failed, trying c++ mode
In file included from /usr/src/tmp/parms-buildroot/usr/include/parms_vec.h:14,
                 from /usr/src/tmp/parms-buildroot/usr/include/parms_opt_impl.h:4:
/usr/src/tmp/parms-buildroot/usr/include/parms_sys.h:46:10: fatal error: mpi.h: No such file or directory
   46 | #include "mpi.h"
      |          ^~~~~~~
compilation terminated.
cpp.req: WARNING: /usr/src/tmp/parms-buildroot/usr/include/parms_opt_impl.h: cpp failed
In file included from /usr/src/tmp/parms-buildroot/usr/include/parms_comm.h:15,
                 from /usr/src/tmp/parms-buildroot/usr/include/parms_comm_impl.h:12:
/usr/src/tmp/parms-buildroot/usr/include/parms_sys.h:46:10: fatal error: mpi.h: No such file or directory
   46 | #include "mpi.h"
      |          ^~~~~~~
compilation terminated.
cpp.req: /usr/src/tmp/parms-buildroot/usr/include/parms_comm_impl.h: cpp failed, trying c++ mode
In file included from /usr/src/tmp/parms-buildroot/usr/include/parms_comm.h:15,
                 from /usr/src/tmp/parms-buildroot/usr/include/parms_comm_impl.h:12:
/usr/src/tmp/parms-buildroot/usr/include/parms_sys.h:46:10: fatal error: mpi.h: No such file or directory
   46 | #include "mpi.h"
      |          ^~~~~~~
compilation terminated.
cpp.req: WARNING: /usr/src/tmp/parms-buildroot/usr/include/parms_comm_impl.h: cpp failed
In file included from /usr/src/tmp/parms-buildroot/usr/include/parms_mem.h:24,
                 from /usr/src/tmp/parms-buildroot/usr/include/parms_table_impl.h:13:
/usr/src/tmp/parms-buildroot/usr/include/parms_sys.h:46:10: fatal error: mpi.h: No such file or directory
   46 | #include "mpi.h"
      |          ^~~~~~~
compilation terminated.
cpp.req: /usr/src/tmp/parms-buildroot/usr/include/parms_table_impl.h: cpp failed, trying c++ mode
In file included from /usr/src/tmp/parms-buildroot/usr/include/parms_mem.h:24,
                 from /usr/src/tmp/parms-buildroot/usr/include/parms_table_impl.h:13:
/usr/src/tmp/parms-buildroot/usr/include/parms_sys.h:46:10: fatal error: mpi.h: No such file or directory
   46 | #include "mpi.h"
      |          ^~~~~~~
compilation terminated.
cpp.req: WARNING: /usr/src/tmp/parms-buildroot/usr/include/parms_table_impl.h: cpp failed
In file included from /usr/src/tmp/parms-buildroot/usr/include/parms_mem.h:24,
                 from /usr/src/tmp/parms-buildroot/usr/include/parms_timer_impl.h:12:
/usr/src/tmp/parms-buildroot/usr/include/parms_sys.h:46:10: fatal error: mpi.h: No such file or directory
   46 | #include "mpi.h"
      |          ^~~~~~~
compilation terminated.
cpp.req: /usr/src/tmp/parms-buildroot/usr/include/parms_timer_impl.h: cpp failed, trying c++ mode
In file included from /usr/src/tmp/parms-buildroot/usr/include/parms_mem.h:24,
                 from /usr/src/tmp/parms-buildroot/usr/include/parms_timer_impl.h:12:
/usr/src/tmp/parms-buildroot/usr/include/parms_sys.h:46:10: fatal error: mpi.h: No such file or directory
   46 | #include "mpi.h"
      |          ^~~~~~~
compilation terminated.
cpp.req: WARNING: /usr/src/tmp/parms-buildroot/usr/include/parms_timer_impl.h: cpp failed
In file included from /usr/src/tmp/parms-buildroot/usr/include/parms_operator.h:17,
                 from /usr/src/tmp/parms-buildroot/usr/include/parms_solver_impl.h:4:
/usr/src/tmp/parms-buildroot/usr/include/parms_sys.h:46:10: fatal error: mpi.h: No such file or directory
   46 | #include "mpi.h"
      |          ^~~~~~~
compilation terminated.
cpp.req: /usr/src/tmp/parms-buildroot/usr/include/parms_solver_impl.h: cpp failed, trying c++ mode
In file included from /usr/src/tmp/parms-buildroot/usr/include/parms_operator.h:17,
                 from /usr/src/tmp/parms-buildroot/usr/include/parms_solver_impl.h:4:
/usr/src/tmp/parms-buildroot/usr/include/parms_sys.h:46:10: fatal error: mpi.h: No such file or directory
   46 | #include "mpi.h"
      |          ^~~~~~~
compilation terminated.
cpp.req: WARNING: /usr/src/tmp/parms-buildroot/usr/include/parms_solver_impl.h: cpp failed
In file included from /usr/src/tmp/parms-buildroot/usr/include/parms_viewer.h:15,
                 from /usr/src/tmp/parms-buildroot/usr/include/parms_viewer_impl.h:13:
/usr/src/tmp/parms-buildroot/usr/include/parms_sys.h:46:10: fatal error: mpi.h: No such file or directory
   46 | #include "mpi.h"
      |          ^~~~~~~
compilation terminated.
cpp.req: /usr/src/tmp/parms-buildroot/usr/include/parms_viewer_impl.h: cpp failed, trying c++ mode
In file included from /usr/src/tmp/parms-buildroot/usr/include/parms_viewer.h:15,
                 from /usr/src/tmp/parms-buildroot/usr/include/parms_viewer_impl.h:13:
/usr/src/tmp/parms-buildroot/usr/include/parms_sys.h:46:10: fatal error: mpi.h: No such file or directory
   46 | #include "mpi.h"
      |          ^~~~~~~
compilation terminated.
cpp.req: WARNING: /usr/src/tmp/parms-buildroot/usr/include/parms_viewer_impl.h: cpp failed
Requires: libparms = 3.2-alt10, /usr/lib64/libparms.so.3
Finding debuginfo files (using /usr/lib/rpm/find-debuginfo-files)
Executing: /bin/sh -e /usr/src/tmp/rpm-tmp.5iK9bN
Processing files: libparms-devel-doc-3.2-alt10
Finding Provides (using /usr/lib/rpm/find-provides)
Executing: /bin/sh -e /usr/src/tmp/rpm-tmp.vxggdw
find-provides: running scripts (alternatives,debuginfo,lib,pam,perl,pkgconfig,python,python3,shell)
Finding Requires (using /usr/lib/rpm/find-requires)
Executing: /bin/sh -e /usr/src/tmp/rpm-tmp.uFYEut
find-requires: running scripts (cpp,debuginfo,files,lib,pam,perl,pkgconfig,pkgconfiglib,python,python3,rpmlib,shebang,shell,static,symlinks,systemd-services)
Processing files: parms-debuginfo-3.2-alt10
Finding Provides (using /usr/lib/rpm/find-provides)
Executing: /bin/sh -e /usr/src/tmp/rpm-tmp.822T3j
find-provides: running scripts (debuginfo)
Finding Requires (using /usr/lib/rpm/find-requires)
Executing: /bin/sh -e /usr/src/tmp/rpm-tmp.amzl7C
find-requires: running scripts (debuginfo)
Requires: parms = 3.2-alt10, /usr/lib/debug/lib64/ld-linux-x86-64.so.2.debug, /usr/lib/debug/usr/lib64/openmpi/lib/libmpi.so.20.debug, /usr/lib/debug/usr/lib64/openmpi/lib/libmpi_mpifh.so.20.debug, debug64(libc.so.6), debug64(libgcc_s.so.1), debug64(libgfortran.so.5), debug64(libm.so.6), debug64(libmvec.so.1), debug64(libopenblas.so.0)
Processing files: libparms-debuginfo-3.2-alt10
Finding Provides (using /usr/lib/rpm/find-provides)
Executing: /bin/sh -e /usr/src/tmp/rpm-tmp.KMhkqF
find-provides: running scripts (debuginfo)
Finding Requires (using /usr/lib/rpm/find-requires)
Executing: /bin/sh -e /usr/src/tmp/rpm-tmp.yCdMpp
find-requires: running scripts (debuginfo)
Provides: debug64(libparms.so.3)
Requires: libparms = 3.2-alt10, /usr/lib/debug/usr/lib64/openmpi/lib/libmpi.so.20.debug, debug64(libc.so.6), debug64(libgcc_s.so.1), debug64(liblapack.so.4), debug64(libm.so.6), debug64(libopenblas.so.0)
Adding to parms-debuginfo a strict dependency on parms
Adding to libparms-devel a strict dependency on libparms
Adding to libparms-debuginfo a strict dependency on libparms
Removing 1 extra deps from libparms-devel due to dependency on libparms
Wrote: /usr/src/RPM/RPMS/x86_64/parms-3.2-alt10.x86_64.rpm (w2.lzdio)
Wrote: /usr/src/RPM/RPMS/x86_64/libparms-3.2-alt10.x86_64.rpm (w2.lzdio)
Wrote: /usr/src/RPM/RPMS/x86_64/libparms-devel-3.2-alt10.x86_64.rpm (w2.lzdio)
Wrote: /usr/src/RPM/RPMS/noarch/libparms-devel-doc-3.2-alt10.noarch.rpm (w2.lzdio)
Wrote: /usr/src/RPM/RPMS/x86_64/parms-debuginfo-3.2-alt10.x86_64.rpm (w2.lzdio)
Wrote: /usr/src/RPM/RPMS/x86_64/libparms-debuginfo-3.2-alt10.x86_64.rpm (w2.lzdio)
12.34user 5.47system 0:21.78elapsed 81%CPU (0avgtext+0avgdata 63928maxresident)k
0inputs+0outputs (0major+1278484minor)pagefaults 0swaps
1.86user 1.21system 0:30.25elapsed 10%CPU (0avgtext+0avgdata 111348maxresident)k
0inputs+0outputs (0major+222735minor)pagefaults 0swaps
--- libparms-3.2-alt10.x86_64.rpm.repo	2020-09-18 11:01:46.000000000 +0000
+++ libparms-3.2-alt10.x86_64.rpm.hasher	2023-06-25 05:24:26.444135778 +0000
@@ -7,2 +7,3 @@
 Requires: libc.so.6(GLIBC_2.4)(64bit)  
+Requires: libgcc_s.so.1()(64bit)  
 Requires: liblapack.so.4()(64bit) >= set:omtGrTStsrjN
@@ -10,3 +11,3 @@
 Requires: libm.so.6(GLIBC_2.2.5)(64bit)  
-Requires: libopenblas.so.0()(64bit) >= set:qn8fspfkChWo8bGsWsdlT257
+Requires: libopenblas.so.0()(64bit) >= set:roO3nmJ2H8zhXoWo8nkVkdnT8
 Requires: rtld(GNU_HASH)  
@@ -16,3 +17,3 @@
 File: /usr/lib64/libparms.so.3	120777	root:root		libparms.so.3.2.0
-File: /usr/lib64/libparms.so.3.2.0	100644	root:root	c9bcfc936bb6de0d701b5bc008f490ff	
-RPMIdentity: f06d11c6da839d8ba086223a95dbcd0f148b6acc61f8cc784d9001882419af1d3cffab6cf39e5ed90096c900e86c7a105f99052ca7e6e973f9243b3e9743dcb1
+File: /usr/lib64/libparms.so.3.2.0	100644	root:root	537a7ac4ca9182ac05b6d586430e1d74	
+RPMIdentity: 48225bb080657a3f124e76b6ef40234853a35382930996962fde34492fb6e684b26adfdee82e997801c64fa1c2e12bed85eb381a2a43fd953473764236a99c79
--- libparms-debuginfo-3.2-alt10.x86_64.rpm.repo	2020-09-18 11:01:46.000000000 +0000
+++ libparms-debuginfo-3.2-alt10.x86_64.rpm.hasher	2023-06-25 05:24:26.506136858 +0000
@@ -1,4 +1,4 @@
-/usr/lib/debug/.build-id/ba	40755	root:root	
-/usr/lib/debug/.build-id/ba/a9196f7eac488b8005e676ceab3140134cced1	120777	root:root	../../../../lib64/libparms.so.3.2.0
-/usr/lib/debug/.build-id/ba/a9196f7eac488b8005e676ceab3140134cced1.debug	120777	root:root	../../usr/lib64/libparms.so.3.2.0.debug
+/usr/lib/debug/.build-id/da	40755	root:root	
+/usr/lib/debug/.build-id/da/d3d6d2d1fdb4ef6f8b434650a7a73cec6c07d2	120777	root:root	../../../../lib64/libparms.so.3.2.0
+/usr/lib/debug/.build-id/da/d3d6d2d1fdb4ef6f8b434650a7a73cec6c07d2.debug	120777	root:root	../../usr/lib64/libparms.so.3.2.0.debug
 /usr/lib/debug/usr/lib64/libparms.so.3.2.0.debug	100644	root:root	
@@ -54,2 +54,3 @@
 /usr/src/debug/parms-3.2/src/parms_comm.c	100644	root:root	
+/usr/src/debug/parms-3.2/src/parms_complex.c	100644	root:root	
 /usr/src/debug/parms-3.2/src/parms_ilu_vcsr.c	100644	root:root	
@@ -73,2 +74,3 @@
 Requires: debug64(libc.so.6)  
+Requires: debug64(libgcc_s.so.1)  
 Requires: debug64(liblapack.so.4)  
@@ -80,6 +82,6 @@
 Provides: libparms-debuginfo = 3.2-alt10:sisyphus+258293.100.1.1
-File: /usr/lib/debug/.build-id/ba	40755	root:root		
-File: /usr/lib/debug/.build-id/ba/a9196f7eac488b8005e676ceab3140134cced1	120777	root:root		../../../../lib64/libparms.so.3.2.0
-File: /usr/lib/debug/.build-id/ba/a9196f7eac488b8005e676ceab3140134cced1.debug	120777	root:root		../../usr/lib64/libparms.so.3.2.0.debug
-File: /usr/lib/debug/usr/lib64/libparms.so.3.2.0.debug	100644	root:root	8aebab864867f786bb196810cbdeab2c	
+File: /usr/lib/debug/.build-id/da	40755	root:root		
+File: /usr/lib/debug/.build-id/da/d3d6d2d1fdb4ef6f8b434650a7a73cec6c07d2	120777	root:root		../../../../lib64/libparms.so.3.2.0
+File: /usr/lib/debug/.build-id/da/d3d6d2d1fdb4ef6f8b434650a7a73cec6c07d2.debug	120777	root:root		../../usr/lib64/libparms.so.3.2.0.debug
+File: /usr/lib/debug/usr/lib64/libparms.so.3.2.0.debug	100644	root:root	3c5a103207ee3da7f9231d6795cf4f0d	
 File: /usr/lib/debug/usr/lib64/libparms.so.3.debug	120777	root:root		libparms.so.3.2.0.debug
@@ -134,2 +136,3 @@
 File: /usr/src/debug/parms-3.2/src/parms_comm.c	100644	root:root	b80d0d0868bc27c17228b3e8f17be3c7	
+File: /usr/src/debug/parms-3.2/src/parms_complex.c	100644	root:root	1111ae143d9e0669f099a843d6c31c7d	
 File: /usr/src/debug/parms-3.2/src/parms_ilu_vcsr.c	100644	root:root	79b6680512272d766f6bca8cfc564ef1	
@@ -151,2 +154,2 @@
 File: /usr/src/debug/parms-3.2/src/parms_viewer.c	100644	root:root	eafb0ca0662497133bcecfbbb17698bd	
-RPMIdentity: 522df54ee8e72d20bdbaf046b44ecf6f210096433aa56907b068589195c82bed8c5ed66a981fb28053eb672efef6ef68648e73f7e77182be3efedc12a13ba328
+RPMIdentity: e50660835884dbfcc4492b68c1642474d568b1a8276c56f9bce7fc5d48b49baa9c4344cab2437cda89b9978eb67667404bbccba93c995ae1e77bf8335d37c46e
--- parms-3.2-alt10.x86_64.rpm.repo	2020-09-18 11:01:46.000000000 +0000
+++ parms-3.2-alt10.x86_64.rpm.hasher	2023-06-25 05:24:26.699140219 +0000
@@ -36,4 +36,6 @@
 Requires: libc.so.6(GLIBC_2.3.4)(64bit)  
+Requires: libc.so.6(GLIBC_2.34)(64bit)  
 Requires: libc.so.6(GLIBC_2.4)(64bit)  
 Requires: libc.so.6(GLIBC_2.7)(64bit)  
+Requires: libgcc_s.so.1()(64bit)  
 Requires: libgfortran.so.5()(64bit) >= set:ojToWZ5nodSGAR10mg1GcLqf9rIiRZtsA9HCBGFe2jDCNAQKdTid
@@ -44,3 +46,3 @@
 Requires: libmvec.so.1(GLIBC_2.22)(64bit)  
-Requires: libopenblas.so.0()(64bit) >= set:qn8fspKLfshBjDHFWmEU0
+Requires: libopenblas.so.0()(64bit) >= set:roO3nmJ2H8mGVGyaDGVW61
 Requires: rtld(GNU_HASH)  
@@ -48,6 +50,6 @@
 Provides: parms = 3.2-alt10:sisyphus+258293.100.1.1
-File: /usr/bin/dd-HB-dse.ex	100755	root:root	cb33aec37af6896ffd236239e0f024cb	
-File: /usr/bin/dd-grid.ex	100755	root:root	54c7b6d4b865020f4d260bc8fb64b81f	
-File: /usr/bin/fdd-HB-dse.ex	100755	root:root	94b698cea115d4ee40ddf3570ed55401	
-File: /usr/bin/fdd-grid.ex	100755	root:root	5302b0c8cd46ecf2089c2167acd12ee0	
+File: /usr/bin/dd-HB-dse.ex	100755	root:root	a1868bd440560b4ad58ad19c063d2a15	
+File: /usr/bin/dd-grid.ex	100755	root:root	ae46fb308af69e0f9c797e25d05680ac	
+File: /usr/bin/fdd-HB-dse.ex	100755	root:root	e3aea12bf4f5329dcefeb5f5ee3aba41	
+File: /usr/bin/fdd-grid.ex	100755	root:root	7cd4536aa1c912fefd7be8a4a7cf07c0	
 File: /usr/share/doc/parms-3.2	40755	root:root		
@@ -76,2 +78,2 @@
 File: /usr/share/parms/examples/matrices/qc324.cua	100755	root:root	4aaf36f2a9075e3ff9444424414fbb13	
-RPMIdentity: ded662813f3936f24aed512a9227eea55ffa99ba5e0c8f362e2ad96e2cb896f4c54090a3b70a18f15b9cf6a32460ce1749ef35cf98638398481bfb83373a89ea
+RPMIdentity: af5fd7fd6ff777637f2e35b6e1a1e4489217d8d6c2bec0524a85a6eb2300e85c110833b2e189600720374187b3fedc6bd946a56cdb1098f9f4e6841c75dca418
--- parms-debuginfo-3.2-alt10.x86_64.rpm.repo	2020-09-18 11:01:46.000000000 +0000
+++ parms-debuginfo-3.2-alt10.x86_64.rpm.hasher	2023-06-25 05:24:26.762141317 +0000
@@ -1,13 +1,13 @@
-/usr/lib/debug/.build-id/22	40755	root:root	
-/usr/lib/debug/.build-id/22/4c05271c1eef7dc6c5d5c678b7e3b042963b14	120777	root:root	../../../../bin/fdd-HB-dse.ex
-/usr/lib/debug/.build-id/22/4c05271c1eef7dc6c5d5c678b7e3b042963b14.debug	120777	root:root	../../usr/bin/fdd-HB-dse.ex.debug
-/usr/lib/debug/.build-id/28	40755	root:root	
-/usr/lib/debug/.build-id/28/76ef5d5588d8400a824e75274c83661a286e40	120777	root:root	../../../../bin/fdd-grid.ex
-/usr/lib/debug/.build-id/28/76ef5d5588d8400a824e75274c83661a286e40.debug	120777	root:root	../../usr/bin/fdd-grid.ex.debug
-/usr/lib/debug/.build-id/7b	40755	root:root	
-/usr/lib/debug/.build-id/7b/20db6efba9292024c3c0f0bf1783335dee43bd	120777	root:root	../../../../bin/dd-HB-dse.ex
-/usr/lib/debug/.build-id/7b/20db6efba9292024c3c0f0bf1783335dee43bd.debug	120777	root:root	../../usr/bin/dd-HB-dse.ex.debug
-/usr/lib/debug/.build-id/db	40755	root:root	
-/usr/lib/debug/.build-id/db/55f6eff98e0c258f882cf7f2ff2ce00d4bec27	120777	root:root	../../../../bin/dd-grid.ex
-/usr/lib/debug/.build-id/db/55f6eff98e0c258f882cf7f2ff2ce00d4bec27.debug	120777	root:root	../../usr/bin/dd-grid.ex.debug
+/usr/lib/debug/.build-id/3f	40755	root:root	
+/usr/lib/debug/.build-id/3f/7b6a34ed50bab3a98262c8ec7fd95053447fa4	120777	root:root	../../../../bin/fdd-grid.ex
+/usr/lib/debug/.build-id/3f/7b6a34ed50bab3a98262c8ec7fd95053447fa4.debug	120777	root:root	../../usr/bin/fdd-grid.ex.debug
+/usr/lib/debug/.build-id/41	40755	root:root	
+/usr/lib/debug/.build-id/41/143ee70996d3a3717d759d66038d25cb80a1e9	120777	root:root	../../../../bin/fdd-HB-dse.ex
+/usr/lib/debug/.build-id/41/143ee70996d3a3717d759d66038d25cb80a1e9.debug	120777	root:root	../../usr/bin/fdd-HB-dse.ex.debug
+/usr/lib/debug/.build-id/45	40755	root:root	
+/usr/lib/debug/.build-id/45/d04be45fff465cacb631eb1a081b28186b33de	120777	root:root	../../../../bin/dd-HB-dse.ex
+/usr/lib/debug/.build-id/45/d04be45fff465cacb631eb1a081b28186b33de.debug	120777	root:root	../../usr/bin/dd-HB-dse.ex.debug
+/usr/lib/debug/.build-id/f7	40755	root:root	
+/usr/lib/debug/.build-id/f7/acfcb711147710a4a810b6e2e04341b87afe9b	120777	root:root	../../../../bin/dd-grid.ex
+/usr/lib/debug/.build-id/f7/acfcb711147710a4a810b6e2e04341b87afe9b.debug	120777	root:root	../../usr/bin/dd-grid.ex.debug
 /usr/lib/debug/usr/bin/dd-HB-dse.ex.debug	100644	root:root	
@@ -84,2 +84,3 @@
 Requires: debug64(libc.so.6)  
+Requires: debug64(libgcc_s.so.1)  
 Requires: debug64(libgfortran.so.5)  
@@ -91,18 +92,18 @@
 Provides: parms-debuginfo = 3.2-alt10:sisyphus+258293.100.1.1
-File: /usr/lib/debug/.build-id/22	40755	root:root		
-File: /usr/lib/debug/.build-id/22/4c05271c1eef7dc6c5d5c678b7e3b042963b14	120777	root:root		../../../../bin/fdd-HB-dse.ex
-File: /usr/lib/debug/.build-id/22/4c05271c1eef7dc6c5d5c678b7e3b042963b14.debug	120777	root:root		../../usr/bin/fdd-HB-dse.ex.debug
-File: /usr/lib/debug/.build-id/28	40755	root:root		
-File: /usr/lib/debug/.build-id/28/76ef5d5588d8400a824e75274c83661a286e40	120777	root:root		../../../../bin/fdd-grid.ex
-File: /usr/lib/debug/.build-id/28/76ef5d5588d8400a824e75274c83661a286e40.debug	120777	root:root		../../usr/bin/fdd-grid.ex.debug
-File: /usr/lib/debug/.build-id/7b	40755	root:root		
-File: /usr/lib/debug/.build-id/7b/20db6efba9292024c3c0f0bf1783335dee43bd	120777	root:root		../../../../bin/dd-HB-dse.ex
-File: /usr/lib/debug/.build-id/7b/20db6efba9292024c3c0f0bf1783335dee43bd.debug	120777	root:root		../../usr/bin/dd-HB-dse.ex.debug
-File: /usr/lib/debug/.build-id/db	40755	root:root		
-File: /usr/lib/debug/.build-id/db/55f6eff98e0c258f882cf7f2ff2ce00d4bec27	120777	root:root		../../../../bin/dd-grid.ex
-File: /usr/lib/debug/.build-id/db/55f6eff98e0c258f882cf7f2ff2ce00d4bec27.debug	120777	root:root		../../usr/bin/dd-grid.ex.debug
-File: /usr/lib/debug/usr/bin/dd-HB-dse.ex.debug	100644	root:root	7fb3972ae346f8b2a9789c92c7b3dfc9	
-File: /usr/lib/debug/usr/bin/dd-grid.ex.debug	100644	root:root	e81a77961a3ca00cecb69466b1c044c3	
-File: /usr/lib/debug/usr/bin/fdd-HB-dse.ex.debug	100644	root:root	c4c170ceef6453351b72bfa71422a0a8	
-File: /usr/lib/debug/usr/bin/fdd-grid.ex.debug	100644	root:root	5f933e3678a812ebcbb504370653b73e	
+File: /usr/lib/debug/.build-id/3f	40755	root:root		
+File: /usr/lib/debug/.build-id/3f/7b6a34ed50bab3a98262c8ec7fd95053447fa4	120777	root:root		../../../../bin/fdd-grid.ex
+File: /usr/lib/debug/.build-id/3f/7b6a34ed50bab3a98262c8ec7fd95053447fa4.debug	120777	root:root		../../usr/bin/fdd-grid.ex.debug
+File: /usr/lib/debug/.build-id/41	40755	root:root		
+File: /usr/lib/debug/.build-id/41/143ee70996d3a3717d759d66038d25cb80a1e9	120777	root:root		../../../../bin/fdd-HB-dse.ex
+File: /usr/lib/debug/.build-id/41/143ee70996d3a3717d759d66038d25cb80a1e9.debug	120777	root:root		../../usr/bin/fdd-HB-dse.ex.debug
+File: /usr/lib/debug/.build-id/45	40755	root:root		
+File: /usr/lib/debug/.build-id/45/d04be45fff465cacb631eb1a081b28186b33de	120777	root:root		../../../../bin/dd-HB-dse.ex
+File: /usr/lib/debug/.build-id/45/d04be45fff465cacb631eb1a081b28186b33de.debug	120777	root:root		../../usr/bin/dd-HB-dse.ex.debug
+File: /usr/lib/debug/.build-id/f7	40755	root:root		
+File: /usr/lib/debug/.build-id/f7/acfcb711147710a4a810b6e2e04341b87afe9b	120777	root:root		../../../../bin/dd-grid.ex
+File: /usr/lib/debug/.build-id/f7/acfcb711147710a4a810b6e2e04341b87afe9b.debug	120777	root:root		../../usr/bin/dd-grid.ex.debug
+File: /usr/lib/debug/usr/bin/dd-HB-dse.ex.debug	100644	root:root	f0d4bb175a184c208067fef92a2352a9	
+File: /usr/lib/debug/usr/bin/dd-grid.ex.debug	100644	root:root	2db468d81b96e276345fe10e396822dd	
+File: /usr/lib/debug/usr/bin/fdd-HB-dse.ex.debug	100644	root:root	b18a288f86486d134940f6375783f8a5	
+File: /usr/lib/debug/usr/bin/fdd-grid.ex.debug	100644	root:root	9d33928a21ec027c6b66438a1224c2da	
 File: /usr/src/debug/parms-3.2	40755	root:root		
@@ -171,2 +172,2 @@
 File: /usr/src/debug/parms-3.2/src/parms_viewer.c	100644	root:root	eafb0ca0662497133bcecfbbb17698bd	
-RPMIdentity: e6bdd203d46fa9f8d1bee3c005b7bec378a8ef3ba7f0d3a23db36bc76ff1f51292478d33074e2af94796162c53b5dff39b65993948788d9bc9ef5141f46cb6f1
+RPMIdentity: 230dcc94edbd09b5d57b064058e5d26b6e7a5639796c15117ad7c13276c6bf662c45914c8d2b50393c0b37bd011983ea32751b05eb65edba22523b04b399e085