<86>Jun 21 00:35:56 userdel[2654694]: delete user 'rooter'
<86>Jun 21 00:35:56 userdel[2654694]: removed group 'rooter' owned by 'rooter'
<86>Jun 21 00:35:56 userdel[2654694]: removed shadow group 'rooter' owned by 'rooter'
<86>Jun 21 00:35:56 groupadd[2654726]: group added to /etc/group: name=rooter, GID=1289
<86>Jun 21 00:35:56 groupadd[2654726]: group added to /etc/gshadow: name=rooter
<86>Jun 21 00:35:56 groupadd[2654726]: new group: name=rooter, GID=1289
<86>Jun 21 00:35:56 useradd[2654749]: new user: name=rooter, UID=1289, GID=1289, home=/root, shell=/bin/bash, from=none
<86>Jun 21 00:35:56 userdel[2654796]: delete user 'builder'
<86>Jun 21 00:35:56 userdel[2654796]: removed group 'builder' owned by 'builder'
<86>Jun 21 00:35:56 userdel[2654796]: removed shadow group 'builder' owned by 'builder'
<86>Jun 21 00:35:56 groupadd[2654858]: group added to /etc/group: name=builder, GID=1290
<86>Jun 21 00:35:56 groupadd[2654858]: group added to /etc/gshadow: name=builder
<86>Jun 21 00:35:56 groupadd[2654858]: new group: name=builder, GID=1290
<86>Jun 21 00:35:56 useradd[2654880]: new user: name=builder, UID=1290, GID=1290, home=/usr/src, shell=/bin/bash, from=none
<13>Jun 21 00:35:58 rpmi: libidn2-2.3.4-alt1 sisyphus+309023.100.1.1 1666791084 installed
<13>Jun 21 00:35:58 rpmi: libnettle8-3.9.1-alt1 sisyphus+322548.100.1.2 1686176879 installed
<13>Jun 21 00:35:58 rpmi: gcc-c++-common-1.4.27-alt1 sisyphus+278099.1300.1.1 1626028636 installed
<13>Jun 21 00:35:58 rpmi: libp11-kit-0.24.1-alt1 sisyphus+293720.100.1.1 1642535264 installed
<13>Jun 21 00:35:58 rpmi: libtasn1-4.19.0-alt1 sisyphus+305700.100.1.1 1661359624 installed
<13>Jun 21 00:35:58 rpmi: libstdc++12-devel-12.2.1-alt3 sisyphus+322898.100.1.1 1686662298 installed
<13>Jun 21 00:35:59 rpmi: gcc12-c++-12.2.1-alt3 sisyphus+322898.100.1.1 1686662298 installed
<13>Jun 21 00:35:59 rpmi: libhogweed6-3.9.1-alt1 sisyphus+322548.100.1.2 1686176879 installed
<13>Jun 21 00:35:59 rpmi: libgnutls30-3.7.9-alt1 sisyphus+315353.100.1.1 1676639068 installed
<13>Jun 21 00:35:59 rpmi: libngtcp2-0.15.0-alt1 sisyphus+321126.100.1.1 1684414014 installed
<13>Jun 21 00:35:59 rpmi: libjson-c5-0.15-alt1.1 sisyphus+279547.100.1.2 1626594466 installed
<13>Jun 21 00:35:59 rpmi: publicsuffix-list-dafsa-20230404-alt1 sisyphus+318117.100.1.1 1680769734 installed
<13>Jun 21 00:35:59 rpmi: libpsl-0.21.2-alt1 sisyphus+312536.100.1.1 1672131178 installed
<13>Jun 21 00:35:59 rpmi: libnghttp3-0.9.0-alt1 sisyphus+317166.100.1.1 1679409330 installed
<13>Jun 21 00:35:59 rpmi: libnghttp2-1.53.0-alt1 sisyphus+320325.100.1.1 1683872090 installed
<13>Jun 21 00:35:59 rpmi: openldap-common-2.6.4-alt1 sisyphus+321176.240.10.2 1684802269 installed
<13>Jun 21 00:35:59 rpmi: libntlm-1.5-alt1 sisyphus+278100.3300.1.1 1626058899 installed
<13>Jun 21 00:35:59 rpmi: libidn-1.37-alt2 sisyphus+300849.100.1.1 1653769687 installed
<13>Jun 21 00:35:59 rpmi: libverto-0.3.2-alt1_1 sisyphus+321176.2200.10.2 1684803947 installed
<13>Jun 21 00:35:59 rpmi: liblmdb-0.9.29-alt1.1 sisyphus+306630.100.1.1 1663072360 installed
<13>Jun 21 00:35:59 rpmi: libkeyutils-1.6.3-alt1 sisyphus+266061.100.1.1 1612919566 installed
<13>Jun 21 00:35:59 rpmi: libcom_err-1.46.4.0.5.4cda-alt1 sisyphus+283826.100.1.1 1629975345 installed
<13>Jun 21 00:35:59 rpmi: libbrotlicommon-1.0.9-alt2 sisyphus+278430.100.1.2 1626213212 installed
<13>Jun 21 00:35:59 rpmi: libbrotlidec-1.0.9-alt2 sisyphus+278430.100.1.2 1626213212 installed
<13>Jun 21 00:35:59 rpmi: rpm-macros-alternatives-0.5.2-alt2 sisyphus+315270.200.2.1 1676457367 installed
<13>Jun 21 00:35:59 rpmi: alternatives-0.5.2-alt2 sisyphus+315270.200.2.1 1676457367 installed
<13>Jun 21 00:35:59 rpmi: ca-certificates-2022.12.14-alt1 sisyphus+311754.200.1.1 1671046143 installed
<13>Jun 21 00:35:59 rpmi: ca-trust-0.1.4-alt1 sisyphus+308690.100.1.1 1666182992 installed
<13>Jun 21 00:35:59 rpmi: p11-kit-trust-0.24.1-alt1 sisyphus+293720.100.1.1 1642535264 installed
<13>Jun 21 00:35:59 rpmi: libcrypto1.1-1.1.1u-alt1 sisyphus+322200.100.1.1 1685474736 installed
<13>Jun 21 00:35:59 rpmi: libssl1.1-1.1.1u-alt1 sisyphus+322200.100.1.1 1685474736 installed
<86>Jun 21 00:35:59 groupadd[2665301]: group added to /etc/group: name=_keytab, GID=999
<86>Jun 21 00:35:59 groupadd[2665301]: group added to /etc/gshadow: name=_keytab
<86>Jun 21 00:35:59 groupadd[2665301]: new group: name=_keytab, GID=999
<13>Jun 21 00:35:59 rpmi: libkrb5-1.21-alt1 sisyphus+323024.100.1.1 1686749925 installed
<13>Jun 21 00:35:59 rpmi: libgsasl-1.8.0-alt3 sisyphus+275307.100.1.2 1624478543 installed
<86>Jun 21 00:35:59 groupadd[2665733]: group added to /etc/group: name=sasl, GID=998
<86>Jun 21 00:35:59 groupadd[2665733]: group added to /etc/gshadow: name=sasl
<86>Jun 21 00:35:59 groupadd[2665733]: new group: name=sasl, GID=998
<13>Jun 21 00:35:59 rpmi: libsasl2-3-2.1.27-alt2.2 sisyphus+306372.1000.8.1 1663097224 installed
<13>Jun 21 00:36:00 rpmi: libldap2-2.6.4-alt1 sisyphus+321176.240.10.2 1684802269 installed
<13>Jun 21 00:36:00 rpmi: libssl-devel-1.1.1u-alt1 sisyphus+322200.100.1.1 1685474736 installed
<13>Jun 21 00:36:00 rpmi: libssh2-1.10.0-alt1 sisyphus+289470.100.1.1 1636752293 installed
<13>Jun 21 00:36:00 rpmi: libcurl-8.1.2-alt1 sisyphus+322142.100.1.1 1685433965 installed
<13>Jun 21 00:36:00 rpmi: libclamav9-0.103.8-alt1 sisyphus+316420.100.1.1 1678354296 installed
<13>Jun 21 00:36:00 rpmi: libclamav-devel-0.103.8-alt1 sisyphus+316420.100.1.1 1678354296 installed
<13>Jun 21 00:36:00 rpmi: gcc-c++-12-alt1 sisyphus+300988.300.1.1 1654033053 installed
<13>Jun 21 00:36:00 rpmi: zlib-devel-1.2.13-alt1 sisyphus+309409.200.2.1 1667402043 installed
Building target platforms: x86_64
Building for target x86_64
Wrote: /usr/src/in/nosrpm/havp-0.93-alt1.nosrc.rpm (w1.gzdio)
Installing havp-0.93-alt1.src.rpm
Building target platforms: x86_64
Building for target x86_64
Executing(%prep): /bin/sh -e /usr/src/tmp/rpm-tmp.64186
+ umask 022
+ /bin/mkdir -p /usr/src/RPM/BUILD
+ cd /usr/src/RPM/BUILD
+ cd /usr/src/RPM/BUILD
+ rm -rf havp-0.93
+ echo 'Source #0 (havp-0.93.tar.gz):'
Source #0 (havp-0.93.tar.gz):
+ /bin/gzip -dc /usr/src/RPM/SOURCES/havp-0.93.tar.gz
+ /bin/tar -xf -
+ cd havp-0.93
+ /bin/chmod -c -Rf u+rwX,go-w .
+ echo 'Patch #0 (havp-0.93-alt.patch):'
Patch #0 (havp-0.93-alt.patch):
+ /usr/bin/patch -p1
patching file etc/havp/havp.config.in
patching file havp/connectiontobrowser.cpp
patching file havp/httphandler.cpp
patching file havp/params.cpp
patching file havp/scanners/clamlibscanner.cpp
patching file havp/scanners/drwebscanner.cpp
patching file havp/scanners/f-protscanner.cpp
+ find /usr/src/RPM/BUILD/havp-0.93/etc/havp -type d -print0
+ xargs -r0 chmod 755
+ find /usr/src/RPM/BUILD/havp-0.93/etc/havp -type f -print0
+ xargs -r0 chmod 644
+ exit 0
Executing(%build): /bin/sh -e /usr/src/tmp/rpm-tmp.64186
+ umask 022
+ /bin/mkdir -p /usr/src/RPM/BUILD
+ cd /usr/src/RPM/BUILD
+ cd havp-0.93
+ CFLAGS='-pipe -frecord-gcc-switches -Wall -g -O2 -flto=auto'
+ export CFLAGS
+ CXXFLAGS='-pipe -frecord-gcc-switches -Wall -g -O2 -flto=auto'
+ export CXXFLAGS
+ FFLAGS='-pipe -frecord-gcc-switches -Wall -g -O2 -flto=auto'
+ export FFLAGS
+ FCFLAGS='-pipe -frecord-gcc-switches -Wall -g -O2 -flto=auto'
+ export FCFLAGS
+ '[' -n '' ']'
++ printf %s '-pipe -frecord-gcc-switches -Wall -g -O2 -flto=auto'
++ sed -r 's/(^|[[:space:]]+)-[^m][^[:space:]]*//g'
+ ASFLAGS=
+ export ASFLAGS
+ export lt_cv_deplibs_check_method=pass_all
+ lt_cv_deplibs_check_method=pass_all
+ readlink -e -- ./configure
+ xargs -ri dirname -- '{}'
+ xargs -ri find '{}' -type f '(' -name config.sub -or -name config.guess ')' -printf '%h/\n'
+ sort -u
+ xargs -rn1 install -pm755 -- /usr/share/gnu-config/config.sub /usr/share/gnu-config/config.guess
+ ./configure --build=x86_64-alt-linux --host=x86_64-alt-linux --prefix=/usr --exec-prefix=/usr --bindir=/usr/bin --sbindir=/usr/sbin --sysconfdir=/etc --datadir=/usr/share --includedir=/usr/include --libdir=/usr/lib64 --libexecdir=/usr/lib --localstatedir=/var/lib --sharedstatedir=/var/lib --mandir=/usr/share/man --infodir=/usr/share/info --disable-dependency-tracking --disable-silent-rules --without-included-gettext --localstatedir=/var --enable-ssl-tunnel
configure: WARNING: unrecognized options: --disable-dependency-tracking, --disable-silent-rules, --without-included-gettext
checking for x86_64-alt-linux-g++... x86_64-alt-linux-g++
checking whether the C++ compiler works... yes
checking for C++ compiler default output file name... a.out
checking for suffix of executables... 
checking whether we are cross compiling... no
checking for suffix of object files... o
checking whether we are using the GNU C++ compiler... yes
checking whether x86_64-alt-linux-g++ accepts -g... yes
checking for ar... ar
checking for perl... perl
checking for x86_64-alt-linux-gcc... x86_64-alt-linux-gcc
checking whether we are using the GNU C compiler... yes
checking whether x86_64-alt-linux-gcc accepts -g... yes
checking for x86_64-alt-linux-gcc option to accept ISO C89... none needed
checking for special C compiler options needed for large files... no
checking for _FILE_OFFSET_BITS value needed for large files... no
checking for initgroups... yes
checking for setgroups... yes
checking OS... Linux
checking for mandatory locking support... OS supported
checking for ClamAV scanner library... found 0.103.8 in /usr
checking for Trend Micro scanner... /etc/iscan/libvsapi.so not found, disabled
configure: creating ./config.status
config.status: creating Makefile
config.status: creating havp/Makefile
config.status: creating havp/scanners/Makefile
config.status: creating etc/havp/havp.config
config.status: creating havp/_default.h
configure: WARNING: unrecognized options: --disable-dependency-tracking, --disable-silent-rules, --without-included-gettext
+ make -j8
cd havp && make
make[1]: Entering directory '/usr/src/RPM/BUILD/havp-0.93/havp'
x86_64-alt-linux-g++ -pipe -frecord-gcc-switches -Wall -g -O2 -flto=auto -Wall -g -O2 -DHAVE_CONFIG_H -c -o logfile.o logfile.cpp
logfile.cpp: In static member function 'static void LogFile::AccessMessage(const char*, ...)':
logfile.cpp:111:22: error: 'time' was not declared in this scope
  111 |         time_t now = time(NULL);
      |                      ^~~~
logfile.cpp:33:1: note: 'time' is defined in header '<ctime>'; did you forget to '#include <ctime>'?
   32 | #include <cstring>
  +++ |+#include <ctime>
   33 | 
logfile.cpp:112:19: error: variable 'tm TmDate' has initializer but incomplete type
  112 |         struct tm TmDate = *localtime(&now);
      |                   ^~~~~~
logfile.cpp:112:29: error: 'localtime' was not declared in this scope
  112 |         struct tm TmDate = *localtime(&now);
      |                             ^~~~~~~~~
logfile.cpp:112:29: note: 'localtime' is defined in header '<ctime>'; did you forget to '#include <ctime>'?
logfile.cpp:113:9: error: 'strftime' was not declared in this scope
  113 |         strftime(tmpdate, 50, TimeFormat.c_str(), &TmDate);
      |         ^~~~~~~~
logfile.cpp:113:9: note: 'strftime' is defined in header '<ctime>'; did you forget to '#include <ctime>'?
logfile.cpp:115:32: warning: argument to 'sizeof' in 'char* strncpy(char*, const char*, size_t)' call is the same expression as the source; did you mean to use the size of the destination? [-Wsizeof-pointer-memaccess]
  115 |         strncpy(strt, tmpdate, sizeof(tmpdate));
      |                                ^~~~~~~~~~~~~~~
logfile.cpp: In static member function 'static void LogFile::VirusMessage(const char*, ...)':
logfile.cpp:141:22: error: 'time' was not declared in this scope
  141 |         time_t now = time(NULL);
      |                      ^~~~
logfile.cpp:141:22: note: 'time' is defined in header '<ctime>'; did you forget to '#include <ctime>'?
logfile.cpp:142:19: error: variable 'tm TmDate' has initializer but incomplete type
  142 |         struct tm TmDate = *localtime(&now);
      |                   ^~~~~~
logfile.cpp:142:29: error: 'localtime' was not declared in this scope
  142 |         struct tm TmDate = *localtime(&now);
      |                             ^~~~~~~~~
logfile.cpp:142:29: note: 'localtime' is defined in header '<ctime>'; did you forget to '#include <ctime>'?
logfile.cpp:143:9: error: 'strftime' was not declared in this scope
  143 |         strftime(tmpdate, 50, TimeFormat.c_str(), &TmDate);
      |         ^~~~~~~~
logfile.cpp:143:9: note: 'strftime' is defined in header '<ctime>'; did you forget to '#include <ctime>'?
logfile.cpp:145:32: warning: argument to 'sizeof' in 'char* strncpy(char*, const char*, size_t)' call is the same expression as the source; did you mean to use the size of the destination? [-Wsizeof-pointer-memaccess]
  145 |         strncpy(strt, tmpdate, sizeof(tmpdate));
      |                                ^~~~~~~~~~~~~~~
logfile.cpp: In static member function 'static void LogFile::ErrorMessage(const char*, ...)':
logfile.cpp:171:22: error: 'time' was not declared in this scope
  171 |         time_t now = time(NULL);
      |                      ^~~~
logfile.cpp:171:22: note: 'time' is defined in header '<ctime>'; did you forget to '#include <ctime>'?
logfile.cpp:172:19: error: variable 'tm TmDate' has initializer but incomplete type
  172 |         struct tm TmDate = *localtime(&now);
      |                   ^~~~~~
logfile.cpp:172:29: error: 'localtime' was not declared in this scope
  172 |         struct tm TmDate = *localtime(&now);
      |                             ^~~~~~~~~
logfile.cpp:172:29: note: 'localtime' is defined in header '<ctime>'; did you forget to '#include <ctime>'?
logfile.cpp:173:9: error: 'strftime' was not declared in this scope
  173 |         strftime(tmpdate, 50, TimeFormat.c_str(), &TmDate);
      |         ^~~~~~~~
logfile.cpp:173:9: note: 'strftime' is defined in header '<ctime>'; did you forget to '#include <ctime>'?
logfile.cpp:175:32: warning: argument to 'sizeof' in 'char* strncpy(char*, const char*, size_t)' call is the same expression as the source; did you mean to use the size of the destination? [-Wsizeof-pointer-memaccess]
  175 |         strncpy(strt, tmpdate, sizeof(tmpdate));
      |                                ^~~~~~~~~~~~~~~
logfile.cpp: In static member function 'static void LogFile::AccessMessage(const char*, ...)':
logfile.cpp:118:14: warning: ignoring return value of 'ssize_t write(int, const void*, size_t)' declared with attribute 'warn_unused_result' [-Wunused-result]
  118 |         write(Access_fd, strt, strlen(strt));
      |         ~~~~~^~~~~~~~~~~~~~~~~~~~~~~~~~~~~~~
logfile.cpp: In static member function 'static void LogFile::VirusMessage(const char*, ...)':
logfile.cpp:148:14: warning: ignoring return value of 'ssize_t write(int, const void*, size_t)' declared with attribute 'warn_unused_result' [-Wunused-result]
  148 |         write(Virus_fd, strt, strlen(strt));
      |         ~~~~~^~~~~~~~~~~~~~~~~~~~~~~~~~~~~~
logfile.cpp: In static member function 'static void LogFile::ErrorMessage(const char*, ...)':
logfile.cpp:178:14: warning: ignoring return value of 'ssize_t write(int, const void*, size_t)' declared with attribute 'warn_unused_result' [-Wunused-result]
  178 |         write(Error_fd, strt, strlen(strt));
      |         ~~~~~^~~~~~~~~~~~~~~~~~~~~~~~~~~~~~
make[1]: *** [Makefile:24: logfile.o] Error 1
make[1]: Leaving directory '/usr/src/RPM/BUILD/havp-0.93/havp'
make[1]: *** Waiting for unfinished jobs....
make[1]: Entering directory '/usr/src/RPM/BUILD/havp-0.93/havp'
x86_64-alt-linux-g++ -pipe -frecord-gcc-switches -Wall -g -O2 -flto=auto -Wall -g -O2 -DHAVE_CONFIG_H -c -o genericscanner.o genericscanner.cpp
make[1]: Leaving directory '/usr/src/RPM/BUILD/havp-0.93/havp'
make[1]: Entering directory '/usr/src/RPM/BUILD/havp-0.93/havp'
x86_64-alt-linux-g++ -pipe -frecord-gcc-switches -Wall -g -O2 -flto=auto -Wall -g -O2 -DHAVE_CONFIG_H -c -o httphandler.o httphandler.cpp
make[1]: Leaving directory '/usr/src/RPM/BUILD/havp-0.93/havp'
make[1]: Entering directory '/usr/src/RPM/BUILD/havp-0.93/havp'
x86_64-alt-linux-g++ -pipe -frecord-gcc-switches -Wall -g -O2 -flto=auto -Wall -g -O2 -DHAVE_CONFIG_H -c -o sockethandler.o sockethandler.cpp
sockethandler.cpp: In member function 'int SocketHandler::CheckForSSLData(int, int)':
sockethandler.cpp:584:20: warning: operation on '((SocketHandler*)this)->SocketHandler::Timeout.timeval::tv_sec' may be undefined [-Wsequence-point]
  584 |     Timeout.tv_sec = Timeout.tv_sec = Params::GetConfigInt("SSLTIMEOUT");
      |     ~~~~~~~~~~~~~~~^~~~~~~~~~~~~~~~~~~~~~~~~~~~~~~~~~~~~~~~~~~~~~~~~~~~~
make[1]: Leaving directory '/usr/src/RPM/BUILD/havp-0.93/havp'
make[1]: Entering directory '/usr/src/RPM/BUILD/havp-0.93/havp'
x86_64-alt-linux-g++ -pipe -frecord-gcc-switches -Wall -g -O2 -flto=auto -Wall -g -O2 -DHAVE_CONFIG_H -c -o helper.o helper.cpp
helper.cpp: In function 'bool MakeDaemon()':
helper.cpp:174:10: warning: ignoring return value of 'int chdir(const char*)' declared with attribute 'warn_unused_result' [-Wunused-result]
  174 |     chdir("/tmp/");
      |     ~~~~~^~~~~~~~~
make[1]: Leaving directory '/usr/src/RPM/BUILD/havp-0.93/havp'
make[1]: Entering directory '/usr/src/RPM/BUILD/havp-0.93/havp'
x86_64-alt-linux-g++ -pipe -frecord-gcc-switches -Wall -g -O2 -flto=auto -Wall -g -O2 -DHAVE_CONFIG_H -c -o connectiontobrowser.o connectiontobrowser.cpp
make[1]: Leaving directory '/usr/src/RPM/BUILD/havp-0.93/havp'
make[1]: Entering directory '/usr/src/RPM/BUILD/havp-0.93/havp'
x86_64-alt-linux-g++ -pipe -frecord-gcc-switches -Wall -g -O2 -flto=auto -Wall -g -O2 -DHAVE_CONFIG_H -c -o scannerhandler.o scannerhandler.cpp
make[1]: Leaving directory '/usr/src/RPM/BUILD/havp-0.93/havp'
make[1]: Entering directory '/usr/src/RPM/BUILD/havp-0.93/havp'
x86_64-alt-linux-g++ -pipe -frecord-gcc-switches -Wall -g -O2 -flto=auto -Wall -g -O2 -DHAVE_CONFIG_H -c -o params.o params.cpp
make[1]: Leaving directory '/usr/src/RPM/BUILD/havp-0.93/havp'
make: *** [Makefile:2: all] Error 2
error: Bad exit status from /usr/src/tmp/rpm-tmp.64186 (%build)


RPM build errors:
    Bad exit status from /usr/src/tmp/rpm-tmp.64186 (%build)
Command exited with non-zero status 1
4.04user 0.88system 0:01.92elapsed 256%CPU (0avgtext+0avgdata 105640maxresident)k
0inputs+0outputs (0major+274740minor)pagefaults 0swaps
hsh-rebuild: rebuild of `havp-0.93-alt1.src.rpm' failed.
Command exited with non-zero status 1
2.60user 1.79system 0:10.58elapsed 41%CPU (0avgtext+0avgdata 110732maxresident)k
1920inputs+0outputs (0major+201572minor)pagefaults 0swaps